##TITLE=1H_LR-695-CR5-K1
 CDCl3, 8 sc, 
 25.2.2020
##JCAMPDX= 6.0         $$ Bruker NMR JCAMP-DX V2.0
##DATA TYPE= NMR FID
##DATA CLASS= NTUPLES
##ORIGIN= UXNMR, Bruker Analytische Messtechnik GmbH
##OWNER= root
$$ XWIN-NMR		Version 3.5
$$ Tue Feb 25 14:37:50 2020 Russian Standard Time (UT+4h)  she@DPX200
##.OBSERVE FREQUENCY= 200.1315
##.OBSERVE NUCLEUS= ^1H
##.DELAY= (6, 6)
##.ACQUISITION MODE= SIMULTANEOUS
##.ACQUISITION SCHEME= undefined
##.AVERAGES= 8
##.DIGITISER RES= 18
##SPECTROMETER/DATA SYSTEM= spect
##.PULSE SEQUENCE= zg30
##.SOLVENT NAME= MeOD
##.SHIFT REFERENCE= (INTERNAL, MeOD, 0, 15.7039)
##AUDIT TRAIL= $$ (NUMBER, WHEN, WHO, WHERE, WHAT)
$$ ##TITLE= Audit trail, XWIN-NMR		Version 3.5
$$ ##JCAMPDX= 5.01
$$ ##ORIGIN= Bruker BioSpin GmbH
$$ ##OWNER= she
$$ F:/spectra/data/she/nmr/H-F/1/audita.txt
$$ ##AUDIT TRAIL=  $$ (NUMBER, WHEN, WHO, WHERE, WHAT)
(   1,<2020-02-25 14:36:29.87 +0400>,<she>,<DPX200>,
      <created by zg, POWCHK disabled, PULCHK disabled
       configuration hash MD5:
       00 E9 B6 7A A2 85 ED C7 34 08 36 98 17 FE 4E 26
       data hash MD5: 16K
       1C DB 9E 64 E6 04 D5 04 4B 73 B8 49 3F 78 E7 F8>)
$$ ##END=
$$ 
$$ hash MD5
$$ B4 79 A9 09 B1 6B B6 8C 19 F5 80 B0 6A 46 15 72
##$RELAX= 
##$RELAX= 
##$RELAX= 
##$RELAX= 
##$RELAX= 
##$RELAX= 
$$ Bruker specific parameters
$$ --------------------------
##$DU= <F:/spectra>
##$EXPNO= 1
##$NAME= <H-F>
##$PROCNO= 1
##$TYPE= <nmr>
##$USER= <she>
##$AMP= (0..31)
100 100 100 100 100 100 100 100 100 100 100 100 100 100 100 100 100 100 
100 100 100 100 100 100 100 100 100 100 100 100 100 100 
##$AQSEQ= 0
##$AQ_mod= 1
##$AUNM= <au_zg>
##$AUTOPOS= <>
##$BF1= 200.13
##$BF2= 200.13
##$BF3= 200.13
##$BF4= 200.13
##$BF5= 200.13
##$BF6= 200.13
##$BF7= 200.13
##$BF8= 200.13
##$BYTORDA= 1
##$CFDGTYP= 0
##$CFRGTYP= 5
##$CHEMSTR= <none>
##$CNST= (0..31)
1 1 145 1 1 1 1 1 1 1 1 1 1 1 1 1 1 1 1 1 1 1 1 1 1 1 1 1 1 1 1 1 
##$CPDPRG= <>
##$CPDPRG1= <>
##$CPDPRG2= <>
##$CPDPRG3= <>
##$CPDPRG4= <mlev>
##$CPDPRG5= <mlev>
##$CPDPRG6= <mlev>
##$CPDPRG7= <mlev>
##$CPDPRG8= <mlev>
##$CPDPRGB= <>
##$CPDPRGT= <>
##$D= (0..31)
0 1.2 0 0 0 0 0 0 0 0.06 0 0.03 0 0 0 0 0.0002 0 0 0 0 0 0 0 0 0 0 0 0 
0 0 0 
##$DATE= 1582626989
##$DBL= (0..7)
120 120 120 120 120 120 120 120 
##$DBP= (0..7)
150 150 150 150 150 150 150 150 
##$DBP07= 0
##$DBPNAM0= <>
##$DBPNAM1= <>
##$DBPNAM2= <>
##$DBPNAM3= <>
##$DBPNAM4= <>
##$DBPNAM5= <>
##$DBPNAM6= <>
##$DBPNAM7= <>
##$DBPOAL= (0..7)
0.5 0.5 0.5 0.5 0.5 0.5 0.5 0.5 
##$DBPOFFS= (0..7)
0 0 0 0 0 0 0 0 
##$DE= 6
##$DECBNUC= <off>
##$DECIM= 24
##$DECNUC= <off>
##$DECSTAT= 4
##$DIGMOD= 1
##$DIGTYP= 9
##$DL= (0..7)
0 120 120 120 120 120 120 120 
##$DP= (0..7)
150 150 150 150 150 150 150 150 
##$DP07= 0
##$DPNAME0= <>
##$DPNAME1= <>
##$DPNAME2= <>
##$DPNAME3= <>
##$DPNAME4= <>
##$DPNAME5= <>
##$DPNAME6= <>
##$DPNAME7= <>
##$DPOAL= (0..7)
0.5 0.5 0.5 0.5 0.5 0.5 0.5 0.5 
##$DPOFFS= (0..7)
0 0 0 0 0 0 0 0 
##$DQDMODE= 0
##$DR= 18
##$DS= 0
##$DSLIST= <SSSSSSSSSSSSSSS>
$$ [...]
##$SUBNAM2= <"">
##$SUBNAM3= <"">
##$SUBNAM4= <"">
##$SUBNAM5= <"">
##$SUBNAM6= <"">
##$SUBNAM7= <"">
##$SUBNAM8= <"">
##$SUBNAM9= <"">
##$SW= 24.9337058887773
##$SWIBOX= (0..15)
0 0 2 0 0 0 0 0 0 0 0 0 0 0 0 0 
##$SW_h= 4990.01996007984
##$TD= 16384
##$TD0= 1
##$TE= 0
##$TE2= 300
##$TE3= 300
##$TEG= 300
##$TL= (0..7)
0 120 120 120 120 120 120 120 
##$TP= (0..7)
150 150 150 150 150 150 150 150 
##$TP07= 0
##$TPNAME0= <>
##$TPNAME1= <>
##$TPNAME2= <>
##$TPNAME3= <>
##$TPNAME4= <>
##$TPNAME5= <>
##$TPNAME6= <>
##$TPNAME7= <>
##$TPOAL= (0..7)
0.5 0.5 0.5 0.5 0.5 0.5 0.5 0.5 
##$TPOFFS= (0..7)
0 0 0 0 0 0 0 0 
##$TUNHIN= 0
##$TUNHOUT= 0
##$TUNXOUT= 0
##$USERA1= <user>
##$USERA2= <user>
##$USERA3= <user>
##$USERA4= <user>
##$USERA5= <user>
##$V9= 5
##$VALIST= <valist>
##$VCLIST= <CCCCCCCCCCCCCCC>
##$VD= 0
##$VDLIST= <DDDDDDDDDDDDDDD>
##$VPLIST= <PPPPPPPPPPPPPPP>
##$VTLIST= <TTTTTTTTTTTTTTT>
##$WBST= 1024
##$WBSW= 4
##$XGAIN= (0..3)
0 0 0 0 
##$XL= 0
##$YL= 0
##$YMAX_a= 301150
##$YMIN_a= -128561
##$ZGOPTNS= <>
##$ZL1= 120
##$ZL2= 120
##$ZL3= 120
##$ZL4= 120
##$ABSF1= 10
##$ABSF2= 0
##$ABSG= 5
##$ABSL= 3
##$ALPHA= 0
##$AQORDER= 0
##$ASSFAC= 0
##$ASSFACI= 0
##$ASSFACX= 0
##$ASSWID= 0
##$AUNMP= <proc_1d>
##$AZFE= 0.1
##$AZFW= 0.1
##$BCFW= 1
##$BC_mod= 2
##$BYTORDP= 1
##$COROFFS= 0
##$CY= 11.3945322036743
##$DATMOD= 1
##$DC= 2
##$DFILT= <>
##$DTYPP= 0
##$F1P= 16.9975609425685
##$F2P= -3.02152046262296
##$FCOR= 0.5
##$FTSIZE= 0
##$FT_mod= 4
##$GAMMA= 1
##$GB= 0.15
##$INTBC= 1
##$INTSCL= 1
##$ISEN= 128
##$LB= 0.24
##$LEV0= 0
##$LPBIN= 0
##$MAXI= 10000
##$MC2= 0
##$MEAN= 0
##$ME_mod= 0
##$MI= 1.114404
##$NCOEF= 0
##$NC_proc= 0
##$NLEV= 6
##$NOISF1= 3.799351
##$NOISF2= 2.8
##$NSP= 1
##$NTH_PI= 0
##$NZP= 0
##$OFFSET= 15.70392
##$PC= 1
##$PHC0= -9786.204
##$PHC1= 11.20082
##$PH_mod= 1
##$PKNL= yes
##$PPARMOD= 0
##$PSCAL= 0
##$PSIGN= 0
##$REVERSE= no
##$SF= 200.130013532006
##$SI= 16384
##$SIGF1= 3
##$SIGF2= 2
##$SINO= 400
##$SIOLD= 16384
##$SREGLST= <1H.CDCl3>
##$SSB= 0
##$STSI= 0
##$STSR= 0
##$SW_p= 3612.71676300578
##$SYMM= 0
##$S_DEV= 0
##$TDeff= 0
##$TDoff= 0
##$TI= <>
##$TILT= no
##$TM1= 0
##$TM2= 0
##$TOPLEV= 0
##$USERP1= <user>
##$USERP2= <user>
##$USERP3= <user>
##$USERP4= <user>
##$USERP5= <user>
##$WDW= 1
##$XDIM= 8192
##$YMAX_p= 0
##$YMIN_p= 0
$$ End of Bruker specific parameters
$$ ---------------------------------
##NTUPLES= NMR FID
##VAR_NAME=  TIME,          FID/REAL,        FID/IMAG
##SYMBOL=    X,             R,               I
##VAR_TYPE=  INDEPENDENT,   DEPENDENT,       DEPENDENT
##VAR_FORM=  AFFN,          ASDF,            ASDF
##VAR_DIM=   8192,          8192,            8192
##UNITS=     SECONDS,       ARBITRARY UNITS, ARBITRARY UNITS
##FACTOR=    0.0002004,     1,               1
##FIRST=     0,             0,               0
##LAST=      1.6414764,     0,               0
##MIN=       0,             -128561,         0
##MAX=       1.6414764,     301150,          0
$$ Real data points
##PAGE= N=1
##DATA TABLE= (X++(R..R)), XYDATA
$$ [...]
$$ plain form
2424 -1959 -3201 -948 2371 3605 2206 -1208 -3507 -2287 1035 4306 4322 1347 -2229 -3166 -1630 2014
2440 2014 4039 3142 -79 -2710 -2608 630 3843 3901 1247 -2084 -3516 -1461 2030 4615 3628 424
2456 424 -2453 -2848 -303 3234 4094 1582 -1480 -3103 -1254 1797 4485 3593 345 -3325 -3593 -849
2472 -849 2995 4200 2725 -1423 -3159 -2184 1322 3515 2969 94 -2922 -3316 -946 2621 4312 2553
2488 2553 -1169 -3527 -3115 -52 3043 3196 1028 -2550 -3608 -1325 1948 3884 2159 -1219 -3918
2503 -3918 -3653 -409 2788 3493 1135 -2518 -3825 -2197 886 2829 2023 -830 -3745 -3193 -689 2683
2519 2683 3230 1249 -2202 -4382 -2690 238 2832 2137 -295 -2959 -3169 -753 1730 2692 737 -2389
2535 -2389 -3940 -2304 350 2921 2389 20 -2992 -3618 -1744 1463 2314 980 -1599 -3402 -2082 577
$$ packed form
2424a959j242K253L319J234j399l414k299J220L322L271J6k975l576r37J536L644
2440B014K025q97l221k631J02L238L213N8k654l331j432K055L491K585r87l204
2456D24k877l95K545L537Q60k512l062j623J849L051K688q92l248l670k68K744
2472h49L844J205j475m148j736R75L506K193n46k875l016l94K370L567J691j759
2488B553l722k358M12L063L095J53k168l578j058K283L273J936j725l378k699
2503c918K65L244L197P05k358l653j307J628L083J943q06k853k915N52K504L372
2519B683N47j981l451k180J692K928K594o95k432k664k10K416K483R62j955l126
2535b389j551J636K654K571n32k369l012o26J874L207Q51j334k579j803J320K659
$$ plain form
2551 577 2610 2282 27 -2960 -3528 -1525 1471 2749 1636 -1144 -2704 -2318 -53 2149 1861 66
2567 66 -1952 -3015 -1218 1459 2867 1723 -661 -2720 -2678 -298 2055 2162 722 -1218 -2211 -1151
2583 -1151 1124 2253 1367 -708 -2534 -2224 -162 2072 2566 977 -1266 -2008 -1034 435 1828 1457
2599 1457 -147 -1879 -1340 243 1773 1969 887 -1087 -1984 -1221 435 1581 1386 93 -924 -1053
2615 -1053 -43 1239 1581 368 -1029 -1317 -625 1057 2089 1807 42 -1105 -831 -140 1376 1674 747
2632 747 -579 -878 -296 1002 1981 1353 -437 -1201 -743 272 1488 1467 776 -473 -652 40 1134 1375
2650 1375 647 -385 -1183 -292 717 1829 1937 260 -893 -1046 -74 1082 1538 716 -348 -848 -277
2667 -277 1143 1520 1042 -265 -904 -1043 101 1486 1607 744 -398 -986 -239 880 1468 813 -453 -1501
$$ packed form
2551E77K033l28k255k987n68K003K996J278j113k780j560L86K265K202k88j795
2567F6k018j063J797K677J408j144k384k059M2K380K353J07j440j940r93J060
2583a151K275J129q86k075j826L10K062K234M94j589k243p42R74J469J393l71
2599A457j604j732N39J583J530J96j082j974q97P63J656J146j95j293j017j29
2615a053J010J282L42j213j397k88O92J682J032k82j765j147K74O91J516K98r27
2632G47j326k99N82J298R79o28j790p64M58J015J216k1o91j249j79O92J094K41
2650A375p28j032p98Q91J009J112J08j677j153j53R72J156M56q22j064n00N71
2667b77J420L77m78j307o39j39J144J385J21q63j142n88P47J119N88o55j266j048
$$ plain form
2685 -1501 -903 534 1440 1636 571 -1181 -1619 -874 502 1577 660 -511 -1278 -1122 260 1484 1367
2702 1367 -41 -1980 -2017 -982 467 1744 989 -787 -2010 -2106 -164 1051 1163 -386 -2166 -2124 -1304
2719 -1304 1019 1476 757 -1159 -2651 -2185 -598 865 1224 -25 -1887 -2445 -1342 626 1644 221
2735 221 -1712 -2985 -2521 -647 1511 1398 287 -2286 -3128 -1596 510 1389 958 -1072 -2628 -2366 -424
2752 -424 1746 1933 79 -2270 -2915 -1780 682 1961 1604 -658 -2498 -2548 -516 1715 2122 370 -1873
2769 -1873 -3043 -1698 1168 2664 2146 -39 -2470 -2640 -653 1984 2567 1151 -1312 -2347 -1376 1048
2785 1048 2581 2462 66 -2316 -2553 -393 2363 3191 1810 -436 -1929 -1497 897 2926 2899 661
2801 661 -1460 -2245 -265 2268 3381 2273 -323 -2393 -1899 674 2970 3005 1384 -1052 -2073 -508
$$ packed form
2685a501N98J437R06J96j065j752m38P45J376J075r17j171p67J56J382J224j17
2702A367j408j939l7J035J449J277p55j776j223r6J942J215J12j549j780M2Q20
2719a304K323M57p19j916j492M66J587J463L59j249j862n58J103J968J018j423
2735B21j933j273M64J874K158j13j111k573q42J532K106Q79m31k030j556K62J942
2752d24K170J87j854k349o45J135K462J279l57k262j840n0K032K231M07j752k243
2769a873j170J345K866J496n18k185k431j70J987K637N83j416k463j035R71K424
2785A048J533j19k396k382k37K160K756Q28j381k246j493M32K394K029k7k238
2801F61k121p85J980K533J113j108k596k070M94K573K296L5j621k436j021J565
$$ plain form
2817 -508 2084 3481 2224 -278 -2184 -1879 795 2902 3174 1424 -1208 -2773 -1268 1492 2973 2495
2833 2495 170 -2009 -1814 309 2469 3071 1350 -1504 -2917 -1693 1241 3001 2435 147 -2007 -2334
2849 -2334 -249 1605 2899 1112 -1518 -2942 -1922 904 2696 2383 190 -2320 -2799 -937 1300
2864 1300 2515 1294 -1133 -2803 -1927 6 1939 1945 -97 -2671 -2816 -1116 1047 2147 1411 -891
2880 -891 -2584 -2055 -213 1383 2014 12 -1995 -2613 -1248 879 1858 1297 -801 -2377 -2524 -615 1332
2897 1332 1847 318 -1520 -2586 -1181 467 1837 1344 -728 -2268 -2175 -244 1570 1923 612 -1354
2913 -1354 -2261 -1368 262 1383 1144 -116 -1802 -1620 -481 1498 1818 410 -1044 -2361 -1277 502
2929 502 1986 1378 -51 -1249 -1551 -525 1108 1714 637 -791 -1586 -743 426 1521 1261 185 -1098
$$ packed form
2817e08K592J397j257k502j906L05K674K107K72j750k632j565J505K760J481m78
2833B495k325k179J95K123K160O02j721k854j413J224K934J760n66k288k154l27
2849b334K085J854J294j787k630j424J020K826J792l13k193k510m79J862K237
2864A300J215j221k427j670Q76J933J933Ok042k574j45J700K163J100p36k302
2880h91j693N29J842J596O31k002k007o18J365K127R79n61k098j576j47J909J947
2897A332N15j529j838j066J405J648J370m93k072j540R3J931J814L53j311j966
2913a354r07Q93J630J121k39j260j686J82J139J979L20j408j454j317J084J779
2929E02J484o08j429j198l02J026J633O06j077j428p95Q43J169J095k60j076j283
$$ plain form
2946 -1098 -1320 -448 1032 1551 887 -540 -1071 -794 928 1323 1405 328 -917 -1371 -197 1001 1389 794
2964 794 -444 -950 -920 185 1440 925 85 -738 -792 194 960 1243 349 -641 -1125 -370 380 1250 1007 189
2984 189 -680 -936 -204 721 989 83 -886 -1082 -388 575 1127 454 -442 -1219 -911 108 654 954 305 -643
3004 -643 -1157 -307 762 1116 693 -258 -1342 -744 141 795 1048 138 -926 -1152 -329 416 897 602 -725
3023 -725 -1203 -826 549 1171 1097 1 -1019 -1126 -216 1058 1173 676 -792 -1053 -464 494 1095 980 -191
3042 -191 -1017 -961 -362 1213 1255 395 -680 -1085 -861 631 1250 946 -394 -1205 -1185 11 1129 1757 760
3061 760 -641 -1385 -921 474 1671 1404 -43 -1600 -1222 -370 1411 1787 933 -820 -1624 -1042 486
3078 486 1687 1338 136 -1300 -1558 -319 1111 1777 729 -1127 -1702 -1333 521 1720 1279 80 -1408
$$ packed form
2946a098k22Q72J480N19o64j427n31K77J722L95Q2j077j245m54J174J198L88n95
2964G94j238n06L0J105J255n15q40q23n4R86P66K83q94r90m84P55P50Q70k43q18
2984A89q69k56P32R25K68r06r69j96O94R63N52o73q96p77L08J019N46L00o49r48
3004f43n14Q50J069L54m23r51j084N98Q85O54K53r10j064k26Q23P45M81k95j327
3023g25m78L77J375O22p4j096j020j07R10J274J15m97j468k61N89R58O01j15j171
3042a91q26N6N99J575M2q60j075m05K24J492O19l04j340q11K0J196J118O28r97
3061G60j401p44M64J395J197k67j447j557L78Q52J781L76q54j753q04N82J528
3078D86J201l49j202j436k58J239J430O66j048j856n75L69J854J199m41j199j488
$$ plain form
3095 -1408 -2015 -498 1064 1776 775 -745 -1844 -1312 429 1599 1385 29 -1935 -1842 -724 880
3111 880 1733 1126 -811 -2242 -1791 -62 1235 1164 321 -1737 -1965 -1116 678 1830 988 -1106 -2352
3128 -2352 -1680 -404 1586 1647 202 -1411 -2688 -1337 663 1792 1046 -803 -1833 -1738 -305 1624
3144 1624 1768 346 -1315 -2422 -1237 578 1837 1120 -160 -2072 -1989 -283 1601 1674 869 -1076 -2228
3161 -2228 -1268 556 2199 1552 372 -1453 -2047 -459 1508 2046 1144 -854 -2111 -1655 665 2025
3177 2025 1873 514 -1542 -1874 -522 1249 2325 1306 -340 -1641 -1521 126 1921 1930 718 -1468
3193 -1468 -1821 -853 1044 2378 1366 -200 -1753 -1322 156 1762 2562 804 -1136 -1695 -492 897
3209 897 2147 1452 -189 -1406 -1483 66 1725 2269 1044 -860 -1851 -1075 905 2093 1552 55 -1450
$$ packed form
3095a408o07J517J562P12j001j520j099N32J741J170k14j356j964R3J118J604
3111H80Q53o07j937j431M51J729J297p1q43k058k28Q49J794J152q42k094j246
3128b352O72J276J990O1j445j613j277J351K000J129p46j849j030R5J433J929
3144A624J44j422j661j107J185J815J259p17j280j912Q3J706J884P3q05j945j152
3161b228R60J824J643o47j180j825n94J588J967N38r02j998j257M56K320J360
3177B025j52j359k056l32J352J771J076j019j646j301J20J647J795Rj212k186
3193a468l53R68J897J334j012j566j553M31J478J606Q00j758j940n59J203J389
3209H97J250o95j641j217p7J549J659N44j225j904r91P76J980J188n41j497j505
$$ plain form
3226 -1450 -1414 -113 1487 1684 1198 -849 -1600 -1077 505 1741 1477 66 -1522 -1642 -353 978 1531
3243 1531 652 -852 -1924 -1143 221 1366 1244 -253 -1140 -1731 -693 751 1211 611 -1002 -1389 -1380 129
3261 129 1205 980 -104 -1470 -1738 -767 826 1172 472 -770 -1704 -1366 -129 995 993 -51 -899 -1658
3279 -1658 -787 582 1303 551 -252 -1326 -1486 -14 894 799 -69 -753 -1301 -555 725 1136 646 -351 -1346
3298 -1346 -1037 280 876 809 189 -1014 -856 -585 613 1172 492 -234 -807 -861 222 963 939 210 -592
3317 -592 -957 -224 614 1095 470 -374 -952 -561 165 818 731 361 -294 -790 -136 380 857 470 -309 -843
3337 -843 -562 369 885 1095 -92 -631 -755 -99 740 992 508 -379 -813 -639 469 810 801 -41 -1011 -665
3357 -665 110 660 899 49 -609 -951 -470 354 799 425 -32 -767 -778 -156 719 885 113 -661 -552 -412
$$ packed form
3226a450L6J301J600J97m86k047p51N23J582J236k64j411j588j20J289J331N53
3243A531q79j504j072P81J364J145j22j497q87n91J038J444M60o00j613l87RJ509
3261A29J076k25j084j366k68R71J593L46p00j242r34L38J237J124kj044q48p59
3279a658Q71J369P21p52q03j074j60J472R08r5q68o84n48P46J280M11m90r97r95
3298a346L09J317N96o7o20j203J58K71J198N59o80p26n73n4J083P41k4p29q02
3317e92l65P33Q38M81o25q44n78L91P26O53q7l70o55m96O54N16M77l87p79n34
3337h43K81R31N16K10j187n39j24O56Q39K52m84q87m34J74J108L41rq42r70L46
3357f65P75N50K39q50o58l42M81Q24M45l74m57p35j1O22Q75J66p72p74J09J40
$$ plain form
3377 -412 569 1016 818 -433 -1126 -700 -245 555 863 447 -935 -812 -1011 363 930 618 -309 -1099 -1086
3396 -1086 -197 733 818 80 -858 -1007 -514 309 1016 254 -450 -1147 -906 -126 897 1009 237 -767 -1187
3415 -1187 -478 631 1211 509 -438 -918 -1123 -4 1038 1206 322 -864 -1184 -518 681 1252 1015 -428
3433 -428 -949 -887 228 1067 1124 338 -1023 -1333 -651 464 1399 1062 -207 -1150 -1188 106 957 1397 369
3452 369 -613 -1361 -689 567 1478 1275 0 -1148 -1047 -56 1026 1294 711 -815 -1398 -617 381 1375
3470 1375 1188 115 -1334 -1375 -197 1176 1668 782 -619 -1336 -1097 517 1721 1265 13 -1290 -1381
3487 -1381 -479 656 1526 810 -779 -1325 -1003 262 1263 1231 482 -1105 -1604 -577 564 1659 1003
3504 1003 -527 -1648 -1081 43 1333 1361 223 -1094 -1706 -510 757 1091 898 -488 -1496 -1274 -438
$$ packed form
3377d12R81M47j98j251o93M26M55Q00L08m16j382J23j99J374N67l12r27p90J3
3396a086Q89R30Q5p38r38j49M93Q23P07p62p04o97K41P80J023J12p72j004m20
3415a187P09J109N80p02r47m80k05J119J042J68q84j186l20O66J199N71k37j443
3433d28n21O2J115Q39N7p86j361l10O82J115R35l37j269r43l8J294Q51M40j028
3452C69r82p48O72J256R11k03j275j148J01R91J082K68n83j526n83P81R98R94
3470A375j87j073j449m1J178J373M92q86j401p17K39J614J204m56j252j303r1
3487a381R02J135Q70p16j589n46L22J265J001l2p49j587m99J027J141J095o56
3504A003j530j121N67J124J290K8j138j317o12J196J267L34j93j386j008K22Q36
$$ plain form
3521 -438 1097 1653 629 -1022 -1710 -1079 609 1131 1319 -365 -1357 -1339 -12 1250 1572 753 -1076 -1239
3539 -1239 -1000 362 1261 951 -137 -1224 -1361 -436 1114 1388 794 -528 -1351 -985 174 1481 1296
3556 1296 210 -1230 -1409 -283 700 1145 577 -535 -1274 -881 293 1036 1263 102 -973 -1297 -662
3573 -662 724 1490 672 -217 -1210 -983 145 1237 1014 3 -836 -1096 -252 847 1209 738 -349 -1334
3591 -1334 -1545 -143 967 1377 302 -987 -1346 -753 222 704 755 -275 -1100 -1208 -100 1043 812 443
3609 443 -648 -1285 -826 479 1067 723 -288 -1345 -1056 -245 712 1070 240 -769 -1179 -725 269 724
3627 724 211 -118 -972 -929 -185 756 947 312 -547 -883 -492 50 912 610 -351 -733 -1080 -227 307 802
3647 802 349 -557 -713 -586 307 590 669 -107 -553 -649 0 624 830 472 -122 -461 -602 532 650 579 -222
$$ packed form
3521d38J535N56j024j651o88O31J688N22J88j684r92J8J327J262L22q19j829j63
3539a239K39J362Q99l10j088j087j37R25J550K74n94j322q23L66J159J307j85
3556A296j086j440j79J126R83M45n68j112p39L93J174P43K27j161j075l24O35
3573f62J386P66q18q89r93K27J128J092k23j011q39k60Q44J099L62m71j087r85
3591a334k11J402J110M10j075j289l59N93R75M82N1j030q25j08J108J143k31l69
3609D43j091o37M59J305N88l44j011j057K89Q11R57L58q30j009m10M54R94M55
3627G24n13l29q54M3P44R41J91o35q59l36L91N42Q62l02r61l82l47Q53N34M95
3647H02m53r06j56J27Q93K83P9p76m46r6O49O24K06l58n94l39j41J134J18p1q01
$$ plain form
3668 -222 -878 -577 7 733 748 262 -283 -811 -48 681 807 480 -115 -468 -484 267 718 1194 674 -58 -340
3689 -340 188 737 843 524 191 -655 -344 273 1058 807 400 -55 -131 80 523 1099 450 -229 -323 -45 -18
3710 -18 918 846 298 -202 -307 49 748 886 665 -371 -475 -254 367 829 678 139 -633 -877 -13 695
3730 695 785 143 -336 -591 -608 135 540 700 -174 -707 -800 -205 420 561 99 -481 -811 -666 -285 613 417
3751 417 -476 -837 -1013 -234 396 588 62 -733 -932 -811 96 673 559 1 -786 -1078 -367 131 941 178
3771 178 -651 -1340 -810 -20 570 633 -63 -1058 -1295 -417 334 418 470 -657 -1067 -984 -40 555 1003 -242 -1029
3792 -1029 -923 -554 413 904 346 -393 -1242 -890 -53 822 861 221 -614 -1215 -325 644 818 486 -161 -938
3812 -938 -753 -184 1015 1150 373 -364 -1073 -234 565 1264 1148 -48 -884 -761 253 708 1003 563 -636
$$ packed form
3668b22o56L01N84P26J5m86n45n28P63P29J26l27n95l53j6P51M51M76n20p32k82
3689c40N28N49J06l19l33q46L11O17P85k51m07m55p6K11M43N76o49o79r4K78K7
3710a8R36p2n48n00j05L56O99J38k21j036j04K21O21M62j51n39p72k44Q64P08
3730F95R0o42m79k55j7P43M05J60q74n33r3N95O25J41m62n80l30J45L81Q98j96
3751D17q93l61j76P79O30J92n26p95j99J21R07N77j14n58p87k92P11M98Q10p63
3771A78q29o89N30P90N90O3o96r95k37Q78P51Q4N2j127m10Q3R44N95M48j245p87
3792a029J06L69R67M91n58p39q49L52Q37Q75L9o40q35o01Q90R69J74l32o47p77
3812i38J85N69J199J35p77p37p09Q39P99O99j16j196q36J23J014M55K95m40j199
$$ plain form
3831 -636 -793 -244 628 1436 841 -169 -935 -908 201 955 1448 900 -76 -1134 -429 691 1512 1051 5
3850 5 -748 -555 -2 1173 1235 648 -300 -973 -426 272 1205 791 143 -855 -931 -216 679 1247 996 -432 -994
3871 -994 -914 242 1070 992 222 -1008 -754 -360 579 1482 585 -190 -985 -1078 -19 811 781 171 -631 -1082
3891 -1082 -177 637 1092 489 -351 -1176 -895 -156 843 820 123 -943 -1516 -478 208 663 398 -296 -1062
3910 -1062 -1279 146 633 516 67 -831 -1336 -871 59 904 570 -179 -1257 -986 -381 484 845 227 -726
3929 -726 -1338 -772 140 840 359 -2 -936 -1256 -382 472 836 -28 -830 -950 -747 148 894 555 27 -929
3949 -929 -994 -295 354 1119 251 -350 -1071 -675 415 419 593 -35 -544 -458 -130 484 904 379 -80 -400 -539
3970 -539 48 722 380 118 -423 -494 -184 378 541 466 -424 -555 -350 23 773 738 -64 -557 -659 -161 296
$$ packed form
3831f36j57N49Q72Q08n95j010p66K7J109P54M93n48r76j058P05J120Q21m61j046
3850Ep53J93N53J175O2n87r48o73N47O98R33m14o48r98p6P15Q95N68k51j428n62
3871i94Q0J156Q28p8p70j230K54L94R39R03q97p75p95r3J059Q30l0o10q02m51
3891a082R05Q14M55o03q40q25K81P39R99k3o97j066n73J038O86M55k65o94p66
3910a062k17J425M87j17m49q98n05M65R30Q45l34p49j078K71O05Q65L61o18r53
3929g26o12N66R12P00m81l61r34l20Q74Q54L64q64q02j20K03Q95P46l39n28r56
3949i29o5O99O49P65q68o01p21L96J090MJ74o28n09Q6L28O14M20n25m59l20j39
3970e39N87O74l42k62n41p1L10N62J63p5q90j31K05L73P50l5q02m93j02M98M57
$$ plain form
3991 296 1070 711 33 -590 -691 204 1197 492 227 -383 -395 -164 615 877 314 -261 -265 -607 252 742 858
4012 858 43 -340 -343 -163 591 545 436 72 -720 -471 81 550 698 101 -474 -223 72 592 659 448 -440
4033 -440 -436 -104 317 612 449 59 -292 -545 135 366 469 329 -526 -321 -331 -49 601 857 85 -514 -182
4054 -182 -159 618 540 341 -451 -700 -165 106 606 364 -1 -637 -270 -61 551 744 -49 -368 -582 -123 144
4075 144 234 349 -241 -478 -671 82 546 782 41 -527 -616 -175 179 760 605 214 -520 -418 181 769 564
4096 564 15 -577 -964 -443 419 512 257 -130 -562 -556 25 698 564 155 -573 -653 -522 338 802 552 -65
4117 -65 -978 -631 -243 524 637 86 -575 -619 -541 134 639 399 -473 -905 -937 -183 434 869 489 -543 -1099
4138 -1099 -443 90 630 438 187 -821 -894 -360 744 881 247 -319 -1095 -737 112 746 706 -168 -907 -842
$$ packed form
3991B96P74l59o78o23j01Q95R93p05k65o10j2K31P79K62n63n75ml42Q59M90J16
4012H58q15l83lJ80P54m6j09l64p92K49N52M69J48n97n75K51K95N20O7k11q88
4033d40ML32M21K95j63l90l51k53O80K31J03j40q55K05j0K82O50K56p72n99L32
4054a82K3P77p8j99p92k49N35K71N00k42l65o36L67K09O12J93p93l19k14M59K67
4075A44R0J15n90k37j93P53M64K36p41n68q9M41L54N81j55l91p34J02N99N88k05
4096E64n49n92l87N21Q62R3k55l87m32ON81O73j34m09p28q0J31Q60M64k50o17
4117f5r13L47L88P67J13n51o61m4P8O75N05k40q72m32l2P54O17M35l80j032n56
4138a099O56N33N40j92k51j008p3N34J104J37o34n66p76L58Q49O34m0q74p39O5
$$ plain form
4158 -842 -275 374 672 359 -297 -860 -595 -5 906 712 -96 -388 -819 -277 372 966 380 -380 -983 -658
4178 -658 148 900 685 87 -624 -999 -120 538 939 283 -123 -736 -529 43 737 965 265 -792 -742 -198
4198 -198 782 1224 843 -271 -694 -494 175 845 874 406 -278 -821 -333 687 1099 675 -246 -184 -668 125
4218 125 694 807 475 -348 -787 -22 442 795 768 91 -662 -501 -236 380 640 537 -412 -901 -387 205
4238 205 756 544 60 -790 -869 81 408 716 297 -486 -963 -425 175 769 707 47 -769 -709 -648 423 609
4259 609 143 -503 -1061 -638 -12 553 567 -82 -894 -930 60 468 408 191 -227 -965 -753 -188 418 870 -50
4280 -50 -858 -1195 -652 167 629 452 -106 -1019 -1014 -289 530 459 42 -428 -777 -206 370 589 225 -463 -668
4301 -668 -836 -67 495 561 200 -421 -634 -2 406 720 433 -118 -500 -266 -12 391 719 156 -108 -445
$$ packed form
4158h42N67O49K98l13o56n63K65N90R11j94q08k92m31N42O49N94n86p60o03L25
4178f58Q06P52k15n98p11l75Q79O58M01o56m06o13K07N72O94K28p00j057N0N44
4198a98R80M42l81j114m23K00O69O70K9m68o84n43M88J020M12m24r21O2m84P93
4218A25N69J13l32q23m39P65M64L53k7o77p53J61K65O16K60j03r49m89N14N92
4238B05N51k12m84q50p9R50L27L08m19p83m77N38O00N94o2o60q16O0O1J071J86
4259F09m66o46n58M23O26N65J4o49q12l6R90M08o0k17m18p38K12N65O06M52r20
4280e0q08l37N43Q19M62j77n58r13NP25Q19p1m17m70l49N71N76K19l64o88k05
4301f68j68P69N62O6l61o21k13O32M08L14k87n51l82K34K54M03L28n63k64l37
$$ plain form
4321 -445 -190 183 610 606 163 -605 -334 57 290 590 260 -466 -843 -203 658 769 676 52 -310 -298 -39
4342 -39 479 541 255 -294 -423 -178 444 388 565 106 -508 -263 428 358 630 425 -130 -202 34 111 478 421
4364 421 20 -403 -386 249 462 417 14 -59 -118 -230 233 729 442 -159 -234 -370 229 350 57 -196 -153 -368
4386 -368 -280 263 208 253 -98 -469 12 -198 508 410 0 -172 -485 -379 130 290 255 -281 -713 -424 -155 478
4408 478 -58 -158 -649 -740 -460 39 461 -76 -390 -611 -386 -144 363 306 -104 -602 -782 -328 282 321 68
4429 68 -377 -675 -545 -75 552 418 -384 -490 -370 -101 113 223 502 -192 -594 -314 234 252 276 42 -336
4450 -336 -497 -250 91 348 428 -154 -664 -515 43 361 355 80 -425 -269 -322 204 425 403 131 -660 -336 54
4472 54 500 705 103 -689 -576 -20 273 708 241 -10 -693 -536 146 313 723 312 -610 -431 -181 105
$$ packed form
4321d45K55L73M27mm43p68K71L91K33L00l30p26l77O40Q61J11r3o24l62J2K59
4342c9N18O2k86n49j29K45O22n6J77m59o14K45O91p0K72k05n55p2K36P7L67n7
4364D21m01m23J7O35K13m5m03p3n9j12M63M96k87o01p5j36N99J21k93k53M3k15
4386c68Q8N43n5M5l51l71M81k10P06r8m10j72l13J06N09J60l5n36m32K89K69O33
4408D78n36j00m91r1K80M99M22n37l14k21K25K42N07n7m10m98j80M54O10L9k53
4429F8m45k98J30M70O27j34q02j06J20K69K14J10K79o94m02K80N48J8K4k34l78
4450c36j61K47L41K57Q0n82n10J49N58L18ok75n05J56n3N26K21k2k72p91L24L90
4472E4M46K05o02p92J13N56K93M35m67k51o83J57O82J67M10m11r22J79K50K86
$$ plain form
4492 105 607 647 -57 -472 -340 154 597 613 66 -347 -325 -280 332 866 350 -178 -514 -224 -279 314 686 273
4514 273 -476 -943 -201 371 588 495 3 -554 -362 -130 455 629 203 -262 -478 -183 515 601 562 -433 -713
4535 -713 -742 -295 735 574 5 -364 -878 -399 88 520 415 -264 -388 -324 -60 381 537 196 -108 -618
4555 -618 -641 -215 323 586 -24 -149 -945 -331 461 537 266 5 -694 -445 71 749 500 -55 -682 -509 -67
4576 -67 409 508 325 42 -480 -620 145 579 311 -55 -167 -592 -311 431 686 472 -176 -643 -479 -101 809
4597 809 420 294 -207 -478 -159 580 744 324 -312 -860 -430 -3 696 761 162 -300 -647 -244 346 549
4617 549 34 -252 -457 -690 87 602 481 313 -306 -356 90 -53 551 330 -32 -584 -579 -357 488 344 -77
4638 -77 -252 -385 -131 28 513 492 -41 -493 -504 -121 495 482 11 -127 -426 -318 68 578 400 8 -328
$$ packed form
4492A05N02M0p04m15J32M94M43J6n47m13K2M5O12N34n16n28l36K90n5N93L72m13
4514B73p49m67P42N72K17r3m92n57J92K32N85J74m26m65k16K95O98Q6l9r95k80
4535g13k9M47J030j61n69l69n14M79M87M32j05o79j24O4K64M41J56l41l04n10
4555f18k3M26N38K63o10j25p96O14P92P6k71k61o99K49N16O78k49n55o27J73M42
4576f7M76R9j83k83n22j40P65M34k68l66j12m25K81P42K55k14o48m67J64L78R10
4597H09l89j26n01k71L19P39J64m20o36n48M30M27O99O5n99m62l47M03N90K03
4617E49n15k86k05k33P77N15j21j68o19n0M46j43O04k21l62n52NK22Q45j44m21
4638g7j75j33K54J59M85k1n33m52j1L83O16j3m71j38k99J08L86N10j78l92l36
$$ plain form
4659 -328 -633 -58 197 534 249 -79 -434 -364 -47 636 263 26 -266 -307 -378 79 326 46 -471 -488 -470 112
4681 112 408 54 108 -502 -237 -107 260 508 205 -85 -313 -202 508 229 371 64 -577 -326 -53 155
4701 155 110 123 -251 -298 -179 4 153 341 -365 -415 -389 -78 77 453 410 -126 -385 -157 202 458 153 -197
4723 -197 -126 -309 122 311 518 366 77 -283 -95 338 561 455 154 -187 -163 48 40 325 497 -121 -118 -63
4745 -63 96 134 522 -26 -211 -461 191 171 307 78 -470 -366 -312 137 364 217 250 -334 -434 73 366 122
4767 122 287 -23 -661 -230 -64 285 34 -42 -589 -438 -149 465 161 -102 -277 -218 -383 -49 426 352 -118
4788 -118 -400 -495 -101 29 178 27 -30 -699 -472 179 377 109 -292 -360 -116 104 239 344 183 -516 -413
4809 -413 -428 -29 264 271 92 -407 -292 -237 400 120 190 -211 -512 -180 301 502 95 -65 -412 -114 -51 235
$$ packed form
4659c28l05N75K55L37k85l28l55P0L17O83l73k37k92m1p1M57K47k80n17j7J8N82
4681A12K96l54N4o10K65J30L67K48l03k90k28J11P10k79J42l07o41K51K73K08
4701A55m5J3l74m7J19J83J49J88p06n0K6L11J55L76m3n36k59K28L59K56l05l50
4723a97P1j83M31J89K07j52k89l60J88M33K23j06l01l41K4K11qK85J72o18LN5
4745f3J59L8L88n48j85k50O52k0J36k29n48J04N4M49K27j47L3n84j00N07K93k44
4767A22J65l10o38M31J66L49k51p6n47J51K89O14l04k63j75N9j65L34M75p4m70
4788a18k82r5L94J30J49j51n7o69K27O51J98k68m01o8K44K20J35J05j61o99J03
4809d13j5L99K93Pj79m99J15N5O37k80P0m01l01L32M81K01m07j60l47K98O3K86
$$ plain form
4831 235 193 -96 -416 -137 -14 210 522 299 -57 -242 -401 17 257 413 27 -307 -596 -298 459 577
4851 577 407 66 -495 -530 307 536 329 225 -153 26 -278 146 364 627 70 -355 -471 -53 349 348 257
4872 257 -205 -453 -282 -5 636 325 305 -305 -437 -362 410 576 383 -208 -425 -522 183 339 416 264 -374
4893 -374 -625 -222 176 752 424 -25 -683 -385 -231 432 568 24 -98 -290 -177 180 375 168 -13 -621
4913 -621 -311 149 479 486 314 -523 -363 -372 -152 232 164 -134 -453 -485 -98 268 348 -46 -545 -494 -378 366 132
4936 132 276 -232 -498 -436 97 227 599 -65 -241 -365 -500 100 293 745 -130 -254 -461 -165 378 389 97
4957 97 -352 -674 -90 329 234 255 -46 -624 -240 246 371 387 210 -41 -362 -516 -35 338 310 97 -363 -497
4979 -497 -133 403 651 165 -232 -292 -202 57 353 353 -46 -101 -542 -56 9 465 86 -46 -89 -181 -71 533 217
$$ packed form
4831B35m2k89l20K79J23K24L12k23l56j85j59M18K40J56l86l34k89K98P57J18
4851E77j70l41n61l5Q37K29k07j04l78J79l04M24K18K63n57m25j16M18M02jr1
4872B57m62k48J71K77O41l11k0o10j32P5P72J66j93n91k17r7P05J56P7j52o38
4893c74k51M03L98N76l28m49o58K98J54O63J36n44j22j92J13L57J95k07j81o08
4913f21L10M60L30Pj72q37J60rK20L84o8k98l19l2L87L66Q0l94m99N1J16P44k34
4936A32J44n08k66O2N33J30L72o64j76j24j35O00J93M52q75j24k07K96N43J1k92
4957I7m49l22N84M19r5K1l01n78L84M86J25J6j77k51l21j54M81L73k8k13m60j34
4979d97L64N36K48m86l97o0R0K59K96%l99n5m41M86O5M56l79j32m3r2J10O04l16
$$ plain form
5002 217 -8 -520 -534 -36 182 393 421 -203 -349 -225 -127 439 377 209 -302 -292 -116 504 324 -24 -81 -108
5024 -108 -34 -122 -73 292 53 -349 -301 -206 -35 477 255 -125 -305 -182 -9 477 148 149 -238 -197 -447 123 359
5047 359 298 -46 -295 -298 -68 162 184 -126 -371 145 -124 47 119 118 -226 -461 -422 296 601 192 -82 -452 -168
5070 -168 -206 69 272 139 17 -270 -260 28 379 355 21 -320 -320 -176 167 280 49 -158 -70 -284 162 335
5092 335 499 -94 -456 -170 78 -103 165 365 19 -303 71 292 102 294 52 -490 -110 -158 244 295 51
5113 51 -99 -159 -213 -73 227 314 13 -37 -494 -315 125 327 -141 -133 -171 7 -18 409 322 17 -428 -448 -313 208
5137 208 17 -6 -107 -261 -271 25 669 135 49 -306 -259 -171 281 403 32 -480 -396 -190 -2 -78 122 16
5159 16 -606 -556 -254 57 12 352 -200 -394 -196 -162 230 335 -207 -448 -179 -375 -83 257 26 -314 -339 -256
$$ packed form
5002B17k25n12j4M98K18K11K8o24j46J24R8N66o2j68n11J0J76O20j80l48n7k7
5024a08P4q8M9L65k39m02M8R5J71N12k22l80j80J23J73M86l29Jl87M1k50N70K36
5047C59o1l44k49lK30K30K2l10k45N16k69J71P2jl44k35L9P18L05m09k74l70K84
5070a68l8K75K03j33j22k87J0K88L51k4l34l41%J44L43J13k31k07Q8k14M46J73
5092C35J64n93l62K86K48j81K68K00l46l22L74K21j90J92k42n42L80m8M02N1k44
5113E1j50o0n4J40L00Q7l01n0m57J79M40K02m68Ql8J78k5M27q7l05m45k0J35N21
5137B08j91k3j01j54j0K96O44n34q6l55M7Q8M52J22l71n12Q4K06J88p6K00j06
5159A6o22N0L02L11m5L40n52j94J98L4L92J05n42k41K69j96K92L40k31l40k5Q3
$$ plain form
5181 -256 -25 38 478 12 -41 -222 -125 19 348 300 26 -417 -413 303 381 354 -103 -12 -466 -171 74 333 420
5204 420 -126 -529 -559 322 306 367 100 56 -716 -114 267 221 375 62 -371 -93 254 442 602 169 -243 -446
5226 -446 -168 441 501 395 -249 -402 -508 5 198 354 185 -170 -276 -160 355 448 166 120 -214 -337 59
5247 59 558 393 169 -99 -353 -325 141 335 80 -26 -265 -99 -88 362 417 226 -174 -170 -274 199 362 249
5269 249 -42 -196 -471 -306 -22 126 270 -366 -283 -283 -138 180 134 126 -264 -654 22 268 527 341 -299 -218
5291 -218 -338 142 64 337 606 -307 -317 -11 360 252 208 -102 -211 -144 266 97 182 -43 -291 -439 -145 27
5313 27 429 129 -304 -608 -215 -274 103 330 68 -277 -258 -190 240 304 -183 19 -306 -678 -95 160 265 202
5335 202 -118 -253 173 216 217 91 59 -97 -270 -192 22 236 123 136 -464 -47 475 57 -82 148 -178 -715
$$ packed form
5181b56K31O3M40m66n3j81R7J44L29m8k74m43MP16P8k7m57R1m54K95K45K59Q7
5204D20n46m03l0Q81j6O1k67m4p72O02L81m6J54l13m33K78L47J88J60m33m12k03
5226d46K78O09O0j06o44j53j06N13J93J56j69l55j06J16N15R3k82m6l34j23L96
5247E9M99j65k24k68k54K8M66J94k55j06k39J66J1M50N5j91m00Mj04M73J63j13
5269B49k91j54k75J65K84J48J44o36Q3%J45L18m6ql90l90O76K46K59j86o40Q1
5291b18j20M80p8K73K69r13j0L06L71j08m4l10j09O7M10j69Q5k25k48j48K94J72
5313B7M02l00m33l04L93n9L77K27k62l45J9O8M30O4m87K02l25l72N83K55J05o3
5335B02l20j35M26M3Jj26l2j56j73P8K14K14j13J3o00M17N22m18j39K30l26n37
$$ plain form
5357 -715 166 295 317 137 -247 -307 -67 153 174 393 -120 -196 -166 22 637 421 286 -66 -334 22 343 339
5379 339 231 286 68 -376 317 337 245 307 -349 -199 -19 330 256 103 -130 -121 -51 -107 45 94 81 -165 -367 -169
5403 -169 152 117 228 -195 29 15 -137 238 162 -110 -223 -336 -3 33 187 -74 -192 -447 73 -40 203
5424 203 63 -191 -185 -419 116 -28 196 180 -289 -253 -231 -108 37 227 81 -263 -307 -228 84 16 178 -210 -196
5447 -196 -16 112 215 243 -11 -266 -207 -306 110 268 44 -167 -563 -503 -281 176 174 87 -523 -137 -342 369
5469 369 512 -73 112 -195 -100 -155 70 144 -45 233 -365 6 246 167 127 -433 -188 -449 105 56 168 176 159
5492 159 -260 -137 86 609 243 -157 -60 73 -173 109 376 499 -372 -127 -9 119 410 100 163 -93 -277
5513 -277 405 209 387 -151 -343 -76 -62 2 146 194 -103 -341 -270 -235 114 213 -19 -38 -434 -162 101 330
$$ packed form
5357g15Q81J29K2j80l84o0K40K20K1K19n13p6L0J88O15k16j35l52k68L56L21m
5379C39j08N5k18m44O93K0r2O2o56J50J80L49p4j53k33RP0n6J52M9j3k46k02J98
5403a69L21l5J11m23K24j4j52L75p6k72j13j13L33L6J54k61j18k55N20j13K43
5424B03j40k54Ok34N35j44K24j6m69L6K2J23J45J90j46l44m4P9L12o8J62l88J4
5447a96J80J28J03K8k54k55N9r9M16J58k24k11l96O0K22M57kq7o10L86k05P11
5469C69J43n85J85l07R5n5K25P4j89K78n98L71K40p9m0n60K45k61N54m9J12Qj7
5492A59m19J23K23N23l66m00R7J33k46K82K67J23q71K45J18J28K91l10O3k56j84
5513b77O82j96J78n38j92K67J4O4J44M8k97k38P1L5L49R9k32j9l96K72K63K29
$$ plain form
5535 330 204 -355 -119 -418 107 301 177 301 -82 -103 -354 -83 254 7 -68 -118 -234 55 142 219 280 -130
5557 -130 -294 -134 63 381 345 -273 -140 -265 19 81 478 91 -240 -333 -413 -35 23 57 -69 -213 -364 53
5579 53 -8 109 14 -375 -356 -136 41 481 199 151 8 -280 -150 206 155 -277 26 -24 -124 136 206 36 120
5602 120 -68 -304 -30 1 337 189 -144 104 -226 -414 284 521 14 -186 -220 -209 208 465 -36 -174 153
5623 153 -192 -230 193 474 -76 -453 -398 -74 334 147 520 -54 -166 -116 114 342 536 43 -183 59 -300
5644 -300 -11 319 244 -65 -216 -118 -35 242 358 237 -253 -220 -400 218 104 40 209 -186 -68 -110 230 289
5666 289 239 -98 -269 -135 75 428 -63 -207 -88 -112 -200 49 92 297 -202 -206 -295 113 359 72 -127 -62 -107
5689 -107 -79 72 180 -334 -86 -79 -36 133 215 315 -283 -41 -185 -237 357 280 47 -58 -21 -253 80 3 330
$$ packed form
5535C30j26n59K36k99N25J94j24J24l83k1k51K71L37k47p5n0j16K89Q7P7O1m10
5557a30j64J60J97L18l6o18J33j25K84O2L97l87l31r3q0L78N8L4j26j44j51M17
5579E3o1J17r5l89J9K20J77M40k82m8j43k88J30L56n1m32L03n0j00K60P0j70Q4
5602A20j88k36K74L1L36j48l33K48l30j88O98K37n07k00l4J1M17K57n01j38L27
5623A53l45l8M23K81n50l77N5L24M08j87L73n74j12N0K30K28J94m93k26K42l59
5644c00K89L30p5l09j51R8Q3K77J16j21m90L3j80O18j14o4J69l95J18m2L40N9
5666B89n0l37j71J34K10L53m91j44J19k4q8K49M3K05m99mq9M08K46k87j99O5m5
5689a07K8J51J08n14K48PM3J69Q2J00n98K42j44n2N94p7k33j05L7k32L33p7L27
$$ plain form
5712 330 127 -573 -199 31 202 55 315 -195 -199 -15 317 503 204 -266 -9 -474 -222 20 113 208 18
5733 18 -460 -43 295 130 85 -167 -217 -345 43 338 343 362 -192 -414 -203 179 171 336 -209 -420 -256 139 383
5756 383 -84 -101 -137 -157 -22 -155 453 288 33 24 -9 13 120 300 -36 -102 -247 -44 379 -137 76 -267 -262
5779 -262 191 13 -209 186 117 -105 -148 114 29 318 101 -10 38 -227 38 168 111 155 43 -114 -190 52
5801 52 184 -56 -68 -96 -249 14 184 -202 -105 -262 -209 -190 -8 57 48 -159 -28 36 34 127 169 46 78 141 -49
5826 -49 -108 116 60 -609 209 -178 -265 186 94 -197 -102 -390 -271 184 -217 140 -116 198 49 122 14 67 222
5849 222 -85 -261 -215 21 34 308 298 -62 -100 88 69 482 208 -162 -205 -209 223 372 119 94 135 -200 270
5872 270 131 94 236 -78 -268 -123 120 336 213 210 25 -238 139 349 87 173 268 203 -143 -15 331 487
$$ packed form
5712C30k03p00L74K30J71j47K60n10mJ84L32J86k99m70K57m65K52K42R3R5j90
5733A8m78M17L38j65m5k52n0j28L88K95NJ9n54k22K11L82qJ65n45k11J64L95K44
5756C83m67j7l6k0J35j33O08j65k55rl3K2J07J80l36o6j45K03M23n16K13l43N
5779b62M53j78k22L95o9k22m3K62q5K89k17j11M8k65K65J30n7M4j12j57p6K42
5801E2J32k40j2k8j53K63J70l86R7j57N3J9J82O5rk07J31O4kR3M2j23L2O3j90
5826d9n9K24n6o69Q18l87q7M51r2k91R5k88J19M55m01L57k56L14j49P3j08N3J55
5849B22l07j76M6K36J3K74j0l60l8J88j9M13k74l70m3mM32J49k53k5M1l35M70
5872B70j39l7J42l14j90J45K43K16j23lj85k63L77K10k62Q6R5o5l46J28L46J56
$$ plain form
5894 487 204 -344 -239 -2 228 151 21 151 -144 -113 104 347 367 123 -252 -309 -260 188 -68 351 -186 -451
5916 -451 -501 180 451 405 72 -410 -104 -321 290 226 192 -226 -220 -264 308 260 16 74 -202 -293 -138 134 43 311
5940 311 -139 151 -217 -59 61 18 -329 -372 -191 -210 35 66 412 -86 -685 -143 495 241 338 136 99 -372
5962 -372 -11 241 155 285 46 32 -342 193 164 -7 105 169 -259 34 208 533 368 26 -307 -177 88
5983 88 165 277 -8 -482 -384 -311 -43 378 -71 -184 -51 37 59 51 283 159 -331 -164 -412 -48 323 398 -191
6006 -191 -119 8 19 -15 119 23 -209 -272 -264 -22 153 -138 -39 -381 -378 23 244 363 215 112 -175 -81 20 402
6030 402 306 144 -263 81 -123 138 -71 -78 -220 -246 56 2 206 373 -84 -175 42 -171 -15 101 206 -155
6052 -155 -204 35 8 101 137 213 -295 -462 108 154 34 111 136 -89 73 -81 -155 77 -95 -103 -358 -16 78 241
$$ packed form
5894D87k83n48J05K37K30p7j30J30k95L1K17K43K0k44l75n7M9M48k56M19n37k65
5916d51n0O81K71m6l33m82L06k17O11o4l4m18Om4N72m8k44N8k76r1J55K72r1K68
5940C11m50K90l68J58J20m3l47m3J81j9K45L1L46m98n99N42O38k54R7k02l7m71
5962c72L61K52q6J30k39j4l74N35k9j71J12O4m28K93J74L25j65l42l33J30K65
5983H8P7J12k85m74R8P3K68M21m49j13J33Q8K2qK32j24m90J67k48L64L71P5n89
6006a91P2J27J1l4J34r6k32o3QK42J75k91R9l42LM01K21J19j48j03k87R4J01L82
6030D02r6j62m07L44k04K61k09pj42k6L02n4K04J67m57r1K17k13J56J16J05l61
6052a55m9K39k7R3L6P6n08j67N70M6j20P7K5k25J62j54p4K32j72qk55L42R4J63
$$ plain form
6076 241 295 -32 -49 -25 189 -13 542 21 -77 -484 -88 32 23 -73 100 67 -36 283 -58 -84 85 -182 28
6099 28 140 -40 195 15 -286 -113 -172 68 55 207 24 -59 -225 292 155 134 30 -150 -66 45 237 -18
6121 -18 137 -118 -9 -162 -252 108 -57 40 -184 -208 -140 -16 0 149 82 -83 -274 42 -8 362 107 154 -92
6144 -92 -289 7 191 493 -52 213 -105 189 457 -110 262 -48 -273 -71 -104 105 104 21 -241 -243 -78 -1 404
6167 404 -2 -94 -329 -124 147 -25 -49 184 -162 -336 134 -9 -2 192 -146 -97 225 79 250 37 -184 -66
6189 -66 -35 268 325 198 -187 80 -92 60 -29 -36 -39 -36 2 -126 24 19 -80 87 -83 -168 -28 164 309 155 71
6214 71 -129 -157 -34 153 -27 107 -335 -331 9 -229 342 177 -160 -3 -210 -145 247 71 106 -269 -251 -243 -58
6237 -58 -149 -75 -35 -194 -31 25 -29 207 199 -53 -374 80 3 -73 19 -94 -335 -230 321 273 -107 154 78 -368
$$ packed form
6076B41N4l27j7K4K14k02N55n21r8m07L96J20rr6J73l3j03L19l41k6J69k67K10
6099B8J12j80K35j80l01J73n9K40j3J52j83q3j66N17j37k1j04j80Q4J11J92k55
6121a8J55k55J09j53r0L60j65R7k24k4O8J24J6J49o7j65j91L16n0L70k55M7k46
6144i2j97K96J84L02n45K65l18K94K68n67L72l10k25K02l3K09jq3k62kJ65P7M05
6167D04m06r2k35K05K71j72k4K33l46j74M70j43PJ94l38M9L22j46J71k13k21J18
6189f6L1L03N7j27l85K67j72J52q9plLL8j28J50nr9J67j70q5J40J92J45j54q4
6214G1k00k8J23J87j80J34m42ML40k38N71j65l37J57k07O5L92j76L5l75J8QJ85
6237e8r1P4M0j59J63N6n4K36qk52l21M54p7p6R2j13k41J05N51m8l80K61p6m46
$$ plain form
6261 -368 -70 -198 231 -137 -65 76 -170 -37 220 238 9 -28 168 -101 48 195 360 2 45 -245 -81
6282 -81 133 433 399 198 -129 -274 36 236 95 105 -144 -233 271 -96 20 333 5 -162 -207 -227 183 226
6304 226 56 -86 -71 59 -122 -87 408 30 -370 -269 -283 41 217 -243 -218 -96 150 -5 102 39 -27 48
6326 48 -247 -101 143 367 -52 -102 -66 133 -198 280 -68 -129 -218 -184 65 249 50 -195 -172 -81 -51 272 7
6349 7 278 -16 -8 -243 -21 100 70 18 -199 -2 -122 294 358 -153 241 -139 -80 -121 247 88 355 170 -124
6372 -124 -131 -10 213 57 -107 -128 -314 -81 77 240 235 238 -163 220 71 135 -86 -11 -248 -210 173 -169 375
6395 375 34 274 47 -277 50 204 -76 347 -100 -124 64 43 266 13 42 -20 -43 6 392 -23 -194 -396
6417 -396 54 -268 159 66 130 7 -165 -266 -256 135 182 97 -14 -85 -101 197 -122 -50 -180 -209 -18 -138 209
$$ packed form
6261c68K98j28M29l68P2J41k46J33K57J8k29l7J96k69J49J47J65l58M3k90J64
6282h1K14L00l4k01l27j45L10K00j41J0k49q9N04l67J16L13l28j67m5k0M10M3
6304B26j70j42J5J30j81L5M95l78m00J01j4L24J76m60K5J22K46j55J07o3o6P5
6326D8k95J46K44K24m19n0L6J99l31M78l48o1q9L4K49J84j99k45K3R1L0L23k65
6349GK71k94Qk35K22J21l0n2k17J97j20M16O4n11L94l80N9m1L68j59K67j85k94
6372a24pJ21K23j56j64k1j86K33J58J63nLm01L83j49O4k21P5k37L8L83l42N44
6395C75l41K40k27l24L27J54k80M23m47k4J88k1K23k53K9o2k3M9L86m15j71k02
6417c96M50l22M27r3O4j23j72j01J0L91M7q5j11p1j6K98l19P2j30k9J91j20L47
$$ plain form
6440 209 234 -240 -246 -199 -206 197 164 151 -206 -47 -119 162 146 198 73 -214 -4 -92 309 165 67 -204 -463 -34
6464 -34 -69 -60 166 74 -454 -20 342 345 -165 -95 -85 -208 -398 -16 10 102 212 -136 58 -86 123 245 260 -120
6488 -120 -356 29 187 400 263 29 26 -103 181 266 146 35 -146 -171 -114 152 195 61 272 -63 -50 292
6510 292 239 188 289 -123 -122 -93 179 221 16 -256 117 -273 -61 33 -164 140 125 -159 -127 224 240 -101 130
6533 130 -62 -549 30 567 45 152 -41 157 -173 -85 254 24 308 -290 244 -239 153 10 -81 -287 -113
6554 -113 -262 26 556 195 -17 152 -228 16 -80 479 87 -219 156 -282 -28 60 151 93 -370 -298 77 12
6576 12 -321 380 -180 -220 -204 -14 80 -18 143 -370 -187 -4 148 439 28 43 -25 -186 -22 -148 281 -56
6598 -56 8 -204 -138 10 212 258 -138 128 -198 36 83 -50 38 -57 140 -422 162 110 -109 -15 -21 48 -20 179
$$ packed form
6440B09K5m74oM7pM03l3j3l57J59p2K81j6N2j25k87K10q8M01j44r8k71k59M29
6464c4l5RK26r2n28M34L62Ln10P0J0j23j90L82K6R2J10l48J94j44K09J22J5l80
6488a20k36L85J58K13j37k34lj29K84Q5j20j11j81k5N7K66M3j34K11l35J3L42
6510B92n3n1J01m12JK9K72M2k05k72L73l90K12R4j97L04j5k84L2L51J6l41K31
6533A30j92m87N79N37n22J07j93J98l30Q8L39k30K84n98N34m83L92j43r1k06J74
6554a13j49K88N30l61k12J69l80K44r6N59l92l06L75m38K54Q8R1n8m63P2L75o5
6576A2l33P01n60m0J6J90R4r8J61n13J83J83J52K91m11J5o8j61J64j26M29l37
6598e6O4k12O6J48K02M6l96K66l26K34M7j33Q8r5J97n62N84n2k19R4oO9o8J99
$$ plain form
6622 179 137 -30 -270 -152 -156 129 -18 46 180 -382 46 56 24 201 -43 -105 -248 -125 -50 449 288 81 -97
6645 -97 -195 -92 212 273 109 23 -262 -153 184 199 -113 151 -91 -244 -93 333 200 -23 -35 -291 139 71
6667 71 231 283 182 -321 17 -175 64 333 -348 -321 -108 -49 -74 -195 149 -162 -110 34 -168 198 126 114 186
6690 186 -169 -71 -224 184 124 -128 138 -15 49 110 132 -54 -21 -118 -390 33 236 370 83 124 -99 -24 116
6713 116 392 30 -47 -137 -228 -73 31 22 117 83 -278 67 -105 -35 65 -111 -128 74 22 77 -69 112 -183 -204
6737 -204 110 118 115 27 -76 -57 -44 -130 7 -54 -145 -330 -139 -49 56 63 246 -182 -261 -142 -28 191 248 -42 124
6762 124 -180 -158 -96 186 174 -6 -31 -88 -235 360 256 39 164 -268 94 66 211 386 -144 -55 4 30 108
6785 108 214 6 129 -16 122 105 -18 141 190 -255 -31 -108 -100 136 185 96 -95 76 -108 47 -41 114 -267
$$ packed form
6622A79m2j67k40J18mK85j47O4J34n62M28J0l2J77k44o2j43J23P5M99j61k07j78
6645i7r8J03L04O1j64q6k85J09L37J5l12K64k42j53J51M26j33k23j2k56M30o8
6667G1J60N2j01n03L38j92K39K69o81K7K13N9k5j21L44l11N2J44k02L66p2j2P2
6690A86l55R8j53M08o0k52K66j53O4O1K2j86L3r7k72M23K03J34k87M1k23P5J40
6713A16K76l62p7r0r1J55J04rR5l4l61L45j72P0J00j76j7K02n2N5j46J81k95k1
6737b04L14Qlq8j03J9J3q6J37o1r1j85J91R0J05PJ83m28p9J19J14K19N7k90J66
6762A24l04K2O2K82j2j80k5n7j47N95j04k17J25m32L62k8J45J75n30Q9N9K6P8
6785A08J06k08J23j45J38j7j23J59M9m45K24p7QK36M9q9j91J71j84J55q8J55l81
$$ plain form
6808 -267 -165 85 16 228 -19 -20 -202 -317 -1 273 354 -6 36 -69 -363 -47 -111 -40 363 98 180 127 140
6831 140 -157 -315 -67 -31 -155 229 195 110 45 -228 -203 -154 290 -229 -166 47 -222 126 83 158 -79 -327 -379
6854 -379 -352 184 357 155 -136 -146 -210 154 164 151 147 135 89 -123 52 295 89 -86 -100 -109 -99 -6 262 192 -149
6879 -149 409 16 -107 223 -37 -139 -350 -153 89 135 192 -157 -29 -141 -96 101 169 8 76 33 -370 76
6901 76 31 39 -128 -81 165 -365 -26 19 149 211 -211 -158 -7 28 344 239 -5 -167 66 238 153 31 -83
6924 -83 140 -269 14 335 181 98 -248 55 234 32 324 477 -163 -24 -140 267 238 -168 -109 -167 -287 52
6946 52 182 129 48 252 -344 78 99 126 62 -119 50 17 -300 18 42 -95 -25 -25 -136 271 70 472 274 -142
6970 -142 86 60 -66 -62 329 34 -165 -76 27 -324 611 149 -228 -382 -79 142 -98 146 111 0 -260 7
$$ packed form
6808b67J02K50o9K12k47jj82j15L16K74Q1l60M2j05k94L16o4P1M03k65Q2n3J3
6831A40k97j58K48L6j24L84l4q5o5k73K5M9M44n19O3K13k69L48m3P5k37k48n2
6854c79K7N36J73k02k91j0o4L64J0j3mj2m6k12J75K43k06j75j4rJ0R3K68p0l41
6879a49N58l93j23L30k60j02k11J97K42M6N7l49J28j12M5J97O8j61O8m3m03M46
6901G6m5Qj67M7K46n30L39M5J30O2m22N3J51L5L16j05k44j62K33J72q5j22j14
6924h3K23m09K83L21j54q3l46L03J79k02K92J53o40J39j16M07k9m06N9n8j20L39
6946E2J30n3q1K04n96M22K1K7o4j81J69l3l17L18K4j37P0%j11M07k01M02j98m16
6970a42K28k6j26ML91k95j99Q9J03l51R35m62l77j54L03K21k40K44l5j11k60K67
$$ plain form
6992 7 -144 185 206 -120 -300 98 -274 -134 219 -78 -157 75 -193 -56 130 242 -41 54 -141 344 253 10
7014 10 144 141 -143 18 3 -5 277 -277 -146 -391 -31 91 295 -51 67 -138 -29 -64 265 230 -13 -84 71
7037 71 -108 142 421 30 -5 71 201 -31 -21 174 -18 -114 147 -148 30 313 135 -187 -22 294 164 -69
7059 -69 -35 -29 -169 -238 -320 202 -149 -55 136 -298 -30 224 353 11 -245 -102 -179 63 134 38 36 -155 -3 -133
7083 -133 -17 -109 118 -120 -315 -35 -40 122 273 182 -75 -134 128 -176 390 135 -55 -92 -263 102 265 93
7105 93 -1 -374 -80 6 87 277 22 74 -129 -214 -125 -50 257 119 116 85 -161 -118 66 98 -164 -332 -184 -190 59
7130 59 226 -354 94 -353 -139 204 87 181 254 23 -78 203 -98 -106 -282 -88 -44 -33 -242 111 173 -326 6
7153 6 -42 -113 47 -52 129 108 -210 -197 35 112 268 13 -87 -275 104 -6 202 114 -147 56 -8 378 319 -81
$$ packed form
6992Gj51L29K1l26j80L98l72J40L53k97p9K32k68J37J86J12k83R5j95M85r1k43
7014A0J34lk84J61j5qK82n54J31k45L60J22K04l46J18k05J09l5L29l5k43p1J55
7037G1j79K50K79l91l5P6J30k32J0J95j92r6K61k95J78K83j78l22J65L16j30k33
7059f9L4Oj40o9q2N22l51R4J91m34K68K54J29l42k56J43p7K42P1r6kj91J52j30
7083a33J16r2K27k38j95K80nJ62J51r1k57n9K62l04N66k55j90l7j71L65J63j72
7105I3r4l73K94Q6Q1J90k55N2k03q5Q9P5L07j38ll1k46M3J84L2k62j68J48oK49
7130E9J67n80M48m47K14L43j17R4P3k31j01K81l01qj76J94M4J1k09L53O2m99L32
7153Fm8p1J60r9J81k1l18J3K32P7J56k55j00j88L79j10K08q8k61K03o4L86n9m00
$$ plain form
7177 -81 18 -300 -141 -99 150 161 40 -16 -274 -277 -81 195 -233 467 58 -53 421 -35 366 -76 138 10
7199 10 -64 229 -5 177 65 -476 -262 -110 -48 -90 10 -202 108 -183 133 100 216 -107 -188 -223 266 -264
7221 -264 70 -1 -322 -177 -301 309 250 -29 -165 -189 -103 62 35 297 -126 -204 -130 -148 -155 39 -44 35 4 -154
7245 -154 112 112 19 127 -103 164 109 27 50 -66 -11 -288 -220 92 51 265 -59 133 -186 99 163 -85 -47 -103
7269 -103 -191 -102 -432 -151 55 4 -34 -194 173 394 100 125 105 -6 -159 -61 36 -211 16 -300 -60 -153 -47
7292 -47 103 -2 237 -43 61 65 26 392 311 9 -9 -83 -16 141 239 40 -85 213 -203 -77 -162 259 -251
7315 -251 92 -27 178 195 197 -228 47 83 143 511 545 182 22 32 44 30 -139 86 12 -92 -230 4 43 175
7339 175 -107 -368 -197 -323 -211 -91 -68 -133 -78 -34 130 33 -82 186 -50 -250 75 -203 83 198 -90 0
$$ packed form
7177h1R9l18J59M2K49J1j21n6k58lJ96K76m28P00m09j11M74m56M01m42K14j28
7199A0p4K93k34J82j12n41K14J52O2m2J00k12L10k91L16l3J16l23q1l5M89n30
7221b64L34p1l21J45j24O10n9k79j36k4Q6J65k7K62m23p8P4j8pJ94q3P9l1j58
7245a54K66%r3J08k30K67n5q2K3j16N5k77O8L12m1K14l24J92l19K85O4k48L8n6
7269a03q8Q9l30K81K06n1l8j60L67K21k94K5k0j11j53R8R7k47K27l16K40r3J06
7292d7J50j05K39k80J04Ml9L66q1l02j8p4O7J57R8j99j25K98m16J26q5M21n10
7315b51L43j19K05J7Km25K75L6O0L68L4l63j60J0J2j4j69K25p4j04j38K34L9J32
7339A75k82k61J71j26J12J20K3o5N5M4J64r7j15K68k36k00L25k78K86J15k88R0
$$ plain form
7361 0 116 -134 -195 79 -280 10 -207 -116 95 -27 99 10 -111 -124 -301 -67 -63 -68 12 -87 178 -62 71 -23
7385 -23 -22 -56 -324 65 103 366 -76 -9 -261 -136 -245 -161 36 -83 185 77 8 -283 2 411 37 -131 -84
7408 -84 180 126 112 -7 -287 57 -180 341 140 184 -135 -23 -130 127 142 156 -134 -95 -199 -48 124 275
7430 275 265 -135 -9 200 76 -264 140 24 -137 340 -105 -101 -29 -107 76 -217 -163 -200 -62 4 -70 260 -356
7453 -356 -23 -25 103 -125 -269 -184 -285 118 165 -27 3 -49 -456 -333 -247 161 186 -119 16 -345 -140 154 56
7476 56 288 21 -92 -237 37 6 81 172 -98 -180 21 217 243 204 35 -16 -10 104 -63 174 45 -69 -213
7499 -213 -28 263 56 79 25 -393 -202 159 -28 -150 17 -160 384 -115 -58 190 -128 -136 35 164 -27 154
7521 154 13 189 -320 -130 -79 11 60 -287 115 -297 -34 117 210 71 -139 -74 -134 -208 59 210 169 -16 -262
$$ packed form
7361@J16k50o1K74l59K90k17R1K11j22J26q9j21j3j77K34MnQ0r9K65k40J33r4
7385b3Jl4k68L89L8K63m42O7k52J25j09Q4J97j19K68j08o9k91K85M09l74j68M7
7408h4K64n4j4j19k80L44k37N21k01M4l19J12j07K57J5J4k90L9j04J51J72J51
7430B75j0m00J26K09j24l40M04j16j61M77m45MP2p8J83k93N4l7J38O6p4L30o16
7453c56L33kJ28k28j44Q5j01M03M7j92L0n2m07J23Q6M08K5l05J35l61K05K94r8
7476E6K32k67j13j45K74l1P5R1k70q2K01J96K6l9j69n1OJ14j67K37j29j14j44
7499b13J85K91k07K3n4m18J91L61j87j22J67j77N44m99N7K48l18qJ71J29j91J81
7521A54j41J76n09J90N1R0M9l47M02m12K63J51R3j39k10O5o0p4K67J51m1j85k46
$$ plain form
7544 -262 -137 -1 16 -63 37 175 68 162 256 249 -228 -390 -14 -71 -104 -127 92 43 152 33 -227 -35 160
7567 160 200 -166 105 -98 289 -84 207 7 -210 33 194 339 -15 150 -209 33 149 -238 91 204
7587 204 142 -450 -332 58 10 -28 65 -92 -242 -208 -93 544 13 21 -354 -237 36 65 69 32 -128 -386 -298 -50
7611 -50 -220 46 -65 -75 -142 30 -76 345 404 353 -188 -275 -116 -10 331 -208 -80 -146 77 149 77 95 5 -150
7635 -150 -30 -189 15 11 102 4 -193 -9 -111 -27 36 4 -127 -197 73 -56 -73 -1 164 86 120 -238 -98 73
7659 73 43 -140 -161 -36 -19 128 -25 -212 -97 104 -106 174 -26 185 -247 -138 -72 67 92 126 -64 -360
7681 -360 -56 -89 -14 -5 -22 180 -206 -128 38 -187 -281 36 41 85 -46 55 66 -177 -43 -106 93 186 -3 74 -103
7706 -103 -152 -115 -9 -20 53 225 53 75 -98 -218 -159 -11 -9 -10 -33 109 192 -38 -14 -413 -57 -84 221 6 34
$$ packed form
7544b62J25J36J7p9J00J38j07R4R4pm77j62L76n7l3k3K19m9J09j19k60J92J95
7567A60M0l66K71k03L87l73K91k00k17K43J61J45l54J65l59K42J16l87L29J13
7587B04o2n92J18L90m8l8R3j57j50L4J15O37n31Ql75J17K73K9Ml7j60k58Q8K48
7611e0j70K66j11j0o7J72j06M21N9n1n41q7J59J06L41n39J28o6K23P2p2J8r0j55
7635a50J20j59K04mR1r8j97J84j02Q4O3l2j31p0K70j29j7P2J65p8L4l58J40J71
7659G3l0j83k1J25J7J47j53j87J15K01k10K80k00K11m32J09O6J39K5L4j90k96
7681c60L04l3P5Rj7K02l86P8J66k25r4L17NM4j31J01J1k43J34o3J99R3j89P7j77
7706a03m9L7J06j1P3J72j72K2j73j20N9J48Kjk3J42Q3k30K4l99L56k7L05k15K8
$$ plain form
7731 34 -3 -341 52 -86 40 34 -389 -261 -108 -199 149 150 316 -143 43 -135 44 253 61 -138 -13 -38 -156
7754 -156 84 -55 219 56 -299 -47 71 212 -68 200 112 -144 168 89 23 -4 -390 -229 -153 72 -68 -64
7776 -64 -104 -152 -43 -265 214 146 129 356 -259 -115 204 -19 47 319 -193 -134 -234 107 300 237 -145 -282 -266
7799 -266 33 155 177 134 -181 6 -91 292 -119 245 -72 -125 -136 132 -132 160 111 28 -27 248 168 202 223 -38
7823 -38 28 -80 -107 -31 -16 -41 -108 -124 -171 349 65 46 -241 53 20 -73 49 -125 94 94 -167 63 -36 -155 320
7848 320 -291 64 -221 -64 -216 26 -364 -56 -120 33 91 -25 92 -74 -285 116 144 73 19 86 -214 39
7870 39 -167 0 184 247 -92 -22 24 -83 -163 136 146 -304 -217 115 151 26 -48 -53 -144 -284 -36 407 -82 -112
7894 -112 21 -350 211 75 196 -107 68 7 25 -233 93 -43 -59 -30 28 -78 54 109 318 20 -26 -139
$$ packed form
7731C4l7l38L93j38J26om23J28J53r1L48JJ66m59J86j78J79K09j92j99J25k5j18
7754a56K40j39K74j63l55K52J18J41k80K68q8k56L12p9o6k7l86J61P6K25j40M
7776f4m0m8J09k22M79o8j7K27o15J44L19k23O6K72n12N9j00L41J93o3l82j37J6
7799b66K99J22K2m3l15J87r7L83m11L64l17n3j1K68k64K92m9q3n5K75q0L4K1k61
7823c8O6j08k7P6J5k5o7j6m7N20k84j9k87K94l3r3J22j74K19%k61K30r9j19M75
7848C20o11L55k85J57j52K42l90L08o4J53N8j16J17j66k11M01K8p1n4O7l00K53
7870C9k06J67J84O3l39P0M6j07q0K99J0m50Q7L32L6j25p4nr1j40K48M43m89l0
7894a12J33l71N61j36J21l03J75o1J8k58L26j36j6K9N8j06J32N5K09k98m6j13
$$ plain form
7916 -139 216 159 423 128 -96 113 58 161 90 38 -113 46 74 81 110 189 58 -190 -187 -309 -144 -63 -101 -25 88
7941 88 -50 78 145 50 -324 -56 6 -35 -54 245 307 67 -331 -49 104 33 206 -81 44 189 -174 124 38
7964 38 209 17 -270 -113 -235 123 93 239 76 45 -230 104 -59 -243 -207 -159 -149 -87 -147 -8 58 116 -278
7987 -278 -192 15 185 204 -47 -79 -14 66 -16 -115 166 -155 40 -114 62 -223 204 -244 -24 -182 48 272
8009 272 -148 162 -63 84 -173 323 -217 358 149 116 54 134 205 -165 172 116 -187 239 198 68 114 -58
8031 -58 -69 103 9 -51 -34 -49 -7 -46 124 132 167 -259 41 -169 -247 -2 183 38 65 -162 60 66 -1 -99 155 -247
8057 -247 125 -168 4 223 57 43 -96 -82 -238 34 -197 130 46 -108 156 -252 377 61 208 -166 -33
8078 -33 -242 -3 -20 180 83 -172 -165 -344 109 175 -44 -11 -18 -172 -120 15 6 -187 -10 -262 104 -109 5 -120
$$ packed form
7916a39L55n7K64k95k24K09n5J03p1n2j51J59K8PK9P9j31k48Lj22J65Q1l8P6J13
7941H8j38J28O7r5l74K68O2m1j9K99O2k40l98K82J53p1J73k87J25J45l63K98q6
7964C8J71j92k87J57j22L58l0J46j63l1k75L34j63j84L6M8J0O2o0J39O6N8l94
7987b78Q6K07J70J9k51l2O5Q0q2r9K81l21J95j54J76k85M27m48K20j58K30K24
8009B72m20L10k25J47k57M96n40N75k09l3o2Q0P1l70L37n6l03M26m1j30M6j72
8031e8j1J72r4o0J7j5M2l9J70QL5m26L00k10p8K45J85j45K7k27K22Oo7r8K54m02
8057b47L72k93J72K19j66j4j39J4j56K72k31L27q4j54K64m08O29l16J47l74J33
8078c3k09K39j7K00r7k55Pj79M53O6k19L3pj54N2J35rj93J77k52L66k13J14j25
$$ plain form
8102 -120 -157 28 -27 310 -24 -36 319 65 134 -70 169 -62 -205 -53 -117 32 40 -150 324 145 3 -263
8124 -263 105 203 -99 410 -164 -270 -229 -264 140 -81 -36 19 -190 -23 49 -30 140 369 -53 -134 -52 -97 21
8147 21 33 -420 -135 305 22 17 13 -65 -336 276 22 -47 217 -94 81 -143 -129 185 87 56 -201 304 -237 58
8171 58 162 44 148 -123 -207 -212 10 -35 -118 280 -445 -176 42 -86 20 183 290 -97 -246 310
$$ packed form
8102a20l7J85n5L37l34j2L55k54O9k04K39k31j43J52o4J49Qj90M74j79j42k66
8124b63L68R8l02N09n74j06M1l5M04k21M5N5k09J67P2p9J70K29m22q1Q2m5J18
8147B1J2m53K85M40k83nmp8k71O12k54o9K64l11J75k24J4L14r8l1k57N05n41K95
8171E8J04j18J04k71q4nK22m5q3L98p25K69K18j28J06J63J07l87j49N56
8191C10
$$ Imaginary data points
##PAGE= N=2
##DATA TABLE= (X++(I..I)), XYDATA
$$ plain form
0 0 0 0 0 0 0 0 8 -8 8 -8 9 -16 16 -24 24 -32 40 -45 56 -63 73 -85 98 -113 133 -150 174 -196 222 -249
30 -249 281 -317 356 -397 443 -492 548 -609 676 -748 831 -920 1016 -1126 1247 -1384 1539
47 1539 -1715 1918 -2152 2430 -2762 3175 -3694 4378 -5318 6698 -8948 13254 -24547 119402
61 119402 301150 191327 111235 42294 72670 124634 183836 176149 127477 64174 68199 131557
73 131557 212291 226353 169692 75342 22904 38782 114746 187227 209158 163536 98816 67946
85 67946 99024 155495 185189 158286 100925 60320 70762 120013 166271 165514 110433 36597 -850
98 -850 23509 84439 127450 121326 80328 44062 40865 66672 91781 86534 43493 -8388 -23232
111 -23232 18289 86776 125410 106390 49709 -3564 -23388 -7620 20934 29010 589 -42971
$$ packed form
0@%%%%%%Qj6J6j6J7k5L2m0M8n6P2q5J01j19J36j58J83k11K46k83L24l70M18m71
30b49N30n98O73p53Q40r35J040j157J285j424J579j751J936k142K373k631K923
47A539l254L633m070M582n192N937o869Q072r696J2016j5646K2202l7801J43949
61A19402J81748j09823q0092o8941L0376N1964N9202p687m8672o3303M025O3358
73A31557Q0734J4062n6661r4350n2438J5878P5964P2481K1931m5622o4720l0870
85F7946L1078N6471K9694k6903n7361m0605J0442M9251M6258p57n5081p3836l7447
98h50K4359O0930M3011o124m0998l6266l197K5807K5109n247m3041n1881j4844
111b3232M1521O8487L8634j9020n6681n3273j9824J5768K8554Q076k8421m3560
$$ plain form
123 -42971 -55816 -18762 36953 61250 31860 -29730 -83684 -95417 -59168 -4215 25082 4705
135 4705 -43848 -75157 -62616 -22412 5816 -6111 -51216 -96687 -105785 -70891 -19009 6027
147 6027 -18510 -77485 -125532 -128561 -89581 -42987 -23988 -41543 -75813 -95058 -83874 -51669
159 -51669 -29773 -43027 -84749 -120665 -120064 -81270 -32782 -7690 -18744 -54492 -90684 -103774
171 -103774 -89475 -66504 -59913 -74712 -90966 -87189 -62521 -35351 -23147 -33569 -60144 -86991
183 -86991 -93976 -74752 -45466 -28894 -31690 -40903 -44168 -39688 -34068 -32639 -38789 -49690 -56191 -48861
197 -48861 -29919 -12551 -10227 -21780 -36451 -43032 -38944 -29129 -20626 -16486 -14670 -10785 -1675 8158
211 8158 10444 542 -16696 -28523 -25603 -9810 8474 20455 22953 17880 10532 5720 5477 5387 167
$$ packed form
123d2971j2845L7054N5715K4297k9390o1590n3954j1733L6249N4953K9297k0377
135D705m8553l1309J2541M0204K8228j1927m5105m5471r098L4894N1882K5036
147F027k4537n8975m8047l029L8980M6594J8999j7555l4270j9245J1184L2205
159e1669K1896j3254m1722l5916O01L8794M8488K5092j1054l5748l6192j3090
171a03774J4299K2971O591j4799j6254L777K4668K7170J2204j0422k6575k6847
183h6991o985J9224K9286J6572k796r213l265M480N620J429o150j0901o501P330
197d8861J8942J7368K324j1553j4671o581M088R815Q503M140J816L885R110R833
211H158K286r902j7238j1827K920J5793J8284J1981K498n073p348m812k43r0n220
$$ plain form
226 167 -7110 -7725 3530 21033 34311 39122 35101 24569 12488 5285 7978 15600 21888 26351
240 26351 31515 37376 38717 33388 26278 20839 17434 16854 19090 25160 29695 31107 33520 36793 36792 29392
256 29392 16020 6685 8005 20476 37271 48020 46805 34537 19460 11896 16459 25458 27227
269 27227 19566 9281 8276 21190 39874 50265 41478 16324 -9351 -18343 -4331 21923 39506
282 39506 37052 19043 3270 2701 14927 27593 26268 8194 -15225 -23504 -5904 24985 45369
295 45369 38859 10653 -17895 -27726 -15040 7930 22300 15802 -4306 -17631 -9763 12236 27132
308 27132 19109 -7702 -33789 -40648 -20896 11655 32050 25276 -2502 -26457 -28325 -11164 6494
321 6494 7466 -10246 -30187 -32954 -12416 17403 31680 16889 -17383 -45219 -45570 -19873 10296
$$ packed form
226A67p277o15J1255J7503J3278M811m021j0532j2081p203K693P622O288M463
240B6351N164N861J341n329p110n439l405n80K236O070M535J412K413L273jp400
256B9392j3372r335J320J2471J6795J0749j215j2268j5077p564M563Q999J769
269B7227p661j0285j005J2914J8684J0391q787k5154k5675q992J4012K6254J7583
282C9506k454j8009j5773n69J2226J2666j325j8074k3419q279J7600L0889K0384
295D5369o510k8206k8548r831J2686K2970J4370o498k0108j3325P868K1999J4896
308B7132q023k6811k6087o859J9752L2551K0395o774k7778k3955j868J7161J7658
321F494R72j7712j9941k767K0538K9819J4277j4791l4272k7836l51K5697L0169
$$ plain form
334 10296 20505 5059 -19568 -30451 -17909 6320 18964 5564 -25316 -48961 -42713 -8933
346 -8933 26635 36981 14567 -22056 -44513 -36521 -6959 18214 17467 -7607 -32273 -30857 -2027
359 -2027 29372 37214 11869 -28351 -54342 -44136 -4675 33651 41294 14811 -20611 -33732 -16274
372 -16274 14859 30731 17108 -15961 -39885 -31066 7319 45222 52505 22436 -20993 -43475
384 -43475 -29655 7488 36729 36210 8035 -20194 -23443 1779 32984 41606 17326 -20734 -40644
397 -40644 -24288 16546 50554 51411 20723 -15945 -30548 -13081 18485 36172 24260 -4276
409 -4276 -22456 -11371 20353 46601 43656 11915 -26273 -40968 -20560 17660 42762 36842 8457
422 8457 -15785 -16132 5453 29113 31170 7866 -23180 -33799 -12710 24950 48257 38909 4502
$$ packed form
334A0296J0209j5446k4627j0883J2542K4229J2644j3400l0880k3645O248L3780
346h933L5568J0346k2414l6623k2457P992K9562K5173p47k5074k4666J416K8830
359b027L1399P842k5345m0220k5991J0206L9461L8326P643k6483l5422j3121J7458
372a6274L1133J5872j3623l3069k3924Q819L8385L7903P283l0069m3429k2482
384d3475J3820L7143K9241n19k8175k8229l249K5222L1205Q622k4280l8060j9910
397d0644J6356M0834L4008Q57l0688l6668j4603J7467L1566J7687j1912k8536
409d276j8180J1085L1724K6248k945l1741l8188j4695K0408L8220K5102n920k8385
422H457k4242l47K1585K3660K057k3304l1046j0619K1089L7660K3307r348l4407
$$ plain form
435 4502 -27682 -34256 -12689 17504 30125 15304 -12601 -27549 -15594 13161 32382 24168 -7199
448 -7199 -37297 -41360 -15324 20414 38656 25359 -6870 -32687 -31661 -8515 14366 16257 -5066
461 -5066 -29624 -34750 -14243 15394 29896 15701 -17766 -45064 -46373 -21172 8670 20068 6900
474 6900 -16993 -29950 -21617 -680 12960 4681 -19767 -40542 -38718 -15243 11990 21955 8357
487 8357 -18054 -37011 -35087 -15743 2418 4333 -10338 -26306 -27403 -12179 6112 12115 -364
500 -364 -22275 -36609 -31215 -10374 10660 16092 3386 -14865 -23775 -16951 -3276 4249 -1472 -15400
514 -15400 -23918 -17529 157 15528 16808 2896 -16855 -26022 -19372 -2451 10342 11310 2561 -5841
528 -5841 -5225 3594 13052 12832 2048 -11549 -15495 -6218 9517 21348 21285 10748 -1177 -6364 -1160
$$ packed form
435D502l2184o574K1567L0193J2621j4821k7905j4948J1955K8755J9221q214l1367
448g199l0098m063K6036L5738J8242j3297l2229k5817J026K3146K2881J891k1323
461e066k4558n126K0507K9637J4502j4195l3467k7298j309K5201K9842J1398j3168
474F900k3893j2957Q333K0937J3640q279k4448k0775J824K3475K7233R965j3598
487H357k6411j8957J924J9344J8161J915j4671j5968j097J5224J8291O003j2479
500c64k1911j4334N394K0841K1034N432j2706j8251q910O824J3675P525n721j3928
514a5400q518O389J7686J5371J280j3912j9751r167O650J6921J2793R68q749q402
528e841O16Q819R458k20j0784j3597l946R277J5735J1831o3j0537j1925n187N204
$$ plain form
543 -1160 7791 12050 8709 3287 2523 8363 17116 21828 19435 9909 555 -1504 5023 14974 21144
558 21144 20324 15914 12515 12151 13453 13837 11447 7819 6161 9270 15705 21261 22581 19295 13551 9883
574 9883 8954 10360 11717 12429 13537 16195 19279 20882 18773 13655 8390 5418 6999 10447 13658 13648
590 13648 12287 12004 12889 13829 12642 7431 1836 -1679 958 9015 15919 17028 11302 4471 162 987
606 987 4463 6585 3491 -2080 -4767 -546 8205 13302 9406 -1370 -11645 -15687 -10259 -48 6286
621 6286 4195 -4377 -11183 -9962 -2507 3140 670 -9630 -20394 -21853 -12219 1809 8373 2735
635 2735 -11353 -23058 -24725 -14912 -3814 -423 -9198 -20661 -24622 -16239 -3094 3662 -3362 -19626
649 -19626 -32791 -32318 -17728 -338 5895 -3021 -18607 -28586 -24383 -10785 -550 -3386 -17638
$$ packed form
543a160Q951M259l341n422p64N840Q753M712k393r526r354k059O527R951O170
558B1144q20m410l399l64J302L84k390l628j658L109O435N556J320l286n744l668
574I883r29J406J357P12J108K658L084J603k109n118n265k972J581L448L211j0
590A3648j361k83Q85R40j187n211n595l515K637Q057O904J109n726o831m309Q25
606I87L476K122l094n571k687M221Q751N097l896j0776j0275m042N428J0211O334
621F286k091q572o806J221P455N647k470j0300j0764j459R634J4028O564n638
635B735j4088j1705j667R813J1098L391q775j1463l961Q383J3145O756p024j6264
649a9626j3165M73J4590J7390O233q916j5586r979M203J3598J0235k836j4252
$$ plain form
662 -17638 -31123 -30565 -14743 3982 9724 -1195 -20973 -34338 -30759 -13377 3584 5513 -7345
675 -7345 -22527 -25843 -13907 3138 10328 695 -18412 -30918 -25901 -5857 13270 16791 2133
688 2133 -17611 -26508 -17109 1692 14140 8888 -7955 -21061 -17719 758 18519 21595 6327
701 6327 -15356 -25615 -15120 7497 25005 23086 5042 -12336 -14440 47 18654 24557 11840
714 11840 -8824 -19429 -8684 14990 33165 31444 11274 -10853 -17934 -3497 19065 31241
726 31241 22794 2612 -10690 -5198 15061 32635 32617 13373 -9358 -17356 -2665 22624 37865
739 37865 31399 9448 -9717 -10391 6528 26593 31444 17352 -3916 -12483 -1135 21008 35817
752 35817 30171 8204 -12576 -15876 853 23042 32765 22487 2214 -10617 -5798 11768 26770
$$ packed form
662a7638j3485N58J5822J8725N742j0919j9778j3365L579J7382J6961J929j2858
675g345j5182l316J1936J7045P190r633j9107j2506N017K0044J9127L521j4658
688B133j9744q897R399J8801J2448n252j6843j3106L342J8477J7761L076j5268
701F327k1683j0259J0495K2617J7508j919j8044j7378k104J4487J8607N903j2717
714A1840k0664j0605J0745K3674J8175j721k0170k2127p081J4437K2562J2176
726C1241q447k0182j3302N492K0259J7574j8j9244k2731p998J4691K5289J5241
739C7865o466k1951j9165o74J6919K0065M851j4092k1268q567J1348K2143J4809
752C5817n646k1967k0780l300J6729K2189R723j0278k0273j2831M819J7566J5002
$$ plain form
765 26770 24300 5818 -13304 -16314 -787 21380 31640 21842 44 -16411 -14977 2258 18879
778 18879 21320 7029 -9899 -15665 -4165 14694 24354 15284 -5745 -21973 -20538 -1873 16830
791 16830 21523 8595 -10551 -20405 -12783 4187 15821 10555 -6940 -21761 -20237 -4327 13750
804 13750 18944 6106 -14843 -26810 -21045 -3012 11887 11538 -2838 -18130 -21397 -9969 5688
817 5688 11367 1941 -15867 -27110 -21702 -4851 10609 12642 -388 -17599 -24606 -16916 -1827
830 -1827 6965 2531 -10741 -20700 -18779 -5903 6846 8718 -2021 -17542 -24483 -17903 -3243 7441
844 7441 6119 -4520 -15561 -17611 -8715 2028 4904 -2469 -13608 -18097 -12158 -442 8555 7013
858 7013 -3296 -14294 -16599 -9470 1012 5379 1469 -6341 -10960 -7582 739 6929 5339 -3311
$$ packed form
765B6770k470j8482j9122l010J5527K2167J0260r798k1798j6455J434J7235J6621
778A8879K441j4291j6928n766J1500J8859R660r070k1029j6228J435J8665J8703
791A6830M693j2928j9146r854P622J6970J1634n266j7495j4821J524J5910J8077
804A3750N194j2838k0949j1967N765J8033J4899l49j4376j5292l267J1428J5657
817E688N679r426j7808j1243N408J6851J5460K033j3030j7211p007P690J5089
830a827Q792m434j3272r959J921J2876J2749J872j0739j5521o941O580J4660J0684
844G441j322j0639j1041k050Q896J0743K876p373j1139m489N939J1716Q997j542
858G013j0309j0998k305P129J0482M367l910p810m619L378Q321O190j590q650
$$ plain form
872 -3311 -11230 -12391 -4835 4396 8997 5501 -2250 -7562 -6545 334 5839 5379 28 -4963 -5005 228
888 228 7406 9833 6004 -1592 -5971 -4312 2204 7803 9032 5183 1051 -487 2228 6385 7793
903 7793 4985 519 -1953 232 5618 9822 10331 7245 2458 738 2504 5003 6580 5503 3219
918 3219 3447 5331 7480 8715 7549 4640 2392 2205 4648 6266 6609 5124 4358 4484 6278 6853 5349
935 5349 2827 950 2033 5435 8222 7868 4999 1524 123 2210 5554 6804 4411 180 -1325
950 -1325 1020 5888 8659 6957 1732 -4346 -5627 -1560 4819 7462 5068 -673 -4675 -3114 2419
965 2419 6314 5153 -1210 -8024 -9333 -3914 4133 7466 4583 -3158 -9356 -8571 -2137 4368 4608 -1820
981 -1820 -9527 -11782 -6454 1581 6226 2186 -6641 -13149 -12373 -4383 4016 5293 -1346 -10868 -14725
$$ packed form
872c311p919j161P556R231M601l496p751n312J017O879N505m60n351m991m2N233
888B28P178K427l829p596m379J659O516N599J229l849m132j538K715M157J408
903G793k808m466k472K185N386M204N09l086m787j720J766K499J577j077k284
918C219K28J884K149J235j166k909k248j87K443J618L43j485p66J26J794N75j504
935E349k522j877J083L402K787l54k869l475j401K087L344J250k393m231j505
950a325K345M868K771j702n225o078j281M067O379K643k394n741m002J561N533
965B419L895j161o363o814j309N419Q047L333k883p741o198P85O434O505K40o428
981a820p707k255N328Q035M645m040q827o508P76P990Q399J277o639r522l857
$$ plain form
996 -14725 -10125 -615 5049 1438 -7792 -14633 -13128 -4039 4656 6057 -1531 -12702 -17878 -12913 -1448
1011 -1448 6299 3907 -5942 -14220 -14272 -5076 5254 7542 -423 -12575 -18311 -12860 -181 9353 8240
1026 8240 -2386 -13375 -15644 -6421 5970 10822 3765 -8752 -16130 -12141 629 11871 12184 1038
1040 1038 -11605 -16039 -6757 7288 15174 10024 -3672 -13368 -12115 399 12962 15529 5373
1053 5373 -8020 -13338 -5664 9078 18676 14699 1010 -11824 -12121 -103 13765 18854 10217 -3095
1067 -3095 -10122 -4382 9146 19577 17212 4243 -9158 -10867 -240 14954 20760 14025 333
1080 333 -8721 -5187 7454 18847 18513 6480 -6552 -9671 -353 13764 21342 15116 1217 -9184
1094 -9184 -7288 5404 17682 19107 8648 -5180 -10296 -2824 10583 19262 14254 736 -10114
$$ packed form
996a4725M600R510N664l611r230o841J505R089Q695J401p588j1171n176M965J1465
1011a448P747k392r849q278n2R196J0330K288p965j2152n736N451J2679R534j113
1026H240j0626j0989k269R223J2391M852p057j2517p378L989J2770J1242L13j1146
1040A038j2643m434R282J4045P886n150j3696r696J253J2514J2563K567j0156
1053E373j3393n318P674J4742R598l977j3689j2834k97J2018J3868N089q637j3312
1067c095p027N740J3528J0431k365j2969j3401j709J0627J5194N806o735j3692
1080C33r054L534J2641J1393l34j2033j3032l119R318J4117P578o226j3899j0401
1094i184J896J2692J2278J425j0459j3828n116P472J3407Q679n008j3518j0850
$$ plain form
1107 -10114 -9171 2893 15288 18388 8501 -5928 -13356 -7176 6279 15912 13317 930 -10717
1120 -10717 -11999 -1139 11590 16487 7363 -7516 -16053 -11201 1939 12915 12343 986 -11535
1133 -11535 -15092 -6611 6489 12405 5672 -7804 -17140 -14551 -2505 9044 10285 164 -12572
1146 -12572 -17546 -10438 1537 8751 4992 -6523 -16417 -16698 -6519 4382 7425 -713 -11939 -17768
1160 -17768 -12452 -1576 6580 4296 -5545 -15597 -16593 -8270 1394 5391 -515 -10104 -15638 -12114
1174 -12114 -2374 5108 3937 -4657 -13941 -15328 -8398 1025 5161 1066 -7437 -13292 -10761 -2512 4818
1189 4818 4306 -3117 -10821 -12588 -6461 1912 6478 3162 -5024 -10322 -8944 -1220 5627 6287 540
1204 540 -7028 -9037 -4457 3492 7485 5031 -1737 -6843 -6024 425 6658 7955 3770 -2842 -5738
$$ packed form
1107a0114R43J2064J2395L100r887j4429p428O180J3455R633k595j2387j1647
1120a0717j282J0860J2729M897r124j4879q537M852J3140J0976n72j1357j2521
1133a1535l557Q481J3100N916o733j3476r336K589J2046J1549J241j0121j2736
1146a2572m974P108J1975P214l759j1515r894k81J0179J0901L043q138j1226n829
1160a7768N316J0876Q156k284r841j0052r96Q323R664L997n906r589n534L524
1174a2114R740P482j171q594r284j387O930R423M136m095q503n855K531Q249P330
1189D818n12p423p704j767O127Q373M566l316q186n298J378P724O847O60n747
1204E40p568k009M580P949L993k454o768n106Q19O449O233J297m185o612k896
$$ plain form
1219 -5738 -2349 4309 8280 6924 1817 -2781 -2367 2103 7466 8737 5583 270 -2357 20 4994
1234 4994 8281 7937 3731 352 288 3529 7364 8737 6189 2401 918 2380 5551 8022 7328 4420
1250 4420 1935 1965 4669 7073 7128 5384 2524 2044 3528 5351 6588 5308 3176 2006 3182 5273
1266 5273 6354 5553 3320 1193 1676 3591 5443 5214 3504 1051 892 2759 4590 5078 2935 407
1282 407 -917 770 3351 5045 3520 699 -1628 -1185 1036 3202 3379 837 -2116 -2808 -815 2156
1298 2156 3308 1383 -2360 -5018 -4183 -552 2626 2230 -1077 -4732 -5404 -3235 1077 2215 -378 -4954
1314 -4954 -7606 -6018 -1522 2257 1419 -2784 -7496 -8479 -4783 -289 1831 -966 -6297 -9481 -7555
1329 -7555 -2043 2287 1604 -4201 -9510 -10456 -6232 250 3181 24 -6486 -10591 -8755 -2862 2425
$$ packed form
1219e738L389O658L971j356n107m598M14M470N363J271l154n313k627K377M974
1234D994L287l44m206l379o4L241L835J373k548l788j483J462L171K471o94k908
1250D420k485L0K704K404N5j744k860m80J484J823J237j280k132j170J176K091
1266E273J081q01k233k127M83J915J852k29j710k453j59J867J831M88k143k528
1282D07j324J687K581J694j525k821k327M43K221K166J77k542k953o92J993K971
1298B156J152j925l743k658Q35L631L178l96l307l655o72K169M312J138k593m576
1314d954k652J588M496L779q38m203m712r83L696M494K120k797n331l184J926
1329g555N512M330o83n805n309r46M224O482K931l157o510m105J836N893N287
$$ plain form
1344 2425 2511 -3320 -9643 -11509 -6500 1033 5053 1571 -5712 -11699 -10644 -3561 3416 4859 -691
1359 -691 -8002 -10871 -6516 1127 5774 3786 -4201 -10602 -10528 -3248 5262 7425 2432 -6257 -10260 -7273
1375 -7273 1266 7300 6313 -1383 -8579 -8869 -1834 6413 9543 4339 -4332 -9593 -6755 2125 9295
1390 9295 9338 1883 -6175 -7964 -2136 7190 10811 6865 -2348 -8279 -5733 3647 11343 12016 4594 -4873
1406 -4873 -8163 -2769 6884 12736 9228 452 -6328 -5044 3360 11727 13006 5740 -3941 -7981 -2538
1421 -2538 7438 13800 11435 2742 -5295 -6013 1671 10459 13540 7352 -2341 -7035 -2957 6507 13304
1436 13304 12041 3194 -5874 -7316 -358 9356 13733 8607 -691 -7025 -4555 4074 11479 11233 3076
1451 3076 -5732 -8254 -2189 7838 12742 8923 -675 -8111 -7077 1184 9104 10166 3288 -5614 -8824
$$ packed form
1344B425Q6n831o323j866N009P533M020l482p283n987J055P083O977J443n550
1359f91p311k869M355P643M647j988p987o401P4P280Q510K163m993q689m003K987
1375g273Q539O034r87p696p196k90P035Q247L130n204q671n261K838Q880P170
1390I295M3p455q058j789N828R326L621l946r213n931K546R380P696O73p422r467
1406d873l290N394R653N852l508q776o780J284Q404Q367J279p266r681m040N443
1421b538R976O362k365q693q037p18P684Q788L081o188r693m694M078R464O797
1436A3304j263q847r068j442O958R714M377n126r298o334K470Q629P405k46q157
1451C076q808k522O065J0027M904l819r598p436J034Q261P920J062o878q902l210
$$ plain form
1466 -8824 -3782 5232 10357 7576 -1679 -9267 -9059 -1287 7499 9554 3493 -5603 -10272 -6607 1879
1481 1879 8216 6012 -1917 -9333 -9897 -3087 4891 7735 2807 -6288 -11464 -8757 -827 5848 5372
1496 5372 -1204 -8672 -10387 -5218 2431 5776 1822 -6223 -11418 -9280 -1927 4544 5164 -766 -8178
1511 -8178 -11066 -6781 418 4257 1832 -5206 -9875 -8663 -2621 3645 4874 -509 -7788 -10942 -7130
1526 -7130 -228 4353 2913 -3039 -7993 -8266 -3509 2292 4119 -167 -5924 -8613 -5683 787 4623
1541 4623 3869 -1305 -6586 -7195 -3062 2299 4420 1730 -3031 -5961 -4044 1131 4721 3889 -627 -4874
1557 -4874 -5395 -1609 3423 5963 3588 -856 -3578 -2333 979 4513 4274 1068 -1929 -2754 464 4468
1573 4468 6032 4054 -2 -2416 -1052 2059 4811 5207 3108 156 -149 1651 4439 5801 3729
$$ packed form
1466h824N042R014N125k781r255p588K08P772Q786K055o061r096m669L665Q486
1481A879O337k204p929p416n64O810P978K844m928r095n176K707P930O675m76
1496E372o576p468j715N169P649L345l954q045n195K138P353O471O20n930p412
1511h178k888M285P199L839k425p038m669J212O042O266J229n383p279l154L812
1526g130O902M581j440n952m954k73M757N801J827m286n757k689K930O470L836
1541D623p54n174n281o09M133N361K121k690m761k930J917N175L590q32m516m247
1557d874n21L786N032K540k375m444k722J245L312L534k39l206k997q25L218M004
1573D468J564j978m056k414J364L111K752L96k099k952l05J800K788J362k072
$$ plain form
1588 3729 593 -858 503 3536 5678 5923 3256 497 369 1906 4102 4382 3241 1442 683 2065
1604 2065 3874 5143 4260 1736 -403 349 1855 3996 4176 2861 1289 908 1724 3260 3097 1955
1620 1955 -51 -1030 81 2478 3729 3341 1117 -935 -914 384 2032 1957 347 -1434 -1526 50 2160
1637 2160 3043 1101 -1732 -3947 -3011 -685 1753 1470 -774 -2920 -3091 -1364 755 1204 -1039 -3914
1653 -3914 -5431 -3743 -227 2165 1323 -1603 -4966 -5757 -3385 -178 898 -1229 -4540 -6044 -4184
1668 -4184 -511 1866 508 -3192 -6865 -7102 -3714 613 2657 -77 -4196 -6483 -5302 -1544 1416
1683 1416 840 -3502 -6793 -6834 -2826 2096 4086 635 -4208 -7379 -6245 -1517 3072 3040 -1267 -5124
1699 -5124 -5986 -2375 2498 4687 1963 -3587 -7237 -5639 193 5121 5712 1375 -3881 -5833 -2915
$$ packed form
1588C729l136j451J361L033K142K45k667k759j28J537K196K80j141j799p59J382
1604B065J809J269q83k524k139P52J506K141J80j315j572l81Q16J536j63j142
1620A955k006r79J111K397J251l88k224k052K1J298J648p5j610j781r2J576K110
1637B160Q83j942k833k215R36K326K438k83k244k146j71J727K119M49k243k875
1653c914j517J688L516K392q42k926l363p91K372L207J076k127l311j504J860
1668d184L673K377j358l700l673k37L388M327K044k734m119k287J181L758K960
1683A416n76m342l291m1M008M922J990l451m843l171J134M728M589l2m307l857
1699e124q62L611M873K189k724n550l650J598N832M928N91m337n256j952K918
$$ plain form
1714 -2915 2371 5438 3887 -1530 -5532 -4176 1483 6626 7398 2445 -3713 -6148 -3039 3511 7577
1729 7577 6296 867 -3975 -3395 1117 6821 7600 3574 -2921 -5540 -2203 4738 9638 8203 1974
1744 1974 -3738 -5082 -133 6136 8596 5120 -884 -4401 -1773 4298 9108 8063 1934 -4678 -5434
1759 -5434 -919 6144 9796 6737 93 -4544 -3660 2108 7306 7701 2420 -3781 -5657 -1080 5802
1774 5802 9305 6698 -514 -6090 -5719 74 6333 7766 3559 -2877 -5890 -2677 3776 7289 5327
1789 5327 -1137 -6847 -6757 -878 5784 7917 3587 -3473 -7509 -5296 826 5881 4869 -737 -6238
1804 -6238 -6837 -1877 4308 6471 2677 -4634 -8913 -6470 -398 5065 5390 283 -5755 -7599 -3678
1819 -3678 2001 4973 1733 -4276 -8379 -6353 -504 4871 5372 308 -6112 -8776 -5340 847 4436
$$ packed form
1714b915N286L067j551n417m002J356N659N143P72m953o158k435L109O550M066
1729G577j281n429m842N80M512N704P79m026o495k619L337O941M900j435o229
1744A974n712j344M949O269K460l476o004l517K628O071M810j045o129o612p56
1759e434M515P063L652l059o644m637Q84N768N198L95n281o201j876M577O882
1774E802L503k607p212n576L71N793O259J433m207o436l013L213O453L513j962
1789E327o464n710R0N879O662K133m330p060m036K213O122N055j012n606n501
1804f238n99M960O185K163l794p311m279K443O072N463L25n107o038j844L921
1819c678N679K972l240o009m103K026N849N375N01n064o420k664L436O187L589
$$ plain form
1834 4436 2456 -2815 -6783 -6501 -1648 3400 4548 31 -5951 -8260 -5250 730 4942 4043 -1193
1849 -1193 -6024 -6586 -2527 2170 4189 652 -4319 -6582 -4237 1066 4821 4131 -1124 -5743 -6589 -2736
1865 -2736 2508 4625 2417 -2279 -5096 -3659 511 4052 3466 -540 -4471 -5020 -1716 3365 5433
1880 5433 3226 -1262 -4472 -3801 16 3682 4083 1115 -2386 -3355 -503 3254 5144 3479 -1005 -3910
1896 -3910 -3193 626 4329 4767 2486 -804 -2385 -1101 2132 3896 2996 -209 -2304 -1470 1292 4482
1912 4482 4521 2319 -1134 -2699 -1001 1995 3583 3407 1068 -1007 -661 1278 3539 3419 1574 -1361
1928 -1361 -2228 -331 2404 4190 3274 836 -634 -1026 820 1925 2176 888 -867 -726 612 2605
1944 2605 3376 2157 -480 -1823 -1300 438 1956 2241 744 -401 -606 290 1790 1678 385 -1440
$$ packed form
1834D436j980n271l968K82M853N048J148m517n982k309L010N980M212q99n236
1849a193m831n62M059M697K019l537m971k263K345N303L755o90n255m619q46L853
1865b736N244K117k208m696k817J437M170L541n86m006l931n49L304N081K068
1880E433k207m488l210O71L817L666M01k968l501r69K852L757J890j665m484k905
1896c910P17L819L703M38k281l290j581J284L233J764r00l205k095Q34K762L190
1912D482L9k202l453j565J698K996J588j76k339k075L46J939K261j20j845k935
1928a361q67J897K735J786r16k438j470l92J846J105K51j288j755J41J338J993
1944B605P71j219k637j343N23J738J518K85j497j145k05Q96J500j12j293j825
$$ plain form
1960 -1440 -1824 -920 946 2220 2155 424 -1437 -1423 -314 648 969 -416 -1767 -1766 -143 1401 2153 763
1978 763 -1582 -2773 -2396 -338 1245 840 -366 -1602 -1987 -289 780 987 -390 -2749 -3500 -2133
1994 -2133 390 1976 1487 -743 -2501 -3028 -1180 648 1013 -240 -2422 -2988 -1421 929 2375 1228
2010 1228 -1965 -4114 -4113 -1196 1440 2791 113 -1944 -3208 -2162 399 1843 1069 -1833 -4000 -3570
2026 -3570 -735 2335 3404 793 -2770 -4429 -2757 367 2571 2004 -749 -3304 -3498 -761 2821
2041 2821 3433 696 -3092 -5124 -3222 887 4013 3760 443 -3301 -3804 -1551 2015 3418 1287 -2663
2057 -2663 -4339 -2605 1680 4795 4237 482 -3693 -4488 -2275 2431 4797 2968 -896 -3653 -2437
2072 -2437 1054 4314 4177 209 -3824 -4485 -1324 3616 5929 4177 -797 -4105 -3311 299 4236 4732
$$ packed form
1960a440l84R04J866J274o5j731j861J4J109R62L21j385j351JJ623J544P52j390
1978G63k345j191L77K058J583m05j206j236l85J698J069K07j377k359p51J367
1994b133K523J586m89k230j758n27J848J828L65j253k182n66J567K350J446j147
2010A228l193k149JK917K636J351k678k057j264J046K561J444p74k902k167M30
2026c570K835L070J069k611l563j659J672L124K204n67k753k555j94K737L582
2041B821O12k737l788k032J902M109L126k53l317l744n03K253L566J403k131l950
2057b663j676J734M285L115n58l755m175p95K213M706K366j829l864k757J216
2072b437L491L260j37l968m033o61L161M940K313j752m974l308P94L610L937M96
$$ plain form
2088 4732 1531 -2670 -3904 -1045 3773 5804 4285 -790 -4537 -4040 313 4625 5963 3191 -1662
2103 -1662 -3875 -1843 2361 5204 3979 -503 -4001 -4170 -115 4915 6333 3434 -1756 -4869 -3477
2118 -3477 1155 4888 4949 980 -3052 -3647 -521 4172 5786 2804 -1979 -5230 -3877 1081 5498 5531
2134 5531 1695 -3147 -4646 -1978 2289 5053 3346 -1479 -4858 -3682 577 4808 5357 1108 -3682
2149 -3682 -5841 -3062 1589 4685 3841 -419 -4093 -4059 -616 3546 3957 741 -3939 -5480 -3221 1348
2165 1348 4907 4047 -780 -4521 -5596 -2127 1940 3652 1438 -2834 -5029 -3635 780 3804 2980
2180 2980 -1035 -5173 -5725 -2788 1854 3987 2123 -2041 -4803 -4187 -602 2562 2637 -737 -4216 -5088
2196 -5088 -2282 1858 3772 2353 -2021 -5128 -4860 -939 2481 3320 520 -3060 -4151 -2052 1372
$$ packed form
2088D732l201m201j234K859M818K031j519n075l747M97M353M312J338k772m853
2103a662k213K032M204K843j225m482l498j69M055N030J418k899n190l113J392
2118c477M632L733O1l969m032n95L126M693J614k982m783l251J353M958M417L3
2134E531l836m842j499K668M267K764j707m825l379J176M259M231N49m249m790
2149c682k159K779M651L096q44m260l674L4L443M162M11l216m680j541K259M569
2165A348L559q60m827l741j075L469M067J712k214m272k195J394M415L024q24
2180B980m015m138n52K937M642K133j864m164k762O16L585L164P5l374l479q72
2196e088K806M140J914j419m374l107K68L921L420Q39k800l580j091K099L424
$$ plain form
2211 1372 3431 1971 -1819 -4525 -3690 -564 2840 4064 1553 -2084 -3832 -2904 853 3033 2075 -576
2227 -576 -2777 -2619 -6 2843 3630 1650 -2036 -3227 -2190 1127 3119 3017 982 -1424 -2036 -56
2243 -56 2790 3314 1525 -862 -2205 -987 1791 3742 3320 1092 -1484 -1879 -160 2221 3146 2264 2
2260 2 -1262 -406 2158 3322 2763 663 -1478 -1547 179 2625 3384 2355 298 -801 -396 1101 2215
2277 2215 1893 433 -1059 -967 633 2650 2959 1146 -536 -1175 -632 769 1779 1559 309 -751 -577
2294 -577 291 1611 1603 405 -1233 -1938 -967 791 1733 1359 37 -1413 -1459 -445 607 610 -561 -1294 -1496
2313 -1496 -355 1063 1300 149 -1660 -2256 -1836 -329 651 358 -254 -1402 -1883 -859 507 715 -776
2330 -776 -2266 -2659 -1755 46 1243 547 -955 -2402 -2341 -1040 220 351 -894 -2023 -2558 -1231 755
$$ packed form
2211A372K059j460l790k706Q35L126L404J224k511l637j748R28L757K180r58k651
2227e76k201J58K613K849P87j980l686j191J037L317J992j02k035k406o12J980
2243e6K846N24j789k387j343J218K778J951m22k228k576l95J719K381R25q82k262
2260Bj264Q56K564J164n59k100k141o9J726K446P59j029k057j099M05J497J114
2277B215l22j460j492R2J600K017L09j813j682o39N43J401J010k20j250j060J74
2294e77Q68J320qj198j638p05R71J758R42l74j322j450m6J014J052Lj171p33k02
2313a496J141J418K37j151j809n96M20J507R80k93o12j148m81J024J366K08j491
2330g76j490l93R04J801J197o96j502j447O1J301J260J31j245j129n35J327J986
$$ plain form
2347 755 1506 461 -1690 -3235 -2827 -820 1005 1328 100 -2049 -2729 -1225 504 1662 443 -1773
2363 -1773 -3024 -2128 -18 2116 2400 255 -1936 -2883 -1452 849 2124 1005 -832 -2314 -2056 525
2379 525 2461 2649 173 -2477 -2897 -1573 1548 3318 2564 -248 -2184 -2167 304 2369 2845 908 -1826
2396 -1826 -2567 -994 2031 3846 3061 -160 -2505 -2705 53 2971 3855 1935 -788 -2197 -948 1745
2412 1745 3835 3188 -111 -2480 -2878 245 3317 4397 2353 -627 -3000 -1683 1200 3457 3566 312
2428 312 -2393 -2713 17 3324 4307 2456 -952 -3474 -2679 672 3669 3647 1473 -1841 -3039 -1146
2444 -1146 2122 3766 2066 -1361 -3625 -3057 773 3498 4222 1100 -2600 -3884 -2299 1660 3233
2459 3233 2515 -755 -3297 -3179 -155 3288 3510 773 -2966 -4281 -2577 1021 3723 3001 -675 -3295
$$ packed form
2347G55P51j045k151j545M08K007J825L23j228k149o80J504J729J158j219k216
2363a773j251Q96K110K134K84k145k191r47J431K301J275j119j837j482K58K581
2379E25J936J88k476k650m20J324L121J770p54k812j936J7K471K065M76j937k734
2396a826p41J573L025J815p85l221k345k00K758K918Q84j920k723j409J249K693
2412A745K090o47l299k369l98L123L072J080k044k980k373J317K883K257J09l254
2428C12k705l20K730L307R83j851l408k522P95L351K997k2k174l314j198J893
2444a146L268J644j700l427k264N68L830K725P24l122l700j284J585L959J573
2459C233p18l270k542J18L024L443K22k737l739j315J704L598K702p22l676k620
$$ plain form
2475 -3295 -3676 -1234 1912 2875 776 -2616 -3847 -2666 746 3636 2908 -826 -3875 -4206 -1918 1820
2491 1820 3000 1473 -1304 -3824 -3093 331 2716 2613 -534 -3526 -4236 -1604 1763 3428 2361 -1488
2507 -1488 -3879 -3560 -118 2301 2628 155 -2740 -3700 -1658 1880 3415 2038 -1165 -3662 -3445 -574
2523 -574 2580 3470 1235 -2111 -3125 -2168 1077 3003 2340 -635 -3013 -2830 -216 2628 3073 1453
2539 1453 -2068 -3489 -2349 765 2979 2624 122 -2327 -2245 -170 2442 3181 1311 -1803 -3159 -1600
2555 -1600 592 3032 2918 714 -1803 -2459 -682 1718 2932 1493 -776 -2368 -1429 740 2857 2664
2571 2664 397 -1817 -2272 -903 1656 2895 1912 -410 -1712 -1444 285 2187 2049 378 -1492 -2023
2587 -2023 -675 1658 2729 1764 -154 -1857 -1739 87 1646 1947 624 -1152 -1387 -269 1412 2169
$$ packed form
2475c295l81K442L146R63k099l392j231J181L412K890p28l734l049l31K288L738
2491A820J180j527k777k520P31L424K385j03l147k992p10K632L367J665j067l849
2507a488k391L19L442K419L27k473k895r60K042L538J535j377l203k497K17K871
2523e74L154Q90k235l346j014R57L245J926o63k975k378J83K614K844M45j620
2539A453l521j421J140L114K214l55k502k449Q2K075K612P39j870l114j356J559
2555a600K192K440j14k204k517o56J777K400J214j439k269j592R39K169K117j93
2571B664k267k214m55J369K559J239r83k322j302K68J729J902j38j671j870n31
2587b023J348K333J071r65j918j703J18J826J559L01j323j776k35J118J681P57
$$ plain form
2603 2169 1668 -242 -1728 -1654 336 1810 2121 1089 -898 -1293 -587 893 1783 910 -174 -1705 -1003
2620 -1003 518 2082 1843 578 -688 -1458 -752 613 1410 946 -204 -1049 -628 679 1637 841 181
2637 181 -1225 -1529 -616 932 1678 852 -118 -1028 -753 422 746 662 -441 -1242 -1436 -236 938 1256
2655 1256 245 -985 -1855 -1148 17 771 649 -314 -1319 -1382 -65 841 889 -209 -1627 -1728 -816 468
2673 468 1199 627 -635 -1749 -1303 -61 357 694 -554 -1705 -1779 -705 732 1166 218 -1153 -2325
2690 -2325 -1751 -428 888 880 -173 -1733 -1873 -608 576 1099 34 -1500 -2230 -1537 -73 1424 1260
2707 1260 -468 -1937 -1919 -909 726 845 165 -1213 -1998 -1613 154 1540 1477 -342 -2316 -2348 -1099
2724 -1099 1095 1798 1075 -1030 -2014 -1365 434 1966 1362 -192 -2049 -1941 -683 1529 2412 1386 -738
$$ packed form
2603B169n01j910j486P4J990J474L11j032j987l95P06J480Q90q73j084j531P02
2620a003J521J564k39j265j266p70P06J365P97m64j150q45M21J307R58p96o60
2637A81j406l04R13J548P46q26r70r10K75J175L24q4j103q01j94J200J174L18
2655A256j011j230q70P07J165P54j22r63j005o3J317R06M8j098j418j01R12J284
2673D68P31n72j262j114M46J242M18L37j248j151p4J074J437M34r48j371j172
2690b325N74J323J316qj053j560j40J265J184N23j065j534p30O93J464J497j64
2707A260j728j469J8J010J635J19o80j378p85L85J767J386o3j819j974l2J249
2724a099K194P03p23k105r84O49J799J532o04j554j857J08J258K212Q83j026k124
$$ plain form
2741 -738 -2187 -1739 437 2098 2483 804 -1151 -1869 -280 1947 2633 1579 -583 -2094 -1617 514
2757 514 2867 2807 1180 -1071 -2148 -589 1556 2952 1807 -157 -1757 -1425 963 2846 2890 1374
2773 1374 -1367 -2202 -829 1464 2941 2692 173 -1622 -1639 329 2652 3135 1239 -1280 -2420 -986
2789 -986 1832 3400 2759 216 -1790 -2298 -194 2083 2976 1598 -1165 -2254 -1281 991 2882 2340
2805 2340 -52 -2336 -2419 -679 1734 3076 1468 -990 -2698 -1562 437 2158 2137 -11 -2325 -3073
2821 -3073 -918 1642 3060 1363 -1215 -3005 -2521 -235 1963 2233 369 -2278 -2984 -1258 1055 2514
2837 2514 1244 -1053 -3192 -2849 -656 1667 2403 746 -2145 -3295 -2014 425 2120 1609 -677 -3126
2853 -3126 -2786 -846 1738 2107 847 -2207 -3091 -2282 348 2355 1874 -617 -2403 -2654 -874 1247
$$ packed form
2741g38j449M48K176J661L85j679j955p18J589K227O86j054k162j511M77K131
2757E14K353o0j627k251j077J559K145J396j145j964j600L32K388J883M4j516
2773A374k741q35J373K293J477k49k519j795j7J968K323M83j896k519j140J434
2789i86K818J568o41k543k006n08K104K277Q93j378k763j089R73K272J891n42
2805B340k392k284q3J740K413J342j608k458j708J136J999J721k1k148k314p48
2821c073K155K560J418j697k578j790M84K286K198K70j864k647p06J726K313J459
2837B514j270k297k139L43K193K323P36j657k891j150J281K439J695n11k286k449
2853c126L40J940K584L69j260l054q84Q09K630K007m81k491j786k51J780K121
$$ plain form
2869 1247 2273 612 -1620 -2853 -2205 652 1900 2152 -127 -2111 -2809 -1087 1124 2121 1142 -820
2885 -820 -2275 -1639 362 2383 2025 157 -1793 -2480 -1088 1241 2495 1252 -707 -1804 -1895 500
2901 500 1840 2275 600 -1410 -2125 -730 1273 2596 1747 -358 -1873 -1661 224 2055 2295 924
2917 924 -933 -1513 -674 992 1805 1592 -99 -1526 -1439 40 1792 2329 1046 -753 -1301 -729 616
2934 616 2214 1084 -44 -1249 -1074 226 1762 1991 971 -1023 -1558 -849 516 1722 1292 42
2950 42 -1133 -1123 -84 1056 1352 503 -759 -1318 -765 661 1380 1210 94 -927 -1138 19 808 1006
2968 1006 425 -805 -1367 -741 496 1212 982 -370 -1180 -977 9 1048 1156 346 -673 -1089 -840 605
2986 605 848 581 -705 -1027 -736 109 1125 951 131 -765 -1115 -500 455 767 305 -311 -1020 -655 377
$$ packed form
2869A247J026j661k232j233O48K857J248K52k279j984o98J722K211R97r79j962
2885h20j455O36K001K021l58j868j950o87J392K329J254j243j959j097r1K395
2901E00J340M35j675k010p15J395K003J323q49k105j515K12J885J831K40j371
2917I24j857n80Q39J666Q13k13j691j427Q7J479J752N37j283j799n48N72J345
2934F16J598j130j128j205J75J300J536K29j020j994n35P09J365J206m30j250
2950D2j175J0J039J140K96q49j262n59N53J426P19j70j116j021k11J157P89J98
2968A006n81j230n62O26J237P16k30j352q10K03R86J039J08q10j019m16K49J445
2986F05K43k67j286l22K91Q45J016j74q20q96l50O15R55L12m62o16p09L65J032
$$ plain form
3005 377 841 799 -69 -940 -910 -158 845 1035 454 -528 -1037 -570 315 872 880 36 -990 -771 98 1280
3025 1280 1061 226 -747 -1278 -551 211 1073 799 -104 -1070 -837 -165 785 999 334 -847 -1409 -646 924
3044 924 1607 958 0 -1493 -1057 -276 736 1527 227 -781 -1583 -648 823 1467 1031 -370 -1622 -1176
3062 -1176 -159 1128 1404 464 -971 -1479 -972 716 1336 765 -529 -1680 -1661 -93 1176 1548 301
3079 301 -1022 -2005 -1284 139 1207 1108 -346 -1723 -1525 -155 973 1550 297 -1340 -2126 -1168 703
3096 703 1582 1348 -248 -1787 -1517 -888 1314 1667 388 -1270 -2141 -1315 516 1666 1451 -298 -1617
3113 -1617 -1926 -732 1185 1832 1024 -631 -2069 -1389 84 1630 1383 -128 -1612 -1965 -869 1652
3129 1652 2396 1152 -664 -1906 -1343 153 1729 1833 249 -1102 -1956 -689 1432 2265 1335 -645
$$ packed form
3005C77M64m2q68q71L0P52J003J90n81r82n09M67Q85N57Qq44j026K19Q69J182
3025A280k19q35r73n31P27P62Q62k74r03r66K33O72R50K14o65j181n62P63J570
3044I24O83o49r58j493M36P81J012P91j300j008q02R35J471O44m36j401j252M46
3062a176J017J287K76r40j435n08N07J688O20n71j294j151J9J568J269L72j247
3079C01j323r83P21J423J068r9j454j377J98J370J128N77j253j637p86R58J871
3096G03Q79k34j596j539K70O29K202L53j279j658q71Q26J831J150k15j749j319
3113a617l09J194J917O47q08j655j438O80J473J546k47j511j484l53J096K521
3129A652P44j244j816j242N63J496J576J04j584j351q54J267K121Q33r30j980
$$ plain form
3145 -645 -1996 -1503 177 1921 1968 864 -1122 -1673 -939 1156 2183 1325 -190 -1630 -1506 112 1747
3162 1747 2326 847 -852 -1981 -891 1169 2348 1669 155 -1150 -1490 -93 2082 2049 956 -979
3178 -979 -1913 -986 778 2285 2144 107 -1424 -1754 -576 1174 2170 1388 -804 -2042 -1385 394 1737
3195 1737 1652 2 -1404 -1939 -865 1038 1874 1162 -963 -1857 -1615 103 1729 1731 38 -1483 -2033 -747
3213 -747 736 1538 1173 -785 -1876 -1738 -396 1405 1674 126 -1213 -1812 -937 397 1830 922 -454
3230 -454 -1832 -1963 -636 1067 1456 288 -1302 -1938 -1115 541 1229 1101 -268 -1832 -1774 -218 1382
3247 1382 1250 480 -1111 -1685 -1114 338 1318 987 -80 -1605 -1481 -292 718 1351 610 -818 -1400
3264 -1400 -1289 235 1432 1212 224 -914 -1274 -178 661 1320 665 -797 -1297 -991 497 1230 1178 99
$$ packed form
3145f45j351M93J680J744M7j104j986n51P34K095J027q58j515j440J24J618J635
3162A747N79j479j699j129J090K060J179o79j514j305l40J397K175l3j093j935
3178i79r34R27J764J507j41k037j531l30J178J750R96p82k192j238O57J779J343
3195A737q5j650j406n35J074J903Q36p12k125q94K42J718J626Kj693j521n50J286
3213g47J483Q02l65j958j091J38J342J801K69j548j339n99Q75J334J433r08j376
3230d54j378j31J327J703L89j168j590o36Q23J656O88j28j369j564N8J556J600
3247A382j32p70j591n74N71J452R80l31j067j525J24J189J010O33p41j428n82
3264a400J11J524J197k20r88j138l60J096Q39O59o55j462n00L06J488P33n2j079
$$ plain form
3282 99 -867 -1175 -294 1057 1498 822 -352 -1093 -857 541 1101 1239 301 -658 -934 -236 581 1197 622
3301 622 -412 -883 -667 449 929 928 493 -727 -949 -203 783 1057 539 10 -972 -782 367 1302 863
3320 863 65 -554 -652 -69 544 929 289 -573 -985 -582 271 686 773 24 -968 -1034 -361 800 403 361 -487
3341 -487 -569 -508 318 676 420 -476 -1222 -732 -170 765 704 33 -639 -911 -773 296 647 253 -200 -918 -659
3362 -659 54 510 567 -272 -646 -1164 -305 419 730 815 -705 -1184 -782 71 762 520 122 -953 -1210 -500
3382 -500 496 1239 864 -563 -1060 -810 92 790 842 125 -788 -977 -618 719 931 561 -231 -1120 -879 332
3402 332 820 1097 250 -594 -913 -253 566 1126 637 -372 -1144 -970 450 799 1062 26 -875 -1031 -358
3421 -358 715 1446 645 -315 -1031 -797 408 1352 1006 145 -1093 -1188 -214 787 1623 1028 -249 -1225 -1046
$$ packed form
3282I9r66l08Q81J351M41o76j174p41K36J398N60J38r38r59k76O98Q17O16n75
3301F22j034m71K16J116M80jm35j220k22P46R86K74n18n29r82J90J149R35m39
3320H63p98o19r8N83O13L85o40q62m12M03Q53M15Q7p49r92o6O73J161l97m2q48
3341d87q2O1Q26L58k56q96p46M90N62R35o1o71o72k72J38J069L51l94m53p18K59
3362f59P13M56N7q39l74n18Q59P24L11Q5j520m79M02Q53O91k42l98j075k57P10
3382e00R96P43l75j427m97K50R02O98N2p17r13j89L59J337K12l70p92q89K41J211
3402C32M88K77q47q44l19O60Q19N60m89j009p72J74J420L49K63j036r01j56O73
3421c58J073P31q01r60p16K34J205R44l46q61j238r5R74J001Q36n95j277r76J79
$$ plain form
3440 -1046 410 1009 1358 175 -911 -1314 -699 376 1315 845 -360 -1232 -1172 354 916 1571 544 -797
3458 -797 -1626 -769 788 1358 1226 -11 -1339 -1319 -115 979 1558 543 -1013 -1274 -933 527 1312 930
3476 930 -204 -1325 -1259 -103 1105 1383 494 -1129 -1073 -886 286 1443 994 -204 -1381 -1338 -297 1162
3494 1162 1713 711 -755 -1516 -1021 185 1622 1294 -63 -1340 -1697 -611 639 1521 799 -674 -1496
3511 -1496 -910 460 1270 1667 401 -1285 -1562 -567 1154 1426 1044 -567 -1541 -1413 -205 1140 1381
3528 1381 275 -1419 -1610 -864 523 1381 1183 -300 -1278 -1198 19 1094 1694 440 -841 -1569 -704
3545 -704 593 1683 978 -263 -1285 -1146 81 1001 1244 561 -923 -1304 -818 717 1362 999 -154
3562 -154 -1178 -1379 -394 1196 1190 759 -872 -1470 -983 279 1246 1041 -14 -1159 -1213 -647 932 1398 624
$$ packed form
3440a046J456N99L49j183j086m03O15J075R39m70j205q72O0J526N62O55j027j341
3458g97q29Q57J557N70j32j237j328K0J204J094N79j015j556k61L41J460P85l82
3476I30j134j121O6J156J208K78q89j623N6J87J172J157m49j198j177M3J041J459
3494A162N51j002j466p61M95J206J437l28j357j277l57J086J250Q82p22j473q22
3511a496N86J370Q10L97j266j686k77R95J721K72l82j611r74J28J208J345K41
3528A381j106j694j91P46J387Q58j98j483r78Q0J217J075O00j254j281p28Q65
3545g04J297J090p05j241j022J39J227R20K43o83j484l81M86J535O45l63j153
3562a54j024k01R85J590om31j631n98M87J262R67k05j055j145n4N66J579M66p74
$$ plain form
3581 624 -711 -1460 -745 226 1129 1269 262 -1079 -1425 -714 693 1244 874 -599 -1297 -582 -103 996
3599 996 1197 268 -958 -1520 -474 510 1116 478 -617 -887 -916 -199 972 1041 496 -696 -1324 -523 462
3618 462 1089 541 -298 -971 -783 202 877 656 379 -588 -954 -313 716 997 836 -149 -819 -826 148 812
3638 812 1043 240 -628 -715 -267 573 1000 935 -111 -448 -513 330 1037 913 199 -353 -603 -45 599 1028 677
3659 677 43 -415 -653 386 922 724 385 -193 -402 -53 641 711 647 -355 -491 -480 501 496 612 445 -409
3680 -409 -507 -275 457 652 575 -158 -656 -374 169 913 351 340 -517 -812 -203 336 714 321 -200 -539 -236
3701 -236 168 637 537 3 -694 -562 -286 302 558 76 -524 -820 -687 -46 271 226 -77 -680 -723 -571 383
3722 383 510 86 -617 -936 -583 -42 567 271 -363 -852 -1234 -548 611 443 222 -518 -988 -781 56 734
$$ packed form
3581F24j335p49P15R71R03J40j007j341l46P11J407N51l70j473o98P15M79J099
3599I96K01r29j226n62J046R84O06o38j095k70k9P17J171O9n45j192o28Q01R85
3618D62O27n48q39o73J88R85O75k21k77r67l66O41J029K81j61r85o70pR74O64
3638H12K31q03q68q7M48Q40M27o5j046l37o5Q43P07j24p14n52k50N58O44M29l51
3659F77o34m58k38J039N36j98l39n78k09L49O94P0o4j002j36J1R81nJ16j67q54
3680d09r8K32P32J95p7p33m98K82N43P44n62j1q57k95O09N39L78l93n21l39L03
3701b36M04M69j00n34o97J32K76N88K56m82o00k96J33O41L17m5l03o03m3J52R54
3722C83J27m24p03l19L53N41O09k96o34m89l82O86J159j68k21p40m70K07Q37O78
$$ plain form
3742 734 386 -434 -1290 -957 -260 480 684 224 -870 -1023 -578 90 570 542 -104 -885 -745 -199 834 655
3762 655 330 -362 -988 -392 353 921 599 83 -554 -1070 39 941 993 506 -440 -843 -657 210 916 659
3782 659 45 -373 -649 6 872 978 554 -201 -872 -520 521 1022 1179 -44 -832 -1035 -100 1051 1090
3801 1090 718 -150 -627 -351 313 1312 1204 7 -856 -650 -305 712 1407 940 -138 -720 -710 536 1247
3820 1247 1226 -21 -901 -789 -231 995 1232 606 -338 -715 -1066 332 1061 954 131 -801 -1227 -155 732
3839 732 1020 935 -366 -1354 -931 -56 1097 1538 420 -1131 -1515 -1182 282 1007 591 -272 -1119 -996 -171
3858 -171 731 851 42 -987 -1406 -550 499 845 632 -320 -1215 -1313 -460 475 752 203 -816 -1335 -1342 5
3878 5 802 838 -140 -1084 -1207 -246 441 1018 649 -755 -1192 -700 35 794 973 -66 -1148 -1195 -476 484
$$ packed form
3742G34l48q20q56L33O97P40K04m60j094j53M45O68M80k8o46p81J40N46J033j79
3762F55l25o92o26N96P45N68l22n16o37n16J109R02N2m87r46m03J86Q67P06k57
3782F59o14m18k76O55Q66J06m24p55o71L52J041N01J57j223p88k03R35J151L9
3801A090l72q68m77K76O64R99j08j197q63K06L45J017O95m67j078n82J0J246P11
3820A247k1j247q80J12N58J226K37o26r44l77l51J398P29j07q23r32m26J072Q87
3839G32K88q5j301r88M23Q75J153M41j118j551l84L33J464P25m16q63q47J23Q25
3858a71R02J20q09j029m19Q56J049L46k13r52q95r8Q53R35K77n49j019n19pJ347
3878EP97L6r78r44j23R61O87N77l69j404m37M92P35P59J79j039j082m7P19R60
$$ plain form
3898 484 1180 765 -425 -1328 -948 -141 878 1010 -193 -853 -1046 -590 512 895 306 -374 -1033 -992 224
3917 224 1161 767 260 -846 -655 -186 278 1349 619 -145 -888 -532 221 975 914 558 -382 -999 -379 601
3937 601 865 745 47 -571 -584 -146 884 932 270 -483 -708 -211 452 848 940 -67 -538 -652 112 542
3957 542 901 538 -160 -953 -196 635 964 989 -35 -571 -630 3 863 1184 359 -441 -536 -398 424 952 800
3978 800 284 -601 -688 42 423 728 592 -415 -741 -268 95 758 492 -129 -404 -361 -146 275 600 282
3998 282 -381 -731 -360 104 606 414 52 -489 -681 18 367 397 252 -308 -595 -492 369 482 289 28
4018 28 -812 -541 71 588 425 315 -177 -661 -350 61 635 257 -126 -630 -621 -93 124 422 65 -539 -497
4039 -497 28 227 391 165 -148 -434 -624 -40 309 684 -44 -447 -679 -500 281 371 415 60 -602 -219 147
$$ packed form
3898D84O96m15j190r03L80Q07J019J32j203o60j93M56J102L83n89o80o59M1J216
3917B24R37l94n07j106J91M69M64J071p30p64p43L56P53P54o1l56r40o17O20R80
3937F01K64j20o98o18j3M38J030M8o62p53k25M97O63L96R2j007m71j14P64M30
3957E42L59l63o98p93P57Q31L29K5j024n36n9O33Q60L21q25q00r5J38Q22N28j52
3978H00n16q85q7P30L81L05j36j007l26M73L63O63k66o21k75M3K15M21L25l18
3998B82o63l50L71M64N02j92l62n41j92O99L49L0j45n60k87J03Q61J13j93k61
4018B8q40K71O12N17j63j10m92m84L11M11N74l78l83n04RN28K17K98l57o04M2
4039d97N25J99J64k26l13k86j90N84L49L75p28m03k32J79P81R0M4l55o62L83L66
$$ plain form
4060 147 220 798 138 -698 -792 -245 -115 350 543 -180 -546 -416 -138 554 292 -20 -678 -623 -203 177 489
4081 489 526 -360 -599 -622 -186 408 503 -60 -548 -802 -265 670 462 753 -353 -848 -686 4 502 656 166
4102 166 -428 -674 -187 419 335 -33 -345 -950 -590 119 610 684 90 -621 -680 -140 131 831 313 -266 -893
4123 -893 -408 -433 496 612 165 -408 -747 -259 532 630 640 -282 -529 -586 154 1165 794 131 -697 -624 -291
4144 -291 700 863 604 -268 -726 -658 -294 853 967 143 -406 -508 -240 347 918 676 -88 -662 -796 107
4164 107 678 1104 265 -312 -954 -495 443 784 966 256 -711 -356 58 532 816 514 -232 -928 -248 206
4184 206 802 893 356 -706 -953 106 1002 966 436 -402 -781 -520 7 1091 826 -172 -483 -742 -339 481
4204 481 1030 215 -344 -691 -802 4 1008 781 33 -510 -835 -412 592 1043 460 -310 -1105 -820 -168
$$ packed form
4060A47P3N78o60q36r4N47J30M65J93p23l66J30K78O92k62l12o58N5M20L80L12
4081D89L7q86k39k3M36N94R5n63m88k54N37R35k08K91j106m95J62O90M98J54m90
4102A66n94k46M87O06q4l68l12o05L60P09M91P4n94p11n9N40K71P00n18n79o27
4123h93M85k5R29J16m47n73l39M88P91R8J0r22k47n7P40J011l71o63q28P3L33
4144b91R91J63k59q72m58O8L64J147J14q24n49j02K68N87N71k42p64n74j34R03
4164A07N71M26q39n77o42M59R38L41J82p10r67L55M14M74K84l02p46o96O80M54
4184B06N96R1n37j062k47J059Q96l6n30q38l79K61N27J084k65r98l11k59M03Q20
4204D81N49q15n59l47j11Q06J004k27p48n43l25M23J004M51n83p70p95K85O52
$$ plain form
4223 -168 615 657 204 -545 -945 -442 78 1032 337 -428 -1284 -780 -59 611 316 296 -626 -1168 -444 -194 716
4244 716 492 -385 -842 -605 -278 775 614 202 -484 -825 -774 289 467 345 -247 -1076 -500 -197 502 694
4264 694 64 -633 -1059 -451 161 525 507 -70 -443 -798 -61 604 927 489 -507 -687 -445 -25 787 817 72
4285 72 -481 -307 -171 413 825 462 -197 -339 -259 327 632 720 102 -498 -623 111 325 919 419 -48 -316
4306 -316 -205 207 604 614 597 -378 -373 -509 709 519 425 -401 -364 -172 245 465 616 118 -617 -393 -565 390
4328 390 397 641 -405 -503 -293 -125 635 563 126 -425 -483 -308 227 645 519 -22 -672 -711 409 493 332 -55
4350 -55 -254 -422 -18 428 283 390 -73 -354 -366 -247 202 436 49 -382 -263 -73 189 370 235 -211 -856
4371 -856 -498 -215 236 109 63 -319 -655 -338 216 195 -138 -287 -571 -556 -35 130 241 -118 -566 -832 -418
$$ packed form
4223a68P83M2m53p49m00N03N20R54o95p65q56N04P21O70k95k0r22n42P24K50R10
4244G16k24q77m57K37L27J053j61m12o86l41N1J063J78j22n92q29N76L03O99J92
4264F94o30o97m26O08O12L64j8n77l73l55P37O65L23m38r96j80K42M20Q12L0p45
4285G2n53J74J36N84M12l63o59j42Q0N86L05Q8o18o00j25P34K14N94n00m67k68
4306c16J11M12L97J0j7r75Nj36J218j90r4q26L7J92M17K20J51m98p35K24j72R55
4328C90PK44j046r8K10J68P60p2m37n51n8J75N35M18j26n41o50l9J120Q4j61l87
4350e5j99j68M04M46j45J07m63k81j2J19M49K34l87m31J19J90K62J81j35m46o45
4371h56L58K83M51j27m6l82l36L17N54k1l33j49k84J5N21J65J11l59m48k66M14
$$ plain form
4392 -418 142 194 -173 -286 -686 -449 18 367 251 -278 -636 -567 -77 265 455 214 -266 -514 -410 -28 224
4413 224 436 -60 -668 -220 -67 311 220 99 -145 -685 -39 2 339 509 161 -427 -312 58 403 582 148
4434 148 -300 -362 -364 15 544 480 91 -243 -512 53 664 398 172 -52 -265 -185 23 776 468 -243 -364 -149
4456 -149 187 370 690 711 -444 -378 -368 276 856 283 -94 -221 -284 -313 398 491 393 -385 -551 -454 423 578
4478 578 444 8 -640 -680 79 61 486 152 -27 -727 -556 280 235 251 -166 -527 -676 -405 382 579 139
4499 139 -738 -475 -659 26 429 712 3 -675 -395 -114 332 497 233 -288 -570 -695 75 347 509 -13
4519 -13 -942 -760 -256 118 659 157 -199 -469 -462 -240 564 581 -2 -623 -985 -418 186 723 274 -167 -774
4540 -774 -511 -255 467 628 -94 -299 -829 -370 135 649 686 106 -709 -538 -185 313 752 491 -590 -701
$$ packed form
4392d18N60N2l67j13m00K37M67L49j16n29l58O9M90L42J90k41m80k48J04L82K52
4413B24K12m96o08M48J53L78r1j21k44n40O46M1L37J70l48n88J15L70L45J79m34
4434A48m48o2kL79N29o4l89l34k69N65O11k66k26k24k13Q0K08P53l08p11j21K15
4456a49L36J83L20K1j155O6J0O44N80n73l77j27o3k9P11R3r8p78j66R7Q77J55
4478E78j34m36o48m0P59j8M25l34j79p00J71Q36m5J6m17l61j49K71P87J97m40
4499A39q77K63j84O85M03K83p09o78K80K81M46J65k64n21k82j25P70K72J62n22
4519a3r29J82N04L74N41n02l56k70PK22Q04J7n83o21l62N67O04N37m49m41o07
4540g74K63K56P22J61p22k05n30M59N05N14L7n80q15J71L53M98M39k61j081j11
$$ plain form
4560 -701 -357 423 727 548 -147 -582 -445 168 620 466 242 -158 -535 -623 90 838 564 -10 -480 -565 -186
4581 -186 374 419 391 -354 -537 -335 165 441 188 185 -423 -532 -332 160 655 372 -296 -217 -318 -15 388 252
4603 252 301 -450 -616 -162 218 813 359 -348 -330 -488 166 584 476 455 -315 -176 -319 522 453 133 -207
4624 -207 -816 -368 196 494 484 285 -167 -746 -347 329 446 305 8 -394 -507 104 260 444 147 -273
4644 -273 -605 -88 -7 471 381 -94 -302 -236 60 279 442 11 -176 -471 -177 166 382 294 -122 -592 -271
4665 -271 -134 625 469 305 -72 -608 -76 13 466 554 -388 -479 -464 11 470 575 156 -415 -343 -179 304 349
4687 349 475 -7 -329 -152 22 259 269 -75 -372 -386 -1 199 495 378 103 -257 -261 -96 292 267 180 -132
4709 -132 -439 22 -5 416 148 -123 -521 -282 183 408 250 -101 -165 -214 -336 244 177 37 -45 -271 -241 104
$$ packed form
4560g01L44P80L04j79o95m35J37O13M52j54k24m00l77q8P13P48k74n74m70q5L79
4581a86N60M5k8p45j83K02N00K76k53lo08j09K00M92M95k83o68P9j01L03M03j36
4603B52M9p51j66M54L80N95m54p07J8j58O54M18j08k1p70J39j43Q41o9l20l40
4624b07o09M48N64K98j0j99m52n79L99O76J17j41k97m02j13O11J56J84k97m20
4644b73l32N17Q1M78r0m75k08O6K96K19J63m31j87k95K94L43K16q8m16m70L21
4665b71J37P59j56j64l77n36N32Q9M53Q8r42r1J5M75M59J05m19n71P2J64M83M5
4687C49J26m82l22J77J74K37J0l44k97j4L85K00K96j17k75l60mJ65L88k5q7l12
4709a32l07M61k7M21k68k71l98K39M65K25j58l51o4m9j22N80o7j40q2k26L0L45
$$ plain form
4731 104 29 356 216 -244 -517 -311 110 200 264 -23 -386 -332 77 176 215 -94 -154 -313 -542 -153 135 84 -4
4754 -4 -305 -275 -20 27 174 -287 -303 -327 -321 228 148 99 -148 -586 -152 348 69 131 -106 -185 -504 -40 170 442
$$ packed form
4731A04p5L27j40m60k73K06M21R0O4k87l63N4M09R9L9l09o0j59k29L89K88n1q8
4754dl01L0K55M7J47m61j6k4ON49q0m9k47m38M34N00k79O2k37p9l19M64K10K72
$$ [...]
8191A37
##END NTUPLES=NMR FID
##END=
