##TITLE=1H_LR-695-CR2
 CDCl3, 8 sc, 
 24.10.2019
##JCAMPDX= 6.0         $$ Bruker NMR JCAMP-DX V2.0
##DATA TYPE= NMR FID
##DATA CLASS= NTUPLES
##ORIGIN= UXNMR, Bruker Analytische Messtechnik GmbH
##OWNER= root
$$ XWIN-NMR		Version 3.5
$$ Thu Oct 24 16:15:45 2019 Russian Standard Time (UT+4h)  she@DPX200
##.OBSERVE FREQUENCY= 200.1315
##.OBSERVE NUCLEUS= ^1H
##.DELAY= (6, 6)
##.ACQUISITION MODE= SIMULTANEOUS
##.ACQUISITION SCHEME= undefined
##.AVERAGES= 8
##.DIGITISER RES= 18
##SPECTROMETER/DATA SYSTEM= spect
##.PULSE SEQUENCE= zg30
##.SOLVENT NAME= CDCl3
##.SHIFT REFERENCE= (INTERNAL, CDCl3, 0, 15.7039)
##AUDIT TRAIL= $$ (NUMBER, WHEN, WHO, WHERE, WHAT)
$$ ##TITLE= Audit trail, XWIN-NMR		Version 3.5
$$ ##JCAMPDX= 5.01
$$ ##ORIGIN= Bruker BioSpin GmbH
$$ ##OWNER= she
$$ F:/spectra/data/she/nmr/H-F/1/audita.txt
$$ ##AUDIT TRAIL=  $$ (NUMBER, WHEN, WHO, WHERE, WHAT)
(   1,<2019-10-24 16:14:15.87 +0400>,<she>,<DPX200>,
      <created by zg, POWCHK disabled, PULCHK disabled
       configuration hash MD5:
       00 E9 B6 7A A2 85 ED C7 34 08 36 98 17 FE 4E 26
       data hash MD5: 16K
       59 7B B0 D4 59 7B 55 64 20 B8 F2 61 10 95 4F FB>)
$$ ##END=
$$ 
$$ hash MD5
$$ FD 01 FD 64 4F 78 81 0F 50 6D 67 2D 0F 87 5A 81
##$RELAX= 
##$RELAX= 
##$RELAX= 
##$RELAX= 
##$RELAX= 
##$RELAX= 
$$ Bruker specific parameters
$$ --------------------------
##$DU= <F:/spectra>
##$EXPNO= 1
##$NAME= <H-F>
##$PROCNO= 1
##$TYPE= <nmr>
##$USER= <she>
##$AMP= (0..31)
100 100 100 100 100 100 100 100 100 100 100 100 100 100 100 100 100 100 
100 100 100 100 100 100 100 100 100 100 100 100 100 100 
##$AQSEQ= 0
##$AQ_mod= 1
##$AUNM= <au_zg>
##$AUTOPOS= <>
##$BF1= 200.13
##$BF2= 200.13
##$BF3= 200.13
##$BF4= 200.13
##$BF5= 200.13
##$BF6= 200.13
##$BF7= 200.13
##$BF8= 200.13
##$BYTORDA= 1
##$CFDGTYP= 0
##$CFRGTYP= 5
##$CHEMSTR= <none>
##$CNST= (0..31)
1 1 145 1 1 1 1 1 1 1 1 1 1 1 1 1 1 1 1 1 1 1 1 1 1 1 1 1 1 1 1 1 
##$CPDPRG= <>
##$CPDPRG1= <>
##$CPDPRG2= <>
##$CPDPRG3= <>
##$CPDPRG4= <mlev>
##$CPDPRG5= <mlev>
##$CPDPRG6= <mlev>
##$CPDPRG7= <mlev>
##$CPDPRG8= <mlev>
##$CPDPRGB= <>
##$CPDPRGT= <>
##$D= (0..31)
0 1.2 0 0 0 0 0 0 0 0.06 0 0.03 0 0 0 0 0.0002 0 0 0 0 0 0 0 0 0 0 0 0 
0 0 0 
##$DATE= 1571919255
##$DBL= (0..7)
120 120 120 120 120 120 120 120 
##$DBP= (0..7)
150 150 150 150 150 150 150 150 
##$DBP07= 0
##$DBPNAM0= <>
##$DBPNAM1= <>
##$DBPNAM2= <>
##$DBPNAM3= <>
##$DBPNAM4= <>
##$DBPNAM5= <>
##$DBPNAM6= <>
##$DBPNAM7= <>
##$DBPOAL= (0..7)
0.5 0.5 0.5 0.5 0.5 0.5 0.5 0.5 
##$DBPOFFS= (0..7)
0 0 0 0 0 0 0 0 
##$DE= 6
##$DECBNUC= <off>
##$DECIM= 24
##$DECNUC= <off>
##$DECSTAT= 4
##$DIGMOD= 1
##$DIGTYP= 9
##$DL= (0..7)
0 120 120 120 120 120 120 120 
##$DP= (0..7)
150 150 150 150 150 150 150 150 
##$DP07= 0
##$DPNAME0= <>
##$DPNAME1= <>
##$DPNAME2= <>
##$DPNAME3= <>
##$DPNAME4= <>
##$DPNAME5= <>
##$DPNAME6= <>
##$DPNAME7= <>
##$DPOAL= (0..7)
0.5 0.5 0.5 0.5 0.5 0.5 0.5 0.5 
##$DPOFFS= (0..7)
0 0 0 0 0 0 0 0 
##$DQDMODE= 0
##$DR= 18
##$DS= 0
##$DSLIST= <SSSSSSSSSSSSSSS>
$$ [...]
##$SUBNAM2= <"">
##$SUBNAM3= <"">
##$SUBNAM4= <"">
##$SUBNAM5= <"">
##$SUBNAM6= <"">
##$SUBNAM7= <"">
##$SUBNAM8= <"">
##$SUBNAM9= <"">
##$SW= 24.0689530833862
##$SWIBOX= (0..15)
0 0 2 0 0 0 0 0 0 0 0 0 0 0 0 0 
##$SW_h= 4816.95568400771
##$TD= 16384
##$TD0= 1
##$TE= 0
##$TE2= 300
##$TE3= 300
##$TEG= 300
##$TL= (0..7)
0 120 120 120 120 120 120 120 
##$TP= (0..7)
150 150 150 150 150 150 150 150 
##$TP07= 0
##$TPNAME0= <>
##$TPNAME1= <>
##$TPNAME2= <>
##$TPNAME3= <>
##$TPNAME4= <>
##$TPNAME5= <>
##$TPNAME6= <>
##$TPNAME7= <>
##$TPOAL= (0..7)
0.5 0.5 0.5 0.5 0.5 0.5 0.5 0.5 
##$TPOFFS= (0..7)
0 0 0 0 0 0 0 0 
##$TUNHIN= 0
##$TUNHOUT= 0
##$TUNXOUT= 0
##$USERA1= <user>
##$USERA2= <user>
##$USERA3= <user>
##$USERA4= <user>
##$USERA5= <user>
##$V9= 5
##$VALIST= <valist>
##$VCLIST= <CCCCCCCCCCCCCCC>
##$VD= 0
##$VDLIST= <DDDDDDDDDDDDDDD>
##$VPLIST= <PPPPPPPPPPPPPPP>
##$VTLIST= <TTTTTTTTTTTTTTT>
##$WBST= 1024
##$WBSW= 4
##$XGAIN= (0..3)
0 0 0 0 
##$XL= 0
##$YL= 0
##$YMAX_a= 119671
##$YMIN_a= -101335
##$ZGOPTNS= <>
##$ZL1= 120
##$ZL2= 120
##$ZL3= 120
##$ZL4= 120
##$ABSF1= 10
##$ABSF2= 0
##$ABSG= 5
##$ABSL= 3
##$ALPHA= 0
##$AQORDER= 0
##$ASSFAC= 0
##$ASSFACI= 0
##$ASSFACX= 0
##$ASSWID= 0
##$AUNMP= <proc_1d>
##$AZFE= 0.1
##$AZFW= 0.1
##$BCFW= 1
##$BC_mod= 2
##$BYTORDP= 1
##$COROFFS= 0
##$CY= 11.3945322036743
##$DATMOD= 1
##$DC= 2
##$DFILT= <>
##$DTYPP= 0
##$F1P= 20.1720416913024
##$F2P= 0.152960286110954
##$FCOR= 0.5
##$FTSIZE= 0
##$FT_mod= 4
##$GAMMA= 1
##$GB= 0.15
##$INTBC= 1
##$INTSCL= 1
##$ISEN= 128
##$LB= 0.24
##$LEV0= 0
##$LPBIN= 0
##$MAXI= 10000
##$MC2= 0
##$MEAN= 0
##$ME_mod= 0
##$MI= 1.114404
##$NCOEF= 0
##$NC_proc= 0
##$NLEV= 6
##$NOISF1= 3.799351
##$NOISF2= 2.8
##$NSP= 1
##$NTH_PI= 0
##$NZP= 0
##$OFFSET= 15.70392
##$PC= 1
##$PHC0= -9565.845
##$PHC1= 14.40084
##$PH_mod= 1
##$PKNL= yes
##$PPARMOD= 0
##$PSCAL= 0
##$PSIGN= 0
##$REVERSE= no
##$SF= 200.130013532006
##$SI= 16384
##$SIGF1= 3
##$SIGF2= 2
##$SINO= 400
##$SIOLD= 16384
##$SREGLST= <1H.CDCl3>
##$SSB= 0
##$STSI= 0
##$STSR= 0
##$SW_p= 3612.71676300578
##$SYMM= 0
##$S_DEV= 0
##$TDeff= 0
##$TDoff= 0
##$TI= <>
##$TILT= no
##$TM1= 0
##$TM2= 0
##$TOPLEV= 0
##$USERP1= <user>
##$USERP2= <user>
##$USERP3= <user>
##$USERP4= <user>
##$USERP5= <user>
##$WDW= 1
##$XDIM= 8192
##$YMAX_p= 0
##$YMIN_p= 0
$$ End of Bruker specific parameters
$$ ---------------------------------
##NTUPLES= NMR FID
##VAR_NAME=  TIME,          FID/REAL,        FID/IMAG
##SYMBOL=    X,             R,               I
##VAR_TYPE=  INDEPENDENT,   DEPENDENT,       DEPENDENT
##VAR_FORM=  AFFN,          ASDF,            ASDF
##VAR_DIM=   8192,          8192,            8192
##UNITS=     SECONDS,       ARBITRARY UNITS, ARBITRARY UNITS
##FACTOR=    0.0002076,     1,               1
##FIRST=     0,             0,               0
##LAST=      1.7004516,     0,               0
##MIN=       0,             -101335,         0
##MAX=       1.7004516,     119671,          0
$$ Real data points
##PAGE= N=1
##DATA TABLE= (X++(R..R)), XYDATA
0 0 0 0 0 0 0 0 0 0 8 -8 8 -8 8 -16 16 -17 24 -26 32 -40 48 -55 64 -73 81 -96 106 -121 139 -155 178 -197
32 -197 223 -249 277 -308 345 -382 425 -471 522 -577 640 -707 784 -868 965 -1076 1204 -1350
50 -1350 1521 -1730 1983 -2303 2722 -3293 4124 -5456 7938 -14186 66118 79497 -16427 48345
64 48345 119671 105731 16422 11563 78414 113148 53246 4948 34504 94966 82363 21807
76 21807 3794 59595 94054 53573 -146 21182 78578 78163 16235 -5499 45045 83927 44180
89 44180 -8051 9859 68129 68333 9276 -13708 35006 73667 37303 -15600 825 57832 60714
102 60714 3501 -21832 25072 65745 31839 -22005 -8334 50004 55011 -3147 -28407 19939
114 19939 60709 25156 -27804 -10818 44872 46660 -6236 -26355 16364 50051 21221 -21941
126 -21941 -11130 34108 41891 -255 -25234 7106 45400 27546 -18853 -18170 30107 46586 2769
139 2769 -29492 4482 48708 29738 -21367 -19509 32451 48508 2034 -28911 5559 48432
151 48432 29602 -19211 -17494 31355 46868 4144 -26830 4032 45569 30272 -16445 -18020
163 -18020 26925 44901 6811 -25296 968 41463 29902 -14859 -19752 21981 41933 7271
175 7271 -24991 -4634 34765 27921 -13935 -23994 13477 37294 8378 -28314 -13803 28221
187 28221 27827 -16138 -33300 4654 35046 5204 -36779 -21272 24829 23811 -24367 -39995 1435
200 1435 29900 -2380 -41639 -24996 18340 16162 -27441 -41860 -5453 20969 -5266 -42044
212 -42044 -30476 9653 12571 -26412 -45014 -14122 15884 -4417 -42138 -36347 3638 12227 -25499
225 -25499 -48285 -18951 14421 -3358 -43278 -40229 677 12647 -24314 -48613 -20763 13928
237 13928 -1582 -41945 -40644 313 14164 -21725 -48395 -20682 16012 1526 -39486 -38730 2507
250 2507 16500 -19010 -44165 -17072 17635 3645 -34576 -34529 3321 17559 -13468 -38338 -16805
263 -16805 16315 7810 -27621 -32832 1590 20156 -6378 -35907 -19583 17194 14181 -24041 -34313
276 -34313 363 23808 -3260 -36814 -20541 18762 16248 -24086 -35832 546 24599 -3162
288 -3162 -36786 -20930 17145 14542 -24038 -35014 -1353 21703 -3600 -35838 -22605 13308
300 13308 13283 -22299 -35856 -5673 18106 -3165 -34588 -25084 9309 12178 -21328 -37119 -9871
313 -9871 15634 -2108 -33807 -29121 5192 12666 -19144 -38703 -14128 14764 328 -34606 -32264
326 -32264 3997 15101 -17988 -40702 -15364 16221 1720 -34529 -32473 5001 15955 -17330
338 -17330 -39352 -13872 16832 3068 -32193 -30052 4886 15908 -13687 -34209 -12921 16145
350 16145 6068 -25959 -28115 3521 18254 -7400 -31642 -14026 16836 11573 -21379 -27922 3617
363 3617 21651 -3270 -30311 -14036 19069 15269 -19191 -27126 4345 23680 -645 -28430 -13552
376 -13552 19933 17053 -16928 -25845 4801 24859 1275 -27216 -13431 19794 17636 -15236 -25374
389 -25374 4258 23999 1673 -25660 -13783 17189 16982 -14268 -25043 1218 21232 2909
401 2909 -23952 -16267 12604 16627 -12319 -26571 -3113 20420 4944 -24744 -20706 11360 18669
414 18669 -11534 -29774 -5598 20863 6053 -26171 -22428 11386 18957 -12414 -30815 -6445
426 -6445 20214 5407 -26028 -22105 10003 17673 -11136 -28996 -6907 18446 6414 -23058 -22151
439 -22151 8396 18374 -7610 -27037 -8302 17859 8911 -20230 -21519 7098 19617 -4122 -24778
452 -24778 -9170 18176 12714 -16595 -21139 6372 21774 72 -23156 -8676 19800 16036 -14114
465 -14114 -21081 7385 24347 2273 -22299 -8114 21240 17514 -12584 -19550 8464 24719 2989
478 2989 -20802 -7529 20613 18021 -10934 -18555 6760 23142 4647 -18991 -9151 17495 18192
491 18192 -8650 -19465 3558 22934 6911 -18905 -12607 15424 19316 -7922 -21720 827
503 827 22271 7174 -20499 -15348 14058 19205 -8636 -23708 -1764 20836 6881 -21032 -16740
516 -16740 12063 17670 -9014 -24691 -3479 19253 6201 -20649 -18035 9863 16838 -8335 -23776
529 -23776 -4842 17346 6498 -19200 -18320 7866 16343 -5718 -22660 -6335 16473 9146 -16211
542 -16211 -18244 6674 18419 -2158 -21399 -7587 17341 12806 -14268 -18452 7140 21158 495
555 495 -20433 -6757 19312 14947 -12421 -17295 8777 23084 2402 -18350 -5390 20231 16750
568 16750 -9826 -14930 9206 23382 4328 -15943 -4788 20056 17939 -7318 -14485 7707 23447
581 23447 7250 -14375 -6070 18163 19073 -5321 -15301 5875 23383 8549 -14603 -8550 16747
594 16747 20095 -4716 -17061 3162 22043 8493 -15754 -11109 14729 18761 -5992 -19009 604
607 604 20207 7145 -17249 -12990 11757 16393 -7125 -20117 -1830 16877 5512 -17785 -14787
620 -14787 8473 13964 -7641 -21148 -5032 14147 5260 -17420 -16974 5301 13503 -6693 -22277
633 -22277 -7795 13572 6545 -16992 -19116 3669 14626 -5070 -22924 -8880 13366 7723 -16650
646 -16650 -19714 4134 15777 -3844 -22226 -8799 13894 9431 -14888 -18284 4780 16523 -1940
659 -1940 -20100 -7743 14731 11024 -11838 -16766 4912 17457 1562 -16766 -7081 14603 13328
672 13328 -8755 -15132 4799 18919 4400 -14589 -7308 15099 15532 -5869 -14649 4452 20320
685 20320 6965 -13720 -7840 15316 17371 -4364 -14949 3393 20410 7746 -13650 -8662 14437
698 14437 17074 -4867 -15730 2686 19124 6943 -14302 -9641 12264 15718 -5076 -16004 -142
711 -142 16413 6348 -14163 -11568 9074 14540 -5248 -17727 -3653 14395 6521 -15027 -14936 6512
725 6512 13399 -5488 -19731 -6364 13011 5477 -16228 -17314 3600 12770 -5731 -21002 -8527
738 -8527 11517 5779 -16322 -18260 2839 12110 -5604 -21209 -9059 11012 6283 -14916 -17932
751 -17932 2139 12189 -4185 -19364 -8526 10732 7232 -13126 -16620 2104 12926 -1482
763 -1482 -17056 -8479 10499 9546 -9977 -15618 2211 15050 1900 -15518 -8692 11994 12521 -7338
777 -7338 -14969 2907 17190 4412 -13762 -7359 13706 14733 -5772 -13889 4124 18580 6396
790 6396 -11992 -6689 13987 15906 -3560 -12519 4015 18743 7948 -10963 -6593 13184 16487
803 16487 -2261 -12039 2775 17708 8194 -10007 -7696 11758 15870 -1711 -12942 513 16651
816 16651 8427 -10149 -9804 9278 15328 -1598 -13911 -1813 14925 8409 -11318 -11431 7450
829 7450 14756 -2128 -15807 -3764 13629 7257 -12137 -13027 5868 13066 -3000 -16144 -5073
842 -5073 12203 6683 -11926 -13989 3806 11956 -2387 -15748 -6639 10371 6957 -11137 -14798
855 -14798 2697 12592 -894 -16073 -7817 10318 8522 -9844 -14779 2492 13479 177 -15104
868 -15104 -7399 11225 10400 -8586 -14203 2785 14523 2240 -13858 -7154 11622 11674 -6988 -13166
882 -13166 3016 15760 4243 -12795 -6632 12298 12873 -4753 -11499 3338 15981 5771 -10532
895 -10532 -5814 11152 13822 -2898 -10714 2644 15944 7679 -8937 -6386 10834 14600 -1289
908 -1289 -11190 1550 16109 8344 -8718 -7770 10250 14837 -1165 -11812 500 15641 8370
921 8370 -9164 -8249 9017 14551 -1132 -12395 -813 14282 7940 -9231 -9569 7019 13590 -1208
935 -1208 -12702 -2540 12761 7613 -9628 -10814 5672 12765 -1213 -13660 -4228 11543 7817
948 7817 -9384 -11716 4199 12089 -476 -13510 -5529 10550 8285 -8924 -12705 3129 12689
961 12689 440 -13637 -6371 10152 9057 -8275 -12731 2904 12961 1070 -13233 -6168 10587
974 10587 9238 -6967 -11925 2743 13036 2045 -11542 -5601 10084 10581 -5251 -11182 2219
987 2219 13620 4280 -10045 -6053 10095 11800 -3659 -10996 2203 14263 5793 -9492 -6513
1000 -6513 9990 12590 -2076 -10660 1795 14753 6783 -8784 -6771 9834 13220 -1795 -10382
1013 -10382 1159 14542 7116 -8657 -7011 8888 13037 -1495 -10930 117 13734 7087 -8467
1026 -8467 -7599 7969 12558 -1223 -11310 -1085 12308 7263 -8107 -8703 6419 12083 -589
1039 -589 -11740 -3017 11111 7624 -7991 -10117 4943 12224 -295 -12285 -4204 10838 7671
1052 7671 -7824 -10733 4124 11758 14 -12015 -4420 10160 7934 -7502 -10722 3735 11932
1065 11932 847 -11358 -4826 10010 8370 -6252 -10677 3040 12061 1964 -10495 -4746 9894
1078 9894 9886 -4920 -9932 2751 12875 3697 -9697 -4599 9977 11044 -3508 -9777 2783 13440
1092 13440 4732 -8843 -5085 9725 12066 -2608 -9838 2082 13440 5901 -8170 -5623 9766
1105 9766 12363 -1991 -9686 2109 13461 6095 -7979 -5868 8682 11800 -1583 -9343 638
1118 638 12506 5984 -7631 -6573 7338 11744 -1103 -9763 -698 11359 6582 -7385 -7774 6092
1132 6092 11163 -1145 -10852 -2144 10661 6146 -8333 -8819 4827 10589 -1279 -11140 -3382 9678
1146 9678 6417 -7973 -9879 3648 10397 -568 -11515 -4414 9190 6479 -7731 -10556 2988
1159 2988 10468 -105 -11264 -4720 9024 6789 -6905 -10054 2694 10595 554 -10512 -4951
1172 -4951 8446 7919 -5485 -9760 2219 10865 2184 -9225 -5001 8694 9333 -4324 -9360 2327
1186 2327 11695 3526 -8820 -4632 9081 10119 -2919 -8838 2691 12424 4556 -7514 -4323 8894
1200 8894 10874 -1738 -8060 2287 12249 5577 -6738 -4950 8768 11595 -1016 -8231 1578 12430
1214 12430 6354 -6555 -5231 8146 11583 -973 -8363 727 11439 6587 -6312 -6101 6772
1227 6772 10730 -471 -8993 -676 10397 6430 -6780 -7554 5338 10600 -843 -10210 -1893 9879
1241 9879 5998 -7768 -8621 4354 9242 -1917 -10913 -3266 8467 5240 -7735 -9199 2825 8768
1255 8768 -1169 -10918 -4797 7372 5143 -7442 -10189 1492 8411 -776 -11129 -5819 6512 5589
1269 5589 -7005 -10520 1103 8617 38 -10796 -5774 6528 6224 -5878 -9916 404 8359 1267
1283 1267 -9704 -5573 6623 7236 -4682 -9624 699 9221 2350 -8629 -5395 6902 8153 -3740
1297 -3740 -8979 1330 9975 3465 -7542 -5027 7448 9005 -2317 -8122 1102 10319 4714 -6756
1311 -6756 -5270 6935 9802 -1154 -8094 198 10521 5271 -6618 -5843 6455 9982 -881 -8765
1325 -8765 -124 9945 5404 -6940 -6564 5125 9410 -1280 -8855 -1734 8969 5109 -6563 -7596
1339 -7596 3641 8481 -1442 -9576 -3213 7395 4348 -7214 -8807 2105 7625 -1639 -10783 -4823
1353 -4823 6098 4151 -7919 -9853 956 6818 -2237 -10987 -6016 4842 3872 -7894 -10728 -638
1367 -638 6345 -1775 -11819 -6852 3945 3673 -7821 -11541 -1073 6224 -1528 -11414 -7197 4223
1381 4223 3927 -7344 -11088 -1437 6476 -803 -10800 -7320 3947 4729 -5869 -10495 -1535 6671 278
1396 278 -9826 -7102 4301 5656 -4811 -9888 -1468 7381 1749 -8918 -6923 4393 6493 -3468
1410 -3468 -9345 -1294 7886 3231 -7601 -6401 4599 7564 -2377 -8801 -1456 7760 3753 -7026
1424 -7026 -6735 4378 7623 -1997 -8683 -1606 8015 4214 -6467 -7032 3512 7649 -1144 -8461 -2254
1439 -2254 6855 4395 -6356 -7268 2751 7589 -951 -8776 -3505 6286 4139 -6108 -8336 1730
1453 1730 7097 -1064 -9180 -4455 5846 3978 -6794 -8867 799 6402 -1125 -9880 -4994 5151
1467 5151 3575 -6702 -9546 -142 6033 -1183 -9799 -6003 4207 3857 -6340 -9438 -618 5907
1481 5907 -985 -9664 -6660 4036 4159 -5697 -9738 -1258 5950 -78 -8799 -6690 3868 4693 -4742
1496 -4742 -9050 -1167 6160 1246 -7933 -6032 3817 5603 -3710 -8581 -1115 6819 2248 -7270 -5824
1511 -5824 4160 6436 -2871 -8272 -876 7286 3297 -6395 -5435 4184 7063 -1635 -7445 -536 7453
1526 7453 3694 -5759 -5423 4248 7219 -599 -7069 -1123 7420 4853 -5002 -5382 3790 7638 -299
1541 -299 -7100 -1566 7434 4833 -4722 -5808 3408 7800 -65 -6791 -1751 6816 5269 -4558 -6529
1556 -6529 2624 7330 120 -6993 -2761 6145 4706 -4424 -6358 1849 7017 283 -7442 -3451 5432
1571 5432 5021 -4157 -6981 1371 6512 720 -7119 -3840 5172 4877 -3885 -7364 430 6656 992
1586 992 -6976 -4480 4681 5528 -3683 -7262 104 6719 1640 -6688 -4570 4662 5696 -2575 -7163
1601 -7163 -144 6944 2272 -5965 -4423 4697 5857 -1943 -6820 -179 6858 3110 -5515 -4175 4195
1616 4195 6718 -1145 -6206 -80 7376 3749 -4754 -4662 4232 7044 -703 -6158 -336 7381 4275
1631 4275 -4727 -4592 4162 7087 42 -6095 -668 6896 4720 -4165 -4841 3395 7235 682 -5812
1646 -5812 -1365 6746 4824 -3341 -4788 2968 6861 652 -5852 -2177 6032 4824 -3410 -5176 2348
1661 2348 6671 918 -5886 -2039 5811 4787 -3286 -5640 1419 6535 1091 -5877 -2994 4941 4989
1676 4989 -3002 -6142 1119 6807 1391 -6010 -3079 4964 5213 -2821 -5907 707 6680 1703 -5720
1691 -5720 -3196 4757 5501 -2318 -5997 478 6541 2374 -5347 -3517 4421 5492 -1903 -5935 414
1706 414 6637 2995 -4883 -3674 4121 6269 -982 -5437 315 6646 3670 -4189 -3339 3833 6653
1721 6653 -312 -5051 123 6551 3960 -3703 -3882 3677 6592 203 -5238 -460 6407 4136 -3235
1736 -3235 -4078 3498 6673 311 -4858 -824 6117 4204 -3151 -4324 2828 6603 592 -5217 -1263
1751 -1263 5605 4279 -2980 -4679 2091 5926 296 -5673 -2420 5085 4130 -3338 -5258 1462 5753
1766 5753 514 -5522 -2802 4617 3983 -3530 -5883 934 5629 903 -5842 -3107 4029 4209 -3216
1781 -3216 -5972 339 5438 917 -5326 -3689 3553 4397 -2670 -5757 -93 5389 1094 -5527 -3863
1796 -3863 3228 4678 -2136 -5853 -364 5619 1795 -4870 -3825 3572 5032 -1644 -5364 -392 5677
1811 5677 2633 -4553 -3619 3549 5310 -690 -5077 -331 5619 3373 -3650 -3765 3525 5798 -455
1826 -455 -4794 -142 5979 3749 -3083 -3933 3331 5854 40 -4854 -676 5429 3639 -3199 -3620 2671
1842 2671 5707 250 -4685 -844 5358 3854 -3071 -4275 2243 5832 505 -4859 -1816 4709 3958
1857 3958 -3158 -4501 1515 5449 199 -5030 -2186 4084 3647 -3093 -4954 742 4904 360 -5311
1872 -5311 -3040 3700 3449 -3194 -5644 166 4452 577 -5307 -3597 2944 3233 -2718 -5579 -392
1887 -392 4442 554 -5496 -3679 2177 3362 -2653 -5900 -716 4260 769 -4909 -3975 2373 3841
1902 3841 -2479 -5750 -1011 4449 1539 -4602 -4170 2707 4399 -1665 -5609 -603 4718 2076 -4305
1917 -4305 -3671 2865 4622 -714 -4837 -689 4934 2717 -3331 -3286 2619 4955 -33 -4367 -721 5278
1933 5278 3354 -2915 -3469 2481 5712 603 -4149 -328 5094 3913 -2248 -3115 2415 5750 558
1948 558 -4001 -586 4848 4077 -1832 -3310 1949 5721 1094 -3707 -1365 4600 4136 -1618 -3827 1988
1964 1988 5429 1213 -3974 -1639 4373 3890 -1989 -3951 1166 4776 1124 -4139 -2181 3488 3526 -2074
1980 -2074 -4318 425 4786 1139 -4180 -2905 3185 3537 -2216 -4876 -7 4400 1211 -4696 -3324
1995 -3324 2675 3401 -2049 -4974 -762 3798 1418 -3959 -3734 2244 3489 -1553 -4665 -787 3738
2010 3738 1708 -3453 -3742 2207 4117 -1046 -4577 -884 4142 2235 -3289 -3392 2060 4525 -485
2025 -485 -4083 -551 4344 2862 -2753 -3323 2162 4644 266 -3955 -807 4285 3392 -2257 -2947 2328
2041 2328 4744 583 -3658 -574 4671 3717 -1936 -2686 2591 5296 941 -3245 -561 4596 3777 -1349
2057 -1349 -2919 1939 4991 1285 -3037 -1138 4036 4003 -1488 -3185 1316 5059 1293 -3264 -1325
2072 -1325 3941 3740 -1527 -3349 695 4610 1492 -3097 -1773 3321 3579 -1279 -4049 429 4056
2087 4056 1503 -3512 -2388 2799 3618 -1453 -4045 16 4186 1277 -3638 -2642 1990 3239 -1645
2102 -1645 -4258 -278 3659 1353 -3437 -3012 1623 3176 -1533 -4294 -839 3497 1385 -3638 -3111
2117 -3111 1870 3196 -937 -4466 -876 3264 1488 -3634 -3119 1797 3379 -659 -4528 -1137 3326
2132 3326 2350 -3055 -3319 1353 3612 -336 -3816 -1049 3497 2534 -2683 -3336 1511 3808 232 -3847
2148 -3847 -1243 3278 2722 -2216 -3198 1274 3887 277 -3448 -1348 3447 2894 -1547 -3450 913 3815
2164 3815 702 -3318 -1419 3116 3038 -1950 -3189 697 3823 855 -3594 -1823 2832 3277 -875 -3666
2180 -3666 258 3582 1072 -3303 -2198 2353 3024 -1616 -3701 -67 3485 943 -3487 -2225 2105
2195 2105 2993 -1327 -3517 -233 3481 1022 -3260 -3059 1793 2954 -1676 -3984 -646 2884 1148
2210 1148 -3281 -3084 1975 2882 -1376 -3969 -1106 2962 1436 -3052 -3112 1262 2850 -1145 -3799 -1262
2226 -1262 2595 1404 -2936 -3411 1049 2720 -700 -3979 -1459 2636 1997 -3152 -3169 878 3137 -334
2242 -334 -3510 -1665 2235 2170 -2659 -3430 678 3114 -19 -3483 -1796 2559 2085 -2336 -3129 566
2258 566 3119 -77 -3575 -1925 2537 2294 -2339 -3633 446 3143 96 -3379 -2081 2054 2121 -1912
2274 -1912 -3502 103 2891 407 -3436 -2471 1777 2287 -2002 -3839 -288 2732 357 -3350 -2329
2289 -2329 1407 2515 -1787 -3721 -521 2403 325 -3462 -2922 1484 2311 -1772 -3745 -589 2332
2304 2332 942 -2768 -3011 1192 2439 -1375 -3796 -925 2450 933 -3206 -2680 1339 2623 -1061
2319 -1061 -3456 -971 2640 1364 -2671 -3298 709 2789 -759 -3360 -1257 2698 1447 -2532 -2939
2334 -2939 733 2517 -656 -3437 -1149 2443 1596 -2389 -2783 736 2873 -145 -3381 -1273 2321
2349 2321 2051 -1895 -2605 725 2952 -180 -3116 -1327 2341 1993 -1655 -3059 566 2850 387 -3215
2365 -3215 -1362 2346 2141 -1418 -2762 104 2839 261 -3111 -1818 1700 1949 -1426 -2924 -25
2380 -25 2904 591 -2693 -2176 1842 2523 -1299 -3255 -234 2489 556 -3010 -2470 1483 2299 -1229
2396 -1229 -3120 -297 2426 1051 -2820 -2493 1388 2338 -1115 -3271 -907 2448 887 -2658 -2503 1032
2412 1032 2380 -911 -3170 -615 2192 1158 -2353 -2543 1088 2495 -777 -2998 -654 2638 1682
2427 1682 -2040 -2208 1200 2726 -205 -2834 -464 2691 1834 -1719 -2147 1315 2998 226 -2493 -710
2443 -710 2948 2152 -1232 -2122 1025 3390 747 -2416 -397 2883 2473 -1238 -2223 1151 3105 756
2459 756 -2084 -692 2661 2817 -800 -2072 1190 3278 1431 -1940 -956 2663 2420 -554 -2337 538
2475 538 2974 989 -1786 -1301 2409 2373 -908 -2010 760 3040 1077 -2110 -1539 2093 2459 -664
2491 -664 -2466 145 2702 993 -1991 -1936 1585 2309 -877 -2842 -143 2416 1008 -2210 -1868 1630
2507 1630 2205 -681 -2583 -601 2228 1081 -2066 -1966 1153 2336 -507 -2839 -630 2226 1511 -1922
2523 -1922 -2351 529 2357 -405 -2874 -638 2041 1433 -1750 -2521 869 2367 -96 -2683 -739 2231
2539 2231 1601 -1392 -2268 633 2613 228 -2342 -1143 1973 2136 -1200 -2137 807 2592 862 -2108
2555 -2108 -1094 2436 2217 -1137 -2245 828 2760 670 -2066 -1056 1854 2035 -472 -1989 336
2570 336 2807 525 -1691 -1042 2108 2358 -645 -1938 421 2527 1196 -1720 -963 1696 2421 -670
2586 -670 -2370 172 2582 1013 -2012 -1605 1165 2185 -447 -2308 -308 2011 1099 -1733 -1830 1117
2602 1117 1783 -642 -2512 -508 2108 1051 -2041 -2144 1004 1606 -740 -2416 -966 1738 964 -2302
2618 -2302 -2287 397 1635 -538 -2456 -892 1432 999 -2131 -2333 717 2040 -219 -2549 -1167 1523
2634 1523 731 -1820 -2445 543 1782 -478 -2546 -1242 1218 954 -1634 -2318 120 1824 -336 -2347
2650 -2347 -1248 1667 1580 -1300 -2444 504 1854 209 -2368 -1172 1631 1603 -1430 -2398 175 2278
2666 2278 215 -1879 -1080 1702 2107 -655 -1921 218 1882 845 -1787 -1376 1502 1883 -771 -2118
2682 -2118 -122 2391 775 -1571 -1379 1338 1927 -717 -2089 -256 2256 922 -1612 -1219 1242 1920
2698 1920 -313 -1962 -427 2330 1150 -1656 -1313 882 1792 -320 -2052 -603 1777 687 -1603
2713 -1603 -1533 856 1733 -40 -1714 -726 1462 1050 -1665 -1742 622 1661 -257 -2180 -1031 1322 1230
2730 1230 -1636 -2134 575 1632 -66 -2107 -1181 1349 1348 -1065 -2044 404 1819 175 -1892 -1005 1062
2747 1062 1430 -796 -1855 127 1927 74 -2056 -1111 1687 1362 -1149 -1760 -98 2128 443 -1825
2763 -1825 -1036 1415 1476 -743 -2051 21 1924 544 -1798 -729 1379 1881 -831 -1916 -26 1907
2779 1907 785 -1672 -904 1140 1687 -426 -1747 -13 1875 920 -951 -1276 1233 1478 -302 -1724
2795 -1724 -158 1949 1042 -1167 -1378 970 1943 -303 -1891 -119 1847 1229 -1416 -1419 971 2419 -141
2812 -141 -1869 -193 1707 1139 -1236 -1385 948 2206 132 -1707 -520 1588 1408 -993 -1283 468
2828 468 1773 280 -1737 -804 1393 1436 -1300 -1404 542 1884 301 -1636 -659 1420 1295 -1042 -1286
2845 -1286 249 1697 650 -1545 -832 1416 1402 -702 -1469 372 2031 636 -1495 -657 1617 1644 -549
2862 -549 -1603 260 1783 446 -1145 -871 1133 1922 -466 -1239 499 1650 552 -1156 -802 1450
2878 1450 1876 -108 -1628 50 2022 940 -1279 -1002 930 2037 75 -1669 -234 1948 1047 -960
2894 -960 -1116 1068 1972 -77 -1244 -129 1831 1192 -1148 -1205 548 1901 35 -1365 -411 1642 1275
2911 1275 -742 -1138 558 1758 200 -1354 -289 1501 1360 -742 -1306 545 1998 386 -1317 -121
2927 -121 1316 1163 -443 -1458 172 1604 657 -1398 -623 1460 1579 -579 -1093 365 1802 697
2943 697 -1268 -458 1654 1700 -690 -1041 388 1824 780 -1328 -709 1219 1645 -553 -1133 542 1830
2960 1830 846 -995 -747 1487 1897 -17 -1140 372 1802 1090 -705 -634 1370 1545 420 -1163 220
2977 220 1831 1080 -787 -851 1295 1637 185 -956 78 1675 1021 -780 -932 840 1565 165 -906
2994 -906 -167 1550 1189 -701 -981 939 1820 256 -1217 -252 1280 1094 -828 -1322 694 1686 393
3011 393 -1033 -453 1410 1277 -606 -1170 477 1858 592 -1568 -688 1082 1070 -714 -1422 336 1560
3028 1560 429 -1090 -874 922 1140 -839 -1159 325 1040 176 -1188 -636 1102 1180 -572 -1479 108
3045 108 1279 379 -1124 -606 849 1318 -261 -1254 -227 1373 546 -968 -763 691 1276 -382 -1448
3062 -1448 -18 1167 790 -861 -951 648 1516 190 -1101 14 1525 888 -864 -954 835 1551 -82
3079 -82 -996 -29 1427 1207 -604 -708 641 1366 84 -1055 -157 1412 1067 -407 -1047 505 1463 -28
3097 -28 -1273 -653 1112 896 -886 -1187 257 1220 117 -1328 -700 1126 782 -517 -1209 246 880
3114 880 92 -1174 -773 787 611 -596 -1310 38 1160 194 -1310 -1182 505 854 -717 -1185 -257
3131 -257 1054 375 -1023 -1162 535 621 -629 -1565 -283 935 311 -1039 -1033 537 990 -655 -1595 -508
3149 -508 1084 640 -1051 -1307 280 945 -539 -1070 -645 1043 376 -1233 -1177 365 1083 -671 -1431 -647
3167 -647 926 331 -1047 -1032 138 924 -462 -1206 -603 683 422 -904 -900 366 1258 136 -1067 -517
3185 -517 818 808 -590 -780 25 1088 171 -1282 -575 740 717 -637 -966 129 964 227 -1097 -637
3203 -637 493 906 -713 -1250 90 971 149 -868 -671 657 792 -483 -1423 -129 754 128 -1393
3220 -1393 -1003 627 928 -612 -1279 148 924 576 -877 -1047 345 957 -396 -1179 -70 804 199
3237 199 -950 -1103 457 896 -158 -1247 -376 1034 256 -1187 -1147 401 803 -220 -1151 -519 712
3254 712 285 -1304 -1119 292 928 -363 -1283 -783 741 247 -697 -1246 33 1066 -250 -1262 -435
3271 -435 560 270 -879 -1436 380 774 -232 -1280 -772 855 785 -489 -1036 127 954 76 -959 -649
3289 -649 495 820 -413 -964 235 821 122 -1088 -365 619 949 -452 -931 261 908 490 -1020 -752
3307 -752 898 1023 -336 -1067 17 1060 250 -790 -714 615 923 -18 -1111 -250 765 76 -1070
3324 -1070 -780 471 632 -68 -953 182 1068 374 -764 -777 569 738 -172 -1071 -204 1053 403 -774
3342 -774 -813 468 842 -222 -842 -307 777 718 -689 -826 228 765 274 -1096 -683 825 600 -490
3360 -490 -1155 316 1007 73 -914 -564 1034 621 -607 -848 444 882 328 -759 -456 982 699 -260
3378 -260 -726 156 910 371 -843 -387 766 970 -479 -876 17 1088 407 -882 -556 585 1057 -278
3396 -278 -928 -250 890 304 -694 -594 460 882 -337 -385 115 837 292 -940 -310 640 600 -301 -712
3415 -712 4 747 578 -864 -759 424 798 -13 -772 -268 1083 482 -814 -664 475 944 131 -847
3433 -847 -138 998 672 -650 -776 532 938 194 -786 -252 1057 666 -361 -727 301 899 29 -697
3451 -697 -250 678 736 -552 -479 258 985 482 -993 -503 515 934 -239 -878 564 1166 357 -729 -276
3470 -276 563 836 -198 -789 229 844 245 -534 -534 450 817 -257 -733 -78 781 294 -583 -450 650
3489 650 788 -270 -876 318 887 481 -703 -569 701 1094 -161 -625 1 602 711 -640 -632 180 661
3508 661 -166 -576 -159 675 445 -496 -759 389 1004 -123 -832 -364 423 516 -661 -682 241 767 -99 -888
3528 -888 -452 453 414 -592 -847 439 747 -64 -750 -439 499 514 -588 -925 -16 785 -201 -857 -601 242
3548 242 556 -481 -1010 -95 835 184 -753 -610 3 504 -97 -806 -15 834 178 -806 -651 312 473 -411
3568 -411 -1117 -434 648 176 -1076 -701 371 694 -210 -1041 18 703 88 -653 -569 222 390 29 -973
3587 -973 -427 610 504 -397 -452 165 533 -205 -853 -89 547 219 -295 -459 365 602 -341 -549 -251 525
3607 525 485 -399 -551 129 821 112 -676 -272 785 736 -574 -871 217 528 -10 -804 -572 487 545 -388
3627 -388 -627 -77 610 293 -937 -447 466 637 -210 -848 115 945 250 -1092 -206 428 218 -347 -636
3646 -636 -3 455 108 -583 -529 453 419 -526 -864 -179 718 249 -676 -855 413 541 -355 -786 -220 658
3666 658 -9 -409 -545 632 582 -20 -618 -346 526 339 -453 -787 217 651 -53 -904 -123 563 499 -229
3686 -229 -516 286 711 90 -566 -260 516 467 -466 -565 92 718 -40 -647 -206 796 551 -371 -702 318
3706 318 759 261 -892 -165 659 613 -433 -351 46 611 127 -646 -245 532 726 -333 -711 336 886
3725 886 211 -902 -541 307 658 -283 -727 -255 877 205 -438 -330 444 466 -244 -549 -215 883 380
3744 380 -477 -712 395 433 233 -720 -78 361 265 -373 -807 145 836 -187 -537 -500 447 405 -316 -754 343
3765 343 683 -477 -412 -109 653 351 -442 -693 330 250 26 -790 -333 832 406 -550 -727 -4 878 -130
3785 -130 -657 -368 627 556 -444 -487 283 942 292 -717 -280 483 553 -608 -570 -131 656 199 -686 -500
3805 -500 485 546 -133 -918 41 528 220 -655 -745 609 667 -532 -764 66 855 306 -635 -419 398 798
3825 798 -389 -713 -94 735 162 -507 -357 468 683 -143 -782 -140 724 23 -607 -599 277 747 146 -835
3845 -835 -209 829 320 -311 -733 48 840 33 -572 -182 732 302 -422 -646 420 692 -176 -519 -239
3864 -239 541 412 -403 -786 344 881 -172 -592 -174 862 391 -337 -675 214 706 172 -542 -237 698
3883 698 878 -188 -658 97 875 365 -675 -597 623 663 -537 -613 63 686 213 -754 -248 462 669 -468
3903 -468 -677 325 887 469 -662 -299 767 547 38 -682 -46 544 353 -603 -691 557 719 79 -692
3922 -692 90 699 455 -808 -171 341 694 66 -904 -468 698 346 -645 -590 -14 516 45 -819 -522 621
3942 621 383 -426 -700 42 404 175 -840 -22 245 402 -561 -513 69 666 -82 -477 -193 785 553 -666
3962 -666 -555 267 918 47 -601 -302 601 666 -177 -865 104 639 164 -649 -519 704 658 -244 -552 -153
3982 -153 544 155 -391 -531 137 470 -292 -643 246 818 328 -559 -389 440 749 145 -616 -140 774 293
4002 293 -360 -536 527 349 -244 -448 190 535 597 -643 -318 563 706 46 -603 -68 856 498 -669
4021 -669 -617 480 553 -109 -601 -365 644 385 -510 -465 304 705 116 -1059 -234 523 729 -646 -976 366
4041 366 852 -106 -493 -355 613 585 -394 -801 -28 611 169 -371 -549 555 329 -371 -670 17 591 -264
4061 -264 -408 -500 365 541 -368 -813 56 726 110 -645 -416 287 592 -605 -792 192 583 131 -504 -427
4081 -427 150 336 -215 -711 -31 676 135 -621 -420 368 928 -157 -507 -130 605 673 -306 -558 362 410
4101 410 -260 -514 -100 797 304 -448 -652 337 491 -80 -771 -185 610 334 -273 -339 532 942 104 -625
4121 -625 -181 887 467 -425 -728 102 862 256 -416 -470 832 389 -417 -743 186 734 14 -483 -264 571
4141 571 337 -190 -526 188 730 -109 -555 -539 507 686 -349 -643 38 1045 389 -586 -442 507 483 -295
4161 -295 -545 -83 883 114 -494 -426 282 866 -65 -870 -134 781 204 -595 -641 432 785 -228 -757 -354
4181 -354 596 192 -564 -557 459 373 -482 -494 -20 711 178 -681 -600 395 483 -273 -600 34 666 248 -357 -427
4203 -427 507 522 -30 -428 -71 593 784 -489 -587 348 833 101 -851 44 643 507 -216 -314 219 940 221
4224 221 -585 -203 708 603 -275 -910 470 902 151 -548 -69 623 939 -418 -591 -200 1054 69 -772
4243 -772 -352 978 966 14 -485 215 747 318 -489 -310 687 653 -588 -629 192 538 385 -850 -269 524
4263 524 627 -225 -565 85 697 89 -531 -648 308 447 -349 -604 147 691 195 -437 -777 456 573 -141
4283 -141 -736 -17 719 252 -480 -518 504 616 54 -646 -292 727 229 -215 -638 353 847 -15 -564 -251
4303 -251 734 353 -650 -684 142 447 -93 -663 75 605 285 -480 -568 188 567 -128 -685 -307 543 320
4323 320 -235 -689 131 691 -45 -603 -329 615 589 -463 -784 11 623 232 -643 -165 193 509 -306 -602
4343 -602 198 845 161 -707 -455 419 509 -381 -1000 76 739 409 -765 -724 399 539 -553 -723 -75
4362 -75 855 232 -527 -676 241 712 -33 -1111 -244 967 228 -430 -237 4 448 -129 -807 -243 635 287
4382 287 -500 -676 334 523 -44 -552 -274 505 456 -756 -463 221 542 -163 -807 -219 589 291 -499 -764
4402 -764 188 803 148 -1114 -251 539 531 -636 -1034 94 393 -168 -968 -370 404 499 -493 -701 -146 333
4422 333 -172 -832 -331 339 523 -387 -829 29 392 -11 -1051 -251 192 373 -232 -941 42 718 162 -790
4442 -790 -616 -8 556 -261 -739 8 501 -56 -834 -756 437 611 -118 -616 -569 449 357 -587 -453 380
4462 380 463 -277 -944 -124 676 412 -474 -495 31 554 -263 -676 -377 540 496 -591 -631 401 595 207 -660
4483 -660 -197 636 393 -504 -947 252 683 -259 -729 -193 588 510 -500 -631 347 388 -128 -471 -233 417
4503 417 528 -491 -787 -139 811 -17 -694 -513 540 516 -387 -444 -248 843 42 -722 -528 540 412
4522 412 -569 -837 37 284 200 -541 -314 416 703 -50 -568 -61 860 269 -971 -521 465 748 -189 -729
4542 -729 -325 930 512 -743 -582 428 581 -242 -873 -293 477 211 -268 -618 37 615 -118 -750 -3
4561 -3 410 385 -710 -641 334 628 -163 -390 -137 533 437 -517 -791 172 394 65 -693 -506 382 152 -411
4582 -411 -484 68 470 286 -788 -289 761 395 -291 -681 401 683 249 -562 -401 566 456 -227 -305 17
4602 17 944 110 -480 -477 487 654 -416 -666 356 794 508 -488 -82 708 643 -155 -729 -219 682 156 -519
4623 -519 -360 605 958 -170 -603 26 926 535 -800 -451 566 927 -4 -732 66 667 617 -402 -307
4642 -307 636 730 182 -680 -18 766 173 -93 -319 413 529 -171 -649 -82 652 618 -422 -283 454 719
4662 719 -22 -634 -179 637 425 -374 -864 331 503 329 -637 -80 697 317 -466 -518 348 708 294 -767
4682 -767 -158 389 363 -292 -531 -6 841 314 -423 -255 837 651 -431 -560 27 947 178 -688 -296 717
4702 717 488 -491 -643 7 849 395 -551 -354 699 471 -201 -707 351 918 75 -673 -437 659 763
4721 763 -518 -472 220 864 334 -314 -46 429 955 -202 -233 55 725 465 -773 -226 720 745 -114 -340
4741 -340 181 588 452 -485 -450 524 529 197 -495 -129 1000 410 -307 -423 507 662 55 -436 -125 597 448
4762 448 -341 -464 440 657 -93 -474 -217 947 424 -165 -379 582 999 -11 -659 -62 726 506 -239
4781 -239 -649 -2 430 29 -808 -14 312 427 -520 -507 113 567 -36 -951 -203 464 503 -407 -400 -20 633
4802 633 145 -623 -307 556 306 -15 -749 61 767 124 -528 -438 486 444 -251 -780 244 558 339 -687
4822 -687 -583 309 673 -368 -447 -111 621 254 -602 -493 277 912 -154 -740 206 462 180 -517 -832 232
4842 232 839 -7 -694 -58 452 369 -510 -287 269 659 94 -793 -39 937 536 -459 -423 520 730 -63 -646
4863 -646 -469 364 215 -397 -199 286 866 -55 -874 -242 442 267 -341 -606 187 894 -55 -664 -454 511
4883 511 317 -268 -464 135 524 275 -703 -360 354 597 -460 -728 -25 626 146 -920 -523 427 674
4902 674 -400 -416 -24 492 246 -494 -587 310 450 -439 -834 -12 696 264 -484 -236 470 529 -233 -997 -286
4923 -286 507 79 -950 -667 190 721 -82 -855 -37 695 325 -578 -627 50 451 -9 -852 -12 1008 179
4943 179 -749 -973 452 703 -144 -538 -260 727 406 -268 -611 498 703 -32 -744 -200 673 309 -506
4962 -506 -629 239 458 134 -841 -431 687 368 -428 -598 231 893 -275 -820 -337 739 412 -143 -725
4981 -725 21 566 123 -828 -417 412 292 -192 -973 39 712 57 -495 -200 458 949 -352 -658 0
5000 0 669 394 -708 -450 608 359 -201 -752 37 858 145 -422 -607 582 329 -277 -634 123 593 240
5020 240 -499 -654 432 494 0 -842 208 693 222 -749 -735 652 592 113 -604 -19 635 199 -357 -679
5040 -679 410 754 -433 -729 -118 628 415 -446 -502 127 683 120 -801 -362 420 684 -408 -621 54
5059 54 438 -191 -803 -389 596 428 -516 -429 -39 634 -157 -725 -335 214 299 -135 -784 139 725 -182 -607
5080 -607 -221 508 625 -546 -911 15 739 -107 -653 -320 563 518 -414 -534 298 693 256 -625 -549 815
5100 815 482 -398 -610 221 846 213 -356 -264 361 647 -342 -900 -28 595 273 -698 -295 430 530 6
5120 6 -529 -11 473 155 -509 -258 258 361 -163 -625 32 750 740 -215 -339 457 771 89 -383 -226 788
5141 788 224 -334 -377 156 527 20 -555 -163 727 353 -501 -836 98 416 24 -655 -234 592 434 -131
5161 -131 -772 207 597 251 -433 -520 414 354 -257 -443 268 609 26 -896 -147 266 684 -326 -699 12
5181 12 539 143 -646 -684 569 551 -754 -885 -39 821 130 -604 -385 721 675 -51 -754 51 504 0
5201 0 -608 -124 564 670 -493 -561 -23 696 355 -696 -706 230 731 -462 -694 -47 534 236 -747 -707 332
5222 332 853 -251 -687 0 557 331 -585 -362 541 479 -193 -952 -182 734 309 -664 -758 399 994 135
5242 135 -479 -316 565 361 -580 -366 324 701 413 -634 -494 611 260 -324 -635 554 723 286 -493
5261 -493 -404 436 474 -314 -653 -93 771 68 -669 16 533 505 -371 -707 43 760 306 -576 -211 572 509
5282 509 -167 -666 62 668 100 -775 -504 641 693 -302 -805 -70 528 149 -297 -803 625 573 -281 -760
5302 -760 -53 718 176 -331 -489 446 605 -113 -879 -243 492 199 -463 -367 517 575 -333 -576 -349 868
5322 868 186 -278 -493 226 714 -47 -666 -453 223 108 -474 -663 157 843 -140 -942 -415 671 430 -687
5342 -687 -739 250 688 -68 -614 -45 889 129 -567 -418 216 863 257 -483 -237 742 207 -476 -416 171 836
5363 836 63 -508 -218 697 449 -342 -398 275 937 -153 -748 -205 722 806 -36 -988 99 971 -79 -447
5383 -447 -363 626 573 -379 -572 71 882 344 -569 -339 645 288 -232 -517 164 492 351 -678 -483 390
5403 390 546 -136 -534 39 549 167 -350 -311 321 665 -155 -680 113 821 479 -323 -581 568 461 115
5423 115 -476 -322 454 389 -620 -549 223 466 6 -784 3 619 249 -574 -614 266 533 -40 -567 -157 723
5444 723 578 -432 -696 423 753 255 -692 -91 578 294 18 -593 226 401 -187 -346 -220 258 577
5463 577 -342 -599 -54 807 104 -534 -393 807 711 -250 -822 424 709 149 -594 -568 745 525 2 -785
5483 -785 160 733 34 -618 -436 435 485 -535 -613 76 775 406 -706 -87 450 716 -376 -417 -110 433
5503 433 109 -510 -671 389 742 -329 -678 96 797 519 -247 -285 129 859 -47 -590 -240 660 353 -431
5523 -431 -555 628 724 -128 -454 -250 462 416 -160 -424 225 644 -154 -524 -232 604 371 -251 -342 -88 565
5544 565 63 -609 -140 428 569 -233 -403 -17 424 111 -632 -410 633 654 -636 -679 169 652 0 -571
5564 -571 -334 315 493 -447 -416 -192 445 301 -557 -535 501 227 -310 -543 -66 704 31 -481 -406 592 361
5585 361 -344 -618 0 780 174 -299 -476 391 525 -414 -509 164 619 20 -543 -460 341 410 -84 -551 -102
5606 -102 653 313 -181 -519 522 542 -96 -498 -97 780 141 -514 -577 326 640 9 -584 159 598 60
5626 60 -95 -723 424 841 -240 -589 -423 594 486 -424 -467 52 556 -231 -720 29 446 322 -189 -656
5646 -656 127 565 -29 -434 -276 493 564 -529 -465 -134 590 -20 -404 -466 493 541 -321 -624 -81 484 598
5667 598 -515 -568 346 454 29 -580 -79 460 -205 -595 -171 435 442 -390 -834 -44 267 -51 -806 -732 347
5688 347 331 -343 -810 -107 1033 196 -633 -255 242 150 -198 -747 -61 598 194 -594 -318 261 341 -288 -587
5709 -587 -115 242 257 -349 -553 122 439 -270 -894 -382 478 279 -596 -638 -186 549 -262 -546 -396 331 452
5730 452 -819 -509 224 504 -107 -797 -452 473 170 -382 -643 -137 563 128 -801 -385 314 356 -386 -454
5750 -454 306 724 67 -361 -172 291 718 -378 -561 -206 472 44 -431 -373 582 597 -507 -558 36 740
5770 740 50 -562 -469 343 375 -453 -341 256 635 89 -510 -494 327 722 -99 -550 -101 485 79 -508 -310
5791 -310 461 912 -560 -614 -5 367 180 -465 -419 391 237 89 -763 -112 338 100 -733 -493 161 445
5811 445 -300 -594 -45 382 140 -683 -470 -5 645 141 -417 -554 368 273 -486 -576 50 536 -151 -281 -29
5832 -29 593 653 -277 -485 180 595 -16 -520 -275 546 88 -350 -615 156 413 84 -360 -292 349 549 170
5853 170 -713 -40 362 61 -501 -467 87 836 -184 -263 -62 567 -128 -399 -317 322 613 -130 -324 -199 968
5874 968 200 -266 31 406 348 -236 -464 -199 549 148 -506 -373 676 770 -174 -167 131 391 161 -445 -546
5895 -546 340 652 345 -755 -112 704 364 -388 -262 441 457 -33 -566 -123 661 333 -456 -509 291 517
5915 517 -311 -544 48 588 187 -268 -465 366 585 38 -299 -82 407 380 -589 -537 283 556 99 -595 -173
5936 -173 313 187 -41 -462 77 448 103 -324 -265 596 702 -328 -615 196 594 -34 -597 -214 559 434
5956 434 -136 -746 -247 465 117 -365 -301 326 174 -17 -562 93 484 187 -262 -219 540 611 87 -455 236
5977 236 623 369 -518 -398 611 452 -29 -473 -5 375 94 -526 -429 476 578 -179 -632 100 524 420
5997 420 -618 -620 404 509 -43 -310 -222 391 293 -652 -55 301 445 84 -270 -216 484 538 -294 -407 364
6018 364 362 -26 -351 -472 494 287 -497 -634 154 645 -184 -415 14 248 205 -91 -548 200 570 166 -564
6039 -564 -256 570 226 -511 -498 -66 543 9 -323 -305 161 243 -346 -551 77 452 -166 -279 -291 418 390 -399
6061 -399 -934 26 275 42 -574 -295 171 238 -101 -420 -126 444 193 -687 -272 274 546 -180 -584 -357
6081 -357 564 15 -630 -378 205 357 -238 -653 -522 311 216 -172 -554 -42 346 -428 -426 -155 370 -33 -612
6102 -612 -472 368 677 -273 -721 -208 669 106 -640 -303 239 453 -196 -669 -276 356 237 -402 -652 -3
6122 -3 583 -140 -567 -184 339 397 -236 -390 143 529 -87 -548 21 235 293 -35 -537 130 637 59 -451
6143 -451 -181 295 240 -400 -351 251 449 11 -424 -466 433 393 -144 -224 -160 660 -201 -460 -285 389 753 -309
6165 -309 -509 6 492 133 -577 -242 146 750 -413 -573 -97 519 179 -291 -478 207 322 -200 -615 -53
6185 -53 570 271 -438 -332 298 411 -24 -452 -223 237 304 -520 -319 -20 475 -9 -119 -314 522 235 -428
6206 -428 -476 362 488 -52 -371 -353 467 418 -309 -436 215 88 -56 -447 -60 353 303 -445 -385 98 221 -104
6228 -104 -529 -138 281 622 257 -34 54 676 66 -462 -335 374 342 -367 -343 -220 277 298 -729 -627 173
6249 173 242 -164 -487 363 498 46 -611 -87 229 348 -153 -707 -88 517 308 -407 -270 497 282 113
6269 113 -649 320 491 281 -378 -381 121 365 -43 -619 82 555 391 -147 23 231 647 -101 -543 276 427
6290 427 418 -334 -236 207 456 6 -329 88 529 222 -271 -508 199 586 -118 -389 -118 179 626 -381 -446
6311 -446 109 547 205 -342 -257 329 224 -242 -39 72 566 86 -573 52 446 194 -62 -466 21 626
6331 626 50 -517 -274 119 548 -55 -559 82 347 24 -402 -474 401 389 -207 -329 -93 258 55 -279 -386
6352 -386 78 212 -124 -250 -110 694 137 -248 -124 353 245 -79 -451 -157 494 140 -171 -418 384 396
6372 396 -181 -455 89 432 369 -82 -388 244 377 22 -496 -331 501 188 59 -48 398 509 -71 -268
6392 -268 -164 591 455 -223 -200 321 716 198 -293 -211 371 206 -250 -255 234 418 26 -374 -170 365 264
6413 264 -307 -305 269 383 81 -455 207 359 242 -186 -555 310 592 78 -122 -128 291 638 -114 -373 69
6434 69 496 -102 -369 61 248 128 -125 -221 81 269 116 -308 -149 539 321 53 -508 -153 451 125 -187
6455 -187 -10 132 387 -36 -350 -26 353 256 -546 -300 330 131 95 -343 -76 263 585 -282 -295 283 316
6476 316 -191 -555 6 139 322 -377 -192 -120 182 168 -495 135 580 237 -354 -187 437 202 -262 -348 113
6497 113 447 -44 -215 -263 280 494 -73 -669 -54 450 379 -331 -498 58 600 -193 -379 -371 420 297 -446
6518 -446 -248 228 226 35 -544 -138 177 654 -31 -561 209 360 100 -445 -76 195 33 -452 -248 30 252
6539 252 119 -467 -450 539 323 -248 -550 83 361 290 -357 -198 194 465 -162 -596 -107 476 149 -290 -458
6560 -458 223 500 -211 -360 -91 376 259 -275 -516 107 281 -51 -492 -41 305 -47 -229 -482 390 420
6580 420 -116 -228 -213 521 152 -468 -616 247 413 143 -452 80 225 -69 -76 -206 152 158 187 -819 -263 502
6602 502 104 -728 -325 -50 365 -139 -359 -121 118 497 -446 -184 -255 339 73 -483 -98 574 433 -106
6622 -106 -379 -53 480 -64 -224 -25 390 183 -416 -202 139 209 331 -483 33 501 400 192 -273 115
6642 115 321 16 -478 -337 357 433 41 7 353 544 201 -584 -460 -19 320 -90 -368 100 249 249 -450
6663 -450 -122 211 334 -179 47 -236 365 363 -146 -278 -171 383 33 -312 89 416 80 -283 -184 319 346
6684 346 84 -373 -153 457 206 -393 -454 190 434 188 -305 -145 140 316 -38 -397 45 268 -315 -228 -225
6705 -225 255 118 -214 -546 103 159 -151 -421 53 224 115 -257 -179 194 308 69 -111 -388 471 260 -278
6726 -278 -246 12 578 58 -370 -283 217 475 1 -340 -168 233 -68 -273 -264 408 375 -70 -377 100 634 104
6748 104 -622 -312 367 547 -184 -770 -74 302 -96 -512 -129 361 553 76 -201 -169 291 209 -346 -107 415
6769 415 199 162 -360 -3 398 73 -412 -234 363 344 8 -596 -332 352 58 -2 -189 -95 490 116 -267
6790 -267 -7 491 361 -508 -25 84 154 -50 -115 -125 338 -31 -289 -217 101 242 -71 -266 -320 149 442 -152
6812 -152 7 81 488 42 -385 -204 145 256 -207 -507 -37 62 -7 -39 -224 174 258 -172 -451 175 298 8
6834 8 -300 -212 260 214 -298 -258 57 408 208 -346 24 215 346 -101 -446 103 465 283 -99 -272 189 400
6856 400 -124 -226 -148 281 364 -346 -451 -34 396 10 -294 -74 231 129 -402 -310 -12 570 -42 -117 -148 575
6878 575 268 28 -186 -105 145 -373 -489 -173 335 -104 -179 -695 431 463 179 -16 -131 284 34 -159 -297
6899 -297 56 370 -150 -421 -60 78 115 -140 -368 280 276 5 -82 -95 457 59 -11 -199 229 546 -7 -364
6921 -364 -225 30 435 -113 -355 35 465 199 -348 -44 256 334 -117 -172 -11 113 -65 -151 -85 289 142
6942 142 -184 -236 147 466 88 -661 -384 256 272 164 -577 -127 247 -253 -153 39 -148 105 4 -583 -362
6963 -362 494 -52 -480 -335 131 274 -14 -304 -361 79 201 -197 -362 -312 231 -141 -210 -213 148 36 -49 -425
6985 -425 -153 237 -36 -392 -145 142 72 -246 -147 221 337 371 -507 -137 144 287 -43 -524 170 211 202 -131
7007 -131 -241 368 275 -182 -370 -104 289 -250 -572 -191 -74 385 56 -275 -239 429 92 -362 -385 200 173
7028 173 65 -450 -144 419 116 -127 -285 181 318 -38 -392 -167 180 257 -386 -76 202 420 176 -434
7048 -434 -192 -35 91 -14 104 125 269 -49 -463 -174 137 293 -195 -380 335 413 52 -178 -177 191 -75
7069 -75 -13 -327 5 393 11 -89 -307 79 221 -214 -395 104 79 -123 -578 58 349 183 -351 -240 162
7090 162 119 -163 -260 118 433 -40 -198 -562 223 115 380 -51 -347 179 7 102 -293 -150 347 -220 -170
7111 -170 -21 133 87 -136 -95 -253 377 -34 -193 172 139 169 -114 4 -32 250 54 -345 -108 -72 663 -229
7133 -229 -445 205 446 140 -207 -287 213 394 50 -174 -184 79 263 -192 -157 153 12 -53 -617 -75 -141 156
7155 156 -256 -493 49 296 272 -177 40 452 257 -70 -156 -159 462 -165 -143 -53 174 325 26 -92 153 434
7177 434 41 -10 -478 25 221 -12 -268 30 318 -109 -179 -136 296 265 -70 -266 1 362 133 -135 -297
7198 -297 452 259 -9 -308 117 251 43 -240 -116 -92 299 -27 -169 352 120 68 -343 -56 75 288 -68
7219 -68 -408 95 -56 -76 -174 -389 145 290 -81 -372 -312 227 -62 -42 -101 111 186 -208 -230 -178 184 -98 -222
7242 -222 -309 -206 270 -169 -400 -321 -29 80 4 -197 14 159 20 -199 -71 334 239 -302 -403 -139 377
7263 377 -70 -246 -384 342 277 58 -403 -332 234 -48 -103 -37 34 131 -6 -305 114 245 -66 -417 78 181
7285 181 123 -104 -266 68 428 44 -253 -87 23 -4 80 -545 -147 315 183 -61 -346 252 182 -47 -126 -69
7307 -69 209 271 -253 -227 410 221 235 -394 -96 214 -20 -263 -222 27 452 -247 -386 67 55 185 -208 -53
7329 -53 141 160 -134 -180 12 170 170 -247 -76 268 169 -30 -197 -72 -4 -108 -124 37 -221 -47 -82 -91 -173 -12
7353 -12 367 -44 95 -40 265 -202 -71 -301 -172 -35 -286 -222 -2 213 -35 -130 -210 -66 319 7 -388
7374 -388 -101 92 263 -66 33 238 35 -232 9 230 251 154 -260 -87 283 338 90 -221 16 207 186 -223
7396 -223 -87 344 119 -326 -287 -1 311 370 -196 -211 134 227 89 -299 188 -51 -56 -24 -320 -52 201 0
7418 0 -156 -525 242 114 -23 -150 518 47 267 -237 -205 385 -70 58 -196 9 193 122 -186 57 25 27
7440 27 -63 -157 351 273 -63 -244 -290 -26 483 -120 124 327 20 104 -127 -81 536 160 -296 -204 -68 395 58
7463 58 -347 28 -130 205 37 -520 95 124 82 -153 -234 302 316 37 -350 15 32 -39 -55 -54 291 292 -108 -201
7487 -201 -45 67 101 -191 -18 247 115 -55 -133 104 -39 177 -221 -206 6 184 -113 -137 -196 239 372 -268
7509 -268 -188 239 137 -113 -381 33 206 23 -402 38 -28 651 -5 -274 -290 217 -6 -5 -155 -201 35 -174
7531 -174 -424 123 363 260 -75 -43 165 218 -111 -343 45 175 208 -158 -253 39 321 -42 -334 -184 240
7552 240 263 -40 -447 195 457 -61 -343 -199 208 370 -115 -125 24 -34 53 -157 -46 134 290 -92 -232
7573 -232 72 446 -167 -492 -336 199 144 -223 -198 -215 95 73 -160 -260 86 82 -375 -200 102 241 21 -244
7595 -244 -30 -58 238 -211 131 -14 94 229 179 102 229 116 2 -367 185 22 170 -156 -392 55 8
7616 8 125 -365 -98 196 473 -122 -326 348 253 143 -152 15 60 -51 21 -197 260 125 -23 166 -139 127
7638 127 315 88 -20 192 386 86 -44 -1 101 50 -372 -120 222 -97 68 68 -140 63 64 -16 -181 194
7660 194 638 446 -275 46 510 125 -212 -346 -142 147 -19 -150 -94 31 479 -5 -184 -183 66 -140 -45
7681 -45 -26 58 315 38 -322 -68 491 123 -81 -38 19 565 39 -24 -16 432 -27 -358 140 -66 246 -35 -188
7704 -188 -185 -66 192 -378 -210 -98 90 6 -68 177 -182 149 -163 -284 276 222 62 -133 -161 104 -23 141
7726 141 -387 -136 -30 80 -186 -16 262 -10 -31 -358 -86 247 236 -161 -78 382 84 232 -249 154 293
7747 293 114 -110 -187 -77 237 -116 -413 -89 -6 277 -81 -315 164 -9 -289 -228 0 161 -350 57 -101
7768 -101 155 71 -182 -79 -209 305 19 49 -188 -93 121 -116 -54 -97 452 61 124 74 61 254 -70 -84 100
7791 100 142 183 58 -169 489 348 90 -143 -40 350 -212 -117 -117 32 13 -138 -512 52 219 427 139 99
7813 99 96 -156 -16 -453 132 -29 -72 -78 -288 238 190 366 87 -111 91 330 5 48 367 148 311 -120 -81
7836 -81 177 196 100 -179 66 208 63 -115 -334 66 113 -307 -184 172 145 -39 -207 -237 91 183 -3 -528
7858 -528 -167 89 32 -195 -129 -165 139 -225 -170 -39 371 237 -403 -323 244 150 39 -259 -144 295 97 -241
7880 -241 -119 19 -125 4 -327 -272 332 98 -114 -337 -152 194 -97 -161 236 162 150 29 -239 209 232 -54
7902 -54 -426 22 77 -67 -208 -65 151 296 57 -341 120 75 101 13 -410 -49 -49 78 -146 -225 90 300 12
7925 12 -111 -87 -119 -292 -205 -201 238 400 57 -650 -178 425 -100 110 -180 157 185 215 -123 144 195 118 -97
7948 -97 156 118 -12 -22 -131 -94 -17 161 -334 47 -50 -124 -93 45 -20 -206 -72 19 -59 278 -136 185 -174 -189
7972 -189 96 37 -193 -53 271 16 252 -154 -142 358 64 -162 197 -94 149 101 -222 -202 83 106 -59 -147
7994 -147 37 336 189 -343 -139 394 -99 -95 -45 154 393 164 132 -124 -21 104 -338 -33 72 171 154 -264
8016 -264 13 245 183 -188 -76 446 111 -1 -267 -23 188 255 -20 -454 -9 134 -207 -32 -276 -168 224
8037 224 78 -140 109 -40 54 -28 -11 -4 251 320 -139 -112 210 172 -172 -131 13 189 -216 -227 37 255 116
8060 116 -354 -36 228 146 248 -198 -69 184 151 -330 205 173 348 89 -108 -425 312 335 -234 2 306
8081 306 70 280 9 15 375 101 90 -133 78 238 -145 57 -19 119 314 -7 -184 231 77 15 -22 133
8103 133 32 321 -68 -178 -171 29 -70 -251 -305 33 117 -108 -264 105 82 -251 -45 -3 65 157 -10 -241 -74
8126 -74 116 -285 -322 15 311 94 -91 -116 65 66 132 -144 -255 6 461 88 -190 66 52 51 -262 -45 356
8149 356 -35 -171 -280 65 131 172 77 -34 20 38 64 -302 -36 68 -148 -79 -385 179 293 -503 -38 -206
8171 -206 60 278 -86 -134 -4 230 -91 -307 -140 38 246 -425 119 -79 277 -199 -435 102 284 138
8191A38
$$ Imaginary data points
##PAGE= N=2
##DATA TABLE= (X++(I..I)), XYDATA
0 0 0 0 0 0 0 0 0 0 0 0 0 0 0 8 -8 8 -8 8 -9 15 -16 16 -22 24 -26 32 -35 40 -46 52 -57 64 -72 80 -91 100
36 100 -111 124 -138 153 -169 186 -207 229 -256 280 -314 349 -391 441 -500 570 -657 770 -920
55 -920 1128 -1443 1970 -3020 5908 -29564 -101335 -27311 49000 17326 -67010 -58201 19907 42447
69 42447 -22496 -63668 -19943 36347 14726 -46243 -49653 10592 37402 -10347 -55698 -23584
81 -23584 33198 23056 -37947 -48066 9021 40182 -5303 -51806 -22689 34072 24794 -34701
93 -34701 -46767 8239 39897 -3557 -50103 -22911 32464 25835 -32550 -46947 5937 39099
105 39099 -1896 -50452 -26380 30742 26206 -32877 -48979 4776 38223 -4911 -52463 -25849
117 -25849 29104 21388 -34122 -45662 2941 30189 -6224 -45618 -25756 19386 17571 -26712
129 -26712 -43824 -5833 26188 307 -43161 -33631 14755 22811 -23961 -48968 -9570 29127
141 29127 2408 -45940 -35248 16937 23811 -25557 -49410 -8159 29830 2442 -43862 -32990
153 -32990 16593 23608 -22625 -46182 -8587 28692 5563 -39542 -32092 14763 25513 -16543
165 -16543 -41984 -9048 28549 9357 -33894 -30646 14345 27216 -11443 -37870 -9601 26893
177 26893 13475 -27252 -29143 11514 28465 -4652 -35202 -12787 27233 19486 -24389 -33308 9147
190 9147 33009 -1126 -37778 -15075 29773 21197 -26783 -34260 10922 33330 -3518 -38630 -14263
203 -14263 27912 18421 -26018 -32935 7706 28374 -3711 -35699 -17165 21397 17085 -23755 -34952
216 -34952 216 24681 -1579 -36329 -23467 15678 17018 -22859 -39144 -5678 22598 -1473
228 -1473 -39197 -28777 12149 16114 -23281 -42113 -9298 20259 -1806 -40028 -31792 9621 16344
241 16344 -23302 -43707 -11859 20548 -702 -40118 -32297 9216 16209 -23047 -42493 -10456
253 -10456 20222 -782 -37525 -30199 8567 15826 -18682 -38376 -11534 18049 3051 -31353
265 -31353 -29179 6176 18916 -11964 -36170 -13842 19750 10591 -26825 -31010 6230 24194 -6993
278 -6993 -35509 -13108 23987 15112 -25210 -29631 9458 27969 -4245 -33683 -11031 25545 16398
291 16398 -22425 -26670 10406 27759 -2369 -30278 -10925 23692 17059 -19283 -26016 7171 26333
304 26333 -252 -28603 -12800 20556 17184 -17662 -27290 3385 24295 1231 -28208 -17238
316 -17238 16296 17180 -16128 -30268 -1928 22472 2533 -30374 -21838 13877 18655 -17175 -34845
329 -34845 -5625 22007 1744 -32894 -24605 12548 16956 -19137 -35846 -6185 20062 -202
341 -202 -33379 -25371 10059 14626 -18219 -34373 -8431 17011 904 -30256 -25963 6833 15232
354 15232 -13925 -33248 -11005 17327 5729 -26671 -26718 6175 18868 -9303 -31976 -10670 20207
367 20207 10270 -23733 -25392 8425 22915 -5275 -29043 -8744 23246 14123 -19796 -22368 10513
380 10513 26105 -1216 -25948 -6474 25319 17854 -15532 -19573 12635 28133 2260 -21626
392 -21626 -3934 26283 19614 -11401 -16461 12673 28546 6081 -17933 -4641 24122 22654 -7429
405 -7429 -16128 10226 29820 10246 -17449 -7644 23656 25546 -6477 -19318 8010 30518 10648
418 10648 -20014 -10289 23042 24456 -8492 -21870 6099 28535 8329 -21186 -12077 19421 21520
431 21520 -9729 -23320 2087 24286 6682 -22038 -15295 14946 19441 -9910 -24920 -2332
443 -2332 20420 6176 -21683 -18100 10751 17746 -8972 -26245 -6236 18325 7260 -21857 -20987
456 -20987 7747 17784 -7104 -26669 -8334 17706 8719 -20838 -22434 7456 19810 -5758
468 -5758 -26524 -8427 19350 10766 -19648 -21224 9101 20556 -4019 -24298 -5990 20454 12435
481 12435 -15826 -18361 9040 21505 -94 -19975 -5270 20144 15745 -11163 -16393 8851 24539
494 24539 4976 -17815 -6424 20881 20198 -7759 -16519 9030 27086 8247 -16866 -6453 22591
507 22591 22185 -6124 -16529 8578 27935 9524 -16254 -6571 21768 22321 -5692 -16516 7779
520 7779 26989 9695 -15935 -7903 19464 21372 -5626 -17191 5121 24494 8601 -15876 -9683
533 -9683 15922 19354 -5047 -18397 804 20856 9127 -15543 -13154 11793 18527 -4769 -20986
546 -20986 -3284 18930 9445 -17497 -17218 8907 18283 -5042 -23348 -6279 17795 8423 -18912
559 -18912 -18580 7863 17649 -6193 -23784 -6656 16869 8174 -17985 -19064 6898 16883 -4799
572 -4799 -22200 -7074 15956 9303 -15668 -18431 5693 17871 -1634 -20267 -7588 15825 12177
585 12177 -12608 -17558 5601 19762 1834 -18406 -7981 16759 15605 -9443 -16798 5574 21626
598 21626 4705 -16820 -7318 18065 17817 -7598 -16203 6189 22766 6750 -15241 -6751 18369
611 18369 18612 -5593 -14763 6684 22774 7493 -13977 -6410 17575 19056 -3985 -13479 5065
624 5065 21899 9046 -12239 -7748 15259 19075 -2665 -14905 2548 20988 10324 -12653 -10822
637 -10822 12958 19428 -2480 -16915 -136 20146 10191 -14216 -12567 11903 19049 -3295 -18282
650 -18282 -1651 18810 9655 -14341 -13955 9755 17556 -3648 -18430 -3305 16949 9141 -13775
663 -13775 -14811 7924 16530 -2213 -18263 -4835 15413 9696 -12599 -15155 6404 16623 -789
676 -789 -17874 -6496 14616 11142 -11067 -15285 4969 17570 1395 -16906 -7001 15008 13406
689 13406 -9274 -15758 5444 19355 3682 -15892 -6723 15828 14729 -7840 -14631 5960 19695
702 19695 4717 -14494 -6052 16065 15790 -5735 -13123 5356 19760 6360 -12621 -6211 14669
715 14669 16515 -3902 -13411 3986 19291 7897 -12244 -7795 13736 16871 -3247 -14117 2573
728 2573 19009 8850 -12277 -9376 12457 17197 -3068 -15505 682 18058 8658 -12643 -10723
741 -10723 11098 16969 -3333 -16099 -958 17059 8437 -12927 -12101 8789 15645 -3008 -15762
754 -15762 -2603 15080 8033 -12164 -12765 7012 14218 -2677 -16129 -4720 13224 8501 -11015
767 -11015 -13658 5156 14435 -1423 -16410 -6106 13127 9968 -10677 -14748 4533 16062 -4
780 -4 -16435 -6639 13839 10955 -10010 -14516 5455 16627 1285 -15029 -6045 13894 12066 -7893
794 -7893 -13213 5174 16866 3419 -13358 -5540 13870 13656 -6055 -12745 4388 17547 5177
807 5177 -11756 -5857 13015 14382 -4490 -12117 3601 17428 6714 -11104 -6571 12389 15501
820 15501 -2787 -12468 2311 16846 6996 -10955 -7874 11639 15681 -2824 -13634 563 16411
833 16411 7258 -11803 -9265 10517 14105 -3614 -14156 -225 14734 6313 -11935 -10386 8001
846 8001 12872 -3658 -14890 -2658 12624 6254 -12092 -12237 5906 12176 -3393 -15962 -4908
859 -4908 11788 6455 -12004 -13730 4322 12364 -2888 -16487 -6149 11292 7127 -11946 -14664
872 -14664 3481 12326 -2147 -16437 -7455 10986 7626 -11350 -14564 3083 13077 -1209 -15903
885 -15903 -6982 11004 8619 -9528 -13779 3301 13081 617 -14180 -6409 10697 9857 -7351
898 -7351 -12807 2703 14046 3089 -11569 -6494 10589 11635 -4930 -11846 2769 15392 4906
911 4906 -11116 -6516 11408 13223 -3652 -11514 2632 15563 6063 -10240 -6555 11616 13488
924 13488 -3022 -11610 2066 15407 6023 -9760 -7078 10145 13306 -2876 -11873 732 14192
937 14192 6093 -10343 -8382 8869 12342 -2869 -12903 -1196 12762 6098 -10569 -10045 6320
950 6320 11800 -3207 -14159 -3194 11387 5637 -11254 -12158 4155 11185 -3194 -15535 -5489
963 -5489 9766 5417 -11909 -13624 3060 10217 -3677 -16119 -6461 8928 4834 -11726 -13722
976 -13722 2087 9586 -3207 -15198 -6929 8205 5510 -10428 -13675 1177 9952 -1365 -14129
989 -14129 -7706 8094 6857 -8536 -13293 1239 10889 257 -13097 -7222 9090 8901 -6990
1002 -6990 -12554 1601 12440 1956 -11939 -6607 9809 10550 -5504 -11471 2330 13764 4173
1015 4173 -10531 -5863 10518 11934 -3754 -10511 3109 14482 5560 -9370 -5256 10799 12632
1028 12632 -2285 -9405 2610 14068 6683 -7731 -5381 9825 13120 -1285 -9612 1472 13864
1041 13864 7234 -7557 -6701 8407 13288 -880 -10473 -150 12924 7172 -8536 -8433 7083
1054 7083 12745 -1330 -11538 -1895 11460 6351 -9040 -9403 5411 11228 -1806 -12344 -3606
1067 -3606 9833 6004 -9268 -10841 3675 10125 -1828 -12977 -5171 8815 5869 -9116 -11929
1080 -11929 2253 9773 -1635 -13206 -6251 8024 6416 -8600 -12326 1395 9640 -708 -13093
1093 -13093 -6788 8004 6791 -7864 -12279 877 10398 487 -12256 -6832 8300 8222 -6969 -11535
1107 -11535 1721 11607 2140 -10991 -5974 8570 9305 -4725 -10206 1898 11928 3439 -9255
1120 -9255 -5392 8694 10461 -2840 -9313 1568 12511 5164 -8034 -5422 8396 11524 -1632
1133 -1632 -9240 1498 12943 6269 -7174 -5591 8419 11845 -1083 -8971 973 12430 7040
1146 7040 -6847 -6390 7746 11881 -399 -9456 -24 11832 6677 -7353 -7236 6745 11653 -959
1160 -959 -10574 -1663 10914 6242 -8074 -8412 4979 10462 -1268 -10555 -2853 8862 5800 -8106
1174 -8106 -10045 3306 9657 -1260 -11510 -5105 7969 5803 -8197 -11170 1457 9042 -1215
1187 -1215 -12244 -6020 7367 5381 -8330 -11712 662 8614 -968 -12060 -6583 6666 5421
1200 5421 -7312 -11899 303 8236 -36 -11401 -6933 6377 6478 -6428 -11396 -290 8924 1202
1214 1202 -10763 -7051 6366 7410 -5374 -10714 -197 9585 2191 -9560 -7044 6357 8150
1227 8150 -3866 -10388 -334 10055 3403 -8701 -7055 6443 9332 -3080 -10095 -396 10626
1240 10626 4320 -8480 -6610 6569 9756 -2352 -9998 -626 10526 4707 -7858 -6858 5453
1253 5453 9388 -1785 -9736 -1476 9045 5016 -7406 -8053 4433 9033 -1233 -10261 -2946 8608
1267 8608 5220 -7537 -8701 3656 8857 -1185 -10663 -4108 7692 5216 -7430 -9060 2224
1280 2224 8343 -1348 -10665 -4842 6895 5419 -7294 -10160 1286 8031 -695 -10961 -5727 6185
1294 6185 4994 -6900 -10361 690 8127 -682 -10797 -5923 5982 5352 -6619 -10213 -6 7949
1308 7949 241 -10229 -6148 5694 6254 -5829 -10572 -261 8426 1471 -10068 -6394 5774 7101
1322 7101 -4618 -10440 -325 8958 2142 -9202 -6527 5573 7703 -3758 -9636 -595 8523 3145
1336 3145 -8164 -6705 4852 7916 -2844 -9739 -1218 8432 3573 -7848 -7313 4695 8143 -2339
1350 -2339 -9384 -1864 8165 3871 -7570 -7123 4023 7896 -1935 -9398 -2713 7410 3990 -6925
1364 -6925 -8186 2743 7753 -1170 -9913 -4076 6714 4331 -7268 -9193 2058 7713 -1585 -10370
1378 -10370 -4338 6222 3773 -7230 -9100 1397 6979 -1567 -10274 -5222 5426 4180 -6917
1391 -6917 -9266 789 6827 -770 -10448 -5477 5247 4896 -6392 -9581 159 6956 -181 -9805
1405 -9805 -6075 4812 5175 -5393 -9713 -203 7551 860 -9001 -6033 5284 6080 -4540 -9178
1419 -9178 -878 7704 1750 -8104 -5518 5103 7014 -3297 -8902 -489 8025 2623 -7163 -5663
1433 -5663 5252 7261 -2795 -8432 -632 7685 3387 -6838 -5778 4765 7610 -1862 -8026 -962
1447 -962 7938 3882 -6143 -6452 4183 7943 -1419 -8321 -1465 7920 4428 -6179 -6850 3795 7997
1462 7997 -1178 -8560 -2225 7310 4013 -6525 -7081 2983 7227 -1030 -8898 -3346 6435 4132 -6240
1477 -6240 -7767 1980 6884 -849 -8951 -3967 5581 4225 -6025 -8363 1545 6965 -801 -8687 -4703
1492 -4703 5163 4371 -5131 -8253 770 6784 157 -8503 -4979 5089 5038 -4661 -8033 276 7189
1507 7189 953 -7436 -4580 5414 5908 -4204 -7856 556 7301 1878 -7095 -4425 5600 6678 -3065
1522 -3065 -7194 915 8183 3114 -5730 -3709 5901 7388 -1374 -6029 818 8456 4120 -5040 -3776
1537 -3776 6329 8184 -535 -5781 1176 8993 4917 -4384 -3788 6054 8612 373 -5621 1011 9103
1552 9103 5428 -3868 -3609 5690 9017 556 -5222 280 8730 5714 -3500 -4067 5218 9015 1108
1567 1108 -5638 -463 8188 5689 -3163 -4858 3882 8293 1225 -5785 -1390 7312 5724 -3608 -5477
1582 -5477 3002 8082 1193 -6514 -2372 6346 5597 -4013 -6071 2031 7407 1254 -6774 -2764 5880
1597 5880 5573 -3465 -6289 1649 7166 1259 -6593 -3202 5306 5702 -3412 -6457 1078 7041 1784
1612 1784 -6263 -3671 5303 5937 -2167 -6282 879 7661 2646 -5432 -3508 5425 6510 -1535 -5889
1627 -5889 780 7594 3656 -4430 -3453 5187 7416 -813 -5333 1151 8185 4228 -4046 -2960 5238
1642 5238 8063 433 -4628 1229 8025 5059 -3313 -2846 5341 8249 914 -4580 728 8024 5969
1657 5969 -2730 -2975 5161 8108 1356 -4439 292 7812 5816 -2599 -3100 4467 8041 1625 -4654
1672 -4654 -378 7384 5809 -2487 -4087 3732 8000 1186 -5082 -997 6643 5124 -2997 -4716 2767
1687 2767 7070 1290 -5520 -2087 5594 4935 -3298 -5663 1708 6602 1096 -5860 -3135 4999 4412
1702 4412 -3249 -6041 722 5762 721 -6331 -4174 3950 4407 -3212 -6540 6 5597 1288 -6091
1717 -6091 -4195 3591 4479 -2776 -6364 -300 5222 1551 -5697 -4798 3378 4648 -2168 -6616 -429
1732 -429 5532 1983 -5421 -4204 3205 5040 -1798 -5774 -813 5910 2428 -4567 -4251 3551 5752
1747 5752 -1042 -5385 -530 5995 3374 -3536 -3872 3551 6285 -82 -5043 -570 6186 4137 -3477
1762 -3477 -3957 3648 6756 181 -4798 -853 6043 4088 -3307 -4034 3099 6639 748 -5207 -1173
1777 -1173 5898 4388 -3038 -4623 2423 6281 661 -5034 -1816 5365 4369 -2835 -5130 1312 5663
1792 5663 788 -5425 -2321 4558 4222 -2950 -5388 437 5188 644 -5503 -3285 3535 4089 -3250
1807 -3250 -5893 3 5017 1085 -5772 -3988 3356 3809 -2715 -5950 -178 4673 916 -5869 -4367
1822 -4367 2745 3760 -2417 -6393 -999 4652 1270 -5558 -4243 2539 4388 -2309 -6343 -1208 4409
1837 4409 1468 -5394 -4526 2533 4254 -1730 -6311 -1451 4700 2152 -4389 -4493 2225 4551 -1164
1852 -1164 -5787 -1366 4593 2689 -4241 -4171 2381 5136 -523 -5463 -1447 4566 2695 -3522 -4412 2080
1868 2080 5126 -270 -4991 -1585 4668 3492 -3409 -4501 1849 5135 311 -5323 -2123 4436 3532
1883 3532 -3005 -4582 1348 5219 452 -5155 -2339 4179 3463 -2899 -5002 978 4542 835 -4890
1898 -4890 -2696 3578 3528 -2929 -5043 521 4796 722 -5199 -3234 3175 3853 -2718 -5284 17 4443
1914 4443 1000 -5199 -3384 2862 3468 -2599 -5318 -417 4020 991 -5120 -4228 2557 3375 -2253 -5702
1930 -5702 -976 4056 1465 -4727 -3946 2040 3832 -1687 -5293 -990 4090 1630 -4277 -3999 2233
1945 2233 3973 -1357 -5124 -1149 3862 2265 -3975 -4079 1735 4167 -954 -4670 -1523 4183 2693
1960 2693 -3570 -4053 1499 4660 -528 -4592 -1504 4185 2879 -2780 -3830 1525 4493 -318 -4445
1975 -4445 -1740 3719 3417 -2638 -3974 1233 4692 344 -4873 -2087 3917 3322 -2749 -4161 872
1990 872 4339 496 -4767 -2376 3699 3205 -2604 -4429 564 4676 405 -4465 -2618 2952 3498 -2509
2006 -2509 -4629 105 3906 638 -4262 -2655 2590 3272 -2112 -4661 -289 4040 950 -4286 -3159
2021 -3159 2644 3568 -1618 -4756 -283 3890 1441 -3937 -3420 2718 3754 -1382 -4722 -742 4106
2036 4106 2052 -3470 -3416 2527 4070 -941 -4502 -353 4292 2398 -3214 -3296 2313 4300 -332 -4248
2052 -4248 -632 4319 2644 -2699 -3216 2341 4593 170 -3995 -774 4170 3166 -2660 -3194 1956
2067 1956 4801 345 -3716 -1039 4276 3244 -2447 -2955 1727 4395 537 -3590 -1132 3823 3426
2082 3426 -2075 -3178 1063 4242 699 -3605 -1728 3362 3161 -1819 -3714 700 3998 769 -3725
2097 -3725 -1891 3034 3008 -2024 -4258 328 3618 667 -4094 -2406 2566 2797 -2071 -4219 -163 3459
2113 3459 768 -3807 -3116 1780 3047 -1854 -4250 -382 3580 1065 -3693 -3077 1958 3021 -1745
2128 -1745 -4392 -729 3398 1069 -4025 -2870 1868 2755 -1368 -4215 -910 3496 1423 -3417 -3246
2143 -3246 1800 3555 -1209 -4212 -842 3425 1715 -2925 -3300 1861 3928 -446 -3632 -826 3572
2158 3572 2147 -2576 -2854 1744 3669 -6 -3398 -1011 3398 2584 -2060 -3180 1533 4120 110
2173 110 -3448 -1182 3639 2694 -1925 -3259 1242 4134 634 -3235 -1405 3526 2849 -1779 -2785 1209
2189 1209 3780 647 -3207 -1221 2781 2641 -1671 -3339 559 3686 633 -3236 -1890 2622 2797
2204 2797 -1961 -3741 81 3207 679 -3611 -2760 2235 2714 -1829 -3658 -254 3176 608 -3654
2219 -3654 -2909 1675 2412 -2040 -4274 -1018 3100 958 -3989 -3042 1430 2669 -2045 -4283 -1121 2592
2235 2592 687 -3747 -3429 1162 2434 -1477 -3894 -1130 2670 775 -3096 -3314 1001 2720 -925
2250 -925 -3839 -1172 2823 1598 -2723 -2843 958 2905 -213 -3591 -1260 2608 1992 -2231 -2863 1154
2266 1154 3502 -59 -3403 -1149 3133 2260 -1954 -2583 1322 3715 588 -2975 -802 3011 2865 -1691
2282 -1691 -2568 1347 3945 984 -2802 -864 3006 2818 -1424 -2904 825 3357 1065 -2876 -1485
2297 -1485 2542 3008 -1390 -2732 845 3505 1092 -2923 -1703 2499 2883 -1061 -2817 453 3280
2312 3280 1309 -2879 -1920 2178 2854 -1166 -3562 10 2866 1008 -2763 -2550 1657 2605 -1294 -3352
2328 -3352 -282 2467 811 -2996 -2345 1278 2594 -1167 -3303 -684 2473 1436 -2638 -2624 1137 2496
2344 2496 -1106 -3559 -990 2245 1222 -2735 -2494 1059 2657 -600 -3579 -1536 2665 1447 -2445
2359 -2445 -2506 1213 2859 -645 -3015 -1081 2732 1760 -2233 -2369 808 3101 385 -2602 -806 2748
2375 2748 2335 -1466 -2493 1012 3325 514 -2403 -1194 2806 2609 -1066 -2127 667 3329 1115
2390 1115 -2170 -1049 2759 3125 -1157 -2489 803 3528 1148 -2597 -1110 2674 2585 -930 -2281 605
2406 605 3374 1341 -1946 -1523 2356 2938 -680 -2445 335 3341 1548 -2214 -1416 2405 2862 -800
2422 -800 -2663 -45 2883 1262 -2447 -1613 1896 2659 -761 -2743 -295 2727 1362 -2173 -2257 1405
2438 1405 2669 -462 -2848 -575 2058 1312 -2302 -2206 1225 2671 -432 -3035 -872 2396 1373 -2230
2454 -2230 -2059 1063 2437 -29 -2781 -825 2314 1503 -1735 -2280 779 2625 -13 -2603 -1115 2252
2470 2252 1858 -1668 -2061 558 2954 315 -2864 -1221 2342 2118 -1137 -2401 840 2628 787 -2594
2486 -2594 -1092 2243 2227 -1145 -2332 880 2850 746 -2339 -994 2313 2512 -884 -2347 395 2943
2502 2943 879 -1894 -1261 2017 2407 -879 -2188 337 2786 1254 -2013 -1421 1918 2304 -558 -2489
2518 -2489 285 2831 1115 -1867 -1560 1921 2490 -504 -2580 -136 2773 1408 -1819 -1800 1332 2433
2534 2433 -293 -2606 -370 2513 1579 -1832 -1850 1148 2614 -323 -2314 -383 2095 1541 -1596 -1964
2550 -1964 905 2644 2 -2264 -745 2340 1708 -1761 -2156 1145 2547 -122 -2291 -780 2403
2565 2403 1654 -1212 -2272 990 2486 163 -2130 -696 1923 1925 -1227 -2126 689 2461 632 -2117
2581 -2117 -911 1751 1718 -1195 -2162 248 2664 268 -2068 -1251 1845 1879 -1089 -1948 358 2395 678
2598 678 -1938 -1322 1665 2070 -910 -1969 319 2202 819 -2001 -1350 1565 1947 -726 -2357 -368
2614 -368 2137 997 -1932 -1481 968 2180 -766 -2575 -473 2226 851 -1993 -1673 1067 2002 -463
2630 -463 -2392 -546 2068 1064 -1989 -1944 994 2338 -614 -2117 -450 2178 1171 -1979 -1965 902
2646 902 2173 -310 -2028 -784 2009 1292 -1467 -1952 806 2121 33 -2367 -512 1990 1729 -1519
2662 -1519 -2015 616 2208 127 -2411 -665 1960 1591 -1240 -1927 413 2397 428 -1822 -752 1762
2678 1762 1697 -834 -1787 569 2269 401 -1824 -645 1541 1892 -770 -1764 290 2205 651 -1586
2694 -1586 -897 1847 2162 -591 -1660 401 2345 931 -1501 -1132 1576 2291 -415 -1631 167 2188
2710 2188 1072 -1779 -1015 1370 1925 -299 -1934 -149 2006 1334 -1588 -1469 1276 2188 -648 -2072
2726 -2072 42 2092 1243 -1382 -1211 1157 2020 33 -2109 -184 2011 987 -1805 -1567 1018 1943
2742 1943 44 -1843 -495 1951 1093 -1298 -1794 912 1895 87 -1744 -595 1840 1119 -1073 -1351
2758 -1351 740 2324 401 -1657 -843 1779 1992 -1121 -1548 746 2218 253 -1644 -874 1774 1780 -806
2775 -806 -1398 926 2079 765 -1431 -877 1754 1811 -551 -1501 491 2303 1157 -1059 -632 1909 2250
2792 2250 -358 -1504 548 2221 927 -979 -737 2082 2103 -312 -1086 764 2535 1118 -1097 -900
2808 -900 1467 2306 92 -1168 284 2175 1645 -718 -1033 1195 2087 108 -1344 98 2098 1377
2824 1377 -1201 -1178 1038 2241 261 -1559 65 1747 1513 -906 -1234 1004 1750 -196 -1613 -237
2840 -237 1536 1532 -992 -1445 532 1557 106 -1702 -685 1486 1205 -866 -1350 749 1851 109 -1831
2857 -1831 -646 1509 1098 -972 -1337 337 1689 152 -1562 -868 1559 952 -1014 -1767 507 1721
2873 1721 172 -1765 -874 1495 1434 -696 -1560 157 1706 653 -1449 -1154 1032 1709 -549 -1366 346
2890 346 1744 683 -1267 -702 1029 1553 -97 -1462 -15 1903 1066 -1223 -914 888 1433 -279
2906 -279 -1506 -107 1611 826 -1246 -840 957 1815 5 -1685 -103 1505 1056 -900 -1050 979
2922 979 1597 -157 -1638 -423 1322 975 -1215 -1282 767 1553 -99 -1629 -345 1283 875 -1114 -1873
2939 -1873 581 1551 -102 -1715 -752 967 1031 -1069 -1665 424 1418 -86 -1714 -725 1016 837 -994
2956 -994 -1728 -80 1137 -80 -1535 -1005 1019 936 -1226 -1979 -9 1190 368 -1529 -1095 555 974
2973 974 -870 -1674 -441 1151 183 -1237 -1519 646 1081 -816 -1640 -73 1179 270 -1282 -1417 450
2990 450 1257 -854 -1967 -516 1096 373 -1518 -1301 684 1182 -741 -1438 -499 1057 690 -1311 -1465
3007 -1465 410 1296 -443 -1487 -421 1148 396 -806 -1336 499 1271 -139 -1688 -628 1135 849
3023 849 -974 -1285 618 1283 157 -1813 -613 1196 741 -791 -1550 -86 1253 94 -1513 -907
3039 -907 841 795 -989 -1209 206 1082 179 -1159 -837 536 746 -768 -1547 57 994 -152 -1453
3056 -1453 -1288 580 1003 -813 -1377 -205 1027 -14 -1448 -870 976 957 -820 -1440 -18 842 402
3073 402 -1594 -1111 765 873 -510 -1681 -564 1503 252 -1467 -1221 268 693 -570 -1783 -194
3089 -194 1063 637 -1264 -1558 384 783 -466 -1637 -396 673 540 -1230 -1037 653 1137 -183 -1487
3106 -1487 -308 831 673 -814 -1192 134 1104 -194 -1615 -676 897 621 -1035 -1266 227 848 -64
3123 -64 -1407 -627 857 847 -1173 -1446 292 1174 30 -1128 -738 810 924 -508 -1230 165 1115 229
3141 229 -1124 -568 698 896 -678 -1447 -39 1186 257 -1134 -801 677 929 -375 -1336 -191 1195
3158 1195 547 -1353 -974 681 1014 -815 -1437 -285 1054 348 -1124 -682 439 1123 -402 -1216 -117
3175 -117 906 418 -918 -732 628 944 -205 -1068 -241 909 432 -896 -935 620 1369 -229 -993 -364
3193 -364 858 862 -621 -1033 375 1247 78 -1371 -295 1135 663 -507 -778 211 1416 284 -1101
3210 -1101 -506 913 860 -550 -1009 -9 1332 290 -895 -629 1036 767 -659 -780 355 1171 315
3227 315 -1091 -676 843 895 -210 -950 -43 1020 316 -701 -740 835 664 -568 -1096 -130 1125 412
3245 412 -1100 -972 451 842 -162 -913 -508 1027 288 -876 -929 231 950 -294 -1074 -353 926 391
3263 391 -788 -825 335 1028 -61 -1282 -368 954 893 -794 -665 269 1018 -153 -1116 -377 803 484
3281 484 -895 -1010 539 1018 27 -1063 -466 756 845 -739 -1016 261 949 -318 -1092 -405 827 991
3299 991 -449 -887 298 1032 114 -891 -450 831 1109 -584 -632 379 1005 206 -664 -332 997 657
3317 657 -284 -685 87 1076 317 -828 -409 732 854 -316 -873 266 1296 209 -618 -443 661 1094
3335 1094 -533 -1076 -78 918 350 -437 -952 683 913 -137 -711 -46 723 527 -711 -658 516 764
3353 764 -311 -871 -71 891 455 -802 -867 344 694 72 -784 -376 765 251 -804 -1062 228 830
3371 830 -134 -1198 -513 775 396 -673 -765 174 724 130 -1146 -519 806 857 -592 -627 -2 694 -35
3390 -35 -1139 -370 815 533 -512 -965 91 556 -161 -851 -845 849 443 -623 -808 304 995 228 -815
3409 -815 -648 510 922 -433 -917 138 958 311 -769 -545 742 883 -222 -804 -117 862 491 -721
3427 -721 -754 578 867 -168 -920 -104 687 725 -461 -557 789 725 -18 -659 -294 862 646 -556 -767
3446 -767 508 919 -391 -942 68 1052 685 -574 -805 361 719 -365 -667 -266 787 279 -978
3463 -978 -791 281 880 -209 -736 -233 851 700 -565 -800 113 485 15 -923 -464 852 619 -767
3481 -767 -990 116 530 42 -822 -546 744 678 -358 -765 81 686 99 -748 -315 809 665 -141 -982
3500 -982 -9 853 512 -445 -613 313 708 -411 -819 -335 886 452 -741 -627 556 824 -394 -740
3518 -740 -227 710 332 -401 -690 663 701 -209 -814 -81 796 379 -465 -921 402 804 212 -911 -325
3537 -325 753 357 -452 -444 293 605 -223 -505 -274 797 770 -446 -422 271 806 83 -731 -378 706 301
3557 301 -438 -826 588 1088 6 -756 -375 552 619 -269 -661 87 1030 -115 -711 -471 530 407 -291
3576 -291 -727 34 860 -124 -379 -588 459 633 -296 -871 160 730 271 -502 -991 529 894 -170 -704
3595 -704 -127 710 471 -542 -384 366 715 -234 -982 -138 529 662 -452 -703 396 903 -380 -893 -153
3614 -153 940 -87 -1017 -892 276 540 267 -934 -95 637 237 -525 -784 218 482 -147 -936 -97
3632 -97 533 325 -487 -613 621 784 219 -885 -302 532 624 -461 -684 368 854 175 -643 -190 92
3651 92 559 -188 -629 136 766 139 -506 -576 455 601 -528 -538 102 685 234 -694 -845 207 703 -308
3671 -308 -814 92 897 402 -677 -574 549 594 -146 -824 -337 818 289 -766 -674 529 945 -316 -906
3690 -906 -183 569 176 -673 -583 456 678 -18 -785 -316 764 452 -196 -544 121 670 -124 -776 -389 805
3710 805 561 -635 -572 263 747 53 -640 -140 613 369 -607 -623 485 423 91 -808 -294 633 155 -312
3730 -312 -974 186 720 283 -565 -520 731 540 -96 -527 234 865 144 -800 -161 557 629 -189 -916 86
3750 86 794 270 -613 -594 249 625 -328 -777 305 691 196 -619 -433 557 542 -251 -803 -32 470 281 -712
3771 -712 -578 686 597 -314 -677 58 606 352 -525 -513 366 419 -70 -1001 -188 750 371 -410 -400 235 705
3792 705 -25 -713 -436 658 439 -686 -438 589 702 -30 -676 -44 796 457 -269 -473 146 777 -55
3811 -55 -645 75 905 775 -272 -766 337 876 114 -470 -329 335 743 -48 -904 394 959 205 -773
3830 -773 -247 581 685 -184 -601 244 675 413 -506 -52 592 682 95 -648 407 810 342 -743 -268 661
3850 661 658 140 -780 -168 712 276 -326 -499 548 770 11 -592 -139 515 189 -393 -502 500 877 -228
3870 -228 -822 -309 494 313 -308 -715 116 642 -199 -863 -112 864 382 -446 -881 19 555 -118 -789 -122
3890 -122 737 496 -749 -642 177 604 66 -676 -214 744 611 -682 -656 359 601 28 -1053 -312 735
3909 735 418 -460 -384 313 667 197 -544 -254 717 397 -403 -898 91 903 81 -682 -355 620 639 -207 -828
3930 -828 45 677 283 -657 -220 533 922 -40 -605 128 823 417 -455 -445 353 677 59 -714 -30 943
3950 943 495 -156 -433 252 675 -186 -908 -196 602 485 -262 -413 517 757 68 -546 -198 815 342 -323
3970 -323 -657 377 773 82 -791 -461 438 421 -337 -488 198 635 -52 -769 -272 408 280 -35 -633 131
3990 131 675 82 -663 -496 446 489 -329 -949 223 698 232 -412 -448 668 580 -357 -861 265 970 -33
4010 -33 -641 -250 381 798 -347 -884 171 768 -106 -634 -375 712 468 -120 -559 134 620 193 -576
4029 -576 -535 178 720 34 -776 -135 761 580 -617 -499 407 778 -165 -696 -236 417 447 -441 -316 424
4049 424 513 39 -663 141 570 173 -274 -551 445 645 -153 -736 -301 769 501 -386 -752 359 439 84
4069 84 -726 -56 452 332 -445 -107 525 933 -46 -527 -211 802 596 -311 -664 263 995 24 -535 -569
4089 -569 468 439 -324 -616 344 822 473 -526 -496 211 795 -130 -607 40 773 388 -716 -385 649 590
4109 590 -135 -839 87 669 440 -574 -437 452 874 72 -547 -133 601 281 -387 -302 601 721 -52 -375
4129 -375 -81 579 309 -403 -729 153 771 -230 -486 -324 682 196 -334 -498 60 713 354 -745 -229
4148 -229 621 658 -474 -430 327 879 -192 -934 -240 719 378 -411 -631 205 1021 -152 -543 -210 446 450
4168 450 -444 -910 -114 550 131 -794 -478 846 777 -574 -720 12 576 221 -416 -738 637 525 -641
4187 -641 -434 -402 625 72 -433 -381 539 522 -387 -669 -82 617 554 -988 -385 371 445 -192 -735 -170 437
4208 437 154 -584 -573 454 647 -411 -667 -24 492 344 -716 -658 332 619 -241 -635 72 577 395 -781
4228 -781 -803 165 598 -246 -499 -213 649 312 -497 -406 173 773 -12 -925 106 615 399 -281 -603 -26
4248 -26 772 8 -466 -369 514 204 -421 -1073 7 557 204 -908 -386 693 671 -466 -848 1 654 105
4268 105 -903 -480 332 413 -582 -828 -227 613 -62 -736 -689 556 617 -587 -820 -3 736 11 -823 -238
4288 -238 109 698 -171 -761 -51 909 289 -686 -623 51 441 -141 -783 -285 422 -12 -865 -654 553 382
4308 382 -219 -1031 -73 713 237 -704 -859 328 529 -95 -815 -407 388 248 -519 -314 181 697 63 -783
4328 -783 -33 367 519 -302 -457 74 512 5 -738 -114 679 735 -409 -563 173 787 -32 -639 -159 721
4348 721 522 -373 -842 70 626 135 -513 -389 210 421 -363 -756 122 665 309 -573 -791 312 518 -386
4368 -386 -659 -75 699 182 -842 -742 406 525 -6 -664 -6 639 234 -768 -419 43 831 -72 -846
4387 -846 -331 500 344 -876 -513 248 435 -106 -644 -394 760 20 -866 -620 104 429 -228 -829 -316
4406 -316 320 277 -586 -578 261 549 -83 -836 -187 532 327 -625 -461 121 695 -101 -1002 -242 428 79 -554
4427 -554 -777 -41 620 237 -386 -340 439 470 -45 -520 319 678 57 -691 -290 292 587 -288 -792 94 420
4448 420 251 -681 -193 218 400 68 -600 214 978 403 -398 -183 572 566 -158 -744 -33 746 446 -574
4468 -574 -571 612 437 -238 -391 145 980 358 -506 -630 661 805 -20 -509 -22 746 184 -552 -362 324
4488 324 601 -115 -943 286 867 493 -598 -519 316 685 -110 -761 -217 775 386 -376 -553 218 670 -246
4508 -246 -809 -312 872 430 -481 -310 -12 731 -220 -787 -69 689 439 -540 -532 242 614 48 -491 -512 471
4529 471 797 -13 -603 64 919 184 -547 -195 477 431 -334 -631 201 593 419 -611 -175 450 469 -248
4549 -248 -745 198 730 561 -579 -200 617 786 -73 -607 127 678 294 -509 -644 391 423 74 -361 212
4569 212 800 278 -542 -194 421 649 -50 -669 65 513 187 -318 -189 480 1022 -19 -496 -126 845 624
4589 624 -181 -245 261 541 26 -895 -88 525 386 -299 -219 585 641 119 -579 -176 714 695 -115 -474 112
4610 112 732 91 -601 -183 651 723 -135 -580 108 690 324 -343 -284 637 415 -26 -735 9 641 214 -513
4631 -513 -338 717 552 -292 -400 -26 583 270 -700 -431 407 656 -277 -629 207 715 386 -598 -344 674
4651 674 587 -356 -766 85 596 217 -859 -483 539 744 -133 -556 141 553 359 -643 -562 435 655 -63
4671 -63 -637 83 660 159 -455 -507 478 795 -101 -585 -320 644 443 -307 -236 91 601 -80 -633 -214 594
4692 594 834 -298 -667 116 721 10 -882 -166 744 597 -530 -421 399 746 -14 -904 -69 483 473 -212
4712 -212 -634 551 924 108 -376 -82 572 454 -309 -473 148 1149 69 -644 -158 741 549 -30 -612
4731 -612 203 571 461 -502 -439 640 457 -223 -776 99 554 291 -623 -452 481 415 -301 -505 78 696
4751 696 399 -816 -568 395 616 -238 -903 -272 819 202 -495 -594 507 405 -134 -981 -119 587 171
4770 171 -591 -553 209 416 -208 -865 -176 552 170 -626 -326 245 816 -45 -589 -250 389 416 -666 -781
4790 -781 -14 568 -83 -833 -472 536 244 -442 -799 40 747 -218 -880 -315 350 532 -360 -597 -25 626
4810 626 204 -767 -548 247 496 -483 -684 12 735 39 -628 -270 339 450 -140 -677 -5 707 120 -501
4830 -501 -281 507 894 -416 -452 -12 550 112 -538 -359 510 490 -340 -609 26 759 338 -573 -400 15
4850 15 525 -183 -871 -196 340 578 -555 -376 163 709 -173 -806 58 752 191 -501 -437 44 602 -357
4870 -357 -455 -13 779 332 -374 -508 473 816 -229 -864 -362 813 442 -800 -525 387 799 207 -664
4889 -664 -343 657 417 -732 -404 339 810 19 -939 -497 506 573 -327 -609 223 704 -10 -770 -290
4908 -290 81 359 -683 -654 83 962 -69 -755 -61 263 486 -494 -414 103 673 160 -941 -661 357
4927 357 600 -613 -889 -145 745 150 -706 -565 356 397 -535 -719 25 739 -5 -622 -397 314 381 -113
4947 -113 -422 -309 572 99 -548 -315 216 472 -118 -517 -153 445 241 -418 -498 146 1016 199 -663 -182
4967 -182 714 385 -312 -479 413 1011 192 -535 -207 616 516 -204 -774 305 714 -190 -617 -359 478 496
4987 496 -315 -736 235 696 189 -679 -8 569 395 -435 -561 233 889 -63 -576 -308 645 388 -400 -440
5007 -440 -30 892 152 -442 -454 657 521 -459 -574 135 769 187 -510 -514 338 736 -348 -618 27 888
5027 888 389 -682 -598 326 452 -384 -430 238 532 393 -739 -358 492 967 -288 -655 -363 745 204
5046 204 -458 -360 311 761 -204 -623 -237 827 361 -344 -573 176 401 26 -491 -146 812 576 -182 -173 242
5067 242 545 -204 -906 -10 727 775 -662 -693 229 620 40 -474 119 774 646 -170 -510 183 772 -150
5087 -150 -659 -6 361 509 -462 -542 239 604 117 -616 -339 872 682 -327 -443 142 491 315 -583 -348
5107 -348 640 710 -286 -867 297 812 251 -497 -231 636 646 -123 -560 22 812 187 -148 -189 395 726 -425
5128 -425 -750 -301 690 290 -546 -544 292 297 -135 -525 -173 589 353 -568 -385 201 721 -33 -787 -210 563
5149 563 365 -616 -487 356 530 -441 -739 -266 506 219 -491 -545 323 832 -27 -793 -217 525 502 -506
5169 -506 -605 285 629 4 -597 -243 596 660 -265 -688 211 387 49 -759 -210 91 436 -264 -495 -191 642
5190 642 -28 -770 -391 472 478 -351 -410 76 945 -72 -681 -525 289 540 -325 -504 -189 993 296 -640
5210 -640 -378 605 642 -208 -644 37 766 121 -516 -516 236 381 -330 -759 47 534 195 -809 -643 311 835
5231 835 -341 -667 116 658 230 -617 -471 566 669 -62 -591 70 351 493 -472 -552 48 588 -77 -635
5251 -635 -156 746 575 -658 -503 279 371 -270 -735 157 747 556 -574 -486 171 498 -55 -860 -354 636
5271 636 568 -233 -680 37 856 0 -870 -497 566 611 -338 -519 158 844 39 -938 -433 667 664 -404
5291 -404 -567 127 828 143 -587 -592 334 460 -342 -747 141 656 316 -672 -466 433 345 -624 -772 -232 615
5312 615 350 -583 -690 359 513 -364 -636 -121 414 234 -565 -311 486 493 -207 -572 -62 638 458 -412
5332 -412 -441 410 587 -52 -553 -309 582 413 -638 -348 542 486 22 -670 -72 749 665 -593 -267 715
5352 715 829 150 -685 -266 564 630 -510 -452 190 848 -105 -766 -8 680 597 -359 -465 333 802 -40 -722
5373 -722 -75 738 281 -37 -467 184 265 150 -503 -327 663 275 -340 -457 -17 758 387 -618 -334 847
5393 847 556 -122 -551 76 764 70 -615 -456 272 487 -222 -627 -110 561 306 -703 -224 574 589 -296
5413 -296 -639 2 742 31 -470 -554 454 737 -200 -770 -289 544 -87 -666 -377 459 316 67 -434 -175
5433 -175 545 -163 -604 -459 500 532 -270 -291 -442 632 24 -719 -423 48 780 22 -531 -275 529 291
5453 291 -741 -514 205 503 -11 -987 -195 611 361 -134 -358 323 880 -106 -734 -354 566 374 -512 -244
5473 -244 704 634 -205 -498 -275 561 507 -483 -750 182 795 113 -431 -392 391 733 -301 -418 83 989 445
5494 445 -457 -78 679 542 -441 -421 110 592 185 -713 -525 435 402 118 -663 -36 624 -61 -533 -416 310
5515 310 838 -137 -634 -374 545 6 -429 -249 287 393 -585 -605 53 611 115 -540 -435 258 493 -242
5535 -242 -775 -122 578 52 -403 -580 340 618 -150 -685 -296 313 155 -593 -601 177 610 -247 -709 -338 214
5556 214 424 -409 -714 341 514 -373 -891 -371 248 350 -16 -507 117 466 8 -535 -205 619 494 -313
5576 -313 -652 352 863 56 -562 -345 620 396 -251 -513 -56 468 262 -734 -399 409 383 -304 -655 131
5596 131 680 60 -769 -343 455 356 -368 -749 -41 500 412 -605 -436 159 636 -165 -542 312 536 113
5616 113 -612 -579 396 255 -348 -438 -87 490 242 -600 -481 411 557 -211 -623 -45 509 191 -539 -469 257
5637 257 421 -391 -738 78 484 413 -564 -760 166 584 -87 -705 -13 407 411 -481 -750 163 391 -268 -417
5658 -417 -45 455 265 -473 -565 160 586 -100 -778 -376 294 184 -476 -312 132 593 144 -673 -200 490
5678 490 656 -283 -340 261 642 -166 -772 -450 287 623 -364 -730 250 500 258 -714 -331 376 624 -330
5698 -330 -440 -131 709 107 -553 -307 289 419 -25 -639 -68 618 294 -509 -725 514 770 -111 -977 -123
5718 -123 519 119 -269 -491 476 695 -20 -538 -74 494 197 -320 -317 398 675 211 -616 -133 599 376 -335
5739 -335 -246 9 374 112 -522 -150 523 217 -760 -291 266 605 -206 -185 -134 665 298 -337 -560 307 309 268
5761 268 -236 88 562 506 -333 -186 200 636 288 -855 10 163 392 -270 -280 -20 540 -44 -363 -315 317
5782 317 209 -126 -526 93 553 -71 -600 -260 390 504 -78 -720 205 492 380 -426 34 153 231 75
5802 75 -712 145 869 152 -297 -155 384 501 -129 -481 -136 546 569 -679 -260 500 426 45 -456 -154 478
5823 478 323 -598 -297 348 332 -116 -459 -115 494 164 -93 -170 286 408 0 -491 -35 757 143 -374 -403
5844 -403 659 624 63 -517 201 591 572 -279 -527 265 594 59 -335 -9 596 465 -439 -465 437 258 157
5865 157 -635 294 598 545 -37 -588 148 504 159 -625 0 349 165 -488 -558 132 581 299 -539 -162 475
5886 475 439 -391 -679 244 648 -47 -345 -408 409 413 -582 -440 64 529 126 -354 -347 161 581 -170 -537 140
5908 140 734 233 -376 -345 69 576 -287 -355 -60 328 149 -278 -481 462 420 -160 -491 -258 173 293 -850
5929 -850 -703 316 206 124 -698 -171 645 259 -303 -595 76 421 -222 -400 -162 360 206 -326 -306 293
5949 293 581 4 -734 -155 401 428 -517 -733 411 1025 65 -338 -486 495 234 -242 -655 386 726 111
5969 111 -290 -212 494 366 -416 -623 104 660 47 -421 -332 519 231 7 -523 -38 420 20 -391 -526 360
5990 360 476 -189 -205 119 343 217 -332 -232 506 240 -150 -722 -76 258 114 -568 -477 215 486 -63 -305
6011 -305 39 514 130 -616 -429 181 423 -104 -564 -34 601 360 -138 -354 125 711 -163 -410 -175 240
6031 240 237 -514 -578 55 425 -110 -681 -328 418 197 -390 -469 182 386 -41 -369 -231 284 197 -178 -393 -18
6053 -18 512 -104 -649 -287 551 178 -533 -430 -104 594 -35 -410 -323 216 331 -475 -370 245 568 94 -610
6074 -610 -381 597 439 -399 -639 189 395 130 -479 -497 426 270 -139 -536 -124 264 425 -354 52 241
6094 241 493 -396 -749 -179 303 415 -501 -332 102 288 -229 -394 -260 143 -54 -496 -422 252 604 -264
6114 -264 -530 49 369 561 -352 -273 577 488 -69 -244 -80 362 683 -251 -227 254 234 153 -432 -24 239 291
6136 291 -527 -496 242 619 9 -483 -174 255 472 -114 -276 260 427 -34 -518 -183 323 334 -221 -283 -90
6157 -90 638 33 -454 -51 577 620 -228 -510 -86 428 109 -353 -295 206 216 -242 -672 280 233 126 -288 -361
6179 -361 230 401 -170 -625 -137 697 168 -371 -396 -1 313 -476 -389 148 535 -11 -625 -456 231 605 12
6200 12 -374 153 398 276 -256 -380 118 412 -102 -577 65 583 378 -599 -465 357 525 -154 -423 50
6220 50 398 500 -234 -180 271 366 109 -379 -81 536 234 -486 -404 278 333 59 -351 -55 472 364 -331 -247
6242 -247 14 486 240 -535 -112 268 353 -87 -353 312 388 91 -397 -361 431 273 -186 -564 -122 534 227
6263 227 -280 67 356 376 -63 -271 182 387 166 -490 -280 420 86 -140 -359 138 518 123 -481 -246
6283 -246 -92 455 -149 -582 -116 519 279 -325 -242 240 424 -194 -601 98 531 380 -113 -380 505 412 -210
6304 -210 -279 -104 386 95 -495 -206 414 406 -289 -546 -57 437 13 -182 -412 431 690 -285 -277 -1 277 634
6326 634 -324 -475 322 439 -6 -78 -323 180 302 7 -242 -26 898 229 -470 -326 328 373 -237 -366 249
6347 249 420 103 -149 -126 354 492 -253 -271 -9 452 128 -491 -283 195 334 35 -638 271 -57 162 -154
6368 -154 -40 186 314 -44 -450 88 384 244 -407 -126 -62 703 -236 -373 94 491 141 -448 -247 361
6388 361 161 -78 -449 46 540 388 -353 -618 -61 503 -17 -445 -297 168 249 -473 -301 339 329 -326 -660
6409 -660 -12 443 409 -490 -716 114 248 -240 -320 -17 363 38 -262 -364 91 305 193 -446 -482 348 343 -196
6431 -196 -227 110 587 -211 -560 -273 166 135 -286 -315 148 347 -109 -190 -216 237 349 -194 -490 226 322 -362
6453 -362 -633 -255 173 582 -51 -351 -66 272 45 -234 -402 350 384 -137 -448 -260 513 -421 -359 -210 241
6474 241 175 -12 -591 -186 292 177 -627 -356 334 386 -389 -508 -189 242 -160 -294 -75 -109 120 -145 -520
6495 -520 -130 578 96 -245 -422 362 780 -53 -163 -221 310 237 -598 -194 108 279 -71 -478 66 460 158
6516 158 -103 -382 36 388 67 -128 -258 138 36 -64 -225 -47 319 -28 -441 -201 173 274 -468 -161
6536 -161 428 208 24 -764 -371 106 110 -483 -447 117 384 -283 -365 -2 378 92 -344 -428 -7 295 -105 -580
6558 -580 -133 220 528 -20 -276 171 120 65 -514 -137 118 188 -342 -525 73 488 -75 -250 -272 284 291 -196
6580 -196 -401 28 502 281 -486 -694 123 136 -61 -335 -62 384 176 -367 -161 -73 370 434 -343 -70 498
6601 498 266 -114 -289 288 485 -231 -501 98 641 297 -544 -300 289 372 -359 -595 134 510 -63 -338
6621 -338 -205 199 475 115 -469 -321 460 296 -355 -204 232 398 4 -406 -240 186 303 -200 -506 23
6641 23 300 61 -452 -55 309 408 -224 -342 149 123 137 -395 -325 282 279 -159 -377 -253 263 79 -239 -125
6663 -125 98 -56 -177 -784 -20 472 146 -253 -140 308 178 -279 -576 -310 363 392 -383 -147 425 165
6683 165 -355 -376 78 192 254 -305 -277 36 215 -173 -620 -197 164 218 -343 -247 -98 374 81 -436 -349 400
6705 400 50 -176 -462 113 -1 60 -200 170 266 75 -179 -323 307 488 193 -318 -358 203 78 -330 -138
6726 -138 -43 473 -94 -243 -137 391 381 -238 -432 25 515 -238 -320 -103 510 462 -266 -450 -5 384 33
6747 33 -203 -303 183 361 -345 -341 92 258 118 -83 -84 267 518 155 -538 -7 335 279 -618 -160 362 213
6769 213 -170 -474 206 184 45 -293 8 82 350 88 -287 -181 233 396 -556 -149 326 293 83 -410 -213
6790 -213 383 260 -601 -512 257 335 -322 -752 -146 143 -68 -354 -373 322 315 -294 -480 117 257 380 -391 -320
6812 -320 162 74 -142 -559 -3 504 143 45 -422 217 295 34 -249 47 166 219 -221 34 130 297 -176 -330
6834 -330 -388 102 222 -259 -246 -208 361 102 -461 -302 217 389 -160 -702 -96 608 187 -407 -224 483 217
6855 217 -253 -132 -84 609 122 -454 -1 357 233 -237 -436 329 514 65 -331 -260 25 269 -477 -298 -9
6876 -9 164 479 -301 -222 52 351 -4 -521 247 602 584 -227 -69 120 270 -170 -275 -166 502 -163 -420
6897 -420 55 76 121 349 -453 -104 192 -94 -250 -113 303 484 -441 -312 -121 52 144 98 -232 282 280 62
6919 62 -350 153 150 216 11 -582 -93 274 29 -319 -133 91 9 -280 -245 -169 201 27 -301 -186 58 297
6941 297 -168 -543 -134 120 157 -362 -73 6 348 -208 -262 87 440 239 -390 -368 118 68 43 -784 -183 286
6963 286 176 -282 -380 289 64 -183 -287 -265 459 -58 -146 2 300 564 13 -565 248 517 10 -552 -523
6984 -523 91 276 -21 -280 76 258 128 -153 -54 97 313 -211 -478 -49 654 258 -256 -77 188 69
7004 69 208 -205 -163 446 -22 -94 -238 138 147 91 -335 121 547 202 -183 -301 11 359 195 -321 72 14
7026 14 62 -484 -236 126 325 -22 -410 75 261 238 -375 -372 27 631 -21 -356 -247 101 199 10 -330 97
7048 97 373 158 -173 -217 253 260 -54 -213 158 225 42 -124 -213 189 181 -127 -114 131 -20 275 -321 -370 464
7071 464 481 40 -51 27 291 48 -39 -291 175 437 30 -180 52 375 145 -493 -100 22 290 -171 -506
7092 -506 -421 451 417 -288 -223 697 364 -157 -135 -118 51 176 -224 -250 181 265 161 -456 3 224 233 10 -276
7115 -276 -104 311 258 -201 152 338 -96 -125 -390 -23 385 -31 -353 -165 484 387 -28 -161 216 552 92
7136 92 -296 79 228 147 -215 -490 -270 204 160 -215 -241 265 147 -235 -212 -3 333 207 -281 -213 442 348
7158 348 -56 -168 -24 421 227 -31 -450 125 146 -147 -159 106 343 226 -168 -108 64 367 -49 -298 -385
7179 -385 305 -8 -374 -153 46 34 48 -594 -305 38 78 -254 -357 -27 398 -94 -237 -152 234 175 -190 -349
7201 -349 -80 104 -111 -448 -34 376 31 45 -498 -94 73 -10 -268 -80 125 282 81 -26 -101 361 237
7222 237 -61 -61 336 74 -95 -56 -76 286 172 -460 -160 117 292 24 -36 54 273 204 -380 -247 51 300
7244 300 196 -201 -203 76 187 -382 -141 206 -10 -164 -198 -144 284 -126 -197 -226 -63 16 20 -219 7 377 242
7267 242 -243 39 312 541 -186 -151 -468 24 142 -253 -456 -2 84 -208 14 -132 -49 53 -180 -294 101
7288 101 150 -92 -174 -130 379 187 -85 -46 -8 47 77 -201 -141 281 279 -195 178 -116 359 3 -420 -365 134 119
7312 119 -49 -190 -52 320 -86 -324 -15 161 14 -89 -90 209 -76 139 23 -184 -37 268 -34 -472 -34
7333 -34 103 97 72 -44 101 178 185 -280 154 212 166 -310 26 39 151 -311 -229 -10 189 257 -278 -385 433 -64
7357 -64 7 -154 -90 263 150 -124 -243 321 220 151 -516 -86 96 137 -176 -116 208 160 -35 -255 -183 132 269
7380 269 -380 -52 -294 104 146 -238 130 159 103 116 -171 341 349 40 -52 -180 296 168 63 -191 148 227 -183
7403 -183 -223 176 201 134 -137 -231 -56 -79 403 -271 -254 249 176 101 -283 132 119 220 -257 -402 259 160 -80
7426 -80 -193 18 141 -111 -244 31 256 154 105 -381 -224 413 317 -375 -164 247 318 125 -262 3 92 228
7448 228 -114 18 368 236 -152 -260 141 226 152 -295 -427 -42 96 83 -300 -73 101 167 -554 -232 19
7469 19 157 -103 -180 17 298 136 -153 -164 270 568 -141 55 -86 365 361 -359 -204 -83 221 -32 -6 -52
7491 -52 -19 200 -139 -181 306 87 157 -132 -274 313 286 -133 -176 -99 161 247 16 -451 137 439 178 155 75
7514 75 191 85 -333 173 59 431 -17 -26 72 80 377 62 -261 -38 495 -287 -339 -67 279 20 -59 -47 209
7537 209 258 12 -163 187 429 181 -56 -68 85 114 111 -475 -186 349 -67 -295 -67 49 312 -74 -230 -237
7559 -237 331 89 -308 -144 -44 32 397 -46 -204 551 426 24 -10 224 174 16 -97 -354 308 -9 -135
7580 -135 -359 125 180 118 -50 -79 -32 -53 237 -126 -41 273 82 -249 57 239 101 -165 -127 -98 -151 177 46
7603 46 -341 126 341 -202 -155 146 11 -74 -132 -45 128 329 -152 130 -111 216 81 -335 -209 92 27 -54
7625 -54 -126 84 5 316 -91 -144 114 71 -125 -231 82 264 117 -209 -23 -22 165 3 -315 -196 208 32
7647 32 -200 -3 356 357 -65 -304 -189 250 254 -111 -362 100 234 249 -230 -23 284 197 -185 -308 -83 272
7669 272 -263 20 17 2 69 -330 -251 -185 219 69 -343 -275 197 202 -387 -241 148 366 -1 -231 117 232 23
7692 23 -149 -333 121 219 -156 -83 -156 -199 -24 -119 -332 185 56 -18 -251 -224 375 -9 -75 -116 163 112 228 -289
7716 -289 -336 -36 -97 80 -99 21 229 6 -134 66 393 -58 173 23 -163 271 174 -111 -371 195 90
7737 90 109 -544 -169 157 317 -23 -194 -11 163 -282 -161 59 85 28 -377 -140 36 490 52 -140 9
7758 9 363 55 44 -269 32 193 74 170 -391 32 189 -75 -189 -195 121 68 -123 -104 260 263 -48 -363 74
7781 74 184 -98 -182 -51 145 135 -132 -377 100 274 408 -151 -264 238 244 -59 -275 -159 207 269 -26 -307
7803 -307 120 303 -97 -197 -194 142 51 -457 -108 34 -65 24 -154 -166 198 134 -237 -341 146 -2 -226 -189 -80
7826 -80 87 192 -294 -295 34 225 -150 -479 -47 271 226 -127 -234 85 77 -69 -352 -429 294 322 -247 -185 -26
7849 -26 69 151 -214 -262 211 91 -100 -198 7 24 147 62 -435 113 536 140 -203 -62 305 -47 -16 -52 -121
7872 -121 198 -43 -406 -192 214 227 -175 -183 -6 244 81 -382 33 -54 -113 -96 -408 139 134 -60 81 103 171
7895 171 134 -475 -126 -75 233 193 -111 -4 152 247 -362 -182 317 211 -60 18 -109 46 -152 -161 -216 286 46
7918 46 92 -194 -50 468 -81 -255 -8 36 272 -87 150 144 139 174 29 -305 -106 265 -80 -417 -123 162 281
7941 281 -324 -246 202 255 157 -377 251 115 68 85 -271 156 147 -123 -317 -118 -143 257 -182 -305 172 -9 252
7964 252 -66 -197 -22 199 169 -119 30 406 296 -189 -366 25 -162 31 -109 128 311 54 -281 -111
7984 -111 -19 -54 -266 -254 161 163 194 -487 -15 153 284 -39 -80 -200 343 157 -142 -204 153 1 -43 -238 65
8007 65 169 239 -107 -237 -53 274 -114 -179 -134 67 295 -62 -504 247 161 37 -190 -14 166 76 102 -482
8029 -482 32 232 301 33 -162 330 -35 -146 -357 36 240 285 157 120 -153 37 -17 -417 -39 175 134 -274
8051 -274 -266 274 -13 157 -145 5 -33 119 -275 -70 44 331 327 -406 -219 297 108 -183 -47 -147 244 -142
8073 -142 29 -63 -35 251 -305 -160 -19 162 -154 -367 -412 506 159 -211 -292 56 294 -69 -147 86 455 -118
8095 -118 -69 -386 1 84 -41 248 -243 386 275 49 -15 -113 99 161 -63 193 161 167 181 59 424 129 296
8118 296 63 -31 278 150 201 -68 -235 329 162 -184 -106 338 140 26 -63 47 138 -91 170 -107 133 213
8140 213 276 27 -50 367 107 -86 -224 76 -152 100 -1 -43 110 210 -142 72 105 -51 40 -143 -273 9
8162 9 -65 -461 -207 86 345 -155 -135 -244 219 218 -298 -93 178 485 87 -69 80 188 77 -41 -131 -71 -66
8185 -66 -125 -349 166 39 73 -85
8191h5
##END NTUPLES=NMR FID
##END=
