##TITLE=1H_LR-694-K1A1
 DMSO-d6, 8 sc, 
 16.10.2019
##JCAMPDX= 6.0         $$ Bruker NMR JCAMP-DX V2.0
##DATA TYPE= NMR FID
##DATA CLASS= NTUPLES
##ORIGIN= UXNMR, Bruker Analytische Messtechnik GmbH
##OWNER= root
$$ XWIN-NMR		Version 3.5
$$ Wed Oct 16 15:24:30 2019 Russian Standard Time (UT+4h)  she@DPX200
##.OBSERVE FREQUENCY= 200.1315
##.OBSERVE NUCLEUS= ^1H
##.DELAY= (6, 6)
##.ACQUISITION MODE= SIMULTANEOUS
##.ACQUISITION SCHEME= undefined
##.AVERAGES= 8
##.DIGITISER RES= 18
##SPECTROMETER/DATA SYSTEM= spect
##.PULSE SEQUENCE= zg30
##.SOLVENT NAME= DMSO
##.SHIFT REFERENCE= (INTERNAL, DMSO, 0, 15.7039)
##AUDIT TRAIL= $$ (NUMBER, WHEN, WHO, WHERE, WHAT)
$$ ##TITLE= Audit trail, XWIN-NMR		Version 3.5
$$ ##JCAMPDX= 5.01
$$ ##ORIGIN= Bruker BioSpin GmbH
$$ ##OWNER= she
$$ F:/spectra/data/she/nmr/H-F/1/audita.txt
$$ ##AUDIT TRAIL=  $$ (NUMBER, WHEN, WHO, WHERE, WHAT)
(   1,<2019-10-16 15:23:23.75 +0400>,<she>,<DPX200>,
      <created by zg, POWCHK disabled, PULCHK disabled
       configuration hash MD5:
       00 E9 B6 7A A2 85 ED C7 34 08 36 98 17 FE 4E 26
       data hash MD5: 16K
       BE 19 D1 59 0F DD 18 6B 64 17 EB 9B B2 30 9B E7>)
$$ ##END=
$$ 
$$ hash MD5
$$ 21 83 B7 02 CB AC 80 70 1C D1 03 C1 3A 7A A6 46
##$RELAX= 
##$RELAX= 
##$RELAX= 
##$RELAX= 
##$RELAX= 
##$RELAX= 
$$ Bruker specific parameters
$$ --------------------------
##$DU= <F:/spectra>
##$EXPNO= 1
##$NAME= <H-F>
##$PROCNO= 1
##$TYPE= <nmr>
##$USER= <she>
##$AMP= (0..31)
100 100 100 100 100 100 100 100 100 100 100 100 100 100 100 100 100 100 
100 100 100 100 100 100 100 100 100 100 100 100 100 100 
##$AQSEQ= 0
##$AQ_mod= 1
##$AUNM= <au_zg>
##$AUTOPOS= <>
##$BF1= 200.13
##$BF2= 200.13
##$BF3= 200.13
##$BF4= 200.13
##$BF5= 200.13
##$BF6= 200.13
##$BF7= 200.13
##$BF8= 200.13
##$BYTORDA= 1
##$CFDGTYP= 0
##$CFRGTYP= 5
##$CHEMSTR= <none>
##$CNST= (0..31)
1 1 145 1 1 1 1 1 1 1 1 1 1 1 1 1 1 1 1 1 1 1 1 1 1 1 1 1 1 1 1 1 
##$CPDPRG= <>
##$CPDPRG1= <>
##$CPDPRG2= <>
##$CPDPRG3= <>
##$CPDPRG4= <mlev>
##$CPDPRG5= <mlev>
##$CPDPRG6= <mlev>
##$CPDPRG7= <mlev>
##$CPDPRG8= <mlev>
##$CPDPRGB= <>
##$CPDPRGT= <>
##$D= (0..31)
0 1.2 0 0 0 0 0 0 0 0.06 0 0.03 0 0 0 0 0.0002 0 0 0 0 0 0 0 0 0 0 0 0 
0 0 0 
##$DATE= 1571225003
##$DBL= (0..7)
120 120 120 120 120 120 120 120 
##$DBP= (0..7)
150 150 150 150 150 150 150 150 
##$DBP07= 0
##$DBPNAM0= <>
##$DBPNAM1= <>
##$DBPNAM2= <>
##$DBPNAM3= <>
##$DBPNAM4= <>
##$DBPNAM5= <>
##$DBPNAM6= <>
##$DBPNAM7= <>
##$DBPOAL= (0..7)
0.5 0.5 0.5 0.5 0.5 0.5 0.5 0.5 
##$DBPOFFS= (0..7)
0 0 0 0 0 0 0 0 
##$DE= 6
##$DECBNUC= <off>
##$DECIM= 24
##$DECNUC= <off>
##$DECSTAT= 4
##$DIGMOD= 1
##$DIGTYP= 9
##$DL= (0..7)
0 120 120 120 120 120 120 120 
##$DP= (0..7)
150 150 150 150 150 150 150 150 
##$DP07= 0
##$DPNAME0= <>
##$DPNAME1= <>
##$DPNAME2= <>
##$DPNAME3= <>
##$DPNAME4= <>
##$DPNAME5= <>
##$DPNAME6= <>
##$DPNAME7= <>
##$DPOAL= (0..7)
0.5 0.5 0.5 0.5 0.5 0.5 0.5 0.5 
##$DPOFFS= (0..7)
0 0 0 0 0 0 0 0 
##$DQDMODE= 0
##$DR= 18
##$DS= 0
##$DSLIST= <SSSSSSSSSSSSSSS>
$$ [...]
##$SUBNAM2= <"">
##$SUBNAM3= <"">
##$SUBNAM4= <"">
##$SUBNAM5= <"">
##$SUBNAM6= <"">
##$SUBNAM7= <"">
##$SUBNAM8= <"">
##$SUBNAM9= <"">
##$SW= 24.0689530833862
##$SWIBOX= (0..15)
0 0 2 0 0 0 0 0 0 0 0 0 0 0 0 0 
##$SW_h= 4816.95568400771
##$TD= 16384
##$TD0= 1
##$TE= 0
##$TE2= 300
##$TE3= 300
##$TEG= 300
##$TL= (0..7)
0 120 120 120 120 120 120 120 
##$TP= (0..7)
150 150 150 150 150 150 150 150 
##$TP07= 0
##$TPNAME0= <>
##$TPNAME1= <>
##$TPNAME2= <>
##$TPNAME3= <>
##$TPNAME4= <>
##$TPNAME5= <>
##$TPNAME6= <>
##$TPNAME7= <>
##$TPOAL= (0..7)
0.5 0.5 0.5 0.5 0.5 0.5 0.5 0.5 
##$TPOFFS= (0..7)
0 0 0 0 0 0 0 0 
##$TUNHIN= 0
##$TUNHOUT= 0
##$TUNXOUT= 0
##$USERA1= <user>
##$USERA2= <user>
##$USERA3= <user>
##$USERA4= <user>
##$USERA5= <user>
##$V9= 5
##$VALIST= <valist>
##$VCLIST= <CCCCCCCCCCCCCCC>
##$VD= 0
##$VDLIST= <DDDDDDDDDDDDDDD>
##$VPLIST= <PPPPPPPPPPPPPPP>
##$VTLIST= <TTTTTTTTTTTTTTT>
##$WBST= 1024
##$WBSW= 4
##$XGAIN= (0..3)
0 0 0 0 
##$XL= 0
##$YL= 0
##$YMAX_a= 152710
##$YMIN_a= -80091
##$ZGOPTNS= <>
##$ZL1= 120
##$ZL2= 120
##$ZL3= 120
##$ZL4= 120
##$ABSF1= 10
##$ABSF2= 0
##$ABSG= 5
##$ABSL= 3
##$ALPHA= 0
##$AQORDER= 0
##$ASSFAC= 0
##$ASSFACI= 0
##$ASSFACX= 0
##$ASSWID= 0
##$AUNMP= <proc_1d>
##$AZFE= 0.1
##$AZFW= 0.1
##$BCFW= 1
##$BC_mod= 2
##$BYTORDP= 1
##$COROFFS= 0
##$CY= 11.3945322036743
##$DATMOD= 1
##$DC= 2
##$DFILT= <>
##$DTYPP= 0
##$F1P= 20.1720416913024
##$F2P= 0.152960286110954
##$FCOR= 0.5
##$FTSIZE= 0
##$FT_mod= 4
##$GAMMA= 1
##$GB= 0.15
##$INTBC= 1
##$INTSCL= 1
##$ISEN= 128
##$LB= 0.24
##$LEV0= 0
##$LPBIN= 0
##$MAXI= 10000
##$MC2= 0
##$MEAN= 0
##$ME_mod= 0
##$MI= 1.114404
##$NCOEF= 0
##$NC_proc= 0
##$NLEV= 6
##$NOISF1= 3.799351
##$NOISF2= 2.8
##$NSP= 1
##$NTH_PI= 0
##$NZP= 0
##$OFFSET= 15.70392
##$PC= 1
##$PHC0= -9603.815
##$PHC1= 66.00092
##$PH_mod= 1
##$PKNL= yes
##$PPARMOD= 0
##$PSCAL= 0
##$PSIGN= 0
##$REVERSE= no
##$SF= 200.130013532006
##$SI= 16384
##$SIGF1= 3
##$SIGF2= 2
##$SINO= 400
##$SIOLD= 16384
##$SREGLST= <1H.CDCl3>
##$SSB= 0
##$STSI= 0
##$STSR= 0
##$SW_p= 3612.71676300578
##$SYMM= 0
##$S_DEV= 0
##$TDeff= 0
##$TDoff= 0
##$TI= <>
##$TILT= no
##$TM1= 0
##$TM2= 0
##$TOPLEV= 0
##$USERP1= <user>
##$USERP2= <user>
##$USERP3= <user>
##$USERP4= <user>
##$USERP5= <user>
##$WDW= 1
##$XDIM= 8192
##$YMAX_p= 0
##$YMIN_p= 0
$$ End of Bruker specific parameters
$$ ---------------------------------
##NTUPLES= NMR FID
##VAR_NAME=  TIME,          FID/REAL,        FID/IMAG
##SYMBOL=    X,             R,               I
##VAR_TYPE=  INDEPENDENT,   DEPENDENT,       DEPENDENT
##VAR_FORM=  AFFN,          ASDF,            ASDF
##VAR_DIM=   8192,          8192,            8192
##UNITS=     SECONDS,       ARBITRARY UNITS, ARBITRARY UNITS
##FACTOR=    0.0002076,     1,               1
##FIRST=     0,             0,               0
##LAST=      1.7004516,     0,               0
##MIN=       0,             -80091,          0
##MAX=       1.7004516,     152710,          0
$$ Real data points
##PAGE= N=1
##DATA TABLE= (X++(R..R)), XYDATA
0@%%%%%%%%Qj6J6j6J6k4L2l5M3n5O3p2Q8j04J20j36J57j81K06k35K66l01L41l82
32b01M28m81N38o01O66p38Q21r11J010j119J239j372J519j684J870k081K323k603
50a377K930l317L789m380N138o158P614r873J3907k3383Q8749P9071n6066J030
64I7674j1392K358j9126q600j2763o25j0493q946j5658n767o405m255j0296l114
78a7408K526Q038j406n954o789Q81L010L771N43K563L111M302k16p96k46L921
94a49K884M03j159K060L416K308k427m367j580Q01N06k73o67N08L92j639l221
111b204k064l09L61m26j955l97J473J526q95k408j260N17J581J147M11R80J309
128b613R22j87m39R29J767P63p84n60J054J157L09j198j583O01K71M15o8k32n2
$$ plain form
0 0 0 0 0 0 0 0 0 0 8 -8 8 -8 8 -16 16 -19 24 -31 32 -40 48 -56 64 -72 85 -96 110 -125 141 -160 181 -201
32 -201 227 -254 284 -317 349 -389 432 -479 531 -588 651 -721 798 -886 984 -1097 1226 -1377
50 -1377 1553 -1764 2025 -2355 2783 -3375 4239 -5634 8273 -15110 73639 152710 96644 97674
64 97674 86282 88640 69514 60914 48151 47526 37033 28087 12429 6662 257 -3998 -14294 -17408
78 -17408 -14882 -6844 -8250 -14204 -20993 -20112 -17102 -13331 -12788 -10225 -7114 -2812 -3028 -3824 -4070 -149
94 -149 2735 3138 1979 4039 7455 9763 7336 2969 1389 2190 2696 2423 1756 2264 2656 1017 -2204
111 -2204 -4268 -4577 -4216 -4642 -6597 -6994 -5521 -3995 -4890 -7298 -8558 -8041 -6460 -5313 -4902 -3922 -2613
128 -2613 -1691 -1878 -2317 -1388 379 1142 358 -202 852 2009 2318 1120 -463 138 409 824 756 524 472
147D72K02n12j293k75L54L03j26l97n18Q20P2j75o77J00R2P54K90j15K52M04N1
168G8l92Q2k1P52M02J35m18N47M08J81q2l24L24J84M8j64j0K48j99r5p12j8k58
191F96N34k73o17j61K83J67l56l22n72O96l5l95L03j33K19k51n20l80P12j67M19
212a53K5j69K93Q0J94k25k17K34N8M09m16J66k53L04l81k13l5L30r7K44m44l00
234e66O50l51N4m34K63O5K33r9j71k7J82J23k74l65L82Q9M60q3n94L66L09J24
256C36o31J32N6M92r9l01j46L71j8m36k04K17K86J6j9M8n13M26j14m55P2j55N51
279h8q2l0L1J48k8j77J19n04K22O07j16J50n60K57M40m51J10J58J08j0m96M36
301B44L0j53L35j45J13l11P7Q9J62J00m21J19j64N8k79r3K79J67k35k77K95m5
$$ plain form
147 472 674 162 -1131 -1406 -1052 -749 -875 -1272 -1790 -970 -898 -1073 -1750 -1650 -1558 -804 -514 -629 -377 27 78
168 78 -314 -232 -253 499 901 1036 618 1165 1573 1754 1672 1348 1672 1856 1904 1740 1730 1978 1779 1684 972 954 696
191 696 1230 957 340 179 462 629 273 -49 -621 75 40 -355 -52 -185 34 -217 -737 -1117 -405 -572 -153
212 -153 -128 -297 -4 76 270 45 -172 62 120 529 113 279 26 330 -51 -264 -299 31 -66 178 -266 -566
234 -566 84 -267 -213 -647 -384 -319 -86 -185 -356 -383 -201 -78 -352 -717 -335 -246 214 131 -463 -97 212 336
256 336 -295 -163 -107 385 286 -15 -161 210 192 -244 -448 -231 55 71 52 100 -413 13 -101 -556 -484 -639 -88
279 -88 -170 -200 -169 -21 -49 -226 -107 -611 -389 218 102 252 -308 -51 389 -62 48 206 314 304 -192 244
301 244 274 121 456 311 424 113 190 279 441 541 120 239 75 133 -146 -239 40 207 -28 -305 -10 -55
323e5K37k34m49O51j34k4n5m8J51l89J13K4p2J85%L01j09l9Qo4N0n2Q6NN27j76
349D38kj19j90K48j47l54j26L30nL3J31m79M66j02J36j32K5l09K50j31J37P9k7
372A50j12j85j64K01J59k76K88k20J07j2mn4P5K0j35Q4K5J08k9k7r4k3q5J23L22
397B42K9n66ML83o9k18J77Q6k7p5J82k16j9K88j69l62J64R0P1p9J60J44l84N38
421C74m69J17n5j01Q1R6j27K9j04P9L8k10K84k02Q3k9K44k10k06K07j45M12k68
444h2k7R9j24K57k92J90l21J42K15j58K11j48j28R1N3P1l08k1L06J3l05K37m6
467g5Om9L87k38k09Q4J09k17QK97m9n0J02m8r9M5m0K43J6q7r6k97L73j45J3j85
493b01K51l03J42l1m9L11L2j63j61L9J50Q2k65L97l10n3P4P6L15k94R8j09J08
$$ plain form
323 -55 182 -52 -501 150 16 -8 -63 -111 40 -349 -236 -212 -284 -99 -99 202 93 54 62 -2 48 -4 82 87 614 438
349 438 436 317 127 375 228 -126 -252 78 73 106 237 -242 224 122 258 126 151 -158 92 -39 98 177 150
372 150 38 -147 -311 -110 49 -227 61 -159 -52 -64 -68 -122 -47 -27 -162 -78 -53 55 26 -1 -95 -118 -203 -80 242
397 242 271 -295 -291 92 23 -195 -18 68 41 -34 148 -68 -87 201 32 -330 -166 -76 -5 -84 76 220 -164 374
421 374 -95 22 -33 -134 -53 43 -84 -55 -159 -80 -42 -252 32 -170 -87 -116 128 -82 -288 -81 -226 186 -82
444 -82 -109 -10 -134 123 -169 21 -300 -158 57 -101 110 -38 -166 -75 -22 49 -259 -280 26 39 -266 -29 -75
467 -75 -69 -118 269 31 -178 -94 15 -202 -194 103 54 4 106 58 -41 4 -36 207 223 136 40 -257 116 -29 -16 -201
493 -201 50 -253 -111 -142 -191 120 152 -11 -172 -133 17 99 -166 231 -79 -132 -58 18 333 39 137 28 136
516A36k29J83j15mj4K20j74R6J09l51M98j58j51MJ31n72K90q2M21k81RP5j13J10
540C8j58J39k22l6K53r6K36l9r0k06K84R8l23K27J84k61l87O41m06J44M6q5k61
563b80J38R1J47j05j48L58nr8k94p9J78j21J43M1J70k57K01J14j98J5R6j83m9
586a25J41q7n6j07j21M51J5j77R3L04l39m9P7k1J85k42P4k95K22k54K66J04O2
609A21j65o2J61O9j29k35rJ23J01L9r7N3J53j82r5J86J17j38r3qJ33k0m5M5n9
634c6J58o3j25k61M18K21l8j56j42r7L61k64n1J63O4m12K7K10k10M8O51l54J97
657C09K9j90l84K02J16k56n2K30k8k26L20K42k82M2j09j9M6K52l46m1K8J52k54
680b19K06j58R9J70P5k71pJ57L7n01L39J16j03N6Rj89L42j14k75K24Jj41J95J45
$$ plain form
516 136 -93 90 -25 -29 -43 177 3 99 208 -143 355 197 46 50 181 -391 -101 -183 238 -43 -34 41 -72 38
540 38 -120 19 -203 -239 14 -82 154 115 25 -181 103 201 -122 105 289 28 -359 282 -124 20 66 -19 -280
563 -280 -142 -51 96 -9 -157 201 196 98 -196 -275 -97 -218 -75 -34 136 -121 80 194 -4 11 107 -76 -125
586 -125 16 -71 -127 -234 -355 96 111 -66 27 331 -8 -57 20 -1 184 -58 16 -279 -57 -311 -45 59 121
609 121 -44 -106 55 124 -5 -240 -249 -126 -25 14 -83 -30 123 -59 -154 32 149 11 -82 -90 43 23 -22 23 -36
634 -36 122 59 -66 -327 91 312 274 118 -24 -121 240 -24 -75 88 152 -260 -233 -23 -233 -185 466 112 309
657 309 338 148 -236 -34 82 -174 -226 4 -24 -250 70 312 30 72 -37 -56 -10 242 -104 -145 -117 35 -219
680 -219 -13 -171 -72 98 173 -98 -105 52 89 -412 -73 43 -60 -4 5 -184 158 44 -231 -7 -6 -147 48 193
704A93j17J60q6k62j75L55r8q9K38J34l34K41p8n08N57m08L29J7j01K38M4l18
726f8k24J81j28J19J76k47J82k25O08m93L85k94j79r0L07o3J30l25K58J11j63
747d2o7O5L8p9K05j70J94k44L08l68K43j9l42R2J32o2Q2p3j97K02J44J56l29O4
771f7Q5J30k10L14k32k4m3K1%j75L25j81j4j53M73k52J37l87K65K55o32L52J72
794A59j26k56K32M6k17K35p5J42k57J09J49l50J80jj5J87q1N8k28J21r9K58q3
817H8Q4l52m7K44J88l56L95j3K2P1k04l31j57J39J82o4L28m13K66nk04J81k49
840b07J79PJ77k45K73l62%O4J06J4J87m22J2L02O6k28K79j19j49J43K9r9n4k10
864b57K30n9l5K21k04r9J56J11j50L3N3j92L33N7m27J73R7J16m7J19k81j68Q0
$$ plain form
704 193 76 236 150 -112 -287 68 -30 -119 119 253 -81 160 82 -426 131 -277 52 69 -32 206 250 -68
726 -68 -292 -111 -239 -120 56 -191 -9 -234 374 -119 266 -28 -207 -297 10 -53 77 -248 10 121 -42
747 -42 -109 -44 -6 -85 120 -50 144 -100 208 -160 83 64 -278 -186 -54 -116 -34 -107 -304 -102 42 198 -131 -67
771 -67 18 148 -62 252 20 -4 -47 -26 -26 -201 124 -57 -71 -224 249 -3 134 -253 12 267 -365 -13 159
794 159 33 -223 9 55 -162 73 -2 140 -117 -8 141 -209 -29 -30 -45 142 61 119 -109 12 -87 171 88
817 88 172 -180 -227 17 205 -151 244 231 253 324 120 -211 -368 -229 -47 -111 217 -196 70 65 -139 42 -207
840 -207 -28 -21 156 -89 184 -178 -178 -114 -8 6 193 -229 -217 85 151 -77 202 83 -66 77 106 7 -47 -257
864 -257 -27 -86 -121 100 -104 -203 -47 64 -86 -53 0 -192 141 198 -229 -56 41 157 110 229 -52 -220 -140
887a40n6J45J8j05p0L35r6J00o3L4j02P6J17j06j02l73L77J53j48p6k90J68K68
910F4J85o7j39M01n06NK61rk32M7j80L9J54J5p0k65O9J99J89k67K63l1k92L43
934A76k82L5L31j40m32K54J22j31j15L37j46LJ46p4nl9Q3l2j46P7J6m4n3j87K82
959C6p3J31l0K05j95N1k92K19L9j50L4J32j20r8R4j79K79q1j32k3K45m8k2j7J33
984A38k58J40k51N09k45j58J47l1J63k86n9M23j89Lq9L27l48P6q4j02K33R2j39
1007A2RK21m09j06K13L44j71j86N5L03l56Q6j40K73k98J39N0k15K12l7K03k21
1029a9J25j48J6o2K31j73J96Q9k31j93J4J92l8J45r2n0l1j0J19J0r4Lk26L50l30
1054b07K9q3M0M27k29J82j39q3J24J8l73L82J0lK26m14P7l7j96pK05K70k85Q4
$$ plain form
887 -140 -196 -51 -33 -138 -208 127 31 131 68 102 0 76 193 87 -15 -388 -11 142 -6 -82 -372 -204 64
910 64 249 182 43 444 -62 -57 204 195 -37 10 -170 -131 23 38 -32 -297 -228 -29 160 -107 156 125 -167 176
934 176 -106 -71 260 120 -312 -58 64 -67 -182 155 9 12 158 84 79 40 123 91 -55 22 38 -6 -59 -246 36
959 36 -37 94 64 269 74 125 -167 52 91 -59 -25 107 -13 -111 -17 -196 83 2 -130 -153 92 44 22 5 138
984 138 -120 20 -231 278 33 -125 22 -9 154 -132 -191 232 43 46 -43 284 -64 12 -72 -174 59 151 12
1007 12 21 242 -167 -273 -60 284 113 -73 -18 285 -71 15 -125 148 -150 -11 39 -176 36 -1 202 -19
1029 -19 106 -42 -26 -88 143 -30 166 255 24 -169 -155 37 -1 144 52 2 -29 -39 80 90 -4 -1 -227 123 -207
1054 -207 -178 -261 -221 206 -23 159 20 -63 61 79 -294 88 98 95 321 -93 -16 -53 -249 -256 -51 219 -66 18
1078A8k9L86m2n10qK89j14J75N0l31k38N65m7k95R4J55j07K07m8j52J56m75K16
1101h5j16J59K85l47K68j92j56L52k7j23K25l41o5J06j28N24nm03Q3L0l61M46
1123A29l4j21O6k28k55N08l15mN04k67l8J10j77L12j96P1j33M7J75j58k8q0Rk10
1147c13M06K42l05n6l9j07Q5K55k99j11K54j41l42N85k10M3o1M18r8j96R4j32
1169b8J8q4K05J05J8l61L40j85k54L65n2k14O1L5o8j45K29O6l4m8p8L50l48J32
1193B5J5n0J03k01L58p4n5J4J05l67J94k04r5K34N5j67L35k30K40m19J45J52k93
1216a80J76Nj5M1O8j69J35j11j01K52j57K8n4K51l80L36J3P9J16j72k63Q3j36
1239a55M7J22J08l54J77M0l02J59J76m19K09K32K28j87j06M14l28l4l0R4K44n01
$$ plain form
1078 18 -11 375 333 -177 -185 104 -10 165 215 -116 -354 211 164 -131 -37 118 11 218 170 18 174 -301 -85
1101 -85 -201 -42 243 -104 164 -28 -184 168 141 18 243 -98 -163 -57 -185 339 334 -69 14 44 -317 129
1123 129 95 -26 40 -188 -443 65 -250 -254 250 -17 -55 55 -122 190 -6 65 -68 -21 154 -4 -32 -112 -103 -313
1147 -313 93 335 30 -26 -65 -172 -87 168 -131 -242 12 -129 -471 114 -96 -53 -114 304 206 10 104 -28
1169 -28 -10 -94 111 216 234 -127 213 28 -226 139 87 -127 -66 -31 -99 -244 -15 51 17 -31 -109 241 -107 25
1193 25 40 -10 93 -108 250 176 121 135 240 -127 67 -137 -232 2 57 -110 225 -5 235 -184 -39 113 -180
1216 -180 -4 1 -14 27 95 -74 61 -50 -151 101 -56 -28 -82 169 -211 125 138 217 333 161 -102 -19 -155
1239 -155 -108 14 122 -232 -55 -15 -317 -158 18 -401 -192 40 268 81 -25 389 61 27 -3 91 335 -166
1261a66K51K6J9k96K65Ooj81j42M12k42K79k23L3j72K51k71K34l8j88K74k50L91
1284B66l76M3J22j17j51J32K88l49J85M1J26r2J3k34J29j08m9L1K33j66ok8j63
1307b30J7J48nP2k49N1J95pj00J98qj95K2N7r7J13K29k27k53L19K26k70j09L68
1331B65j83O2k89M8r7MK20r6J97l65L1K4L76j16j37K49r3k75K08o9P5K22l20j89
1355b48K71Pk28J69R0Ll32K43r9K71M2o6l6k35J80r7n8P2o6M5o0K30k56K0L25
1380A87m96K16K05J42o6k57J79m6N7l42K13l15M02J38k98J10K5j35K28j95K47
1401A99j43j39J47p1L5r3j37K60j03N8Q1LP7k6M3n4j97O5K37l10J88k94M83j68
1425A41l07J95J71n6k04J62l21j08L28J32k3K07k82J54l69j6K14j33K88N6r9j43
$$ plain form
1261 -166 85 111 130 -166 99 105 99 -82 -224 188 -54 225 2 35 -137 114 -157 77 39 -149 125 -125 266
1284 266 -110 -67 55 -62 -213 -81 207 -142 43 84 210 118 131 -103 26 -82 -131 -100 133 -33 -39 -67 -230
1307 -230 -213 -65 -70 2 -247 -196 -1 -8 -108 90 82 -113 -91 -34 -131 -18 211 -16 -269 50 276 6 -103 265
1331 265 82 144 -145 -97 -194 -190 30 -66 131 -234 -203 -179 197 81 -56 193 100 -175 33 -36 39 261 -59 -248
1355 -248 23 30 -198 -29 61 64 -268 -25 -124 147 189 123 87 -148 32 -65 -123 -51 -117 -72 -132 98 -158 -138 187
1380 187 -309 -93 112 254 188 -69 110 64 121 -221 -8 -323 79 217 -81 29 54 -81 147 -48 199
1401 199 56 -83 64 -7 28 -65 -202 58 -45 13 94 97 174 148 191 137 -60 5 242 -68 120 -174 309 141
1425 141 -166 29 200 144 -60 102 -219 -327 1 133 110 317 35 189 -180 -196 18 -115 173 229 130 -13
1447a3L34j90j13k48r7K63K09l24L14j97J11j2j34K45k97K46Kj5M1J70l08j19
1469a32K42k92L0N8K2j13L47j61J87m15J72M9Q7j46K06ok3j6j46QJ08k81L30j2
1493A03j44j94M12q2n5n4K49P1m37J59J7m3o0M2j80K07J5k5l70M32J3m31M39k9
1517E5j08J58p2J42j73Q2j81K26J7P9l95Q6L13k40j13N0J62rj50J37k8L6K38n94
1541b82K65j04J92Q1J12m12K77l83K84K33l2r1j41K32k29R0j52J84l60J49R1j04
1563a00K38l61L24k14P4n3K01k50N7J48J80k10r3n6j05L12j09n4j43L01r5J89
1585A81l73L35j75K07n41N37j17o3j44k1j46M78K0p9J95k76J07j2L2k16K30l58
1607a99J35J87r8k64M13k94R6J13j83P0L13k00R8K2r4J58n3o7j26j18Q0K48l59
$$ plain form
1447 -13 321 131 18 -230 -327 -64 145 -179 135 -62 49 37 -97 148 -149 97 99 84 125 295 -13 -132
1469 -132 110 -182 -152 -94 -72 -185 162 1 188 -227 -55 -6 81 -65 141 135 112 96 -50 -42 66 -215 115 103
1493 103 -41 -235 177 95 40 -14 235 306 -131 28 45 2 -58 -16 -196 11 26 1 -369 63 76 -355 84 55
1517 55 -53 105 33 175 2 84 -97 129 146 225 -170 -84 229 -11 -124 -74 88 79 -71 66 38 74 312 -282
1541 -282 -17 -121 71 152 264 -148 129 -254 30 263 231 140 -1 231 2 92 -60 124 -236 -87 4 -100
1563 -100 138 -223 101 -113 -39 -92 109 -141 -84 64 244 34 -59 -115 -220 92 -17 -71 -214 87 -8 181
1585 181 -192 143 -32 175 -366 171 54 -9 -153 -174 -320 158 178 99 294 18 125 113 145 -71 159 -199
1607 -199 -64 123 25 -239 174 -120 -24 89 -94 -24 289 89 187 209 115 273 220 153 27 -91 -11 237 -122
1630a22K37j75%M2K12j15k6K24L2k43k01J39J44j82L6Q8j28N6j66K10Q3l14L60
1653A91l49J47j9QM3j21J73n7J15j28M1o6K08j15k53L10r0o3j58K75l24m5J22
1676a55K95L7l99J47R6J78j32J08m82L28O5j26kN7m06L95O4J7k12J96K51k17k61
1699a58L1K3J94j55q0J92J93l61J62n4PL98o60K58j44J01n3K79j70K10j08r4q9
1722g8j46O43o41J88k20M20j76J01m9n5R3J4J10j07j07L30k87l90M07O2k28K23
1744A07k87k1L43k21J14r4K7L4k3j69k16J58L92L2j26K05l80J54j09n1K4M2O8
1767CR9J8k8r3j20J82j87J2M20m10J30J79k78K05o2l53K75R6o9j47L57j81q7P9
1791D0o9Q4k1R3k20J01j42k50M30Kk88L67j82k18J44M8j06J33K07l26R9L42l66
$$ plain form
1630 -122 115 -60 -60 -18 194 79 53 277 309 66 -135 4 148 -34 2 90 -38 18 -148 62 145 -169 191
1653 191 -158 -11 -30 -22 21 -100 73 16 131 3 44 -22 186 71 -182 128 38 -25 -183 92 -232 -277 -155
1676 -155 140 177 -222 -75 21 199 67 175 -307 21 86 -40 -42 15 -391 4 68 85 -127 69 320 103 -158
1699 -158 -127 -104 90 -65 -145 47 240 -121 41 -13 -6 392 -268 -10 -154 -53 -106 173 3 213 105 11 -78
1722 -78 -224 419 -222 -34 -254 166 -10 91 42 -13 80 94 204 97 -10 320 33 -357 50 112 -116 107
1744 107 -180 -201 142 -79 35 -59 -32 2 -21 -190 -406 -248 144 176 50 255 -125 29 -80 -131 -107 -65 3
1767 3 102 120 92 -1 -121 61 -126 -114 306 -104 26 205 -73 132 70 -283 -8 88 19 -128 229 48 -39 40
1791 40 -29 55 34 127 -93 8 -134 -384 46 48 -240 127 -55 -273 -129 -81 -187 -54 153 -173 -74 268 -98
1814i8K00Q7j82O8O8P6l34J94J56l10r2K30l48J64J6J28P8j90O3n2o3J26k90J10
1838a95L25J46l73L69j73k25Nj58p9M92J26j87K97l17J28j49j73LJ2M30j63k96
1860a55q5L03j30j23J89k83K23J15j41K1L2j51M51l50K6K2K02j72k0Nm5M39l36
1883C7L2j27Q6o6O7L41m92L19k31L48k97k40J00n6J34J09l00P3J78r5K91k74K95
1906B32m5l56l4K04k62M25n39N94j99Q4k47m0L9k2L10P5m08O7Nj9K22nm80N44
1930A45j34j85J62O6j28L8R9K5J60j26j52R5j33L81l56M5L9K6j4j50K66k07J80
1953A42J47l40M1K37m86K00L45l36k8L45k58J64J02l23L3k88M41k65J67q9j24
1974a73M07j98K20k25q1j3L07p9n5m14O92l41j69l8K2K65j88P8J14k40r0J32K0
$$ plain form
1814 -98 102 189 7 75 143 219 -115 79 235 -75 -167 63 -285 -121 -105 23 101 -89 -26 -78 -141 -15 -305 -195
1838 -195 130 276 -97 272 99 -126 -121 -279 -358 134 260 73 370 53 181 32 -141 -138 -126 304 141 -155
1860 -155 -240 63 -67 -190 -1 -284 -61 54 -87 -66 -34 -185 266 -84 -58 -36 166 -6 -26 -21 -66 373 37
1883 37 69 -58 28 -38 29 370 -122 197 -34 314 17 -223 -123 -179 -45 64 -236 -163 15 -80 211 -63 232
1906 232 187 -169 -203 1 -261 164 -375 219 20 104 -143 -183 -144 -166 144 219 -189 -122 -117 -136 86 81 -399 145
1930 145 11 -174 -12 54 -74 -36 63 88 248 122 -30 65 -68 313 -43 2 41 67 53 -97 169 -38 142
1953 142 289 -51 -10 227 -259 -59 286 -50 -78 267 9 173 275 -48 -15 -303 138 -127 40 -49 -173
1974 -173 234 36 256 31 -50 -63 244 165 110 -304 388 47 -122 -160 -138 127 -61 17 131 -109 -199 -67 -47
1997d7k3J73J56k74J38k66o2K63l19L8R0j8o7M77l64K98j30J75j51k11K38l34
2019b20L93j63M1m9j7J18J9j26j77J17L12k62J46j22O3m56L85k48L79o4j93J30
2041Fk13L27J25l17L22m08J82m8k73L86j31L12l58L45K1j14k84L75m26K32o1J
2063Aj81Q5K71kj19L9L1j6k21L19j96J41R2l82K10k3J00j73j19j41O9K45o9j38
2087a77J9q2Q3L25l15K24k08p9j29K33J1L84k84l48K28n5j6K15J41l16L20k65
2109i1J46l75j11K21J71N2M5j76o0J95n0J88m0j28j5R5O7l83J18J34J16J7l20
2132a84K95k84r5J02J2J83p7j79K61J12l3J38l62p6J03j99L26r2k2p4J8R6J90
2155A59J30l38N3J7L9m72K95r8K97J13j17J92l02j01K12j24Q0j5k1J31j98J3r0
$$ plain form
1997 -47 -70 103 259 -15 123 -143 -205 58 -261 -223 -133 -151 -218 259 -105 193 63 238 87 -124 114 -220
2019 -220 173 10 51 2 -15 103 122 -4 -181 -64 248 -14 132 10 73 -383 2 -246 133 69 -124 6
2041 6 -207 120 245 -72 250 -158 24 -24 -297 89 -42 270 -88 257 278 164 -120 255 -171 61 0 1
2063 1 -180 -95 176 174 55 94 125 109 -112 207 11 152 244 -138 72 49 149 -24 -143 -284 -215 30 -39 -177
2087 -177 -158 -240 -157 168 -147 77 -131 -210 -339 -106 -95 289 5 -343 -115 -170 -186 29 170 -146 174 -91
2109 -91 55 -320 -431 -210 -39 13 58 -118 -178 17 -33 155 115 -13 -28 67 134 -249 -131 3 119 136 -184
2132 -184 111 -173 -268 -166 -154 29 -48 -227 34 146 113 251 -111 -187 -84 -283 43 -49 -71 -145 -127 -31 159
2155 159 289 -49 4 21 60 -412 -117 -215 82 195 78 270 -32 -133 79 -45 35 20 -1 130 -68 -55 -145
2178a45N5m1R0j07n7M52l10Q2o0Mk41M51k32Q1P5J26k15q2P8j28J00LN6QK9j58
2204h6k0Q7r1K86l41P7m4l0J34j33K95l06L61m67M60j86L26o7r7o4J00o5j67J07
2228F9k98J22p4K92p2k31J55J47l16J75n9qK95j34j59L28K2j52j8Q3j05j99L20
2251A83j89K68l41J47n5k68L19O0j29J41q0j56K2j29K57m2j44N09l33L18k84j37
2273f3L8K7n7P0P7k1mj44l35M93n7p7K09r9Q2j50K00j29r0r1J92R1k10Pj01K00
2299E8k28J6L6j89K62J02m4J19j62J19m9J7J52k38j8Q8j06l13L78k9j85J29j33
2322b18N34n40j67N44l67N45k67Q4k66K01k6o2K61n87K95J25Q3N8k98J65q2j67
2344a52Q9Kj72J17j50J96J1n3J05K01q8j12N0K3j72L48m59J76N7j72K48k49R4
$$ plain form
2178 -145 -90 -131 -41 -148 -205 247 -63 19 -41 -37 -278 173 -59 22 97 223 8 -74 4 -124 -24 -21 35 43 72 -86
2204 -86 -106 -19 -110 176 -165 -88 -132 -162 -28 -161 134 -172 189 -278 182 -4 322 255 158 94 194 129 -38 69
2228 69 -229 -107 -181 111 39 -192 -37 110 -206 -31 -90 -98 197 63 -96 232 254 102 84 167 62 -137 183
2251 183 -6 262 -79 68 13 -255 64 124 -5 136 56 -100 -78 -207 50 8 -136 373 40 358 74 -63
2273 -63 -25 2 -55 15 92 71 67 -77 -412 81 24 -53 156 57 139 -11 189 60 -30 -121 71 162 -48 -41 -142 58
2299 58 -170 -154 -118 -307 -45 57 13 132 -30 89 40 57 209 -29 -47 41 -65 -378 0 -29 -214 -85 -218
2322 -218 316 -224 -391 153 -214 331 64 148 -118 83 57 -5 256 -331 -36 89 172 230 -68 97 15 -152
2344 -152 -63 -61 -233 -116 -266 -70 -59 -112 -7 194 106 -6 44 67 -105 243 -216 -40 17 -155 93 -156 -62
2367f2Mn6J79J3M3l82K99j20RK31k44k3L11l24K32k13J86kr7J04K7j0k90R8O0
2392b7r1j9K36N9k75Q1Q9j3l69L31R3k4r8nK39J65l26J70j51l0K6q4j32M06k98
2417d7J34P0J17k28L5j25jRr3J03j83O0L69j63M2R4j83mJ19J97l14kq7l9o9L15
2443A26j08KO4n1j55J22K73j0k62j27K77j46k17N56m59K69k71NqP1J40k04R1r3
2467a15L7J70N9l70J36K68K72l08j25o7k41L30M1j60Q8j57J10k53M15J24J1l68
2489a03r0N4K89j17JJ59oj04p5j50J85L9j67J54J81k79p5J45j79J33j71j24J69
2512a31K94j65j7j6k43L71O2j19J14r0j37K40m7j24j7r9O4N5J64o4K33m03j22
2535a97J44K83k80K8k6p8P3O2R3o4p7Q2J98qj37q1P9J01m8J38l33r5L56j28k24
$$ plain form
2367 -62 -58 -114 65 78 121 -261 38 -82 -73 158 -86 -109 202 -122 110 -103 83 81 -16 88 115 105 -185 -87 -27
2392 -27 -118 -137 99 158 -117 -36 53 40 -329 2 95 71 -27 -32 207 372 46 216 65 35 61 -23 -155 251 -47
2417 -47 87 157 274 46 81 -44 -45 -36 -129 -26 -209 -149 220 57 99 193 10 6 125 322 8 6 -81 -120 -189 126
2443 126 18 20 84 33 -122 0 273 263 1 -126 151 5 -212 344 -115 154 -117 -112 -120 -49 91 -113 -22 -115
2467 -115 -78 92 151 -219 -83 185 457 149 24 -43 -284 46 87 -73 15 -142 -32 -285 130 254 265 -103
2489 -103 -193 -139 150 33 34 193 187 83 8 -142 43 82 -85 69 250 -29 -104 41 -138 -5 -176 -300 -131
2512 -131 163 -2 -19 -35 -278 93 155 36 150 60 -77 163 116 -8 -25 -124 -60 -5 159 95 328 -75 -197
2535 -197 -53 230 -50 -22 -48 -126 -53 9 102 38 -39 43 241 233 96 15 94 195 147 285 -48 -143 213 85 -139
2560a39K50k06o8J14m9L3J5j99L84m84M78k88R6J20j33N4k0P0P1j02J02p0o6J8
2584a9j90J04K79k18J85m10M14J38k93J81k32j35J71M41m92J59q4q1M22j25k70
2605e5k2j85K60q8L1K16P1k28J20k65J65j49L76j56l20M06l05j74L65J29k05r9
2627a12J99J5K4j69Q0j28J09K32j55j63pL8Nj35M05o2J43l40KLJ1n6J46p3j34
2652a22J12%N7Q8J7l30J66j53R8r6N2J93o7o3P0j09J3N4K67m55N75n87K42k89
2676b67K11J57k32K33k22K85kk40L00m41j58M42K55j05j59o3J43j85R8K02l03
2697e1J17l00R6K61j75j08L73j65j9p6L79j84N9k99Q2K67k37o6J30O7j66O2kJ5
2721F0L9K66k64j10K24m5m8p5K05m74L79m22K01J40M4j60K01l7j67k60O66o5k71
$$ plain form
2560 -139 111 -95 -163 -49 -98 -65 -50 -249 135 -349 129 -159 -63 57 -76 -22 -42 28 99 -3 99 29 -37 -19
2584 -19 -209 -105 174 -44 141 -269 145 283 -10 171 -61 -196 -25 416 -76 83 -1 -82 340 215 -55
2605 -55 -77 -262 -2 -90 -59 157 228 0 120 -145 20 -129 247 91 -229 177 -128 -302 63 192 -13 -112
2627 -112 87 102 126 -43 37 -91 18 250 95 -68 -75 -37 -32 -167 238 176 319 -21 -19 -16 -5 -61 85 12 -122
2652 -122 -10 -10 47 135 152 -178 -12 -165 -67 -163 -111 82 15 -48 22 -87 -74 -20 247 -208 367 -220 22 -267
2676 -267 -56 101 -131 102 -120 165 163 -77 223 -218 -376 66 321 216 57 -6 137 -48 50 252 -51
2697 -51 66 -234 -138 123 -52 -160 213 48 29 -47 332 148 207 -92 -10 257 20 -46 84 151 -15 47 45 60
2721 60 99 365 101 -9 215 170 122 47 252 -222 157 -265 -64 76 120 -40 161 124 -43 -303 363 298 27
2744B7L6m9J37m72M32J16j95QJ4K47l00P8K23j10Lm12J62J23j54K72k32o0K05
2767I9o0P6k33K54r8J02Q2k35K01M5j55O3n18L49K53j06j1q9l11L34j31M4m9K2
2791g2j7M31k18k4j96p4J16J35J35k66j59K63k34J98j50J41j00J90j7l64M29l14
2813a67M26l38K41n0j51k58O6L01r5J27l79K56J13k25K6N7j68K76K54m36n2L31
2835A55l99K76M6j02N0R0j62J04J8p5Q8P8k41j04n1J50J30j89L06Qj11Q6M2k05
2859a2J15j39QKJ61j66k9k26r2N70m10L01m50N25k40J16q2l8R6O0J26l46J27J53
2883A30o6l33J31j6K10P4l1J06n09N51j88kM6k30K02Op8k42M06l44K48j13o7L23
2907B14k15j51K02M2k9j68J25J42O6j46j5n9j08M66m87O4K7K86l22r8N2M1K60
$$ plain form
2744 27 63 14 151 -321 111 227 32 40 54 301 1 79 302 192 195 -217 -55 68 -86 186 -46 -106 99
2767 99 39 115 -118 136 38 140 222 -13 188 233 78 141 -377 -28 225 119 108 19 -292 42 -89 -45 -94 -72
2791 -72 -89 342 124 100 -96 -170 -54 81 216 -50 -209 54 -180 18 -132 9 -91 99 82 -282 147 -167
2813 -167 259 -79 162 112 -39 -297 -231 70 -25 102 -277 -21 92 -133 -107 -50 -218 58 312 -124 -176 155
2835 155 -244 32 78 -24 26 116 -46 58 76 1 89 167 -74 -178 -229 -79 51 -138 168 176 65 151 193 -12
2859 -12 103 -36 -28 -26 135 -31 -60 -286 -378 192 -218 83 -367 158 -82 34 -48 -86 10 70 196 -150 -23 130
2883 130 64 -269 -138 -154 56 130 99 205 -304 247 59 57 103 -127 75 81 3 -239 167 -177 71 -42 -109 214
2907 214 -1 -152 50 92 63 -105 20 162 228 82 67 8 -100 366 -121 -57 -30 256 -66 -164 -112 -71 189
2930A89j22l50M31j00k7K04k48k05J66j17J96P8J14l05J71k6j96J46J97k74p2
2951a50N4L5K21j81j14M4J69J82k06k57K22rK8l19L26j59jJ62M5p5L0j11M1k69
2975b92L36k3J02j77J22m0l1m0n6j45L18j27M5P9M1p7J28k25M54m79J38k27M94
2998C18m46J39n2n7Q8r2M5K65r0j14J42k02K23j08l2j74K7J98j41J05l31J72j33
3021b50L23J7p7m5J27r2M3K1j59K1L8j4R9p9j51j99N12k26J35L0n6p8L14k9kk67
3047d4J2m1J71k05J15q2K22k50K48R3n32L85l49K31j97K85K65k22j0k16Q1j5j56
3070b11L54j81J00l38K52P0N7l13K63r6k35L37n6j02j3J44lJ4k21O8M13l47j90
3093b34M07j33q3N0k32l5L26k17L63k5k02k4o1J70r6J47k60n1N7j64K47M4J32
$$ plain form
2930 189 67 -283 148 48 21 225 -23 -228 -62 -179 17 95 209 -96 75 49 -147 -1 196 -78 -150
2951 -150 -96 -61 160 -21 -135 -91 78 260 54 -203 19 10 38 -281 45 -114 -115 47 92 17 47 -64 -23 -292
2975 -292 44 21 123 -54 68 28 -3 -43 -99 -244 74 -53 -8 71 112 35 163 -62 392 -87 51 -176 318
2998 318 -128 11 -41 -98 -10 -102 -57 208 118 4 146 -56 167 59 27 -147 -120 78 -63 42 -289 -117 -250
3021 -250 73 90 13 -32 95 3 46 67 -92 -71 -33 -47 52 -27 -178 -377 135 -91 44 74 18 -60 254 225 223 -44
3047 -44 -32 -73 98 -107 8 -74 148 -102 146 239 -293 92 -257 -26 -223 62 327 105 95 -121 -40 -55 -211
3070 -211 143 -38 62 -276 -24 46 103 -210 53 -43 -278 59 3 -99 -112 32 29 43 -178 -110 303 -44 -234
3093 -234 173 40 -43 7 -225 -260 66 -151 212 187 -15 -39 -100 70 -26 121 -139 -190 -133 -297 -50 -6 126
3116A26k88K02M04k93j9J32m36J2O4J61j29J32J27j24j62K33r7j56J36j02l5k2
3138a34J93p1O9j6L43j8k67k22K88r9N8k9j84mK52k38k6j80J22J66k99K71j60
3161a85O5N1k8J35j15P7Q5j61M6j31L08k42j34K96K78n69J79K20j90J72Nj16k17
3184a71L59j38j09R2R2J36j56j57n9j64L52R3k79L9J78J10m79M1L53j73O9J5L5
3207G9q5R6J55l20RJ25j27J02J06k44L27k66J0J78m5Q8l11m5J80k7M4j07J40p1
3231ir9J08J47k07J55l87M87N0m38M45m81J31J95mn5J56R4J7m55J66m6KJ1P7j87
3256a27L12J55n10L3LJ64K8J76j02j41j14J56k37M08P9m10K39l14J99p9k64K51
3278i5J8J60j1j01j29k9l4K60L0k59M26l37pmr0J00j35L74q5l9L39o65O57m95
$$ plain form
3116 126 -162 40 444 151 132 264 -172 -160 -96 65 -64 68 195 71 -91 142 45 -111 25 -77 -112 -134
3138 -134 59 -12 57 41 384 366 99 -123 165 66 124 95 -89 -93 159 -79 -105 -285 -163 3 -296 -25 -185
3161 -185 -120 -69 -97 38 -77 0 85 -76 -30 -161 147 -95 -229 67 345 -224 -45 175 -15 157 162 46 -171
3184 -171 188 50 -59 33 125 261 105 -52 -111 -275 77 170 -109 -70 108 218 -261 -220 133 -40 29 44 79
3207 79 -6 90 245 -75 -66 59 -68 34 140 -104 223 -43 -33 145 100 188 -123 -168 12 -15 29 -78 62 -9
3231 -9 -108 0 147 -60 95 -292 195 245 -193 252 -229 -98 97 93 38 194 288 305 -150 16 -30 -28 -17 60 -127
3256 -127 185 340 -170 -137 -134 30 58 234 132 -9 -123 33 -204 204 283 -127 112 -202 -3 -82 -346 -95
3278 -95 -77 83 72 -29 -158 -187 -221 39 69 -190 236 -101 -108 -112 -202 -102 -237 137 52 13 352 -313 344 -151
3302a51j25N68l49J24J23m09K62k44m1M18pm02K63P0j11J38mj04j02J6J26L6l9
3325E6j57j0J9K05k16K04p4J20j14k1R0N6k67J87j29l3K12l37K05ol00M2K80r2
3349h0j72K79n9j46L3K39k85K19Ll33L11J15n6l1l47L11l07L58p0j94J34l9J07
3372a0j37o7K07J41j44r5J61J22k68l11K10P4K92m36M20o6l15K51O3j64NO7N4
3395E4j16k84K16K54O3M9l44L48k92k30L54J46Kk46l3J33N5l98K96k33R9o9J68
3418hpm4j51L00p3Kl9j3o4lL74j02J36m00N4J31l66J53K27j34j67Q1J54K77k23
3443I5l49J44J02K4qj9J80m97M73j12J53k6l10J95q7j5K58j13k13J03K31k45n7
3466i3K36j96L23m15P9j55J61p8K33J93k02j15j79J29j9j40j6L33j12p8j5j11
$$ plain form
3302 -151 -276 292 -57 67 190 -219 43 -201 -242 176 169 -233 30 100 -11 127 123 19 -83 -67 59 95 56
3325 56 -101 -111 -92 113 -103 101 27 147 33 12 102 158 -109 78 -51 -84 128 -209 -4 -10 -310 -268 12 -80
3349 -80 -252 27 -32 -178 -145 94 -191 28 31 -302 9 124 68 37 -310 1 -306 52 -18 -212 -78 -117 -10
3372 -10 -147 -214 -7 134 -10 -105 56 178 -90 -401 -191 -117 175 -261 159 93 -222 29 92 -72 -67 0 54
3395 54 -62 -346 -130 124 187 236 -108 240 -52 -282 72 218 220 -26 -59 74 129 -269 27 -206 -107 -176 -8
3418 -8 -15 -59 -210 90 17 19 -20 -33 -97 -100 274 172 308 -92 -38 93 -273 -120 107 -27 -194 -113 41 318 95
3443 95 -254 -110 -8 16 8 -11 169 -328 145 33 186 160 -150 45 -42 -57 201 88 -125 -22 209 -36 -93
3466 -93 143 -53 270 -145 -66 -221 -60 -138 95 288 86 -29 -208 -79 -98 -238 -254 79 -33 -111 -126 -237
3488b37o8L24o7j03J1J29j5O7QR1j46J78j83o0M38k80p7k53J28P1p0P7l99N54
3512A18k36J19L26k06k61M57k38k26K03k2M5M9m4j59J10K51k09nk09M03l32L5
3534c1P5r3K39Oj53j39m1j30P8J45j58J93rK87l52j39K27M5K12k70j79L16j77
3557d8Q3q8J79j51k18M41l09J71k11Q8k7J61l37L60ml98M48n8j38J34k12J49M4
3580E9L07l23j22m9O6LJ03K8O4k08J61k56j71M66j63J40l49L21N1k72L49k68J53
3603I0l35M06r6m11L47R1Rj0j70J51J12p0k63J61j34K92k67J02K25k3k25M0J39
3626A61K68p35N48j93j67J43O1r9k87j13K73j35j39J93K02K4k52K30K4m4o4J97
3648I6L8n5l60L79j36j57n3K06l18J17J59Q9J56k70kP7r4p1L63j11k36J55j84
$$ plain form
3488 -237 -305 19 -48 -151 -140 -11 -26 41 49 140 -6 172 -11 -71 367 87 10 -243 -115 -44 -114 -37 -436 118
3512 118 -118 1 327 121 -140 317 79 -147 56 34 79 128 84 -75 35 286 77 72 -137 266 -66 -31
3534 -31 44 -49 190 196 43 -96 -137 -267 -189 -44 -202 -9 -18 269 -83 -222 5 50 262 -8 -187 129 -48
3557 -48 35 -53 126 -25 -243 198 -111 60 -151 -63 -90 71 -266 94 90 -308 140 82 -56 78 -134 15 59
3580 59 366 43 -79 -128 -62 -59 44 72 136 -72 89 -167 -338 128 -35 105 -244 77 128 -144 205 -63 90
3603 90 -245 161 65 -346 1 92 101 91 -79 72 184 114 -149 12 -122 170 -97 5 230 207 -18 22 161
3626 161 429 -306 242 49 -118 25 86 -13 -300 -413 -140 -275 -414 -221 -19 5 -247 -17 7 -37 -101 96
3648 96 134 79 -281 98 -38 -195 -248 -42 -360 -243 -84 5 161 -109 -111 -34 -128 -199 164 53 -183 -28 -212
3671b12K64K34o28M79M8k44M3M3J88k74J36M0J64j36k29K4j18K02N1O6k25qK16
3694A24o1P7p4J3o7j08j28L64k4j89K27k64J38M5k66K15o8M8J34m35L20mn4o7
3718a04P7R5K7k17K78Jj41k42K64j57L07l01LnK5Q9Q8n29K54J49Rk17K57o5k22
3743b77K68J24j43L25l87oM32l36J77R3k17j16j22L87k68J81kk23L82m57j5J68
3765c2j58R3J04J5J43j52j82J42J62q2l39p8M26k05K61k05J83l63Q8M00j04M2
3787A59p4J56m85K08L29m58K22k51J05J94j89OK98l87K48l13M71j68K6j46j0j34
3809a93K6L86j86J58k58M5J33m4k07K26j60j4K56M4o3R1k8l60K33j23k05L60K8
3832A45M8m35K72L4q2j78O8O5J54j31J79l38J61J31l50J22J76Q6j68j56K22m2
$$ plain form
3671 -212 52 286 -342 137 185 -59 -16 27 215 -59 77 117 281 145 -84 -60 -178 24 75 141 -84 -92 124
3694 124 63 140 66 79 12 -96 -224 140 116 -73 154 -110 28 73 -193 22 -46 2 136 -299 21 17 -37 -104
3718 -104 -27 68 95 -122 156 157 16 -226 38 -119 188 -113 -110 -115 -90 -1 87 -442 -188 -39 -30 -247 10 -55 -277
3743 -277 -9 115 -28 297 -90 -96 336 0 177 270 53 -63 -185 202 -66 115 113 -110 272 -185 -200 -32
3765 -32 -190 -97 7 22 165 13 -169 -27 135 53 -286 -364 62 -143 118 -87 96 -267 -179 221 117 159
3787 159 85 241 -244 -36 293 -165 57 -194 -89 105 -84 -78 220 -167 81 -232 239 71 97 -49 -59 -193
3809 -193 -167 219 33 191 -67 -22 111 67 -140 86 -74 -88 168 212 149 240 212 -148 85 -38 -243 117 145
3832 145 193 -242 30 64 -18 -196 -128 -63 91 -40 139 -199 -38 93 -257 -135 41 127 -41 -197 25 -17
3854a7P0k7n7L8j75J80K0l05K82K02m59L11N9J31k76J1q2R4K7j01j76L21P5l50
3878b04N25l52n5L8p7J88J01q7q6o1J79R6j53K2k24Q7L71m80K40j39k42K49Q4
3901B0J73J08k04j67Jl1J09q8k4j32L37J07j94K7q8J20j59K15j17j1K32k37J1
3924Hj45M6r0K26Q5j85p8k24M05j74j2K07P2o5n7K04k1j78k54L80l59L65k82J71
3948D5j88J97k28K89j33k40K25l2qR0l17M39k06M1O0k17J65l8J53R5k27O6k57
3971b26Q5J51k73J86l10N19l90m0L14N1j64J80q4J27J1j40J7n4J1O9J0J40j18
3994G2j18J52j44M1P8L10o50K57nK04J0k62J47k63M87n69L34J65k75J61j82L67
4016C17k54j17K95p4N2r7r3j98KP3j9p3j44N24n8q6j8r3k50L01K0o2J02j17o0
$$ plain form
3854 -17 53 26 -31 7 -168 12 32 -273 9 211 -248 63 122 253 -23 -12 -94 0 27 -74 -250 71 146 -204
3878 -204 321 -31 -86 -48 -125 63 164 77 -9 -70 109 205 52 74 -150 -63 308 -172 68 -71 -313 -64 20
3901 20 193 301 97 -70 -69 -100 9 -79 -103 -235 102 209 15 42 -46 74 -85 130 13 2 234 -3 8
3924 8 -137 -91 -181 45 130 -55 -133 -357 48 -126 -138 69 141 76 19 223 202 24 -230 150 -209 156 -126 45
3948 45 -143 54 -174 115 -18 -258 -33 -65 -73 17 -300 139 -67 -26 34 -183 -18 -56 97 192 -35 31 -226
3971 -226 -141 10 -263 -77 -387 132 -258 -298 16 67 -97 83 -1 126 137 -3 14 -40 -29 40 50 190 72
3994 72 -46 106 -38 3 81 391 -259 -2 -7 197 207 -55 92 -171 316 -253 81 246 -29 132 -50 317
4016 317 63 -54 241 167 219 122 29 -169 -167 -94 -113 -186 -330 194 136 50 32 -61 -311 -10 10 -52 50 -67 -127
4041a27J15L0K2JL3k6j21L21mm29K83k49r6K69r1L2R2J71n43N8P7K78Q7m37M79
4066B25l82O24l79J63j60j68J17j28M37m62k7k16L14J72J35k75l58Q28l94o8O2
4087F0k79R5P5M3j76M26k68q7K70j21J01r5l08N80M9q5k62m1J25l70J82J47p2
4110a1J13j74R3q8L28k73J76J5j34k22R2K27j59l43M31J0q2J26qj16n4J53jk35
4134a36K34K01m53K28n6n8j58K22pK3j67MK1q4N2K12K27k43p4P8M4N9p8l5k38
4159a82N7J74k39K74k26n5J52j00J76l96N27L2k08R1k30L2K02j22M9M9k6J91l50
4182a28J58J8q4R3j21K74j86j37J44j07L7L5l43N18l00%K32J9J21n9N8j02l8J7
4206A19j50l5L16k57l2K35k63j22lL38J9k37M8O4q9L7L56p47R4RK06L6N6j54N76
$$ plain form
4041 -127 -12 18 40 41 74 48 -73 248 244 -185 98 -151 -247 22 -69 -37 55 226 -317 -259 -182 96 183 -254 225
4066 225 -157 467 88 251 91 -77 40 -88 349 -113 -140 -356 -42 130 265 -10 -368 460 66 -2 60
4087 60 -219 -124 -49 -6 -182 244 -24 -111 159 38 139 44 -264 316 365 280 18 -23 102 -268 -86 61 -11
4110 -11 102 -72 21 -67 261 -12 164 179 45 -177 -85 142 -17 -360 71 81 -1 125 117 1 -53 100 99 -136
4134 -136 98 299 -154 74 18 -40 -198 24 17 40 -127 -123 -102 -186 -134 78 305 62 -12 66 110 169 91 56 -182
4159 -182 -125 49 -190 84 -142 -197 -45 -145 31 -365 162 194 -14 77 -153 -121 81 -41 8 57 31 222 -128
4182 -128 30 48 -36 57 -64 210 24 -113 31 -76 -39 -4 -347 171 -129 -129 103 122 243 184 242 140 102 119
4206 119 -31 -66 250 -7 -39 196 -67 -189 -192 146 165 -72 -24 40 -49 -12 344 -403 -309 -300 -94 -58 -2 -156 420
4231D20k30k26K5Q8o8J41j85K12j89n9R3J45mk03j29L15k95J92N1j79p4K77Mn9
4255F3m08K19r3M5L17k69J55j04o4J68N0j86O2j49J19K55l57J13K0L33l88k61
4277c60K57R8n8J71k79o0L28j84J21j84N4M6K60rj35r6J13o3q3Jm0O9O1l32M14
4302A10K1k10N5N8q0k7j84L86j88o6J66K87n82M30k34N1J06l60K99L6j63K82j85
4325HK80k39N4j6j34K81k19m0J33L2j10m8Q6K08m01K66k2k11K95k66K37l40M6
4348a20J04J42k50q8L93J1j06k69J49J27k38J49P3j84K4j97K28j22q7L87Jj9N7
4371A65k49n7J99j02J10P6l0p8k04k8K39J78k3j95J73j25J41j04J45k29j21J22
4393Cl77K61J56J9j81m9K3J82J40j62K9j8J14k17q7K49j1j14k03n0O8O07l51L4
$$ plain form
4231 420 190 -36 -11 77 9 150 -35 177 -12 -71 22 167 163 -40 -169 146 -149 43 94 -85 -159 118 122 63
4255 63 -345 -126 -219 -174 143 -126 29 -75 -139 29 79 -107 -45 -194 -75 180 -177 -64 -44 289 -99 -360
4277 -360 -103 -5 -63 108 -171 -231 97 -87 34 -150 -96 -50 210 201 66 -30 83 20 -63 -62 -102 -33 28 -304 110
4302 110 131 -79 -24 34 -46 -73 -257 129 -59 -125 41 328 -254 176 -58 -7 99 -261 38 74 -89 193 8
4325 8 288 49 103 87 -47 234 15 -25 108 140 30 -18 68 276 -125 141 119 -92 203 -63 174 -166 -120
4348 -120 -16 126 -124 -212 181 192 86 -183 -34 93 -145 4 77 -107 -83 -280 -52 -174 -261 126 127 108 165
4371 165 -84 -141 58 -44 66 142 112 34 -170 -198 41 219 196 1 174 49 190 86 231 2 -119 3
4393 3 -374 -113 43 62 -119 -168 -145 37 177 15 44 26 140 -77 -164 85 74 -40 -243 -293 -225 382 31 65
4417F5K09m76k0M48l52N94o02j55M66l25J63P1K38n54R6J16J74j10k38K15L8j82
4439a21K99l66L23P3m36L12j0j15k43L67J07p1n4J21l63J25K01k49L63k45O7j7
4461F8j02J90j27l26J86j51K90J89m88M61k24o7L14m30J83L48j55l88M29k50J79
4482A29K08l35L8J14j65j05K03j90K31k60K59j46J63j30J20O7m47M21j10j3j60
4503a08L72m25L50J38k50j20jK17k61K51m36M3K74O8j12P2j25J16j56K1l9j23
4525b34J39jm1K47j59M4k2J48k73J20K43k28J38j56J87k01R3j77J89k71L5J52
4547b8j31L59r6K9j31m8O8k6K1q8J45l62J66J27j55J87r1J72m02J25L11k52L13
4570B13n03J78p3K56R0j58J53j90K07j96J25l09K67J51k76o2J96K00l31K58j43
$$ plain form
4417 65 274 -202 -222 226 -126 468 -134 -289 177 -148 15 86 324 -230 -134 -18 156 46 -192 23 61 -121
4439 -121 178 -188 135 208 -228 84 74 -41 -284 83 190 119 65 186 -177 -52 149 -100 263 18 85 68
4461 68 -34 156 29 -297 -111 -262 28 217 -271 190 -34 -101 213 -217 -34 314 159 -229 200 -50 129
4482 129 337 2 40 154 -11 -116 87 -103 128 -132 127 -19 144 14 134 201 -246 175 65 52 -108
4503 -108 264 -161 189 327 77 -43 -44 173 -88 163 -273 -230 44 112 0 72 -53 63 -93 -72 -111 -234
4525 -234 -95 -96 -137 110 -49 -5 -27 121 -152 -32 211 -17 121 -35 152 -49 44 -133 56 -215 -180 -28
4547 -28 -159 200 104 133 2 -46 22 -4 17 -71 74 -288 -122 5 -150 37 -54 118 -284 -159 152 -100 213
4570 213 -290 -112 -185 71 161 3 156 -34 173 -23 102 -207 60 211 -65 -127 69 269 -62 196 53
4591E3n8l7j51P8l34M08K69j06l62K36l6J25J63j41j59J73p3q9J81l38K88j46
4613e6R4j0J44k82k01L78j03J20j04n9R2k61K40K41l24J07J06N8j1k36r3n1L0
4636a81n8L38J20k74K06k6k39J71k82L10k44K91r1K6j50K08R8j68J11m28L26m7
4658A7o2J10o0m0j04K64k81K37j98J61l84L63Q7J9j86j37J49l8K66l63L11rk0
4681A02p7j15J79MR0j48L5M3J2j31j55L42m33K71J15m08L62J15k12J8J18k05l5
4704a13J11P2n8k54j71N47j04P4j19m8PJ65J12l88J46J61j80k93J7L2J58N0M0
4727c6K08n18L09n1p6K24N4k85K04K3K0m00J60K61Nj40Q0j62m4L94m14J92j46
4750a38q0N3K91p7j62m6J86J1J8r5Q7R0j30j89J62j99M22l03k5P9J48k63J07R6
$$ plain form
4591 53 -5 -42 -193 -115 -449 -41 228 122 -240 -4 -40 85 248 107 -52 121 48 -41 140 -198 90 -56
4613 -56 38 28 172 -110 -311 67 -36 84 -20 -79 13 -248 -8 233 -91 16 122 180 169 -67 -160 -211 -181
4636 -181 -239 99 219 -55 151 125 -114 57 -225 85 -159 132 41 67 -83 125 223 55 166 -262 64 17
4658 17 -45 65 5 -35 -139 125 -156 81 -117 44 -340 23 110 129 -57 -194 -45 -83 183 -180 131 122 102
4681 102 25 -90 89 93 183 35 70 113 125 -6 -161 181 -252 19 134 -274 88 203 -9 9 127 -78 -113
4704 -113 -2 70 12 -242 -413 134 30 104 -15 -63 -56 109 221 -167 -21 140 -40 -333 -316 -284 -126 -76 -36
4727 -36 172 -346 -37 -88 -164 60 114 -171 33 56 76 -324 -164 97 102 -38 42 -120 -164 230 -184 8 -138
4750 -138 -218 -165 126 49 -113 -159 27 38 56 -39 48 138 8 -181 -19 -218 204 -99 -124 -45 103 -160 -53 43
4774D3k5K37J11o23K67k86M19k07J04k29p5K40o6K56Nj81K04l51L39L2k26J28
4796A16lj71q9J5K92j33j32J33k61K62k9j63Q0R4k43N87k65j52k0J61l32M66l91
4819a78J2J26L1j93OJ11L10k68J59n02J25L35p0n9J53j60l7O9j42K24m3k12L77
4842A74k49l37N44qRj49K1r0Qm9K89k02Q1J31l90Q4J04Q1j54j37R2P0j85M69j61
4867D6J55p3j75M8Q3j06J07r3j44J76j34K38j96j9J45l20K47O0n8K26j88n5p2
4890a02J74j73r5K14j2J36k19R5o5j16K91K15k18j94M7j65K06J29k76j70M19P1
4912A92k38rJ4K8K25j56K30o48K91l0O6j76K13m43K65K13j39L11l38K62l31O6
4934a32P7m3J4K3J44k08K91j56j55q3K36K2J4j6j16o4K61P8j0j02j67J93k6j31
$$ plain form
4774 43 18 255 366 -257 10 -276 143 -64 40 -189 -264 -24 -90 166 171 -10 194 -157 182 214 -12 116
4796 116 113 -58 -147 -132 160 27 -105 28 -233 29 0 -163 -83 11 -232 355 90 -62 -82 79 -253 213 -178
4819 -178 -166 -40 -9 -202 -196 -85 225 -43 116 -386 -261 74 4 -55 98 -62 -99 -30 -172 52 9 -203 174
4842 174 -75 -412 132 124 133 -16 5 -85 -77 -126 163 -39 42 173 -217 -133 -29 52 -102 -239 -147 -77 -262 207 46
4867 46 201 128 -47 1 84 -22 85 -8 -152 24 -110 128 -68 -87 58 -262 -15 45 -13 213 25 -30 -102
4890 -102 72 -101 -196 18 6 142 -77 18 -47 -163 128 343 125 -69 -22 -187 19 148 -128 -298 121 192
4912 192 -46 -55 -41 -13 212 56 286 -362 -71 -101 -35 -211 2 -441 -176 37 -102 209 -129 133 -198 -132
4934 -132 -55 -98 -84 -61 83 -125 166 10 -145 -228 8 30 44 28 -88 -152 109 187 177 75 -92 101 75 -56
4958e6j79M04r5Q7j64j41M2J01mJj12K17j83J29q1J05RL7m31N86j59j54J22K6
4982A07Q3l4r0j82N1J36j88l3M17n88L88k74K35k07L65k09J65J39n00L13n4k17
5004a77K3K42k50P5k75K07k2K5J51n1M24k99j38P3j26p3K39Ol46M25m6k78J87
5027dk47J02J23O5j8j79m4K31j47M9k52L12k73L36j48J63R1p2N6P2j10l16J87
5050b3m7R4J07l33K70k86M0K61j38J89j25N1k01M31n06J16j32L12L50n04J10J36
5072A72j73K20j74k17l0L08K89j09n51M48j35j78J39JL4j96R8lP3j8L34j29l68
5095a65L26J52l42q9Q2r9J12P8k35J86J4q4J07N6mj16J58k51M7n9o2O1p6L67k54
5120i0J03p9j57R2j10K02j54L35j84M3L53l36J94j44J40pj62rk69K86k7Q4j91
$$ plain form
4958 -56 -235 169 74 161 -3 -144 -102 -1 -5 -4 -116 101 -82 47 -34 71 80 117 -314 272 113 -41 81 107
4982 107 190 156 66 -116 -65 71 -117 -150 267 -321 67 -207 28 -179 186 -23 142 281 -219 94 40 -177
5004 -177 -154 88 -162 -87 -362 -155 -177 -152 -1 -52 372 73 -65 8 -118 -191 48 54 -292 133 87 -191 -4
5027 -4 -251 -149 -26 39 21 -158 -202 29 -118 -69 -321 -9 -282 54 -94 69 160 88 144 216 106 -210 -23
5050 -23 -70 24 131 -202 68 -218 -178 83 -55 134 9 60 -141 290 -216 -100 -232 80 430 -74 36 172
5072 172 -1 219 45 -172 -202 106 395 286 -265 183 48 -130 9 10 44 -152 -54 -57 16 -2 332 203 -165
5095 -165 161 313 -29 -118 -36 -135 -23 55 -180 6 20 -64 43 99 95 -21 137 -114 -67 -126 -188 -127 -203 164 -90
5120 -90 13 -66 -223 -131 -241 -39 -193 142 -42 1 354 18 212 68 208 201 39 30 -239 47 20 104 -87
5143h7k77L39M73k68j86J83n0L6l43K89m58K36J18J77k47P2L09j67q8j19P7J82
5165B01j47k73P5L70n4k77J31J25Q0j80j75J07L7M5l01L31k42p0L04nJ6K19m61
5188a44L10k67n3J74n4J64qj06j36K37J8j10J24n96P19l56j16O2L82l71j4j30
5210b71L36o9n1l0L8k6J47o7k1J47j21N2nm4j05r2m8oJ08K27j76K33J35l56N0
5235a5J28N9m23R6J78j97N53o03L28J09l78lL7n9k7K78qm3m4O7nO5k77K41K3j08
5261b8K29l62J58J23k13P1j01J17p3L2l1K77m0j68l3o7J64p4m8k31L06k65M54
5284A97j2j69J68j63K25kk02rj12J23kqL28l84k8K51r0j13K45Q8m01J01Q0l7O1
5309A35k00Rp0J89k74J58J86k9l3kK18l68o9J01j08J56p5j91M38l6k02K21l86
$$ plain form
5143 -87 -364 -25 448 180 -6 177 127 163 -180 109 -349 -113 5 182 -65 7 316 149 61 -58 19 201
5165 201 54 -219 -144 226 172 -105 26 151 231 51 -124 -17 20 65 -236 95 -147 -217 87 82 98 317 -144
5188 -144 166 -101 -154 20 -34 130 122 16 -120 117 135 25 149 -447 272 -84 -200 -138 244 -127 -141 -271
5210 -271 65 -4 -55 -85 -47 -73 74 7 -14 133 12 64 59 15 -90 -182 -230 -236 -128 99 -77 156 291 -65 -15
5235 -15 113 172 -251 -155 23 -174 379 -224 104 213 -165 -168 -131 -190 -217 61 53 10 -34 33 28 93 -184 57 80 -28
5261 -28 201 -161 -3 120 -93 -22 -123 -6 -79 -47 -78 199 159 -9 -42 -109 55 -19 -67 -298 8 -257 197
5284 197 185 16 184 21 246 244 42 33 -79 44 42 34 362 -22 -50 201 111 -2 243 331 -70 31 111 74 135
5309 135 -65 -56 -126 63 -211 -53 133 104 71 69 287 -81 -150 -49 -157 -1 -76 -267 171 135 -67 154 -232
5332b32K85r4J34qn9k9J27j60J13j6p3r9l1j35L01j56j3M2M7K0J86l7%Mj94pK22
5359A38J49k46R4k71L54k14J63j90O7j08L4r5J01Oj24K45n7J67m4J30k87L1j81
5382a38k39O32l11M16n29J0O1N0j87K50k86L01J03n47N50l41J69K3K9j16K49k18
5404f9jK0r7L20l45K26O0k0K1P5m5o7k06P1Lm8K6r1K69j05J94j45k09K39k04L33
5430B05r6J5m8O0j56OJ9j93o3N6k9J23J95k29Q9J93k48J44k12J15M3J9k19j62
5454c73K43J68R9j12K6k42J4j41M22nJ6k07L31r7Rj41oJ9k6n7O7j53M59k3m14
5479a24K20q2l49L44Q1J38k33k54N99l82j8J58J9J36r4l97K79j0j40K52j39N1
5501E5k29j03k0K64J80j72p4L53l94K3M01j10j52j4n2r1K4J91J98k98R5J97m20
$$ plain form
5332 -232 53 -41 93 85 26 -3 124 -36 77 61 -12 -111 -142 -277 24 -132 -145 -103 -56 -36 150 113 113 117 -77 -84 138
5359 138 287 41 135 -136 218 4 167 -23 44 -64 -30 -125 -24 -18 -142 103 46 213 169 299 12 43 -138
5382 -138 -377 255 -56 360 -169 -159 -98 -48 -235 15 -271 30 133 -414 136 -205 -36 -13 16 -100 149 -69
5404 -69 -70 -50 -147 173 -172 54 114 94 115 190 145 78 -128 -57 -54 -102 -76 -167 102 -3 191 46 -163 76 -128 205
5430 205 109 124 76 136 -20 -14 5 -188 -251 -195 -224 -101 94 -135 -46 147 -101 43 -169 -54 -11 8 -211 -373
5454 -373 -130 38 137 25 51 -191 -177 -318 104 99 115 -92 239 142 151 10 4 23 -3 -60 7 -146 313 290 -124
5479 -124 96 14 -335 9 90 228 -5 -259 340 -42 -60 98 117 253 159 -238 41 31 -109 143 4 55
5501 55 -174 -277 -297 -33 147 -25 -99 254 -140 -117 284 174 22 8 -44 -135 -111 80 278 -20 75 272 -148
5524a48n1l0R0K04j32M19k59K34o18M07j85J15k51L26j03j41J01j31r8J84J46
5545G9k1n8j49J31o6M10n29J33l0O2k5P2j40l2J79q2N0J74k29k17K18P6K77k70
5569A3L4n0P1j04K22o5j04O6K3K0n1k81M97k87K02k30L49j17R1n37K41l14N49
5592B38j69J84K0n48L28J44l6k71j03m5M66l56J58O8k42K66P3k78q7J31K1J00
5614F2j92K18p9q8O0J99m55K22K10k16J19m41K46L62j20k48J10J75N7m50J07L1
5636a11J11L7mK77m20R3j14%J41J11k27LK9M7J31O5O7j42L5L3j79rj58J99O5K20
5662C00l68mN6k20L87n9j96J40R4N8k77j36L93k36k7M43k27J70l13K18l11J16
5684AK96j45j75j8J10k5j62j8K83J2j94K2Q8j83P2k28M55k40k9K36M7j33l2o9
$$ plain form
5524 -148 -199 -229 -139 65 -67 352 93 327 -291 116 -69 46 -205 121 18 -123 -22 -153 -251 -67 79
5545 79 58 0 -149 -18 -84 326 -203 -70 -100 -38 -63 9 -131 -163 16 -66 -16 158 -71 -288 -70 6 283 13
5569 13 47 -3 68 -36 186 121 17 83 106 126 75 -206 291 4 206 -24 325 208 299 -238 3 -311 238
5592 238 69 253 273 -275 53 197 161 -110 -213 -258 208 -148 10 78 -164 102 175 -103 -190 -59 -38 62
5614 62 -130 88 9 -79 -19 180 -275 -53 157 -59 60 -381 -135 227 107 -141 -31 144 201 -249 -142 -111
5636 -111 0 37 33 310 -110 -17 -131 -131 10 121 -106 -103 -74 -27 104 169 236 94 129 162 -17 -26 -184 15 80 300
5662 300 -68 -72 -16 -236 151 92 -104 36 130 188 -89 -225 168 -68 -95 348 121 291 -22 196 -115 1
5684 1 297 152 -23 -41 69 44 -118 -136 147 159 -35 -13 75 -108 -36 -264 191 -49 -78 158 205 72 40 -29
5708b9m9J03J47m68K31n6M36k96n1m3j37J59j52L73n2k99Q2L40P1j92%j75K05
5731A48l42K35J59l23L86l67K3j58K47Mj20J10J5J40pk11J89J76m46L68l15L48
5753B59k57j23j25J34K99k74l4J64ok95M01j01M8J60k8j59jQ0j76Kr6K68k38J48
5777E0Q1j25p4J65n2j13L13j01rLj34q9J94j86k30N10k82o4J54J98m77K87K22
5800B41q5o2j22n5j9L25j29O3k40J48k00K55j9L2r5J63k14Q1R6m02K70J27k29
5823g0K22k63J29o1q7J47l7J16k68N4M09m0l58Q7l8J19M0l42K78r7o8NP9j43k8
5848b15N12l07k46K38O9q6m6j22Q0J74L0r5J1M5p3J33L8j11o9j22J07%J81j40
5872a4L3J13q4R5K35n17JL6o3l5k6N2K43k23k9Q6j1K2J0K05j51oq5N8Q9l42K47
$$ plain form
5708 -29 -78 25 172 -296 -65 -121 315 19 -32 -75 -212 -53 -205 168 116 -183 -101 239 310 118 118 -57 148
5731 148 -194 41 200 -123 263 -104 -81 -239 8 12 -108 2 17 157 150 -61 128 304 -142 226 -89 259
5753 259 2 -121 -246 -112 187 -87 -121 43 37 -258 143 42 90 250 222 63 62 142 -34 -32 -128 140 -98 50
5777 50 131 6 -68 97 45 -68 245 144 135 138 4 -85 109 -77 -307 203 -79 -143 11 209 -268 19 241
5800 241 156 94 -28 -83 -102 223 94 157 -83 65 -135 120 101 133 38 201 -13 68 164 -238 32 159 -70
5823 -70 152 -111 18 -43 -130 17 -20 96 -172 -118 291 251 -107 -20 -58 61 101 -241 37 -60 -128 -123 -44 -187 -215
5848 -215 297 -10 -256 -18 51 -35 -81 -203 -123 51 81 -14 -3 42 -31 102 140 29 -40 -162 -55 -55 126 -14
5872 -14 19 132 48 143 378 -139 -138 -102 -165 -200 -226 -174 69 -154 -183 -97 -108 -86 -76 129 -22 -28 -113 -55 34 -308 -61
5899f1K78k70O8m10M89j62O6l2q6K08m15J44N3n2K22J59j8l38L28m4j39q9J92
5922I1j27j8L9k74M44k50L2O9j46J82j61L32q8l38N38j52K0r5l75L22O2k26J86
5945F7r1K16l46j33Q05k75k51Q0r6j71J57k23R3K56k09K41M5k06LL5j6qJ9J47
5969A39k29J90n2m68N44j15j44K49j37J26L0ql62K75ok90M1J79J26m2j81j51L58
5992G2K7J26m14L28j82l7j33M14j79J04K9n4j88QJ61j18j77K80j16q2K71o6K05
6015B79n06J52J10k11k2J73j81J47J46k43N4m8J32pJ21k43K31qj40J17r6K27l06
6038a22M9j7K04m60L80L8nn4N1k71R6J31j39K01k53J61J14%k15j45M86l07j24
6061b01K47J81l18q3K85q3k60J25J74J7Qkk21lK73l93L09lj12K18l03L89m01l7
$$ plain form
5899 -61 217 -53 15 -395 94 -68 -2 -34 -120 88 -327 -183 -130 -182 40 199 181 -157 171 127 -12 -101 91
5922 91 -36 -54 -15 -289 155 -95 -63 6 -140 42 -119 213 125 -213 325 173 193 98 -277 45 107 -119 67
5945 67 -24 192 -154 -287 518 243 -8 72 -24 -195 -38 -261 -168 88 -121 120 165 -41 -38 -3 -19 -27 -8 139
5969 139 -90 100 48 -420 124 9 -135 114 -23 103 133 125 -237 38 32 -258 -217 -38 88 46 -135 -286 72
5992 72 99 225 -189 139 -43 -80 -213 201 22 126 155 101 -87 -79 82 -36 -213 67 -49 -131 140 74 279
6015 279 -227 -75 35 -176 -198 -25 -206 -59 87 -156 -102 -150 -18 -25 96 -147 84 76 -64 53 -43 184 -122
6038 -122 -73 -90 114 -346 34 72 67 13 64 -207 -111 20 -119 82 -171 -10 104 104 -111 -256 230 -77 -201
6061 -201 46 227 -91 -174 111 28 -232 -107 67 84 92 90 -131 -134 139 -254 55 52 -60 158 -145 244 -157 -194
6085a94O1J71J28q9k12J2Q6j09J60j62Q3M84m31J70l22j10N18k58J88p1J4j74
6107e7j18K89J9l86M98l1k02J37J0j69J15k3n7m1P5j77M6J20o1N9K31k02k24J61
6131A2j89n8L00m2J7Kj66r3K51KQ2l75M27k90M2O7m8J4j61J03Q0P8j4j11J85j33
6157a8mJ7K58l21K11j42J54k61J42Q6j55r6nK64j14j33j91M82r9j48J34k47K21
6180C5Kj73K14j83J06J31k08k4k46O37k22m21O00k56q1M0j42k4K60r1J35Rj43
6203d5o9L36m57K52R1k58K53p8J2m1j12R3K25k17J50Pj67K4K60m68L24j41J19
6226I3k0l38j14N04j45k23L66o8j00K43r9r6P6o0r7K41o6n35M96k5R3j15j50J89
6250E0p1q8Q3q0L05l66J81j62J95L7J04j7m37J87J13p7R9j31J10K59M6l57O4l23
$$ plain form
6085 -194 -133 38 166 77 -135 -123 -37 -146 14 -148 -65 419 -12 158 -164 -274 244 -14 174 103 117 -57
6107 -57 -175 114 133 -253 245 214 12 149 159 -10 105 82 25 -16 59 -118 -72 48 -13 46 277 75 -149 12
6131 12 -177 -235 65 23 40 42 -124 -217 34 36 118 -257 170 -120 -78 -11 -59 -45 -206 -103 -23 55 41 -70 115 -18
6157 -18 -22 -5 253 -68 143 1 155 -106 36 122 -33 -129 -134 130 16 -117 -308 174 75 -73 61 -186 35
6180 35 37 -136 78 -105 1 132 -76 -100 -346 291 69 -352 248 -8 -89 -49 -191 -215 45 -46 89 98 -45
6203 -45 -114 222 -235 17 108 -150 103 25 37 -4 -116 -23 202 -15 135 142 -25 -1 259 -209 115 -26 93
6226 93 73 -265 -379 125 -20 -243 123 55 -45 198 99 3 79 19 -78 163 97 -438 58 33 126 11 -139 50
6250 50 -21 -109 -26 -106 199 -167 14 -148 47 84 188 171 -266 -79 34 -43 56 -75 35 294 340 -17 47 -276
6274b76K25J43J2j52J57n6j31j9J30op9J97j6K6M1r1k78j00L05j15j45L24j50
6297e4K3R3Q8r5P1j11L2l4R3j64J09k15M00n48K59j09J05K3K5n0j31L30o6j74
6321a00J65l5j78M91m75L75m25J37k9J83o3k65J42o8m2L84K51o41M50ll43J02
6343A3O2k48K10k63N28n10J62J41O8j30k83L00r0J30L9j03K59l95Q4M1R6j5N4
6366A50k17j04J75j56j56Q8J84p3N6M7k2N3J73J00m91J38L04k83O4j33L51l35
6388h7J05J6Q0j00q7J03q0J10M1k87O2K44lj82q0K03l31K4N90k99J45l34L56r9
6412A10l3k27L54l33J64K1L7k93K77k39j25N71j88n7k88J19N6K61k79K47N2J03
6434C10k21p7j37N98m51J06j35j22l7o4L27k04j0K78j57N6j78L89j58p4J10k90
$$ plain form
6274 -276 -51 92 104 -48 109 53 -78 -97 33 27 -52 145 129 155 196 105 -173 -273 32 -83 -228 96 -54
6297 -54 -31 62 150 55 126 15 47 13 106 -58 51 -164 236 -312 -53 -162 -57 -34 -9 -59 -190 140 74 -100
6321 -100 65 30 -148 343 -132 243 -182 -45 -74 109 46 -219 -77 -145 -187 197 448 -193 257 254 -89 13
6343 13 75 -173 37 -226 302 -208 -46 95 163 33 -250 50 -40 90 129 26 285 -110 -26 15 111 96 150
6366 150 -67 -171 4 -152 -308 -220 -36 -109 -53 -6 -28 25 198 298 -193 -55 249 -34 30 -103 248 -87
6388 -87 18 34 114 14 -73 30 -50 60 101 -186 -124 120 117 -65 -145 58 -273 -249 341 42 187 -147 209 110
6412 110 77 -150 204 -129 35 56 93 -200 77 -162 -287 284 96 39 -249 -130 -74 187 -92 155 207 310
6434 310 89 12 -125 473 22 128 -7 -129 -166 -230 97 -107 -117 161 4 60 -118 271 113 39 149 -141
6456a41K56lp1L5O3j58R7m0k46L03j23J60l29Q5L77l77J77j02R0K1j35K18j65
6479hj74m5K67O5n1L5k92L87o2j83K45j73P0j2l28L00k10K01m6K56k08l17N14
6502B31k48k02Q2m7R6j35M38r5j40m6k17L68k6j76L10j85q2k40O38l85K44m11
6524b28Q7J88q7J12j34J25n7O3q9J24m3j75K3K26l02J69nm1L47j58r1J52k09L55
6548C52l11P4J54l37J35r2J43j80K17l30M64k72l6o1Q9p9J79m2j16j70Q8K12L29
6571D10n06K85j80K7k30K66k35K53j47K7j58J90J57j85K43k89K5k26K28L1k6j4
6593e4L16o02M61P4j94j20L30m87M33l04K35j06j64O4q3L95k29l8L40k08j54O3
6615c2l13M10m54L98j61RJ17j94j3L15k26p1M71m15L45j18ml19L47O5k40L47k99
$$ plain form
6456 -141 115 112 41 76 139 -19 78 38 -208 95 -28 132 -197 -112 265 -112 65 -37 53 74 -61 157 -8
6479 -8 -182 -227 40 105 54 89 -203 184 122 -61 184 11 81 69 -259 41 -169 32 -14 242 34 -283 231
6502 231 -17 -219 -137 -184 -88 -223 215 120 -20 -66 -283 85 59 -117 193 8 -74 -314 324 -61 183 -228
6524 -228 -141 47 -40 72 -62 63 6 69 -20 104 61 -114 -91 135 -167 2 -3 -44 303 145 54 206 -3 352
6548 352 41 115 269 -68 67 -25 118 -62 155 -175 289 17 -19 -80 9 -70 109 67 -49 -219 -131 81 410
6571 410 -96 189 9 36 -194 72 -163 90 -57 -30 -188 2 159 -26 217 -72 -47 -273 -45 -14 -40 -54
6593 -54 262 -340 121 195 1 -119 211 -276 157 -147 88 -18 -182 -118 -201 194 -35 -73 267 59 -95 -32
6615 -32 -345 65 -389 9 -152 -143 -26 -220 -233 82 -144 -215 256 -159 186 68 64 -255 92 157 -83 264 -35
6638c5J57m48M69k36J22j02j74M31j64j19j14K66j63J04n2J38k11L39j83OP5r2
6660A4J84l38N3o7j74K54PM9P9j82J23k14J40p6J49J61n4k90J84j02l61N73p3
6683C9L13j49pk41R0p4K94l56J19j50O7Lj31k49L97N8L6j42P2On1K14r7q6P2j7
6709C0m1j61m3K29p2j14K09j08mM2q8K25k58K5K59R2m6J70n78OK65P0j62J1J50
6734A08j55P8K73l78N5J56N0l05R8O4J4k0J4R6j71k08J61j21J71k78L19l5n0K24
6758A60k0k07m8k47J52L11j96K84k96J24l15M89j95k39MM19l57L74l63J87l5M2
6780B8O7k96K23r9J31R8k78O9J41j99M15j89k51K6j2n1K02q1K62L1k06l29M22
6803A24j76J65J41m07L05l15O9m4J6J24J00QJ17k45j01K60l19K65j71O2p3K45
$$ plain form
6638 -35 122 -326 143 -93 29 -73 -247 184 20 -99 -213 53 -110 -6 -58 80 -131 208 25 31 106 14
6660 14 198 -140 -87 -154 -328 -74 -67 -18 61 -121 2 -212 -72 -148 1 162 108 -182 2 -100 -461 112 39
6683 39 352 203 196 -45 45 -29 265 -91 28 -122 -55 -52 -183 -432 -35 23 59 -83 -11 -5 -56 158 61 -25 47 30
6709 30 -11 -172 -215 14 -58 -172 37 -71 -75 -33 -121 104 -154 -129 130 222 176 346 -232 -226 39 109 -53 -42 108
6734 108 -47 31 304 -74 -19 137 187 -118 -20 44 58 38 52 148 -23 -231 -70 -191 -20 -298 21 -14 -64 160
6758 160 140 -67 -115 -362 -210 101 -95 189 -107 17 -298 191 -4 -243 -239 180 -177 197 -166 21 -14 28
6780 28 95 -201 22 -77 54 152 -126 -57 84 -115 300 111 -140 -114 -126 -177 25 -56 206 237 31 -298 124
6803 124 -52 113 254 -153 152 -163 -94 -138 -122 2 102 110 227 -18 -119 141 -178 87 -84 -22 -95 150
6825A50m99Q5q4K98K74m32j0J60K44k12KJ25K3l30O1JJ29K93j19l21L8R6K09l47
6849a66n1J95J27k82M75j96j64j70L27J28M1rk22J18k98L64j27l7m59M31q8N99
6871E36o42m4M38k14l55L82m7M8k99L53k13k0J3J57Q3j76j01J2L37m56J48p6J52
6894A6p2L9qJ17J1j41K10l24M78l38J47k40j1K02k12K81j65O1l20M20o5k04k6
6917a44K26RL1m6k55R9K74j22N3K69k80j82K5J70k3r0r3J25J50j01l6q0K48j14
6941A13j66j05o7J69R5j02N4q7N36k15J64m58J2J69j41J30k54K42j75J21j27n8
6963a50L06l8on9k3o8P2O0N3j98J4J7l02N74l61K77j19l92L63O6k22L7J66j71
6987a04J3M27l08K09k54m7Q3J39m0j87k90J99m8L6K55P5k62k11N04l9j86p5j03
$$ plain form
6825 150 -349 -264 -348 -50 224 -208 -218 -58 186 -26 -24 101 124 -206 -145 -144 -15 278 159 -162 -124 -28 181 -166
6849 -166 -217 -22 105 -177 298 102 -62 -232 95 223 264 255 33 151 -147 217 90 53 -406 25 -63 536
6871 536 -106 -150 288 74 -281 101 54 102 -197 156 -57 -77 -64 93 176 0 -101 -89 248 -208 -60 -136 16
6894 16 -56 -17 -25 92 103 -38 172 -152 326 -12 135 -105 -116 86 -126 155 -10 51 -269 151 86 -118 -144
6917 -144 82 91 122 76 -179 -80 194 72 125 394 114 -68 -43 127 104 14 -79 46 196 95 59 -21 227 113
6941 113 -53 -158 -225 -56 39 -63 -9 -96 440 225 389 -69 -57 112 -29 101 -153 89 -86 35 -92 -150
6963 -150 156 118 112 53 30 -38 34 94 147 -51 -37 -20 -322 252 -109 168 49 -343 20 86 -136 -99 67 -104
6987 -104 -91 336 28 237 -17 -64 19 158 118 -69 -359 -160 -208 -172 83 158 -104 -315 189 150 -36 -111 -214
7010b14J30m5L76l95J52O3r6K03k50J62j32q0K99k67K6j0N4q3J78l9J58j34k96
7033b40K11J48j4j49L5n0n4L42j23j16J90n7j25j48MMj66L76R1k25L7K04l28m3
7057a96L21j80N7l58O19n71L73j34l35M76j93J89m3J35p8j08K3k77K75l1J9k01
7079b18K34p5J08l15J47l09O18Kj85M4K0q7j70L12k80R5o9N2N5J90k67J02o2o7
7103a25J45J14O9p8m23L3L67j49N5l20K93o6k4j33K73j00J36J90l36K64k49K13
7125A49k57O4K83R8n83K25M48k50J47o39L17K61k30kK3J93j33j52N0r9R5K97p2
7148B33j41k9k17O2J49K81k39j34J5N8j15K67k90Kk2J58k52J53j33K15M15k38
7170A98j98j16J16K9J76j96O9N0j31J57K6k85r0K89k37L8J23Q5m03J96p4O1N1
$$ plain form
7010 -214 -84 -129 247 -148 4 67 -29 174 -76 86 -46 -126 173 -94 -68 -78 -24 -107 71 32 190 56 -240
7033 -240 -29 119 105 -44 -9 -59 -113 229 106 -10 180 123 -2 -150 -146 -142 -308 68 159 -66 -29 175 -153 -196
7057 -196 125 -55 2 -356 263 -308 65 -69 -404 72 -121 68 25 160 82 -26 -3 -280 -5 -36 -17 -218
7079 -218 16 -59 49 -266 -119 -428 190 192 7 51 71 -16 -186 126 -154 -59 -128 -76 -21 169 -98 4 -58 -125
7103 -125 20 134 203 125 -298 -265 102 -47 8 -312 -19 -85 -109 -242 31 -69 67 257 -79 185 -64 149
7125 149 -108 -44 239 337 -246 -21 427 177 324 -315 2 263 33 31 54 247 114 -38 12 -87 8 305 233
7148 233 92 63 -154 -92 57 338 99 -35 -20 38 -77 190 -100 -98 -120 38 -214 -61 -194 21 436 198
7170 198 0 -116 0 29 205 9 78 128 -3 154 180 -105 -195 94 -143 -105 18 103 -300 -104 -178 -117 -66
7193f6J47j45J78j61J01K3j85P4o4K71j23j78%K62j35L2K89l71Q7K5m0j64J84
7216D1j81J71J01o0j17n1K91k60J16j3Mn0J68k55P9j9K54R9m39L50j18j34J9N7
7240E3M3l69Q2J28J85k55j06M46n38J86K97j23j76K01j0j95K18j35J49o5j19K44
7262A41k49L11M4j78j26J09k28J46j06K41j78M4K90l51LK9k95L20R8l60K93J49
7284A47m5k61J12J10q1Nj15J61k43J36KQ6j8Lj69K33k5j33J73J77j65L1j13o3
7308e5K6q3L74j08j12p7r5R4R9k07J63J29j61q9J45J95k42o7J24n5k4j00K89j41
7332B2j28J88k49R9j60K38K9j90m0K5P9J80q7J15l9p7Mk14r1L03Jj28N7j75L69
7357A31l11P8J60k48J17j39L62r5L9j16J73j22J52m84M27l20L90k85R1k7j9M14
$$ plain form
7193 -66 81 -64 114 -47 54 77 -108 -34 -98 173 50 -128 -128 134 -1 31 320 -51 36 61 21 -143 41
7216 41 -140 31 132 72 -45 -96 195 -65 51 38 42 -8 160 -95 -16 -35 219 318 -121 229 111 -23 -4 53
7240 53 96 -273 -191 -63 122 -133 -239 207 -331 -145 152 29 -147 54 44 -151 67 -68 81 16 -103 141
7262 141 -108 203 247 69 -57 52 -176 -30 -136 105 -73 -29 261 -90 -87 -58 -353 -33 65 -295 -2 147
7284 147 102 -159 -47 63 -18 -13 -128 33 -210 -74 -72 14 -4 -1 -170 63 38 -95 78 255 90 121 8 -55
7308 -55 -29 -112 262 154 42 -35 -130 -36 63 -144 19 148 -13 -102 43 238 -4 -71 53 -2 -26 -126 163 22
7332 22 -106 82 -167 -68 -228 10 39 -151 -191 -166 -87 93 6 121 82 5 9 -205 -296 7 8 -120 -63 -238 131
7357 131 -180 -102 58 -190 -73 -212 150 55 94 -22 151 29 181 -303 124 -196 194 -91 0 -27 -46 368
7379C68l54q3M09l35l42M98j90j06k4J85j80L57k41L4J97m07N18l34j19L4L04
7400A89j68K85m34k3K94l40K79O7k55J6K05j40j57K06j18p5P4J46j6Q9m14M59
7422A69l30p1R5K34k36J3K36k44o3Q1K69j09M4q2j56J36k13K06J12Ml70L80l73
7445b68K08O5j11q5R6p5J30J59k77K2M1k5K4J36N0J41j96j07J66p5j39PJ08L5
7469C0j25J2O5j01kJ83P4m7q1j56nj18J32P5J93k77p0K79o3r2L03j50R7j30m3
7494a7k33N4J73n1L37m32O9M87l86K33j57k31R1J4R0j73K94k24Q3l0r8J93Q5j05
7518F6k74L04l2m2M5J51k98j0l9n1K29r9Q9o2j8K9l0K36k42K9J68n0k18K16N6
7543A53l78M20l09K45j79Q2J09j18L5j95J04N4N9q6l01J50k6K72j1j02L3Q3k7
$$ plain form
7379 368 14 -69 340 5 -337 161 -29 -135 -159 26 -154 203 -38 -4 193 -214 304 -30 -149 -115 189
7400 189 21 306 -128 -151 143 -197 82 149 -106 -90 115 -25 -182 24 -94 -169 -95 51 35 124 -290 169
7422 169 -161 -232 -137 97 -139 -126 110 -134 -197 -116 153 44 88 6 -150 -14 -227 -21 91 95 -275 105 -268
7445 -268 -60 5 -106 -191 -95 -170 -40 119 -158 -136 -95 -120 -96 40 90 231 35 -72 94 19 -120 -113 -5 30
7469 30 -95 -83 -18 -119 -121 62 136 89 8 -148 -153 -271 -139 -64 129 -148 -218 61 -2 -94 209 59 156 26 -17
7494 -17 -250 -196 -23 -74 263 -169 -100 387 1 234 77 -154 -63 -49 41 -132 162 -62 21 -9 -107 86 171 66
7518 66 -208 96 64 22 67 218 -80 -90 -129 -180 49 -50 39 -23 -41 -12 -42 194 -48 -19 149 99 -119 97 153
7543 153 -225 195 -114 131 -48 34 143 25 60 -135 -31 23 82 -4 -305 -155 -181 91 80 -22 11 94 67
7566F7R5r1M7j48l0P0j16K10k48L4j5K15k48j69P5j25M62j18m0q0j61K49L24l36
7590g7j8M9J03j71k34L33R5j62j4J20J03j53K75j55k10J75l80N57k23K37k44R8
7612A04j97K27q8k49J99J56k39J33J0l71L30M6o6l3Q1N9o7l8j07J32J65k00J43
7635A30m12K72o1rR8k67K23O4k6l19M20j52J18J99n14L19l36N16m06K18j85j18
7657b28M31j86L6K56k21J12j88k37J72L5k1l4J84K5k09j55K47J7K8m06M40N0l98
7680b50L39Qj86j79J94k1nJ61k46L27j93j48L42pk12J06M2Q6l86J32n3K18J8J97
7704B84q30O58j98R8o0m7m2K39J13m17L2L6K27k32K4l6J42o2L2k25K0J38K37k21
7728i0o1J24N2j41n2pK67Kq2j96j15M73k45J10l5J06m04J48J42M0q3Q1l43L31
$$ plain form
7566 67 162 71 118 -30 -60 10 -106 104 -144 -110 -125 90 -158 -327 -252 -377 85 -33 -73 -153 -314 -65 259 -77
7590 -77 -95 -46 57 -114 -348 -15 80 -82 -96 24 127 -26 249 94 -116 59 -321 236 13 250 6 104
7612 104 -93 134 46 -203 -4 152 -87 46 56 -315 15 61 -5 -38 43 102 35 -3 -110 22 187 -13 130
7635 130 -282 -10 -71 -80 18 -249 -26 38 12 -307 113 -39 79 278 -236 83 -253 263 -143 75 -110 -228
7657 -228 203 17 53 309 88 200 12 -225 -53 -18 -39 -73 111 136 -73 -228 19 36 64 -342 98 148 -250
7680 -250 89 97 -89 -268 -74 -95 -100 61 -185 142 -51 -199 143 136 -76 30 72 158 -228 -96 -149 69 87 284
7704 284 -546 112 -86 12 -48 -95 -137 102 215 -202 -170 -134 93 -139 -115 -151 -9 -71 -39 -264 -244 -106 131 -90
7728 -90 -151 -27 25 -116 -168 -175 92 94 12 -184 -299 174 -71 39 4 110 -294 -146 -4 36 -47 34 -309 22
7752B2Jk81K08j1J17j26n4J6K17j39R9PK8j12L3J16m5j02K51j79M94n77j21J39
7776AJ59j04J50k47M70k28m09K10j08J94l49L44j3J15j91J24k5l15K18j18M33
7797C11l04m9K16l10J86M0k68L26m31N77k38r1J15m3K3N7J8l27N9J0J70q2K44
7820B09l11J46J84j63q1N9M1M1o1k6K03l44Q4M6J41j58o7NM1p8Q3N1k24N33q2
7845B72r6j06k62L05j29K9N9l55M70l25r0K19lK21m41J40L90k57j78J46j5M7R0
7868A31J55m31J33J95k52L32k69j0lj96J60L83l55jJ72q4j78J1K07jN0k73J20
7891dJ58l63M06j22J39r3j8k45R5o5K94k31J52j50L94j03k87l4j60J34K12K55
7913C64l88J6m8Q4k24J82L7J7k58J22J37p3J78N3l06k32L98p2q7K13k46J89p9
$$ plain form
7752 22 23 -258 -50 -61 56 -70 -124 -108 109 -30 69 76 104 -8 25 141 96 -6 245 66 560 -17 -138 1
7776 1 160 56 206 -41 429 201 -208 2 -106 88 -261 83 70 185 -6 118 93 -222 -4 -122 311
7797 311 7 -42 174 -136 50 90 -178 148 -283 294 56 -35 80 37 60 117 135 -192 -133 -123 47 -35 209
7820 209 -102 44 228 65 -16 43 84 125 64 38 241 -103 -19 27 168 10 -57 -52 -11 -89 -6 45 -179 354 272
7845 272 176 70 -192 113 -16 13 72 -283 187 -138 -228 -9 -12 209 -232 -92 298 41 -137 9 -6 41 131
7868 131 286 -145 -12 183 -69 263 -6 -16 -19 -215 -55 328 -27 -28 144 60 -118 -107 100 99 149 -124 -4
7891 -4 154 -209 197 75 214 121 103 -142 -47 -112 182 -49 103 -47 347 244 -43 -77 -237 -103 109 364
7913 364 -24 -8 -56 28 -196 -14 23 40 -218 -96 41 -32 146 199 -107 -339 59 -13 -100 113 -133 56 -23
7936b3j10K3L14l46J87n4j69L85j48m2j25j9K41k90J96J26j42P9J98k03j31J35
7958H2k27L32o1rn6k83K8K76J60j44k20K76j94M9k75K90J03m4m78J66J73j2n0
7981a18K5P4K53j17lj03Q3J54l22K47l83K61Nj26k7K25m6o4j79j0J92N1jj93k
8006a24J27J17m06J91J67Or4LJ20r6j75K84j7j67p9J57l59L48q6L02j85m1j3J9
8030a%P5o7k34K93j41M48n75N21k76r8J05j79L2Oj15J0J12L58k37p4j71M92n9
8054B25J67k97Mn8n3J02l3j81j67J98l30O11k96Q3l3M46l92J23r7q3O2j20K67
8077A48M4O1k63R1k2j03jM1o2J86k00K98q0Jl72n7M69j76K95Mn47K99j9j64M1
8102h8M3kJ5K8J66k11L1N8j06J88o8k18oP9rL04k62jk89K69Q9l2K07k4j09QM6
$$ plain form
7936 -23 -133 -110 204 -142 45 -9 -178 207 59 17 -108 -127 114 -176 20 146 4 83 281 78 -53 82
7958 82 -145 187 126 117 61 -222 -194 82 242 98 -122 154 -40 9 -266 24 127 83 -395 -229 -56 -68 -118
7981 -118 -93 -19 234 117 114 11 94 248 -74 173 -210 51 56 -70 -97 128 82 18 -161 -171 21 72 71 -122 -124
8006 -124 3 120 -286 -95 72 78 -16 -13 107 11 -164 120 103 -64 -143 14 -345 3 -83 219 34 -7 -20 -1
8030 -1 -1 74 7 -227 66 -75 373 -202 319 43 -55 50 -129 -97 -91 -206 -196 -84 274 37 -37 -208 284 225
8054 225 392 95 99 41 -12 90 57 -124 -291 -93 -423 188 -108 -25 -58 388 -4 119 22 -61 1 -119 148
8077 148 192 253 -10 81 59 -44 -45 -4 -66 120 -80 218 138 139 -233 -290 179 3 298 302 -245 54 35 -129 -88
8102 -88 -45 -47 -32 -4 162 -49 -18 40 -66 122 54 -164 -170 -91 -100 204 -58 -59 -348 -79 10 -22 185 161 52 60 106
8129A06k89J33j60N21j08k22J2j49Nj98K80J0Q6K6J07j85k78M06JJ62j85j7K14
8152B78l69j5J01J05k72K61k3o8N9j13j4j75L9L10J51Q2l27k6k11L06l4k7j22
8175a04Np8J2J81K8R7rJ94m24R9k76L77j37L1K34l21
$$ plain form
8129 106 -183 -50 -210 311 203 -19 -7 -156 -151 -349 -69 -59 27 53 160 -25 -303 103 104 266 81 64 278
8152 278 -91 -106 -5 100 -172 89 66 -2 57 -56 -70 -245 -206 104 255 337 10 -16 -227 79 45 18 -104
8175 -104 -99 -177 -165 16 44 141 132 326 -98 1 -275 102 -35 -4 230 -91
8191i1
$$ Imaginary data points
##PAGE= N=2
##DATA TABLE= (X++(I..I)), XYDATA
0@%%%%%%%%%%%%oJ4j6J6j6J6k3L1l2L6m4M9n7O6p4Q6r7J09j24J40j56J74j94K16
36A14k41K69k99L30l66M06m47M95n49O09o77P54q41R38j057J201j374J590j869
55a014K247k791L646n196Q912l3048n2847K1039J8668J7648l55K822L423O366
69a0480k362n034p407N64J978K064j815L674P926Q068j829n878k915N766O574
84a106M445Q28J091K358J316k139k215k42J798R79j990k790J53J243j208n398
100b877m622o08J333O49j425j503m28k46j809j935l20K100K917J022KJ416K729
117c605J775m60j557K67K703K190P94O64K98J136j19p81l92J188J077K31j063
134D346o93P60P87r21j692j223m1N01o3q10l58k33l70n91o74N86L91P53l41r66
$$ plain form
0 0 0 0 0 0 0 0 0 0 0 0 0 0 -6 8 -8 8 -8 8 -15 16 -16 20 -24 25 -32 34 -40 46 -51 58 -66 74 -82 92 -102 114
36 114 -127 142 -157 173 -193 213 -234 261 -288 321 -356 398 -443 495 -562 639 -735 855 -1014
55 -1014 1233 -1558 2088 -3108 5804 -27244 -80091 -59052 -40384 -22736 -23091 -20269 -16846 -10480
69 -10480 -12842 -17876 -25283 -24719 -22741 -20677 -22492 -18818 -10892 -2824 -4653 -10531 -13446 -7680 -1106
84 -1106 3339 4167 5258 7616 8932 6793 4578 4336 6134 7113 5123 2333 2486 3729 2521 -2877
100 -2877 -7499 -8107 -6774 -6125 -7550 -9053 -9481 -9727 -11536 -13471 -13791 -11691 -8774 -7752 -7750 -6334 -3605
117 -3605 -1830 -2290 -3847 -3580 -877 1313 2107 2771 3069 4205 4086 3305 2913 4101 5178 5409 4346
134 4346 3653 4413 5200 4279 2587 1364 1323 1824 1761 951 593 360 -10 -601 -1275 -689 -298 455 114 -852
154h52R1O00L51m45j14L5M55J006j25l3l28M61K1n34l37L34N2M16k35k35k86M56
176G54k65o95j47K61O11k76k8n9j13q0m43j21K08K29P8j44k39l8L15Mj52k33L33
199b40M10K95m04j2J41L86n28n8j73P74k6rm33p1J01K0j58k04k26K63J45J49m19
222b77k22J50j52j52o27O97K67l31R7o8m10M36n7j87k0P3M68J20p7k6J20J05r6
245a69j01L22J98L76R9l68j79K21J44Nj61o4J61J58J66n31M9J17k18k84o6J92
267F7P5L08k73l11K2l61M30l3j12J89K83k65j06j78K08j05j74J77J14J47o9J62
289A95k2k31k2N0L80l52J55J72o0M56m58J14j03j3m2K5K20kk46m5R0j51Q4K7J67
314C88k25o07N23J85k51J05l20N63k84l07L79k75j12M21P0l80R2J31l00M00l70
$$ plain form
154 -852 -761 -161 190 -255 -369 -334 121 1127 1002 969 641 1102 1123 589 252 586 638 1054 819 584 298 754
176 754 489 -206 -353 -92 519 243 215 156 43 -37 -480 -601 -393 -164 -86 -230 -469 -507 -192 -188 -340 -573 -240
199 -240 170 465 61 49 190 576 48 -10 -183 591 565 556 123 52 153 173 15 -189 -415 -152 -7 142 -277
222 -277 -499 -349 -501 -653 -1280 -583 -316 -647 -550 -618 -1028 -592 -649 -836 -856 -783 -315 -195 -272 -298 -178 -73 -169
245 -169 -270 52 250 626 725 357 178 399 543 548 387 323 484 642 808 277 326 443 225 -59 -125 67
267 67 142 450 177 -134 -112 -473 -43 -76 -188 1 284 19 -87 -265 -57 -162 -336 -159 -45 102 33 195
289 195 173 -58 -80 -30 350 -2 153 325 265 721 263 377 274 261 219 244 464 462 216 171 261 110 194 221 388
314 388 163 -444 79 264 13 118 -202 361 77 -230 149 -126 -238 183 253 -127 -35 96 -204 196 -174
335a74R3O5l9J05j19L41k71K01m08m9J04L02j73j1k3q9J63l24J28L36k01L12j95
358G4R1j43m9P5l17K02J40N8n8j15J27k6j4k05Q2J92m09L02J23J59m4k49K8j5
382IN0m11K88Jlo4LK57k47mR4n4J80m5k49jJ91o9M0k44K98l8J10K09k48k31j34
409c12L28k49P0K40J16j52q6m15L66O0j4K3k47J18K18J39m3k8j07j18jK11K43
432C60k02k77M26j18k24j59JJ48n2L44j21j8K02l83K59k36K9J8l6k06L88j22k0
455AL4k21N6K99l9l94J75L12k68n9L72m39K53L1Lp6J29n42N73k98K26o0P2j92
479e2rR2k96J22J35k4J69k8R9l26J5J38r5K70M0k57j43J74K5L6l26PJ91N7J79
504A93k1q8j68J27k41K61P9k74K77l11N1K40j65n0J10l26K21K89q1R2k40J61k28
$$ plain form
335 -174 -81 -16 -55 50 -69 272 1 202 -206 -255 -151 151 -22 -33 -56 -145 18 -306 -178 158 -43 269 74
358 74 165 22 -27 48 -269 -67 73 131 73 -42 85 59 45 -160 -78 114 -295 7 130 289 245 -4 24 9
382 9 59 -352 -64 -63 -66 -130 -127 130 -117 -121 -27 -81 99 54 -195 -196 -5 -74 -34 -278 20 -18 92 301 53 -178 -312
409 -312 16 -233 -163 77 193 41 -45 -460 -94 -34 -48 -25 -272 -154 64 203 160 132 25 -93 -94 117 360
432 360 158 -119 307 189 -35 -194 -193 -45 -97 247 126 108 310 -73 186 -50 -21 -3 -39 -245 143 21 1
455 1 35 -186 -130 169 130 -264 -89 223 -45 -104 268 -171 82 113 116 40 169 -373 200 -98 128 68 140 -52
479 -52 -61 31 -265 -143 -8 -32 137 109 208 -118 -103 35 -60 210 250 -7 -150 24 49 85 -241 -234 -43 14 193
504 193 172 84 -84 43 -198 63 142 -132 145 -166 -115 125 -40 -90 20 -306 -85 204 123 215 -25 136 -92
527i2K9P0p9J3K8Q4k58L18j07K40k13J21j1l69J65K5K91k09M7j66L94m52R4j67
551b04J11L59q0o0l88L16j23n7K78l9j03q8L16j18Q7k02L29l35j9j11j52M03j57
574c7P6J4R4kn9n2rq8J02L0j54j22J41k9J30J2K68j06j92k04R8k8J55J79k18j13
600a14L9pJ07q8K9j87R8L19k39J16o5o5K67k05O9j83j4J20J25P2j51k39K37N4
624I5o6k39K05J10l05K43p8j28J20Q4K48l71P9K65j74L42p41O12m88J12op0K13
647F2j45J24j84O8Q7j25l7J72Kj47J57p2l07J10J66K13j92P3k10M20j61m5j06
670g7P5L02j61j57L34l56k11J48J63j21p5j1L87m12K37q6j54J69J71k51O5m1J2
693e0M5p7K71k98L3J20p6r0J78M6J87k95j8MJ06j5J04q5J55q2j70Q6o7r0L3MJ39
$$ plain form
527 -92 -63 7 -72 -59 -31 53 -205 113 6 246 33 154 143 -226 -61 -36 255 46 93 -73 321 -131 -37 -204
551 -204 -93 266 186 126 -262 54 -69 -126 152 113 10 -78 238 120 207 5 334 -1 -20 -131 -283 120 -37
574 -37 39 53 147 145 86 34 25 -63 39 69 -85 -207 -66 -95 35 47 315 209 17 -187 -89 -117 38 217 -1 -114
600 -114 -75 -82 25 -63 -34 -221 -123 196 -43 73 8 -57 210 5 74 -109 -123 -3 122 194 43 -196 41 95
624 95 29 -210 -5 105 -200 43 -35 -163 -43 41 289 -82 -3 262 88 430 -311 301 -187 -75 -81 -151 62
647 62 -83 41 -143 -75 12 -113 -150 22 24 -123 34 -38 -345 -235 -69 144 -48 25 -185 235 74 29 -77
670 -77 -2 300 139 -18 316 -40 -251 -103 60 -61 -136 -147 240 -172 65 -21 -175 -6 165 -86 -21 -62 -50
693 -50 -5 -82 189 -109 -76 44 -32 -122 56 102 289 -6 -24 -20 86 71 175 90 245 163 -7 79 12 -78 -45 -41 98
720I8J34j56p2j71K52K6j43L0j76MK9R6N0J35l02K14j75K09k56L13n3K21j40j36
744C1j66J57j07l2J10k47K86k72L66n4R9j88K36k1N5k68M7K8J16j63j7j3J43J61
768B87j30j71k3J92k43K25j98J46J78n21L15R7o11M00K73j62M9Q0J53n11J35j35
790a75K10k21J16R6O5j66J32O5l10n7M51l41R4J43o5K6k41p7K68o9M3P3j03J64
814A21r3On9l0J9p3K17r5k04K98P0k20j58L07n6J43k29J66J01l88J24J71m63M13
838H8K72k46qj12j73N9Q3j01J68j71j02M94j3l08L6jJj83n1K17J1o0K46n71J89
863b36L35k25L46j64j22N4m7L67j07m8k80L07k04J56R9k02K48l34j65L11j62O0
885a3n9J79q9J07j36Q8J04J64l39J82j76n3p9m6Q8J6J76j90R1L12l67q3M55m51
$$ plain form
720 98 232 76 4 -167 85 111 -32 -2 -178 -174 -145 -49 1 136 -166 48 -127 82 -174 139 86 307 167 31
744 31 -135 22 -85 -117 -7 -254 32 -240 126 72 171 -17 219 198 253 -15 32 60 176 13 -4 -17 126 287
768 287 157 -14 -37 155 -88 137 -61 85 263 -258 57 154 -457 -57 216 54 103 183 336 -175 -40 -175
790 -175 35 -186 -70 26 91 -75 57 122 -188 -245 206 -135 -41 102 37 63 -178 -255 13 -56 -13 60 -43 121
814 121 28 34 -25 -55 -36 -109 108 13 -191 107 177 -43 -201 106 50 193 -36 130 231 -157 -33 138 -325 88
838 88 360 114 106 -6 -179 -120 -37 -138 30 -141 -243 251 238 -70 -34 -35 -34 -217 -268 -51 -40 -100 146 -425 -236
863 -236 99 -126 220 56 -66 -12 -59 308 201 153 -127 180 -24 132 231 29 277 -57 -222 89 -73 -13
885 -13 -72 107 18 125 -11 77 181 345 6 188 12 -41 -120 -166 -78 -62 114 -76 15 327 -40 -123 332 -119
909a19L21l17L45j57j52J52m8k02M57m20K8R0L0J6k00K57k71K19R4m4j65j78J79
932h5L23k73J22J81m24J01K73l12l2J10j03j05J76L00l43L01Q7m14L16k44J52
953A07K5j54j10O8n9K04j19l81L51l7L0J29j06ON7M0n4Lj10J22J8k87J08N6J52
978E9K7j46J19n5P2o8N1j50K26o4j40J26k67J30pP3K18j10m8K35k32J62j16K9
1002A24k08JJ09o4M9j94K70k96J69l2J86p8P6k19K25Jj67k1L3J40o8k36R9J49
1026D8j50J96j48j07J41L8j08p3J84O5r9k4n0J33O2j22k88N66n48K04Q8N2Q2j74
1050c2J30j04J28l87L30j75L04r5ol58L3L47j6k73K16J02k59Q9J19j11R5l37L98
1073A38o6k84J58PJ84j2j24j03J65k75Q4m7L41l3l22R3J15J66p2l2K3k37R7M62
$$ plain form
909 -119 202 -115 230 73 -79 73 25 -177 280 -140 -112 -22 8 24 -176 81 -190 29 123 79 -86 -264 -85
932 -85 238 -35 87 268 -156 -55 218 -94 -126 -16 -119 -224 -48 252 -91 210 297 -117 199 -45 107
953 107 132 -22 -132 -64 -123 81 -38 -419 -68 -105 -75 54 -52 -46 11 51 -3 0 -110 12 30 -257 -149 -93 59
978 59 86 -60 59 4 76 8 59 -91 135 71 -69 57 -210 -80 -87 -14 204 94 46 281 49 211 95 124
1002 124 -84 -83 26 -38 11 -183 87 -209 -40 -72 114 36 112 -107 118 119 -48 -69 -36 104 36 -200 -101 48
1026 48 -102 94 -54 -161 -20 18 -90 -163 21 86 -13 -37 -87 46 108 -14 -302 264 -284 -80 8 60 142 -32
1050 -32 98 -6 122 -265 65 -110 194 99 93 -265 -232 115 99 -174 42 144 -115 -26 93 -18 77 -260 138
1073 138 72 -212 -54 -47 137 125 1 -102 63 -212 -128 -175 166 133 -189 -96 19 185 113 81 104 -133 -36 426
1097D26m13j34J45o4k24L14K9j03K42j62r2r1M54n47K92J14k15N7j4K02k65J97
1119A48k76J93j79K24n5K3j50j07J70J40l10K42J03k27K88k46J02l8K9l83M37
1140A28k1J3k07K63l75Q1K32O6J4k09O3Q0K2j13J1j8K99k28j98K16K17n18K31
1163D9J06n7pL7N1m1P4j76Mk80J68J03j87N6R7J1K9P5j62m06L79j47q6J81R3M4
1189Hk99M91q1k78Q4K55j08M1j28J67j96J39l58L53j63n0J05q9J11J85k86N3j42
1212a86J05r2K45mk7K5m5k00K15K4j96J61O7k45K55K82n34M72m15n2M97l17L3
1235F8k11L72l77l3P2J89j43J93N8k40k6J23o9L7j54N8P5j3J36k28J93n9kO8j53
1260f6N7k2O8j81j1K34k07l3MJ53J18k99L26J69k77J18n0p6m5j40R5k1k62M81
$$ plain form
1097 426 13 -121 24 -40 -264 50 79 -24 218 56 -36 -127 327 -220 72 186 -29 28 14 216 -49 148
1119 148 -128 65 -114 110 55 78 -72 -179 -9 131 -179 63 166 -61 227 -19 83 45 74 -309 128
1140 128 107 120 -87 176 -199 -118 114 180 194 -15 48 128 150 37 48 30 329 101 -97 119 336 -182 49
1163 49 155 98 91 128 179 138 212 36 40 -240 -72 31 -156 -100 -3 8 37 112 -50 -456 -77 -224 -310 -129 -36 8
1189 8 -291 200 119 -159 -75 180 72 113 -15 152 -44 95 -263 90 -73 -123 -18 -107 4 189 -97 -44 -186
1212 -186 -81 -173 72 68 41 66 21 -179 36 60 -136 25 92 -153 102 384 -150 322 -93 -145 352 35 68
1235 68 -143 229 -148 -181 -109 80 -63 130 188 -52 -78 45 -24 13 -141 -83 -8 -21 115 -113 80 21 19 87 -66
1260 -66 -9 -31 37 -144 -155 79 -128 -161 -157 -4 114 -185 141 310 33 151 101 25 -20 -160 -65 -86 -348 133
1284A33k02J67j22l0k5J10p9J76j25P7N5k36K22J19l4n5K63m18j93Q1J15L8j67
1307a30L35q9j14O4k70N3J4K62J3j02nP2k77L43k70j85J44K34J59l40J20M3k5
1330D9J72l98J34K05Q2l88K06k9j81J23O0q0L4m2P3k88M08n8j58K41k15k1L10
1353B39k93R4k09L43k36j55K22L5L8k57p6K90l7K9j5m5o5K76m54J58J33l4p0O5
1377b4Q3l3j43J31r8J67M3J9j36k2J92k15J97j67p8R9m5L9l4m6J45J03R2N2m37
1402a16K02j52l6K34j36K8Q1Mj70k2K4K27j6j66J13l28K11J97N6j61J64j53k22
1425a37J35J24Q7k95J60J96q1l71L44K1m00L13q1Q8K55l77P5l21K63L1l24K76
1447a9k09m5K0J37J07n8L2p3R1J64k01J43K15m44J3J75j7j59K3R8J58m66K33J74
$$ plain form
1284 133 -69 98 -24 -54 -79 31 -48 128 3 80 135 -101 121 240 206 151 414 -4 -197 -116 -1 37 -130
1307 -130 205 116 2 66 -204 -151 -137 125 138 36 31 103 -174 169 -101 -286 -142 92 251 -89 31 74 49
1330 49 221 -177 -43 162 244 -144 62 33 -148 -25 35 -45 -11 -53 20 -268 140 82 -76 165 -50 -71 239
1353 239 -54 40 -169 174 -62 -217 5 40 78 -179 -255 35 -2 27 12 -33 -98 178 -276 -118 15 -19 -89 -24
1377 -24 59 26 -117 14 -84 83 126 145 9 -13 179 -36 161 -6 -84 15 -30 9 -25 -71 74 177 269 321 -116
1402 -116 86 -66 -102 132 -4 24 105 109 -61 -83 -59 168 152 -14 99 -229 -18 179 235 74 238 85 -137
1425 -137 -2 122 209 -86 74 270 189 -182 162 183 -217 96 15 103 358 -19 56 -265 -2 29 -295 -19
1447 -19 -228 -273 -253 -116 -9 -67 -35 -108 -17 147 -54 89 304 -140 -127 48 31 -128 -105 -7 151 -315 -82 92
1471I2k31L8q7L59j50q7Q9j02M7N8J1O1O8k21J17j94L90m19J51j47N7Q9J59k20
1495g2L1J33k65J32N6j67J86M70m87Q2k4k60K13j48q6J65o5j55P6R0J44P6m03
1518b78J13N22o98M88j87J52k62J99K2j88M36J38l87j40L0K86M3q5j31k7J8m4
1540B0J61j26O4Pn7n7J27m35L42J47j64k69J72J60q4k7J94j32m3M52p66M21K06
1563C13m46P4l48N26p0l6p6J30j50nJ59o6k75K17J74j58M1j08M24k56l05L06L3
1586I8q2J48j1l44N08m52k92N50m1J35k35J17o8K48m49L0o2J44j02j25K11Q8J17
1609A31j39J17l96M01O3J04k61O6L3o2o7p1l0KK52M6j52L5P1m33J98J29j53R5
1633b1L64j84J01k4k14k1l4j12M4j51J53LP3J93m19J53R3O4m92M66K99m02R6J61
$$ plain form
1471 92 -139 -101 -188 171 21 -66 23 -79 -32 26 37 98 166 -55 62 -132 258 -161 -10 -157 -100 -11 148 -72
1495 -72 -41 92 -173 -41 15 -152 34 504 17 99 75 -185 28 -120 -206 -41 -106 -261 -185 -95 49 125 -278
1518 -278 -165 357 -341 147 -40 112 -150 49 71 -117 319 457 70 -70 -40 246 289 204 73 46 64 20
1540 20 181 55 119 126 69 12 139 -296 46 193 29 -240 -68 92 8 -19 175 43 0 452 -314 107 313
1563 313 -133 -59 -407 119 49 13 -63 67 -83 -88 71 5 -270 -53 121 -37 4 -104 320 64 -241 65 98
1586 98 16 164 153 -191 317 -135 -427 123 82 217 -18 99 31 279 -170 -140 -202 -58 -160 -285 -74 14 131
1609 131 -8 109 -287 114 177 281 20 86 119 57 -10 -81 -111 -109 143 189 37 72 143 -290 -92 37 -116 -21
1633 -21 343 159 260 236 22 1 -33 -145 -101 -252 -99 -96 -23 170 -249 -96 -3 61 -431 35 334 -68 28 189
1657A89k4l90J35L27j54k82j60J09M04j65l3J24l33K28J42j05n2K15J56l31j39
1678a39K36j31KK41k3l10J64Q3K5k90K16N0m82M57m85N1M75l59N04k21J74k78
1700d0j12L03j85r3J00p5J01J80k57J06k06K19l8j6M1J19m11J1J42o7K57l60K11
1723g0K79m5J72l11j98L08k02j53J00L51j65j62mK33n6J09l26N3K46j73l2j70
1745b16L8J68J39j08k06M70k43p1M68k52k57M0NL4l44O06k22P9L2l50K66o9J94
1768B01k28M5J08k27K6J36k29J26K74m00L70M4l81L5J28j98q3L64o2l05L84m00
1790b72q7K53p9K06Q9k15K58r2r1K1j54M77j47Qq6j7K44l25R8l89M04j00o0K01
1814A45K42l56k08J76J92k57kj04r3J48J32J65k94kJ61j61L11j51j49k6J18j39
$$ plain form
1657 189 165 -225 -90 237 83 -199 -359 -250 154 -11 -44 80 -253 -25 117 12 -40 175 331 0 -139
1678 -139 97 -34 -32 209 186 -124 40 123 148 -142 74 124 -358 99 -386 -335 140 -219 285 64 238 -40
1700 -40 -152 151 -34 -127 -27 -102 -1 179 -78 28 -178 41 3 -13 28 147 -264 -253 -111 -178 79 -281 -70
1723 -70 209 164 336 25 -173 135 -67 -220 -120 231 66 -96 -100 133 77 186 -140 -87 159 -14 -46 -216
1745 -216 -178 -10 129 21 -185 285 42 -29 439 187 -70 -30 -25 9 -335 271 49 128 160 -190 76 7 201
1768 201 -27 18 126 -101 -75 61 -168 -42 232 -168 202 246 -135 -100 28 -170 -253 111 49 -256 128 -272
1790 -272 -359 -106 -185 21 110 -105 153 61 -30 -9 -163 314 167 175 89 72 316 -9 89 -300 104 4 -56 145
1814 145 387 31 -177 -1 191 -66 -68 -172 -265 -117 15 180 -114 -116 45 -116 195 44 -105 -131 -13 -152
1836a52J62n6J2r5L00k00K10o4J2j0l92K34J18m0R0lk50k24M46j88J70j15n8p9
1860a72J99Q3j74R5k65J71J75J01l63M1l6K7o6L89p5k48L16j16p0L06j77j90j54
1883b03J91N7j86j27K77k6K40l18%J98p4J52L1k23j62l8K17P2n6R0L3P3m07L16
1907A27n10M67j64L8J47%m9k19J48j06q2K91l1j01oK07j9j22j07J07J84j90J95
1930B05P8j13l74J91j08l0J93j94L89j85K86n17K91j59l0o7M34k08j55L20j48
1951I9l1j47l8J71J10k31p3Q3J01r1O7J50k39K49k39N3K80m60n3L22K09q6k64
1974e8j0j50K29n3K49l12K70k71o4L19k45J70O3j38j66J56k08J28M2l0K0r2J55
1997Dj82J50r3J32J86l04R0j14mo0L61l2N5l46K10M4o9O9j59N4J88m88O11k62
$$ plain form
1836 -152 10 -46 -34 -129 171 -29 181 117 129 119 -273 -39 79 39 129 126 -124 -348 98 -90 80 -35 -93 -172
1860 -172 27 110 -64 31 -234 -63 112 213 -150 -109 -145 -118 -184 205 130 -118 198 82 12 318 141 -49 -203
1883 -203 -12 45 -141 -268 9 -17 223 -95 -95 103 29 181 212 -11 -173 -211 6 78 22 112 145 218 -189 127
1907 127 -383 84 -80 -42 105 105 56 -163 -15 -121 -203 88 57 -44 -50 157 138 16 -91 16 200 10 205
1930 205 283 170 -204 -13 -121 -151 42 -152 237 52 338 -179 112 -47 -77 -144 290 82 -73 247 99
1951 99 68 -79 -117 54 164 -67 -140 -57 44 -47 20 170 -69 180 -59 -6 274 -186 -239 83 292 206 -58
1974 -58 -68 -218 11 -42 207 -105 165 -106 -170 149 -96 74 137 -1 -167 -11 -219 -91 -49 -79 -59 -151 4
1997 4 -178 -28 -121 11 197 -107 -17 -131 -135 -195 166 134 189 -157 53 97 28 97 -62 -8 180 -308 303 41
2021D1q2J16Q5j15j75J46l71L46J58n2k14k9R1J10l80N97l78L20j74J48k68J71
2043I1j14k5L9n2k8Q6J82K51l99j25M3L64j29j75L09j15j40L09m41j93L70j84
2065g6J04n1j53L67j81rJ4j01L8J24r3M7J31j19kk38J90K3Q7ok56K20j31M2j53
2090a82L72l16O2N5K7p8j5J71r4K32m49J67k15J97K40k15J74j70L60k80l41J29
2112a69L16k39P3p4J58R0q7O3L9j72J16l04K57j60J46j38R5J75J3L6l82O6K06
2135A24j96K5M57n00K69j87K1J89r8j9o2K22k24k36K22R1J96q0j93N2j79k3J27
2158bj02J81r5l6J30r7N2j3k45j5K70P1P8l38L61l09K23r9k04K41j65Q9k5J12
2182F3j08J60j82J28q4m6J87Jk38L17k24l94M37Q1L9k00l4K85k48K56j74Q2k37
$$ plain form
2021 41 -41 75 160 45 -130 16 -355 -9 149 97 -117 -146 -55 55 -325 272 -106 214 40 188 -80 91
2043 91 -23 -48 -9 -61 -89 -3 179 430 31 -94 -51 313 184 9 318 203 63 372 -69 -262 108 -76
2065 -76 28 -23 -176 191 10 1 15 -86 -48 76 -17 30 161 42 40 -198 -8 15 102 96 -160 60 -71 -29 -182
2090 -182 190 -126 -64 -9 18 -60 -75 96 2 234 -215 -48 -263 -66 174 -41 133 -37 323 43 -298 -169
2112 -169 147 -92 -19 -93 65 155 68 131 170 -2 114 -190 67 -93 53 -85 10 185 198 234 -148 -82 124
2135 124 -72 -47 410 -90 179 -8 13 202 104 85 23 245 21 -215 7 98 294 214 21 73 -106 -129 -2
2158 -2 -104 77 -18 -54 76 -21 31 18 -227 -242 28 99 177 -161 200 -109 114 15 -189 52 -113 -24 -49 63
2182 63 -45 115 -67 61 -23 -69 118 119 -119 198 -26 -420 17 98 137 -63 -97 188 -60 196 22 104 -133
2205a33J18O0L6O7j57r5L3j12M29j89m00M08J83k06O8J20j74j19M03m03PK38k53
2228g1J19J5o7m4K61k75J94k13m0K55m0j00J46k48L06j2q3q3J3l9M8j9J19m4J2
2253A10Q7k81K74j42j96M49n28R3q5N16l99K91k30L2J20N1K1l24M3j07J93N8j07
2276f1M0O0O3l43M17k55j47J64P9j73j75K72L56l44J60q0k7pP3n9K80j05l27K19
2300H0j56rJ50k94O41l97j45J89j06K10m36J19L32j19J67r4m03O21l19L9l2j25
2322h7j0o1K56k36J95L4j79P8J67p3k41K24O1l15K60k31K88k93L65k76J10R7k85
2345a52O2P3J90k96N8K72l05L63l24N6Q6N8j73j02J23K67m08j27J49K71j88m8
2367i5Q1K08r6J30l0j20k12P1K37Jn0O9l69J07p4K77k87K92L1j42N9J34k02q7
$$ plain form
2205 -133 -15 45 81 148 -9 -104 -71 -183 246 57 -343 65 248 42 110 230 56 -63 340 -63 -56 182 -71
2228 -71 48 63 -4 -48 213 -62 132 -81 -121 134 94 -6 140 -108 198 186 103 20 33 -6 42 23 142 98 110
2253 110 197 -84 190 48 -148 301 -227 -134 -219 297 -102 189 -41 -9 111 162 183 -141 -98 -205 -12 46 -61
2276 -61 -21 39 102 -241 176 -79 -226 -62 17 -156 -331 -59 297 -47 113 33 6 -1 72 13 293 188 -139 80
2300 80 -76 -85 65 -229 412 15 -130 59 -47 163 -273 -154 178 59 226 132 -271 350 31 70 38 -87
2322 -87 -97 -158 98 -138 57 91 -88 -10 157 84 -157 67 128 -187 73 -158 130 -163 202 -74 36 133 -152
2345 -152 -90 -17 173 -123 -65 207 -98 265 -59 -3 83 141 -32 -134 -11 256 -152 -279 -130 141 -47 -95
2367 -95 -14 194 98 228 198 78 -134 -63 174 175 125 194 -175 -68 -142 135 -152 140 171 29 88 222 20 -67
2391f7K18j62M9R3O6j76k17K88j5J4L6l04K55N1j20Mj99N08k48m9j34J82K30k21
2415H2k14J65m23P13k46l34J45l6N1M1K27j52k89K06K88k55o4K57k50L09k7k78
2437h4J50k45L15M7k35L25k39k58J33l0M58l38j28n4K85l55K09J27j08J75k18
2458f8k5M1J61nj6m13K37J08L9j4k45K19j94l8J9M53m40K25p2j62K18k73L45l29
2482b29L58k02K81k52j58J68N8R6k83J28pL3O1l4K03l15O8J25k35j07L01m6k02
2505a90J21K47m4j57Jl6P4l44M89m54L66K29j39q1j45J53k6N1k58J09r2J24j78
2528a80J6L11m4Lk91J69k32p6M06J59l86J10o0K50R2n41L66j61l9J39j53J60L
2551B1j87K91p0j14J10k28L93j89k6OJ92l84M65j81j24J07p7Q9o7R1l8j71J48
$$ plain form
2391 -67 151 -11 38 131 197 21 -196 92 77 91 127 -177 78 129 9 13 -186 322 74 25 -109 73 303 82
2415 82 -132 33 -390 323 77 -257 -112 -148 -97 -56 171 19 -270 -64 224 -31 -95 162 -88 221 194 -84
2437 -84 66 -179 136 183 -52 273 34 -224 -91 -121 337 -1 -129 -183 102 -253 -44 83 -25 150 -68
2458 -68 -93 -52 109 104 88 -325 -88 20 59 45 -200 19 -175 -213 -194 259 -181 44 -28 -190 28 -245 100 -229
2482 -229 129 -73 208 -44 -202 -34 24 120 -163 -35 -42 -9 52 18 221 -94 -26 99 -136 -243 58 12 -190
2505 -190 -69 178 134 -23 -22 -58 16 -328 161 -293 73 302 163 82 -63 90 64 115 -143 -34 -126 -2 -180
2528 -180 -164 147 103 106 -185 -16 -248 -324 82 241 -145 -35 -95 155 247 -294 72 -89 -128 11 -142 18 21
2551 21 -166 125 55 -59 51 -177 216 27 1 7 199 -185 280 99 -25 82 5 94 27 118 80 -91 57
2574E7O4r4m4P9N5q5K63m76Q5L21k32l24K21NJ70k35K36k7l50J36K88P8O0j62
2598H9r4p3l3L25q8k00J69m6N9K36m59J96N7k02m8L4K79k36N2l0q8P1j5J06r4
2623c3J68m27M69k46m6K11j40p7K03k27M27o4k75L47m52j26K44N1M2j89K97l25
2645a68j0K49l49K60m3K11k69K55n81N03n5O6K63k66J12l04J69j15pJ80RK6j49
2668a3J12O9k03L20l00J40l81L17j34J52k17J05j37K04N0l5j46J84p4J73m7k80
2690a41m4K93J2k82M92m33Nk2P5j90L65Q5l17M57j71j14j03K29j59k90K03O4r6
2713h2N6j03J14j40j71L06j5m2j0OJ5M76r6k73j19J02m7K0J79k80j79K93J6j33
2737a07L5J00M3j6j39K30j09j5L7o0Oq3L01j64j04Q4N9L8k87J00K18p3k14q2J60
$$ plain form
2574 57 121 27 -17 62 117 32 295 -181 -96 225 -7 -331 -110 -105 65 -170 66 39 -311 -175 113 191 251 89
2598 89 -5 -78 -111 214 126 -74 95 49 108 344 -115 81 138 -64 -112 -78 201 -35 17 -13 -101 -30 -45 61 -33
2623 -33 135 -292 177 -69 -115 96 -44 -121 82 -145 282 218 -57 290 -162 -288 -44 7 49 -140 157 -168
2645 -168 -178 71 -278 -18 -61 150 -119 136 -445 58 3 69 332 66 178 -126 43 -72 -79 101 110 136 -13
2668 -13 99 168 -35 285 -15 125 -256 61 -73 79 -138 -33 -170 34 84 49 -97 87 13 186 139 -141
2690 -141 -185 108 120 -162 330 -103 -98 -120 -45 -235 130 215 -102 355 184 70 -33 196 37 -253 -50 14 -82
2713 -82 -26 -129 -15 -155 -326 -20 -35 -77 -87 -81 -66 410 314 41 -78 24 -23 -3 176 -104 -283 10 26 -107
2737 -107 -72 28 71 55 -84 146 37 22 59 -1 5 -78 223 59 -45 39 98 136 -151 -51 167 94 -120 -202 -42
2762d2j28K48l08J25Rp0J56Q2k44J42J56r5j83J68L5%O3j95p8L00K3j89NJ76J66
2787C22l37N8L26l50j26R2o0J4L61l54N7j43K56k28J9J61J77l31K27J04k33k42
2809b30J99k2J73j94P3N0p8K15m74J91Q2m4J79M3J9K7m78K49J79k44J86o2J51
2832A90m14K63j27l4M35n59N18m81L30j20K8Kj37M2J89q9l5o9o4L92k71m4r5J37
2856a3J18m03J06R8R6J81k17J37r2Q8j50l4K01o6M0J37k15k22K17L9k07J47J63
2879A49j46j1j05lJ99j61k25L87l09K40j40K25%j33m3p6K32r1%J85j30j2j04J14
2903D2l7m7K7J9K75l94J12k0ON8R4n1j55K0J80J2j84j62M60Lo9J45m96K58j1j84
2929i9Q0j78J06P1j7j41J92P3k26Nkkl8K32M8k5n6r9K46l2j23J85m14K45J44N9
$$ plain form
2762 -42 -170 78 -230 -105 -96 -166 -10 72 -172 -30 126 31 -152 16 51 51 114 -81 -159 141 164 -25 -20 156 322
2787 322 -15 43 369 19 -107 -15 -75 -61 300 -54 3 -140 116 -112 -93 68 245 -86 141 245 12 -230
2809 -230 -31 -53 120 -74 -1 49 -29 186 -288 -97 -15 -59 120 163 182 209 -269 -20 159 -85 101 39 190
2832 190 -224 39 -88 -122 313 -246 272 -209 121 1 29 31 -106 -64 125 36 1 -68 -132 260 -11 -55 -150 -13
2856 -13 105 -298 -192 -94 2 183 -34 103 11 99 -51 -85 116 50 90 227 12 -210 7 46 -161 -14 149
2879 149 3 -8 -113 -116 83 -78 -303 84 -225 15 -125 100 100 -33 -76 -152 80 -11 -11 174 44 32 -72 42
2903 42 5 -42 -15 4 279 -115 -3 -23 -17 41 135 84 -71 -51 129 141 -43 -205 255 258 189 334 -162 96 85 -99
2929 -99 -19 -197 -91 -20 -37 -178 14 87 -139 -134 -136 -138 -176 56 104 79 23 -76 170 138 15 200 -214 31 175 234
2955B34k62J57n4j68j74JK33J16J83o35L70j23J30Rq2o0K55P7L3l08J36J33j59
2978D2M3l51M12j05R6k48J20K1o7K42k09J28K2o20O52l07N4L91n25j71L32L12
3000B64k81j50K60j14J66k54J85nk59O7J24K14l19L26Mm32K02j87J55J38l28k6
3022b50k70P44k25j06J96N6j57N5J47k04K41l01K2N6n2J5j1J03j22K61l81K40
3044E7rj68Pj09J05J49R4k2k89N0K58J04k31N2k71J70k3J93j44k4M36l33k96L97
3068A53k14j9K1J30j29k2L4n2K65l79O0K79m01L48j12J87k53M6K74l11J09j31
3090a17L04k71p5N2j09J60K8J15j79n1J95J15k58m7L45j36J63j35j40l3L8J8k1
3113c9l9J42J12k37l6J37n6J09m4Q9k7q7N9j8l9j87K37j7K00n2N2k58N2J28k63
$$ plain form
2955 234 -28 129 75 -93 -267 -266 -33 83 266 -369 1 -122 8 17 -65 -125 130 207 240 -68 68 201 42
2978 42 85 -266 146 41 137 -111 9 30 -37 205 -4 124 146 -474 178 -129 -75 316 -209 -380 -48 264
3000 264 -17 -167 93 -21 145 -109 76 71 -188 -121 3 217 -102 224 228 -204 -2 -189 -34 104 -224 -250
3022 -250 -520 224 -1 -107 89 145 -12 43 190 -14 227 -74 -52 4 -48 -33 -44 59 -63 198 -183 57
3044 57 48 -120 -113 -222 -117 32 126 104 -185 -135 123 227 -4 48 -223 -53 -76 117 -27 -51 385 52 -244 153
3068 153 -61 -80 -59 71 -58 -80 -46 -98 167 -212 -152 127 -274 74 -38 149 -104 -58 216 -95 14 -117
3090 -117 187 -84 -159 -107 -216 -56 -28 87 -92 -143 52 167 -91 -138 207 71 234 99 -41 -74 -36 -18 -39
3113 -39 -78 64 176 -61 -97 40 -16 93 49 138 111 24 83 65 26 -161 76 59 259 207 259 1 53 181 -82
3138h2J21J56j32l11L12r4R1k8p9M6J43Nj03o3L3q6m1o2J15L20m86K23n2R0Q9
3163A25N2l93M90m09J06l9k1J28Q6j43M0J5R7p6k59L9O9k5P9L55n25L56Q4l8r8
3188I5j93J93k1n3k62j5L21k87JK42J3o9k91L45nK1q5r4M24m12L29l05R0pQ6n5
3214FQ5p8j33O3J46n1M4m0J68j27M3n0j97L05l1N4j51R3n9O8J12k59j10L40l96
3239a55o1l8L14l63L30p7J47L8j0r5j67J95j82q0K28O3k1L51j26k46J66l58J29
3262a8J05k15J23M9j22K17j52q4J10o0k44N20n47K26J61j90J82J79k48j04K98
3283A86l19N6mJ24j51p4J68j81J20L7O0J38k98K93%Q7k34Q7j20q5K68k80K26k10
3307a06n8o1K64J25k75l7K83m7Q6j83Kk06K5L75j44k1k51J30L9j21J95PQ2K16
$$ plain form
3138 -82 39 195 63 -248 64 -30 61 33 -46 0 143 148 45 -18 15 -71 -112 -174 -59 261 -225 -2 -54 36 125
3163 125 177 -216 274 -135 -29 -68 -89 39 125 -18 22 37 134 58 -201 -162 -93 -118 -39 316 -209 147 231 193 95
3188 95 -98 95 74 21 -241 -256 65 -222 -221 21 34 -35 -326 19 14 35 -50 -144 280 -132 197 -108 -18 -25 61 6
3214 6 91 13 -120 -57 89 38 82 42 210 83 126 76 -121 184 153 207 56 149 90 158 270 11 -99 241 -155
3239 -155 -216 -254 60 -303 27 -50 97 135 125 30 -137 58 -124 -204 24 87 66 417 291 45 211 -147 -18
3262 -18 87 -128 -5 44 -78 139 -13 -97 13 -47 -291 229 -318 -92 69 -121 61 240 -8 -112 186
3283 186 -133 -77 -81 43 -108 -182 -14 -195 -75 -38 22 160 -138 155 155 242 8 95 -25 -110 158 -122 104 -106
3307 -106 -164 -225 39 164 -111 -148 135 88 174 -9 -7 -213 -188 187 43 22 -229 -99 -60 -181 14 21 103 319
3331C19l09j3Kj51M67k67J74k82K65j12k7R2p5j02J71K9n46L76l7j71J56N4K83
3354B96j36k28L0K23j63j40K55l76K71K4K19m1m59J76kk67L77Q5l5k15K13j42
3376c5o4J22j79J18J49M23l06k17o4J86j86N3J83j48M6Lj07j62K25k08K16j64
3398a16K06k00M5L82n36K41pL5k40Q5k58M55J29l43L04k64K24l84O1o5K69P4K9
3421A26j34K26j83j95J38K09m6m2j0j39j0J41j81lM4o5J70k18K07j34R8K72j53
3444A18o8Ml5RM14l35R8k21R4L66j29k92j5J47j56K6k05J61k1K52J59n54O5J33
3468A5M6J3q6k0L40k39k12k01J27q6r6K17N2j8O7K73l0j34J04j78j00J82J5O3
3492A14k91L5o9L29q1J84K2m8k80J4L44q3k39J77l11K83J86m17K42k32j5Q2J16
$$ plain form
3331 319 10 -3 -1 -152 315 48 222 -60 205 93 66 158 83 -19 152 181 -365 11 -26 -197 -41 13 296
3354 296 160 -68 -38 185 22 -118 137 -239 32 56 275 234 -225 -49 -51 -318 59 144 109 -106 107 -35
3376 -35 -99 23 -156 -38 111 534 228 11 -53 133 -53 0 183 35 81 84 -23 -185 40 -168 48 -116
3398 -116 90 -110 -65 317 -219 22 15 50 -190 -105 -363 92 221 -122 182 -82 142 -242 -181 -246 23 97 126
3421 126 -8 218 35 -160 -22 187 141 99 89 -50 -60 81 -100 -103 -59 -124 46 -172 35 -99 -1 271 118
3444 118 50 54 19 28 442 107 205 -16 78 444 315 23 8 155 -1 25 -180 -19 -40 212 371 -183 -118 15
3468 15 61 74 -12 -32 308 69 -143 -344 -217 -303 -399 -182 -130 -148 -81 192 162 28 132 -46 -146 36 51 114
3492 114 -177 -142 -211 118 37 221 243 195 -85 -71 273 190 -49 128 -183 100 286 -131 111 -121 -136 -54 62
3515F2p8J26j37N8j23R3J62m48L59k86J05K40K6q9j73J4O6L0ok1M5k9Q9k46k97
3540d58L79L2K70l95N42m88K95p8l49J09O7J62j76M20p26L46j69L82q7L2k72L55
3562A93j47J1l39K96j72K30N7Q0k07j70J85l50M52r8Mj25K28j55K89l99O1Pk55
3585c24K54k9M1Qm0J00m0RK38m72K31J84k41P0j5k32K28L99k60j52k27L81J48
3608B59l91N7P6J6N5j17K18m1k09J13j4j64J0J56J99l20j2J03J15J37m3k44J71
3631A30m54L39q8l0M44l44J26j81K75k30j36J17J12p3n5M9L7l12O8j60J59J26
3653h1J28K15l53N6K19k96j10M16k21Rk46J09l7J01j90P7L58k3p6JK20l33P9r6
3677g4j3K27l98M11j51R1p1P9N4P7l9k00j2j3j99J79N5j13K90p3k95K78r6M6j97
$$ plain form
3515 62 -16 110 -27 31 -92 1 163 -285 74 -212 -107 133 159 70 -103 -89 -23 7 1 -20 25 -4 85 -161 -458
3540 -458 -79 -47 223 -172 370 -118 177 99 -250 -141 -74 88 -88 332 -394 -48 -217 165 78 110 -162 193
3562 193 46 57 -282 14 -158 72 129 209 2 -168 17 -333 119 21 25 -100 128 -27 262 -137 -76 -69 -324
3585 -324 -70 -99 -58 -50 -90 10 -30 -21 217 -255 -24 160 -81 -11 -26 -258 -30 369 109 -43 -270 111 259
3608 259 -132 -75 1 17 72 -45 173 132 -77 36 22 -142 -132 24 223 -97 -109 -6 109 246 203 -41 130
3631 130 -324 15 -73 -103 341 -3 123 -58 217 -13 -149 -32 80 7 -48 1 38 -274 -206 -366 -207 -81
3653 -81 47 262 -91 -35 184 -112 -222 194 -27 -18 -264 -155 -192 -91 -281 -204 154 131 55 56 276 -57 22 -74
3677 -74 -87 140 -258 153 2 93 22 101 155 232 193 -7 -19 -32 -231 -52 3 -110 180 107 -188 90 -6 40 -157
3702a57L86o95Q90m16K54l34k61L79o9r1K7PQ1p3K4J52J2k10O0p3J21J23j49j03
3726a15J29J84m64L36k69J58J36k28J15P3p0J64o4l27K75K03l47L03j81K37k54
3747fr2L0J32L99m21J73k38l56M87l89K69k27M64l83N2J11K2j84K57k51M32r5
3769A86l09K77l82K16n1j53K22P9k6j56Q5N2j82R3J4k15o7K53l35L46J59j22Q9
3792G3k45J77j94J94n1J37j07K72l88%O41p17O4M9K3N0j5m8L09k77N6J55k97J3
3816a26J05K5J54k42K01j7J02j46j29j5J06k00Q0J41K26j07J74k52J47k59J69
3837A37k47K3k03L30J91k0J28l71kO4j85J0J57l17O59k27l06P7J94Q2m48J73j27
3860b28J88j7j34L94k21L49k26N8k54J24J36l5Q3j60k4j81K8M39k47k1j78K01
$$ plain form
3702 -157 229 -466 424 8 262 -72 -333 46 -23 -114 -87 -80 1 -72 -48 104 116 -94 -34 -107 14 137 -12 -115
3726 -115 14 198 -266 70 -199 -41 95 -133 -18 55 -15 149 85 -242 33 236 -111 192 11 248 -6
3747 -6 -98 -68 64 463 42 215 -23 -379 108 -281 -12 -239 225 -158 -106 5 27 -157 100 -151 281 186
3769 186 -123 154 -228 -12 -63 -216 6 85 59 -97 -12 40 -142 -49 -35 -250 -317 -64 -399 -53 106 -16 73
3792 73 -172 5 -189 5 -46 91 -16 256 -132 -132 509 -208 -144 -95 -72 -22 -37 -85 224 -53 3 158 -139 -126
3816 -126 -21 4 158 -84 117 100 202 56 -73 -88 18 -182 -102 39 265 158 332 80 227 -32 137
3837 137 -110 -87 -290 40 231 211 339 -32 -34 30 -155 -145 12 -305 354 127 -179 -102 92 174 -274 -101 -228
3860 -228 -40 -57 -191 203 -18 331 105 163 -91 33 169 134 217 57 33 -148 -120 319 72 51 -127 74
3882G4J9j17rN3K77l27K61k70j95K37J6L2l8j05K57k2r0J13rp9l55K27j51K42
3906D1j97K90r9o9J20k34K98n23L86J2j99J24K9K5J79k11r6R3p1l2J23R6J10k90
3930i5J64j26j92M93k11l08M22n9RJ03m76M18k13j16K12o6k05L01k55K48N3j48
3952d7j9m3J11j04K63k35J15j75J17l08L59j1q7j03J71n4K00j09l8J13k14K5K31
3975A58j52L62k69K85m30rJ64P3k08P4K83o87N26k24M15m83M8J39q2k60R5P9J08
3998Ej47Q0K15m53J95r3N2J41RK10k34j02K92l27L18j63P1k49J90j42K57j13J47
4021A59K4k76R0K1J15j94P9j94j52L10K96l95j05J14K92k82L5j17J50j67M18k94
4043g3L6K93k95L16k25j01K38l46L99j69j48J69o05N52J07l5q5j64J86K32m56
$$ plain form
3882 74 93 -24 -33 20 297 -30 231 -39 -234 3 19 51 13 -92 165 143 53 166 157 78 -277 -50 -201 41
3906 41 -156 134 35 -34 86 -148 150 -373 13 25 -174 -50 -21 4 183 -28 -124 -31 -102 -134 -11 85 195 -95
3930 -95 69 -57 -249 244 33 -275 147 88 97 200 -276 142 -71 -187 25 -41 -246 55 -200 48 101 -47
3952 -47 -66 -109 2 -102 161 -74 41 -134 -17 -325 34 23 -64 -167 4 -50 150 41 3 116 -98 -73 158
3975 158 6 368 99 384 -46 -55 109 182 -26 48 331 -356 170 -54 361 -122 -74 65 -17 -277 -182 -103 5
3998 5 -142 -62 153 -300 -105 -198 -146 -5 4 214 -20 -122 170 -157 161 -2 69 -180 10 -132 125 12 159
4021 159 183 -93 -3 18 133 -61 18 -176 -328 -18 278 -117 -222 -108 184 -98 -63 -180 -30 -197 221 -73
4043 -73 -37 256 -39 277 52 -49 189 -157 242 73 -75 94 -511 41 148 113 28 -136 50 282 -174
4064a74Q9J7K51k44K72j72R5n2l93L22k1K4nj79K39j9J9P7j72l32M35j31n7O4
4088d7j85M07K46l28L8n48M22k00K15K6r4J02j81P9J86q2J10K34m11j09L99n1
4110B28j36l21L59K7K7j93Rj38L52l93L74k58J87J0NJ4j39J74j97j85P8Q9j06
4133a33KM3K90j78j01M7P1j80K19R4k79LK91l55K94P7p7k88L11j26O9o2j85K88
4157A35m05L89n7K07l96K54k48j48K49j26K02J25m84M99k26k84M49n53L71K33
4177A86k62M6k80M25k38nK37oj17L3M4k46K88j29j19L70l89K13n9j75J75N5nk6
4201A6jo1m6R4m1k34M25k0j16j53J38J58k68J66o9N7k95L40j6N0j53J58l41o5
4225b77K42J68qj14r7Q5Kp5Q6n9lk07P1J98k3j47J90l41N7K18k49M42M1l83N8
$$ plain form
4064 -174 -85 -68 183 -61 211 39 134 82 -311 11 -10 14 9 -170 69 50 69 146 -26 -358 77 -54 -111 -47
4088 -47 -232 175 421 93 131 -417 5 -195 20 46 -48 54 -127 -48 138 56 166 400 -11 -120 279 228
4110 228 92 -229 130 157 184 -9 0 -138 214 -179 195 -63 124 134 139 153 14 188 -9 -194 -116 -27 -133
4133 -133 -131 -88 202 24 -77 -30 41 -139 80 174 -105 -102 189 -166 128 205 128 -160 151 25 94 32 -153 135
4157 135 -270 119 62 269 -127 127 -121 -269 -20 -146 56 181 -303 196 -30 -314 135 -418 -47 186
4177 186 -76 -30 -310 115 -123 -128 109 103 -14 19 63 -183 105 -24 -143 227 -162 51 -8 -183 -8 47 42 16
4201 16 15 -46 -92 2 -39 -273 152 132 16 -137 1 159 -109 57 -12 45 -250 90 74 124 -29 129 -212 -277
4225 -277 -35 133 125 11 -86 -1 1 -74 12 -47 -50 -257 -186 12 -11 -158 32 -309 -252 -34 -283 159 200 -183 -125
4250a25J13J72k98L94k04mj97K17O8j55K70o2l1j72l7J36l2J41n57L64k07K77
4272G1j81P9r4r9K36k1K03j12J37m2Lk47K59k01M0K97m04L01j71N1l97K40j56
4295b08K3QK79o5j54j53M04r6j11J99m05Q3k6k3L21O9j48J14p8j48M02j08J38
4318C17k50j86L87k20j35N5K67k96L03k71J51k40l2L3L36J81m50J29J18k82K37
4339A52l87K19P3j32j05PJ05N8j62p7L05j37l84O07J7k16k8L5J75j1J09j46j84
4362a07N05n98K37q0J62j31k4J9M7R0Pl16K97N1j29k21O2M8J97k34L71k13k76
4385b36J27J99m2j24k9K74j04j11l2J18J14k4Lq0j02R6q0o9L57k48P1N9j38j50
4409a51L04j18j51L19l75K97j63J46j8n2k55k49N27r7m2r7J41P6k9K21k97r7P1
$$ plain form
4250 -125 -12 160 -138 256 52 48 -149 68 136 -19 251 189 158 -14 -51 85 53 194 -363 1 -206 71
4272 71 -110 -31 -125 -224 12 -9 194 82 219 177 180 -67 192 -9 31 328 -76 225 54 105 -292 -52 -208
4295 -208 -185 -177 102 37 -117 -270 134 38 -73 126 -279 -196 -222 -245 76 145 -3 111 33 -115 287 179 317
4318 317 67 -119 268 48 -87 -32 235 -61 242 -29 122 -118 -150 -117 219 400 -50 79 197 -85 152
4339 152 -235 -16 57 -75 -180 -173 -68 -10 -172 -249 56 -81 -465 142 159 -57 -85 -50 125 114 223 77 -107
4362 -107 398 -200 37 -43 119 -12 -36 -17 30 120 127 -189 108 159 30 -191 -129 -81 116 -118 253 40 -236
4385 -236 -109 90 48 -76 -105 169 65 -46 -78 40 154 130 133 53 -49 47 -33 -102 255 7 78 137 -1 -151
4409 -151 153 35 -116 203 -172 125 -38 108 90 38 -217 -466 61 -36 -78 -175 -34 42 13 234 -63 -160 -89
4432h9J08j27K32J9k06R8M8k47o2J24L07l12J20K45l07oJ84o6j16L2k18K52N5
4455F8l6j06J06l3j4O2r4j1R3j05j07K02j52K40j15j02K26l46j61K73Q1K78l99
4478a52J25j95K33J75k06L2j52M0K41k6j42k50L45J58j67j48K2k79K16O9J99p7
4500F1j38N6K49j97P9o5J13l4j27o6J85k93M1L68M0q7l58L46l20M28m35N03j80
4523A69j0M1j38j39p7K97m46M98k51L2j03R7m6k76L57K07k80O4k1L27l25J02q
4546G1k01J73j72K20J11k03m52N60m06M16J3k08K90k40k0K85m03L80k36k39L66
4567A05j8k85RK5L25pk21R0k1J1K7J93j10j1j71M3O1r5N7k74K70K12k84M5O2r4
4593e6l3J20J85l32J46j97K96R7l26L6K56m0k08j9q1K54l1j05l9L9j00M04r3k17
$$ plain form
4432 -89 19 -108 124 143 -63 35 83 -164 -226 -102 205 -107 13 258 -49 -55 129 63 -53 -21 -239 13 68
4455 68 32 -74 32 -1 -15 47 -47 -58 35 -70 -177 25 -127 113 -2 -104 122 -224 -385 -112 -31 247 -152
4478 -152 -27 -222 11 186 -20 12 -140 -100 141 115 -27 -277 68 226 59 -89 -67 -346 -130 -61 138 61
4500 61 -77 -21 228 31 110 45 158 124 -3 -69 116 -177 -136 232 272 185 -173 173 -147 281 -154 349 169
4523 169 159 200 62 -77 -154 143 -303 195 -56 -24 -127 -30 -76 -352 5 212 -68 -4 -25 302 -23 79 71
4546 71 -130 43 -129 91 202 -1 -453 107 -299 117 130 -78 212 -28 -48 237 -166 214 -22 -261 105
4567 105 87 -198 -189 -164 161 154 -67 23 2 13 40 233 123 112 -59 -16 45 -50 7 -267 3 215 -69 -24 38 -56
4593 -56 -89 31 216 -116 30 -167 129 226 -100 -64 192 152 -56 -75 -156 98 67 -38 -77 -38 -138 266 173 -44
4617d4J72k60l5l7N3J89N1l5k12K54r6j73K75o3m8q2m8Lk53M93k01L1R8l19L62
4642G5j44KJ28j81O1J69j28K96n4k38J39j2m8J45k49o4J5m0N0L2K9j4J5Q6k22
$$ plain form
4617 -44 128 -132 -167 -204 -151 38 89 54 -158 96 0 -173 102 39 -9 -91 -139 -136 -389 104 -97 -66 32 -287 75
4642 75 -69 -67 61 -120 -59 110 -18 278 224 -14 125 113 65 210 -39 -103 -88 -128 -78 -46 -17 -31 -16 70 -152
$$ [...]
8191G1
##END NTUPLES=NMR FID
##END=
