##TITLE=1H_LR-694-K1A
 DMSO-d6, 8 sc, 
 16.10.2019
##JCAMPDX= 6.0         $$ Bruker NMR JCAMP-DX V2.0
##DATA TYPE= NMR FID
##DATA CLASS= NTUPLES
##ORIGIN= UXNMR, Bruker Analytische Messtechnik GmbH
##OWNER= root
$$ XWIN-NMR		Version 3.5
$$ Wed Oct 16 14:03:40 2019 Russian Standard Time (UT+4h)  she@DPX200
##.OBSERVE FREQUENCY= 200.1315
##.OBSERVE NUCLEUS= ^1H
##.DELAY= (6, 6)
##.ACQUISITION MODE= SIMULTANEOUS
##.ACQUISITION SCHEME= undefined
##.AVERAGES= 8
##.DIGITISER RES= 18
##SPECTROMETER/DATA SYSTEM= spect
##.PULSE SEQUENCE= zg30
##.SOLVENT NAME= DMSO
##.SHIFT REFERENCE= (INTERNAL, DMSO, 0, 15.7039)
##AUDIT TRAIL= $$ (NUMBER, WHEN, WHO, WHERE, WHAT)
$$ ##TITLE= Audit trail, XWIN-NMR		Version 3.5
$$ ##JCAMPDX= 5.01
$$ ##ORIGIN= Bruker BioSpin GmbH
$$ ##OWNER= she
$$ F:/spectra/data/she/nmr/H-F/1/audita.txt
$$ ##AUDIT TRAIL=  $$ (NUMBER, WHEN, WHO, WHERE, WHAT)
(   1,<2019-10-16 14:02:29.00 +0400>,<she>,<DPX200>,
      <created by zg, POWCHK disabled, PULCHK disabled
       configuration hash MD5:
       00 E9 B6 7A A2 85 ED C7 34 08 36 98 17 FE 4E 26
       data hash MD5: 16K
       45 62 88 B5 CF 05 7A 05 AF B0 C7 14 8F 41 83 B7>)
$$ ##END=
$$ 
$$ hash MD5
$$ 24 BB 05 CB 24 67 21 F0 21 98 29 27 49 D0 42 72
##$RELAX= 
##$RELAX= 
##$RELAX= 
##$RELAX= 
##$RELAX= 
##$RELAX= 
$$ Bruker specific parameters
$$ --------------------------
##$DU= <F:/spectra>
##$EXPNO= 1
##$NAME= <H-F>
##$PROCNO= 1
##$TYPE= <nmr>
##$USER= <she>
##$AMP= (0..31)
100 100 100 100 100 100 100 100 100 100 100 100 100 100 100 100 100 100 
100 100 100 100 100 100 100 100 100 100 100 100 100 100 
##$AQSEQ= 0
##$AQ_mod= 1
##$AUNM= <au_zg>
##$AUTOPOS= <>
##$BF1= 200.13
##$BF2= 200.13
##$BF3= 200.13
##$BF4= 200.13
##$BF5= 200.13
##$BF6= 200.13
##$BF7= 200.13
##$BF8= 200.13
##$BYTORDA= 1
##$CFDGTYP= 0
##$CFRGTYP= 5
##$CHEMSTR= <none>
##$CNST= (0..31)
1 1 145 1 1 1 1 1 1 1 1 1 1 1 1 1 1 1 1 1 1 1 1 1 1 1 1 1 1 1 1 1 
##$CPDPRG= <>
##$CPDPRG1= <>
##$CPDPRG2= <>
##$CPDPRG3= <>
##$CPDPRG4= <mlev>
##$CPDPRG5= <mlev>
##$CPDPRG6= <mlev>
##$CPDPRG7= <mlev>
##$CPDPRG8= <mlev>
##$CPDPRGB= <>
##$CPDPRGT= <>
##$D= (0..31)
0 1.2 0 0 0 0 0 0 0 0.06 0 0.03 0 0 0 0 0.0002 0 0 0 0 0 0 0 0 0 0 0 0 
0 0 0 
##$DATE= 1571220148
##$DBL= (0..7)
120 120 120 120 120 120 120 120 
##$DBP= (0..7)
150 150 150 150 150 150 150 150 
##$DBP07= 0
##$DBPNAM0= <>
##$DBPNAM1= <>
##$DBPNAM2= <>
##$DBPNAM3= <>
##$DBPNAM4= <>
##$DBPNAM5= <>
##$DBPNAM6= <>
##$DBPNAM7= <>
##$DBPOAL= (0..7)
0.5 0.5 0.5 0.5 0.5 0.5 0.5 0.5 
##$DBPOFFS= (0..7)
0 0 0 0 0 0 0 0 
##$DE= 6
##$DECBNUC= <off>
##$DECIM= 24
##$DECNUC= <off>
##$DECSTAT= 4
##$DIGMOD= 1
##$DIGTYP= 9
##$DL= (0..7)
0 120 120 120 120 120 120 120 
##$DP= (0..7)
150 150 150 150 150 150 150 150 
##$DP07= 0
##$DPNAME0= <>
##$DPNAME1= <>
##$DPNAME2= <>
##$DPNAME3= <>
##$DPNAME4= <>
##$DPNAME5= <>
##$DPNAME6= <>
##$DPNAME7= <>
##$DPOAL= (0..7)
0.5 0.5 0.5 0.5 0.5 0.5 0.5 0.5 
##$DPOFFS= (0..7)
0 0 0 0 0 0 0 0 
##$DQDMODE= 0
##$DR= 18
##$DS= 0
##$DSLIST= <SSSSSSSSSSSSSSS>
$$ [...]
##$SUBNAM2= <"">
##$SUBNAM3= <"">
##$SUBNAM4= <"">
##$SUBNAM5= <"">
##$SUBNAM6= <"">
##$SUBNAM7= <"">
##$SUBNAM8= <"">
##$SUBNAM9= <"">
##$SW= 24.0689530833862
##$SWIBOX= (0..15)
0 0 2 0 0 0 0 0 0 0 0 0 0 0 0 0 
##$SW_h= 4816.95568400771
##$TD= 16384
##$TD0= 1
##$TE= 0
##$TE2= 300
##$TE3= 300
##$TEG= 300
##$TL= (0..7)
0 120 120 120 120 120 120 120 
##$TP= (0..7)
150 150 150 150 150 150 150 150 
##$TP07= 0
##$TPNAME0= <>
##$TPNAME1= <>
##$TPNAME2= <>
##$TPNAME3= <>
##$TPNAME4= <>
##$TPNAME5= <>
##$TPNAME6= <>
##$TPNAME7= <>
##$TPOAL= (0..7)
0.5 0.5 0.5 0.5 0.5 0.5 0.5 0.5 
##$TPOFFS= (0..7)
0 0 0 0 0 0 0 0 
##$TUNHIN= 0
##$TUNHOUT= 0
##$TUNXOUT= 0
##$USERA1= <user>
##$USERA2= <user>
##$USERA3= <user>
##$USERA4= <user>
##$USERA5= <user>
##$V9= 5
##$VALIST= <valist>
##$VCLIST= <CCCCCCCCCCCCCCC>
##$VD= 0
##$VDLIST= <DDDDDDDDDDDDDDD>
##$VPLIST= <PPPPPPPPPPPPPPP>
##$VTLIST= <TTTTTTTTTTTTTTT>
##$WBST= 1024
##$WBSW= 4
##$XGAIN= (0..3)
0 0 0 0 
##$XL= 0
##$YL= 0
##$YMAX_a= 92437
##$YMIN_a= -105722
##$ZGOPTNS= <>
##$ZL1= 120
##$ZL2= 120
##$ZL3= 120
##$ZL4= 120
##$ABSF1= 10
##$ABSF2= 0
##$ABSG= 5
##$ABSL= 3
##$ALPHA= 0
##$AQORDER= 0
##$ASSFAC= 0
##$ASSFACI= 0
##$ASSFACX= 0
##$ASSWID= 0
##$AUNMP= <proc_1d>
##$AZFE= 0.1
##$AZFW= 0.1
##$BCFW= 1
##$BC_mod= 2
##$BYTORDP= 1
##$COROFFS= 0
##$CY= 11.3945322036743
##$DATMOD= 1
##$DC= 2
##$DFILT= <>
##$DTYPP= 0
##$F1P= 20.1720416913024
##$F2P= 0.152960286110954
##$FCOR= 0.5
##$FTSIZE= 0
##$FT_mod= 4
##$GAMMA= 1
##$GB= 0.15
##$INTBC= 1
##$INTSCL= 1
##$ISEN= 128
##$LB= 0.24
##$LEV0= 0
##$LPBIN= 0
##$MAXI= 10000
##$MC2= 0
##$MEAN= 0
##$ME_mod= 0
##$MI= 1.114404
##$NCOEF= 0
##$NC_proc= 0
##$NLEV= 6
##$NOISF1= 3.799351
##$NOISF2= 2.8
##$NSP= 1
##$NTH_PI= 0
##$NZP= 0
##$OFFSET= 15.70392
##$PC= 1
##$PHC0= -9572.992
##$PHC1= 22.00093
##$PH_mod= 1
##$PKNL= yes
##$PPARMOD= 0
##$PSCAL= 0
##$PSIGN= 0
##$REVERSE= no
##$SF= 200.130013532006
##$SI= 16384
##$SIGF1= 3
##$SIGF2= 2
##$SINO= 400
##$SIOLD= 16384
##$SREGLST= <1H.CDCl3>
##$SSB= 0
##$STSI= 0
##$STSR= 0
##$SW_p= 3612.71676300578
##$SYMM= 0
##$S_DEV= 0
##$TDeff= 0
##$TDoff= 0
##$TI= <>
##$TILT= no
##$TM1= 0
##$TM2= 0
##$TOPLEV= 0
##$USERP1= <user>
##$USERP2= <user>
##$USERP3= <user>
##$USERP4= <user>
##$USERP5= <user>
##$WDW= 1
##$XDIM= 8192
##$YMAX_p= 0
##$YMIN_p= 0
$$ End of Bruker specific parameters
$$ ---------------------------------
##NTUPLES= NMR FID
##VAR_NAME=  TIME,          FID/REAL,        FID/IMAG
##SYMBOL=    X,             R,               I
##VAR_TYPE=  INDEPENDENT,   DEPENDENT,       DEPENDENT
##VAR_FORM=  AFFN,          ASDF,            ASDF
##VAR_DIM=   8192,          8192,            8192
##UNITS=     SECONDS,       ARBITRARY UNITS, ARBITRARY UNITS
##FACTOR=    0.0002076,     1,               1
##FIRST=     0,             0,               0
##LAST=      1.7004516,     0,               0
##MIN=       0,             -105722,         0
##MAX=       1.7004516,     92437,           0
$$ Real data points
##PAGE= N=1
##DATA TABLE= (X++(R..R)), XYDATA
0 0 0 0 0 0 0 0 0 0 1 -8 8 -8 8 -15 16 -17 24 -25 32 -36 41 -49 57 -65 77 -88 101 -114 129 -145 166 -184
32 -184 207 -231 260 -288 322 -357 397 -439 486 -539 596 -661 732 -813 901 -1004 1123 -1258
50 -1258 1420 -1614 1851 -2151 2541 -3076 3856 -5109 7455 -13419 62558 92437 -9766 -18296
64 -18296 13707 75389 85023 58357 11480 1713 24532 61979 67789 43063 2114 -18394 -11038
77 -11038 19488 41884 37468 6477 -15511 -11279 14028 25213 10162 -16507 -22700 -3005 21281
90 21281 20435 -4264 -27699 -26083 -4872 12148 7760 -9585 -20299 -15187 -1259 6642 83 -15891
104 -15891 -27695 -22179 -1574 15057 11722 -9214 -27107 -23613 -3402 10851 2713 -18565 -27462
117 -27462 -12317 11375 17554 -229 -23187 -29845 -16161 3515 10698 1123 -13757 -20069 -12777
130 -12777 -62 5396 -1692 -16051 -23794 -15604 1792 10595 1303 -16393 -23429 -12741 3153
143 3153 6794 -4253 -15917 -14678 -2045 7013 2705 -9439 -16601 -11457 472 8356 5733 -2806
157 -2806 -9719 -8183 -34 7752 5814 -2518 -9143 -4419 8203 16773 11027 -3057 -10564 -3291 11314
172 11314 17223 9473 -2407 -4250 5324 15499 16114 6415 -2563 -3194 5578 15140 17951 10718 351
187 351 -3633 1936 12194 16207 9208 -1675 -5140 2974 13569 14367 3445 -7265 -7140 2887
201 2887 11024 9179 -153 -6708 -4203 2385 6493 2828 -3646 -7384 -4411 1894 6245 3578 -3924
216 -3924 -9304 -7809 -32 5933 3099 -5161 -9567 -4838 3872 6692 502 -8302 -10260 -2689 5346
231 5346 6157 -278 -6957 -6835 -1410 4242 4155 -789 -6104 -5959 -125 5453 5731 -129 -7109 -7875 -1260
248 -1260 5962 6530 -280 -7293 -6389 1005 6152 3971 -3336 -7828 -5115 2053 5544 2671 -3571 -6561
264 -6561 -4374 271 3111 1454 -3226 -5875 -3519 1494 4005 1238 -4868 -7853 -3814 2669 5298
279 5298 1064 -4905 -6076 -1726 3834 4262 -826 -5275 -4109 711 4912 4853 116 -3944 -3791 667
295 667 4463 4903 1204 -2603 -2308 1579 5609 5365 256 -3977 -2843 3085 7421 5711 -195 -3877
311 -3877 -1883 3314 5697 3315 -882 -2801 -238 3576 4892 2554 -1419 -3609 -1881 2056 4091
326 4091 2592 -1666 -3928 -1508 2497 3651 687 -3517 -4419 -1000 3558 3540 47 -4009 -4195 -760
342 -760 2586 2315 -750 -3352 -2782 335 2655 2153 -967 -3645 -3028 254 2961 2816 -817 -3480 -2732
359 -2732 1054 3877 2295 -1767 -3336 -1306 2592 4261 1722 -1870 -3534 -1287 2596 3589 1435
374 1435 -1477 -2620 -1128 1800 2979 1160 -2168 -3353 -1311 2211 3468 1217 -2437 -3695 -1335
389 -1335 2133 2315 -364 -3177 -3123 -371 2178 1819 -759 -3202 -3072 -9 1432 1649 -305 -2488 -2274
406 -2274 -286 2028 1463 -798 -2441 -2398 489 2694 1831 -928 -2742 -1660 1289 2801 1409 -1232
422 -1232 -2200 -539 2118 2718 1214 -956 -1782 -406 1803 2881 1512 -721 -1682 -441 1783 2988
438 2988 1101 -1129 -2227 -557 2005 2635 987 -1813 -2285 -153 1924 1979 102 -2068 -1672 -247
454 -247 1582 1333 -55 -1649 -1457 -157 1376 1086 -35 -1574 -1748 236 1734 1153 -395 -1988 -1359
471 -1359 617 1623 913 -810 -1699 -1010 1070 1801 684 -1054 -1437 -783 1159 1877 728 -850 -1306
488 -1306 -755 1198 1773 663 -959 -1433 -126 1703 1845 586 -1528 -1747 272 1581 1751 22 -1427
505 -1427 -1344 -53 1473 1100 -297 -1757 -1805 65 1349 986 -252 -1784 -1513 -454 1283 910 -422
522 -422 -1799 -1331 245 1045 986 -708 -1776 -1090 94 1345 906 -511 -1313 -1101 561 827 368 -534
540 -534 -847 -547 921 1106 693 -706 -1007 -616 968 1391 769 -988 -1162 111 1210 1244 -174 -949
558 -949 -736 -71 1500 1195 60 -923 -967 168 899 979 18 -1308 -1440 155 1351 836 -544 -1167 -1216
577 -1216 137 1147 918 -202 -1279 -578 463 992 253 -844 -1268 -546 343 947 696 -636 -942 -645
595 -645 412 1123 663 -408 -825 -180 971 1241 279 -608 -993 -119 884 1071 397 -913 -650 34 899
614 899 1173 -15 -609 -786 161 1086 1347 -126 -938 -987 102 1094 1060 -136 -998 -777 83 952 1002 -94
634 -94 -1213 -921 129 852 601 -508 -1251 -1100 220 736 420 -602 -1256 -608 447 972 564 -744
652 -744 -1059 -707 273 917 740 -641 -1008 -353 366 837 359 -773 -1016 -141 685 970 8 -853 -819 -23
672 -23 797 621 46 -745 -687 -136 519 654 -37 -953 -585 229 919 662 -187 -731 -413 159 689 593 -524
693 -524 -841 -701 259 1170 523 -414 -839 -414 269 1019 759 -72 -781 -288 330 460 276 -552 -660 -288
713 -288 370 727 408 -456 -769 -417 537 844 292 -441 -476 75 834 810 222 -617 -815 89 633 1021 168
734 168 -298 -303 15 502 840 -208 -392 -522 -3 931 872 191 -818 -569 364 661 490 -357 -639 -291 220
755 220 894 313 -419 -1095 -597 325 735 574 -15 -583 -186 200 309 511 -252 -649 -176 293 294 335 -432
776 -432 -628 -382 613 468 249 -294 -312 -187 337 619 -83 -236 -243 148 557 578 55 -232 -375 -90 244 530
798 530 7 -426 -468 159 421 46 -311 -774 -612 224 840 463 -234 -513 -483 206 545 -3 -280 -780 -93
819 -93 584 447 268 -328 -601 -229 246 528 249 -149 -478 -359 327 613 219 -217 -628 -86 448 488 -158
840 -158 -135 -602 -179 350 311 106 -176 -295 316 153 419 -220 -424 -299 -22 491 418 -23 -272 -362 127 475
862 475 491 -132 -371 -252 200 597 472 -234 -334 -269 57 420 393 -496 -532 -76 72 161 312 -256 -475 -436
884 -436 299 853 132 -69 -412 -294 213 322 331 -255 -375 74 244 176 59 -221 -698 -416 29 167 98 -98
906 -98 -425 265 118 334 93 -202 -471 70 399 399 -13 -398 -404 60 443 56 -369 -333 -426 240 554 459 -304
929 -304 -203 -241 164 426 141 18 -2 -149 417 77 106 -125 -269 -111 275 309 128 -213 -236 43 84 13 208
952 208 -164 -440 -374 567 317 44 -409 -146 119 423 420 147 -512 -142 -230 162 271 38 -378 -259 -115 437
974 437 420 -263 -335 -106 173 -98 508 -47 -190 -47 -206 -7 -118 -335 -314 81 328 456 130 -2 -77 -225
996 -225 211 315 237 -36 -194 -16 375 174 -158 45 -191 -190 253 206 55 -118 -234 -105 413 421 46 -159
1018 -159 -281 -20 -49 291 69 -457 -259 -386 263 318 231 -276 -165 7 473 377 -167 -133 -315 -101 201 297
1040 297 -199 -242 -200 -152 5 250 78 -306 -103 69 286 315 -75 -197 -38 -67 510 61 -163 32 44 121
1062 121 216 315 -118 -199 -264 38 421 148 -330 -189 -83 175 -1 287 -212 -259 241 53 235 131 263 -178
1084 -178 -204 254 32 141 -148 51 -43 299 99 -7 -291 -120 141 204 345 -193 -196 -425 -57 119 391 133
1106 133 -46 131 296 488 56 -109 -46 50 29 111 -144 85 -231 30 -28 341 -209 -95 -473 11 145 -143
1128 -143 287 -373 -187 -128 73 -2 62 48 -9 9 10 157 55 -118 307 -221 59 64 280 -3 -259 -13 -224
1151 -224 340 23 -165 -41 5 -2 108 -11 -173 -186 -49 48 227 -173 -254 -132 98 192 146 218 -108 -94 -160 270
1175 270 291 70 -149 0 -135 394 14 70 -80 -154 -45 185 96 -81 -473 -200 -73 209 275 -199 -279 -22
1197 -22 -20 276 -268 -289 -250 297 -38 136 15 -13 -208 -241 54 -71 87 -213 -153 6 74 211 124 -246 26
1220 26 369 165 237 79 -102 -58 233 277 251 -83 35 144 149 -83 392 -50 -221 49 151 148 104 -60 -5 -130
1244 -130 62 58 431 101 -402 20 69 102 43 -52 -75 72 -147 165 202 -30 -108 -58 40 7 324 -12 -24 17 50
1269 50 141 315 -156 -145 93 300 99 -22 -118 -124 1 139 108 -115 120 -74 164 154 108 23 -149 -217 -99 64
1293 64 24 -219 -165 -36 -102 7 -153 149 -217 -58 94 26 69 -104 92 15 242 10 -181 -110 -129 -116 -203 -30
1317 -30 30 8 -14 -431 -45 156 90 -196 -181 -44 135 19 -58 -78 13 -45 60 134 104 50 -156 -191 -40 7 20
1342 20 -165 -25 -151 120 345 25 14 -350 -306 10 203 -120 -202 -308 -72 219 152 -86 -80 -147 158 -158 14
1365 14 -144 162 129 58 38 115 49 -118 -233 24 224 -59 -139 -144 -53 -28 70 -73 -33 -168 180 29 57 -236 -208
1390 -208 -127 -129 140 182 -176 -373 319 94 239 -290 74 -256 -342 153 273 70 -204 -132 -151 -250 296 199 59
1413 59 154 74 129 -120 33 -206 -109 -220 -131 -101 -174 29 125 -37 81 104 42 -43 19 83 210 1 167 -52 39
1438 39 -455 253 148 49 -12 141 7 227 3 -50 -56 -322 -32 113 217 120 239 33 -290 -121 -277 184
1460 184 14 -82 124 117 135 187 300 -134 254 87 468 154 -294 3 12 -188 216 131 246 104 -139 82 218
1483 218 26 223 -276 -98 -2 -196 -43 24 -30 89 -248 -213 -265 -249 -261 -133 75 77 88 -48 14 -182 115 26
1507 26 -53 -145 -40 249 1 2 73 -46 126 -72 -41 -110 67 71 -79 13 1 50 1 -173 -235 -91 193 228 61
1532 61 28 0 33 200 -142 5 -94 -330 121 119 15 -356 77 -95 131 69 -41 -83 183 -112 50 178 -175
1555 -175 -282 5 164 16 -106 -34 245 -32 329 -29 192 -31 243 -49 -120 94 176 -2 -173 -63 -21
1576 -21 -61 300 -196 -61 26 353 353 41 -114 -77 104 -6 224 -97 276 10 -97 -105 -18 -283 -50 98 -255
1599 -255 175 72 -9 -409 -278 75 14 -44 170 -74 74 -39 333 -301 -110 -285 -326 -162 -100 -77 -159 3
1621 3 -63 152 -15 191 -151 -303 -276 -17 -124 118 -172 -132 -165 39 -109 -1 -20 -131 49 -64 -114 -47 27
1644 27 -39 154 -54 -2 -88 189 -32 138 -178 126 -191 -137 109 -25 323 22 93 170 236 123 11 134 -145
1667 -145 -67 215 14 45 -112 123 -168 72 -199 -241 -221 27 17 117 100 -217 342 -122 -113 -170 -95 -38 -149 -181
1691 -181 -166 -272 -46 198 58 -95 -251 42 38 -148 21 222 -220 -308 -62 138 97 -220 115 -204 -164 215
1713 215 -47 161 -16 219 -24 151 19 -42 -6 249 122 -72 33 -141 101 -120 130 208 100 -6 -123
1734 -123 206 -234 -12 -110 219 172 21 53 -161 -60 -243 -19 -136 123 -128 88 75 111 29 -39 -224 -106
1756 -106 61 5 -33 69 -175 -212 -5 -62 -163 166 278 -515 113 81 99 97 30 201 70 125 302 78 130 -338
1780 -338 -195 172 -147 -155 195 -155 -87 139 -10 -236 97 -202 -49 177 50 11 -134 113 19 -204 -211 112
1802 112 152 -144 108 89 50 -77 -25 50 38 15 100 132 -216 267 -141 -136 -75 189 351 309 -141 -27 201 -109
1826 -109 21 -74 6 153 -118 27 -268 -252 76 235 314 222 249 -183 -293 10 44 175 122 72 122 75 61 -204
1850 -204 -48 0 155 -26 24 191 -204 7 109 -207 147 39 -227 247 45 154 105 -159 -46 108 54
1871 54 35 98 -23 -134 -164 -154 -104 -86 83 170 55 45 151 -275 3 37 -96 -115 77 43 2 -162 -217 265 102
1896 102 -183 68 123 -24 167 -215 21 -23 -39 44 62 -117 -147 9 -71 -15 134 -49 45 -26 -244 73 -22 154
1920 154 -7 268 -1 15 -112 186 183 32 -190 -146 -173 150 -109 -130 -2 -385 214 -101 -199 -53 55 197
1942 197 29 109 -47 -7 43 34 81 6 175 -45 205 162 102 54 -31 -203 134 189 -153 98 -113 9 89 -169
1966 -169 34 -265 -20 -176 -196 -81 106 -48 -230 -256 38 241 -51 58 -150 86 -185 -145 24 -51 21 -81
1988 -81 -236 -304 148 -76 -71 40 74 20 53 -4 116 -139 289 48 9 10 98 -161 -173 219 -59 48 -134 31
2012 31 70 29 294 173 40 -68 -34 -153 199 -142 59 -144 23 89 13 -58 97 87 103 13 -66 92 -170 -289
2036 -289 117 -42 -148 -134 162 -178 -16 -124 38 -151 24 -75 50 -283 108 68 -171 -154 -226 -37 -178 -79
2058 -79 76 -133 -105 -256 40 -12 120 96 -100 -60 -104 -83 122 17 183 -42 35 -42 -111 -135 -254 219 -133 -251
2082 -251 -30 38 268 53 -377 -35 -127 -14 -180 255 226 179 -341 -108 -108 -18 -25 -83 126 -92 -191 195 -294 -36
2106 -36 -188 -192 118 382 149 -214 178 71 -14 348 124 -69 115 9 -207 -78 -167 -278 -298 -121 -39 -97 87
2129 87 2 239 -161 -115 35 9 -370 208 94 -202 -83 259 -64 -137 -15 101 153 11 63 173 114 186 369
2152 369 -245 -29 -199 6 -155 30 -301 125 123 58 -26 202 -152 70 99 0 347 -5 74 1 -31 21 -24 111
2176 111 -79 206 -146 47 -81 228 47 150 -50 271 225 -19 231 11 107 41 -218 49 44 -208 -39 25
2198 25 -374 61 -65 -255 -44 164 46 7 -105 117 250 0 -181 49 -271 64 81 -136 20 -53 -228
2219 -228 94 -105 252 13 44 -119 -84 -39 -123 -57 23 16 14 0 -92 16 -291 139 -318 -135 -235 -54 -230 -89
2243 -89 322 151 -176 294 -101 17 78 -25 50 -52 21 -126 153 -118 25 -36 -78 1 -236 0 84 37 171
2266 171 90 -259 177 -122 -289 25 283 75 -47 -56 -290 -140 -31 -8 -69 18 -175 18 -466 -119 -78 -114 249
2289 249 151 180 161 54 51 -261 -16 -126 -17 -50 -101 187 -260 23 239 -28 26 -143 -266 80 -117 -30 84
2312 84 -106 127 -228 22 -141 96 362 4 205 -175 -78 -443 -113 95 236 -82 1 -24 -142 -29 37 -244
2334 -244 138 7 -68 305 27 -194 30 27 -327 425 62 -167 -205 -48 -145 -12 94 -45 -105 -16 12 -185 -7
2357 -7 114 4 -87 -132 339 67 -262 -87 -183 -132 -96 -36 -123 48 101 165 163 -98 -12 -157 9 -280 -2 15 -45
2382 -45 -77 132 -35 126 -180 -60 202 -13 141 -26 103 -196 -288 -252 240 -5 175 -237 -167 20 105 -117
2404 -117 -76 61 -340 -221 274 -189 -2 95 191 94 53 86 -28 -17 -11 -51 -132 166 -191 56 194 138 9 11 273
2429 273 286 97 -112 -183 138 255 102 89 -88 164 19 274 260 -138 -39 87 105 132 -124 23 -159 -76 53
2452 53 -168 -58 137 -9 162 10 -88 -36 -1 -83 -94 -130 40 -357 -122 130 28 181 -142 -93 140 -195 -69
2475 -69 232 26 22 -65 37 -26 196 -10 187 308 -123 130 -83 -96 -55 174 50 -39 -267 183 -142 -153 238
2498 238 -212 -307 -89 198 -42 55 -5 160 -97 178 -140 -25 -154 -188 -16 -86 78 -223 43 64 90 174 101
2521 101 48 231 36 -55 -475 205 307 -90 -27 -107 174 60 28 -14 -151 246 -67 -97 0 -191 -8 -230 168
2544 168 -191 -17 -35 -90 25 65 -23 223 39 93 194 -55 -5 -19 22 -454 -133 -86 367 -154 -7 -152 -34
2567 -34 171 -26 -174 -71 205 -32 88 -79 83 182 452 -171 61 -60 -17 -129 -104 -424 -128 34 252
2588 252 85 -22 71 384 177 373 -110 -47 166 155 122 -267 43 -214 13 -36 125 -396 -592 -112 33 272
2610 272 46 -273 -62 38 221 -62 -171 317 -135 -191 -15 56 -159 -124 -116 157 -108 -20 254 -100 -12 86 97
2633 97 -45 201 -276 -201 147 -172 -157 -32 -156 -56 188 -76 -104 -72 -52 2 204 -85 -85 44 -306 -251 -143
2656 -143 229 -231 170 -87 -200 281 66 -149 -112 -88 -233 -185 -30 80 -306 51 95 -68 155 -24 228
2677 228 -249 25 -237 182 199 -234 228 364 -74 -13 -104 -84 -93 66 -88 67 342 11 -230 -172 -42 -169
2699 -169 313 -90 -57 246 -25 -212 313 98 -284 -116 -138 -214 74 170 -104 -54 98 -89 106 -26 55 123
2721 123 -24 126 -55 114 -102 -59 13 92 24 159 -110 209 173 35 60 112 46 54 84 278 95 -343 -57 75
2745 75 102 371 -33 -94 -16 -84 152 50 -29 -281 251 -107 66 69 -151 78 -248 190 -83 90 142 -145 -39
2768 -39 -12 -44 161 -155 20 240 -76 15 8 -122 198 135 99 75 -167 265 -90 -180 87 -83 284 56 -62
2791 -62 -35 24 -97 -92 169 110 -279 139 -6 106 33 237 176 -21 137 -115 164 230 185 54 268 -75 -171 54
2815 54 29 117 18 355 217 -97 -314 -51 66 76 160 171 -51 -155 22 -71 -82 34 -168 83 -11 -229 208
2838 208 34 45 -218 -179 117 -176 23 -244 240 5 19 -19 -193 -32 245 171 157 -72 101 77 -142 90
2860 90 -249 -115 178 198 160 68 -64 -19 34 -13 -57 -222 -178 157 -58 182 100 253 45 -247 -40 161 12
2883 12 -72 -165 -1 -77 -204 163 301 -168 -145 122 119 -74 -167 92 213 44 123 -89 -55 -85 -114 -43 237 -323
2907 -323 -44 -109 -114 15 178 201 -80 -36 139 -105 -146 -93 -76 -98 69 8 -160 342 83 213 162 -44 132 71
2931 71 -115 -170 12 140 -60 85 -291 -275 -93 122 12 55 134 -292 8 169 -9 -69 114 -149 -115 -354
2953 -354 49 -214 -83 215 -65 23 -93 19 191 131 216 315 197 -62 278 248 79 40 380 236 -36 80
2975 80 15 -188 66 159 -163 -296 -145 -15 148 27 -125 -266 -25 33 103 -71 69 -38 -31 71 -5 -69 -95
2998 -95 -136 -106 -157 85 187 232 -20 -72 64 -120 -27 0 104 135 -40 301 -147 119 -235 34 122 -30 -16 190
3022 190 -114 -120 9 112 -51 -282 98 -266 -75 -139 103 320 227 -150 238 -198 -29 -170 106 -109 -126 -78
3044 -78 -187 95 -58 -464 -36 154 -183 40 -269 239 -144 10 -365 -129 -400 -42 -38 -83 44 -207 26
3065 26 307 -97 -19 -17 -276 221 43 34 -138 43 -145 -53 -223 -98 328 245 11 139 -31 30 -398 -69 135
3088 135 -46 -312 -14 -49 67 -87 -23 -88 -91 147 -5 38 -124 204 -198 -142 -117 -94 -83 135 -33 -217 -222 -256
3112 -256 268 -280 78 13 15 -228 62 40 224 107 -69 157 204 -184 -5 139 -23 231 247 -83 2 67 -207
3135 -207 60 -144 8 -17 -39 -59 -68 68 -81 -120 18 4 27 -458 96 -14 6 -112 117 9 124 -103 206
3158 206 295 -243 5 34 -75 -49 -34 -112 -271 -57 67 -94 -133 300 -23 93 96 225 194 305 252 -148 164
3181 164 -94 150 45 -129 -144 146 -92 -103 135 164 218 -165 144 62 -211 35 -322 90 -126 208 255 -94
3203 -94 115 70 80 -232 144 90 72 337 -132 -66 -199 -280 4 174 -274 -283 -79 198 58 256 -257 -44 179
3226 179 -195 113 -285 182 -46 164 137 287 -81 8 -3 -77 105 -151 83 -188 267 23 -94 -313 -40
3247 -40 -109 246 81 -262 -98 83 173 274 -372 155 -173 -578 -187 -71 -228 -87 6 76 -48 -69 42 15
3269 15 155 50 85 -64 94 154 -180 -78 -55 92 -123 -180 -53 -151 -23 129 -94 -160 -54 12 260 54 50
3292 50 -140 -35 -94 -161 -73 -197 53 -219 59 -162 -67 145 -332 16 -85 136 249 -255 -168 223 -45 68
3314 68 114 -37 -182 211 157 142 -316 -62 92 -33 110 -45 -254 43 201 -95 61 131 -11 -97 -70 -419
3336 -419 -31 29 145 36 36 -139 -132 155 -237 -258 48 123 30 87 -202 -229 -37 -116 61 -294 -34 32 -107 -113 -5
3361 -5 -70 -100 -143 -111 -207 115 -119 110 148 -143 135 -57 129 -25 -179 -263 96 -38 -116 226 -260 97 95 -3
3385 -3 -21 -72 -57 287 202 -218 -67 217 19 23 -103 -2 -233 107 -48 -83 -156 301 -23 74 -36 -31 139 -99
3409 -99 68 -168 -134 132 139 -42 -66 219 82 -150 206 -130 90 -162 22 111 72 -343 26 239 -116 56
3431 56 168 -65 -103 -169 -60 16 -111 -3 162 -191 -88 159 -27 347 86 -150 36 73 -281 96 7 -71
3453 -71 -51 316 130 -49 -87 37 -77 -201 -260 20 12 -361 281 84 98 144 64 109 114 84 -73 -125 -144 -23 -23 -147
3479 -147 -99 69 25 440 112 -163 119 93 213 19 -182 -135 84 -98 -45 69 -211 -253 228 -21 358 74
3501 74 110 -192 183 122 53 -265 -305 -41 -202 193 -26 -2 -34 43 2 -235 -224 71 213 349 19 -132 -327
3524 -327 43 211 16 -68 -7 64 -11 -320 -57 -168 54 -336 185 105 -73 -5 26 19 92 114 -116 84 26 17 216
3549 216 203 -52 86 -18 384 79 -21 241 -68 -109 50 -100 -13 -73 182 -78 42 -51 54 79 -107 192
3571 192 347 161 44 -153 -155 -208 321 -70 103 -142 73 -99 400 63 -350 -6 96 90 22 64 -224 56
3593 56 -77 113 -7 290 233 -249 32 96 -153 46 56 69 -103 -79 -70 52 151 19 -137 163 -18 104 90
3616 90 61 -247 -4 -286 311 -60 -130 253 112 38 -169 -1 -192 26 -8 -283 -502 83 -102 -84 -226 -74
3638 -74 52 16 85 -288 193 249 -82 80 67 -202 -222 175 354 -225 28 12 73 56 -101 16 -44 83 -23
3661 -23 -208 97 -172 -149 172 -34 85 18 -223 134 347 63 -254 287 -46 -258 31 35 -184 81 -237 -26
3683 -26 -139 -93 143 67 -285 13 134 33 338 65 179 -73 152 150 69 174 101 -55 -125 -170 164 -192 46
3706 46 13 2 216 -6 101 -102 -256 -13 44 188 -43 -64 -213 -40 303 -175 93 -287 -24 -42 -155 134
3728 134 347 198 166 -83 105 -141 151 407 -7 -128 -149 196 -148 -1 -74 487 251 61 62 -155 139 51
3750 51 18 -22 52 -188 223 172 51 -124 11 -54 -43 -36 150 309 -26 162 224 126 -7 187 -74 -80 -130 -143 11
3775 11 -148 -117 -58 5 0 -182 32 -62 136 -19 -12 141 64 -120 176 -253 195 58 -479 -84 -5 -74 -70 150 78
3800 78 210 -29 -253 -59 151 -21 245 -2 17 196 15 -13 196 -268 -20 -398 -13 192 -275 -141 -6
3821 -6 178 141 -41 -58 -41 69 -160 -131 -16 -41 63 78 218 128 -5 1 -24 26 -206 188 238 -181 -73 -20 102
3846 102 -131 31 71 -177 -47 3 -83 -115 45 117 48 41 131 108 113 114 -98 -67 77 189 37 42 -147 -34 -29 191
3872 191 75 93 100 159 -187 -118 -130 48 297 10 160 -277 -42 -211 -61 149 142 -217 183 86 -259 -115 -222
3895 -222 285 40 3 -156 -38 171 137 -112 26 -3 -63 152 -123 -263 -37 120 -63 39 105 12 -232 106
3917 106 -67 145 -43 -233 -1 101 -178 74 -129 70 160 124 50 83 65 75 110 125 271 -376 -6 158 -21
3940 -21 -48 -55 88 118 -16 137 -68 9 -43 -281 -105 71 234 195 127 201 239 171 -139 195 220 239 35 7 132
3965 132 19 153 186 140 -8 -146 100 -199 161 -54 -107 77 -19 -54 152 99 -233 48 -118 287 220 -71
3987 -71 -42 161 -238 77 -7 -178 320 119 -10 -158 132 129 84 24 -141 274 178 332 -95 123 -137 87 -196
4010 -196 113 387 -77 58 158 -213 189 -7 -246 197 -1 -91 46 -56 64 72 -195 -3 -4 -58 -38 185
4032 185 73 -60 71 177 53 103 182 85 181 99 253 251 104 47 32 171 122 207 -34 -187 84 -185 -114 -2
4056 -2 -80 -18 108 51 -161 145 21 109 -28 -30 147 -98 -19 186 217 -28 100 58 -115 -11 253 67 -372 -230
4080 -230 173 153 161 27 99 -82 159 -183 103 -64 40 -113 -62 72 125 240 85 -212 -358 40 21 32 -168
4103 -168 -191 5 -156 -96 -196 -39 12 -94 -217 -178 18 -102 102 320 -38 15 -12 -191 -62 -73 60 -48
4125 -48 -233 125 -249 4 262 -91 -96 8 -6 -247 -163 213 -169 -14 291 -51 6 5 -43 -325 -242 59 -24 -257
4149 -257 76 142 -118 -226 -18 -159 87 -40 113 176 -151 211 114 -259 235 -134 31 -158 -63 32 -121 127
4171 127 66 56 23 -163 -187 -157 -48 -36 -142 -222 31 65 -145 -32 77 -128 -307 -51 17 -85 -323 132 380
4194 380 278 36 -83 -47 214 -15 48 25 133 -342 3 -34 -80 -54 -80 -115 70 155 -109 206 -165 -170 -126 41
4218 41 -254 216 146 120 -54 -259 39 -227 -194 293 185 236 -9 61 133 60 -184 17 2 -234 -57 157 37
4241 37 74 -237 107 34 142 79 -18 -103 123 -35 -48 -78 -119 189 -35 58 113 167 -97 16 -4 -18 -90 192 -54
4266 -54 144 263 187 142 -59 -19 238 50 198 -186 39 -296 -91 -71 -53 -94 246 -133 -84 9 132 23 305
4289 305 190 -237 74 152 45 97 -133 247 -23 42 -120 -39 45 -174 -36 -9 85 -1 47 -56 -23 35 -42 227
4313 227 51 -34 163 -47 72 -243 -83 -126 -69 127 -200 244 -77 -88 146 -4 95 58 67 85 91 18 4 -97
4337 -97 -12 29 -200 -125 -26 152 -137 -220 -113 26 136 148 -11 -45 -235 38 86 52 252 335 -98 -164 88 12
4361 12 36 198 -131 11 -216 -207 291 49 12 249 167 -409 -231 -70 92 22 124 244 -67 117 78 191 25
4384 25 19 -315 140 132 -30 -68 -11 -20 -175 -22 -36 109 161 -78 346 -11 -21 -408 17 433 134 8 -185 -19
4408 -19 -13 -212 -83 156 87 140 101 -73 -149 4 310 98 136 200 -188 238 -32 -6 35 361 255 189 209 241 -21
4433 -21 -39 33 32 63 -97 -283 -116 72 101 208 56 -101 -123 42 -337 202 69 -63 380 64 -31 -227 -98
4456 -98 35 -170 -79 -118 -106 322 48 -131 33 6 -220 -2 250 205 -149 -71 217 141 97 1 -15 -131 246 23
4480 23 -102 134 -182 -22 -92 37 112 -39 261 172 -81 -69 96 -25 -103 181 179 97 13 34 130 -13 44 61 -55
4505 -55 -31 -213 -62 191 -88 258 110 91 -52 -320 141 64 -65 221 71 41 127 157 -63 -11 306 115 50
4528 50 62 349 175 31 15 405 7 120 78 -2 -102 -8 243 -69 -126 9 -39 135 98 285 79 -19 22 149
4552 149 8 95 -194 -62 -196 49 -41 208 193 -347 103 70 18 -143 -37 287 85 148 -64 9 71 -206 11
4575 11 -95 50 -261 -9 19 -128 48 120 169 326 204 -62 18 -93 -24 86 -210 100 -164 -89 -473 33
4597 33 63 -190 1 -70 110 112 -90 90 -76 121 98 -106 50 18 62 10 54 -216 141 120 92 -63 -99 -256
4621 -256 -93 33 -76 -141 -81 -375 69 103 51 4 -116 -49 -34 -137 59 206 -240 -6 63 -21 -21 55 337 100
4645 100 49 -373 36 -234 180 -105 182 326 124 -89 -77 112 -242 -37 10 -210 106 27 94 -68 -66 -153 -17
4668 -17 168 -144 -48 307 -25 -102 -37 81 -36 -6 340 120 211 -93 91 193 -167 -132 209 13 -97 248
4690 248 -42 -140 144 173 -116 128 -141 -196 -135 114 -77 -56 259 -234 165 208 -119 103 -65 342 63 -50
4712 -50 -256 -229 16 -98 44 -42 -267 235 447 -110 -89 251 18 90 134 -116 45 -107 118 187 56 49 302
4735 302 -207 61 94 9 -44 -29 -114 170 92 108 15 -61 3 -6 -225 -110 180 -67 70 -32 124 -237 -283 -100
4759 -100 46 303 -59 7 6 69 140 110 -6 -154 -31 -108 59 82 82 178 -240 -60 59 -158 -4 -176 204 72
4783 72 18 62 92 -179 19 18 47 -62 12 101 -37 -168 29 25 -79 71 31 94 135 -222 73 -32 -66 296 6
4808 6 309 -14 -81 -95 255 11 215 -55 184 106 180 -201 -280 -18 -156 79 242 271 36 -141 53 -82 24
4831 24 -148 -221 166 231 14 319 17 1 31 -146 17 -124 105 132 -102 -184 56 -123 -124 -103 -130 175 21 177
4855 177 130 86 -140 -213 17 91 -170 -97 -135 -160 101 116 267 -105 39 107 -124 61 -169 18 48 158 283
4878 283 149 183 -65 4 188 -43 -19 114 95 -5 -204 -225 136 -157 -135 133 -198 52 0 -142 67 -54
4900 -54 47 153 -161 121 -39 203 177 -254 52 -177 217 -67 84 -102 81 160 123 -276 -230 -10 127 -272
4922 -272 262 380 108 -3 130 31 11 11 -258 336 82 -79 70 91 196 206 19 221 -104 181 -11 -100
4944 -100 -164 164 -42 36 1 47 -304 9 37 74 64 -10 -48 284 220 149 -15 -271 88 -183 -162 28 71 -82
4968 -82 -171 -75 137 22 -102 -268 -146 -3 -22 -74 -100 -97 54 127 122 349 -59 60 -206 -85 -182 -247 -150 -148 15
4993 15 55 92 -123 109 92 162 92 85 -64 215 34 -118 93 -25 110 70 -180 213 59 7 -169 -26 18 -112
5017 -112 -21 126 -122 -321 -143 -142 189 54 -40 78 -78 1 -291 260 92 98 -103 -46 -18 213 -55 -48 -73 157
5041 157 -233 -93 91 -167 79 -31 -29 100 27 61 -146 10 382 182 -233 -88 -61 30 17 16 -156 -53 -117
5064 -117 32 164 -96 -196 -195 -281 95 -64 272 -194 -296 -183 -43 90 -40 -118 -9 -69 179 95 -109 -83
5086 -83 45 -10 236 374 -281 152 -180 19 -216 -80 -13 18 -42 -149 295 8 -27 59 83 -85 30 1 5 176
5110 176 92 8 75 137 18 -100 -34 -177 252 6 18 172 -101 -9 75 -173 1 222 53 147 157 301 75
5133 75 -101 -245 184 132 59 24 -280 -190 -112 -180 29 -274 -21 -88 -140 -84 125 154 -153 -221 77 48 150 -232
5157 -232 82 142 -61 180 -78 109 -65 180 -50 -142 -293 -285 -44 -32 165 30 183 58 197 42 28 -1
5179 -1 26 124 261 164 -147 -93 -166 -60 8 3 -110 -79 158 212 -265 -67 -165 -67 88 -91 192 -239 -131 39 67
5204 67 -68 -28 139 154 -193 -352 11 416 118 -200 -154 -215 110 -193 93 113 -227 305 -207 -69 -11 -21 26
5227 26 303 -337 80 -55 39 -30 193 59 -144 249 80 13 -232 -205 -21 93 14 161 -146 -154 49 42 -127
5250 -127 117 -105 -44 113 -16 120 194 216 101 -140 213 -16 33 94 -263 0 171 41 99 -92 -43 293
5272 293 135 131 108 188 -119 11 17 -291 347 -218 -138 -120 68 71 6 48 -105 -45 143 55 -105 -151 97 255 30
5297 30 -109 -109 -47 41 12 -308 -109 -125 236 -74 201 -20 -86 23 101 -174 106 26 -37 208 -113 -102 33 -10
5321 -10 -256 -147 -155 -28 -4 -72 52 106 73 -79 48 27 -125 321 -155 -60 -153 8 -218 -64 -94 -49 54 118
5345 118 241 -16 -133 309 -132 430 375 149 219 111 252 -65 91 -121 -81 -156 146 -126 -319 130 242
5366 242 -33 29 -232 92 295 -80 118 358 -1 303 80 -71 -128 -156 83 -376 62 169 49 -187 270
5387 270 -174 -157 -65 -113 -276 -17 -218 20 157 -78 19 16 248 -192 165 -18 54 -90 -66 66 249 -165 -114
5410 -114 28 -83 -229 196 -125 -162 -89 17 153 71 -96 181 102 -177 2 240 -160 94 241 -23 196
5431 196 86 -146 176 64 19 172 53 212 -296 37 98 277 137 113 159 98 110 252 -128 -34 -222 36
5453 36 -274 359 -25 37 215 44 -12 -89 10 57 -114 -267 145 -203 343 -173 45 103 -30 21 -96 234 -28
5476 -28 84 -261 5 -118 -220 182 -425 -332 -234 104 16 190 259 -73 -72 -84 36 211 98 32 83 -11 10 66
5500 66 -177 -177 -93 240 59 63 -186 144 336 345 168 -127 347 -101 105 131 313 -81 146 -22 -23 163 8 121
5524 121 -88 153 125 51 -98 305 78 2 -120 191 56 220 -50 62 -21 -38 163 165 203 -93 325 -73 -273
5547 -273 225 144 -57 -261 107 16 244 122 1 -12 194 34 218 -46 -150 9 -169 115 372 0 25
5568 25 -71 181 -171 -299 1 -88 -31 -61 237 33 256 61 -134 50 160 -70 231 307 -107 103 -140 -90
5590 -90 34 -142 48 -17 12 -133 54 102 -256 -169 177 -60 -109 65 50 230 295 -135 -201 229 123 44 -180
5613 -180 -252 65 58 -227 -46 54 51 -221 183 -6 -3 -32 18 39 41 53 111 157 36 41 114 239 -125 14 164 -112
5639 -112 224 159 58 -172 -139 72 213 175 181 177 111 -163 -242 -324 174 93 207 -144 69 186 -4 -118 -140 208
5663 208 232 92 34 144 -64 102 124 -303 337 115 -157 237 129 10 195 81 190 -123 77 16 -95
5684 -95 210 -44 210 -34 -10 -317 211 202 -72 110 -18 -110 247 139 136 -101 -258 -24 -63 63 -54 138 -21
5707 -21 -54 -145 34 -423 -136 143 -57 -84 -5 -202 -70 295 -171 -156 54 58 -42 70 254 149 -307 -45 -91
5730 -91 -30 -3 213 -75 170 -19 233 2 168 -304 48 230 -72 56 -109 145 47 104 49 -99 -195 93
5752 93 112 43 98 105 36 215 -357 40 20 -60 -176 -4 -116 152 -159 258 -236 -50 110 -179 63 268 2
5775 2 -195 165 -163 136 -17 -136 41 -187 18 -147 -213 281 217 234 -244 51 319 -52 37 5 -36 -171 -253
5798 -253 -209 10 167 197 -36 127 -37 -71 254 40 117 -63 115 240 -7 191 -283 131 -48 -133 -23 -152
5820 -152 74 -171 119 82 -185 221 -86 -26 232 33 -114 214 79 98 -11 -2 -209 -150 -75 190 89 -97
5842 -97 -25 196 293 30 206 119 -12 71 226 122 4 -74 314 57 -365 51 -215 59 327 180 -204 107
5864 107 -236 214 166 -43 -40 -252 -200 -120 51 58 268 126 170 152 84 188 -92 -131 87 -203 -52 -27 6 211
5888 211 -10 0 145 -122 41 -62 41 74 -85 -95 121 -253 -182 -2 -54 -164 323 219 -180 37 211 -36
5910 -36 125 -163 -95 -361 118 87 82 -329 -177 -100 63 93 126 -83 -180 13 -72 -59 -14 -111 -77 55 -158 258 99
5935 99 151 -142 20 75 135 -4 251 -60 106 5 -39 -32 -180 -54 -74 -17 90 -180 -107 12 119 -273 68
5958 68 85 -175 259 10 -223 168 -148 -23 48 -17 215 -201 30 82 35 325 76 38 -10 -168 -38 -192 -8
5981 -8 -173 -125 65 50 -124 352 -88 -43 175 301 65 -273 52 190 214 57 144 43 -130 73 102 51 70
6004 70 216 28 49 103 -44 131 -268 29 -88 65 -316 -104 122 56 -65 263 -80 -31 -106 -237 -76 230
6026 230 110 -216 274 -129 29 -210 -171 -45 -102 -17 -64 177 137 162 251 48 89 179 26 179 -81 -5 -212
6049 -212 -48 -170 44 93 -37 334 -88 -279 -22 -192 -147 1 -157 -252 29 -11 -39 -139 -282 202 19 -131
6071 -131 -81 -17 35 -95 67 -228 -169 -149 364 195 180 280 416 27 165 -55 -22 177 -45 243 147 138 -239
6094 -239 40 -292 -31 272 213 -260 111 -34 -51 34 -111 85 351 40 -344 -73 -184 192 -109 123 -7
6115 -7 161 177 -229 -225 83 95 251 230 4 -80 -259 153 62 177 201 -35 168 28 -187 -135 -51 -236 -177 115
6139 115 16 -88 10 23 107 47 40 -208 -123 93 -127 110 186 -313 47 -93 -65 86 32 -165 -57 129 222 -63
6163 -63 65 163 -134 65 30 -269 44 379 -196 66 467 157 72 -1 70 178 5 136 179 -272 -257 76 154
6186 154 28 -72 141 -439 263 116 -286 40 44 -159 88 50 -63 142 35 215 90 228 -122 61 -15
6207 -15 -30 198 -127 -99 232 80 -114 -52 -85 -153 148 -32 177 -165 -5 -136 32 28 -48 -298 -439 132 50
6230 50 -166 121 401 -5 -56 196 94 -77 -204 -165 11 58 -165 -62 37 32 -150 -156 -44 190 305 181 93
6253 93 -89 136 2 103 183 30 225 -94 -173 145 32 354 -27 -180 -26 -156 12 36 -42 430 17 -52
6275 -52 1 -28 38 174 6 -118 205 -26 -285 -10 90 31 198 -327 1 113 22 -190 -5 82 -95 -314
6297 -314 28 -27 32 32 -134 26 230 128 54 -84 207 -92 116 108 57 92 -95 -269 -25 -85 78 -169 -227 186
6321 186 -85 -1 139 148 -219 -40 208 54 -171 -19 -110 -56 -134 285 -71 -233 -80 60 144 308 -66 -172
6343 -172 389 83 -271 163 12 37 283 -160 94 77 142 35 -10 0 -90 46 -14 268 -345 -404 160 -208 17
6366 17 -223 -103 -93 10 80 -238 3 -140 -58 -89 227 26 -212 188 -134 -179 -102 326 125 -102 38 -53 -302
6389 -302 -4 -48 -38 -4 8 193 -22 112 -149 120 22 237 -235 292 -92 87 94 251 -45 -23 295 -29 107
6412 107 -135 76 156 -120 268 -453 296 37 -6 86 183 193 131 -286 -117 -55 -263 79 -92 8 257 -367
6434 -367 172 78 25 -19 190 -57 -113 256 -189 10 101 -191 94 56 -102 -89 -14 231 -91 -236 185 -283 -66
6457 -66 -13 -2 -89 -108 -40 -33 42 91 5 118 70 -38 12 91 159 -151 -124 30 26 -169 111 59 126 -10 8 -50 -136 111
6485 111 128 -39 26 -44 201 23 9 11 -151 0 184 -65 116 -75 -108 47 -55 8 -108 451 -56 -10 51
6508 51 146 -83 -273 -172 -63 172 -34 -111 -43 -149 297 -117 -23 -59 -43 44 182 -28 -114 -123 93 -32 -77 -184
6532 -184 -249 27 -156 -5 -62 -55 -52 3 -266 -260 40 42 -174 -98 137 350 101 -66 264 -164 122 5 231 82
6556 82 -98 -279 -81 109 -144 -8 85 55 -15 57 278 -116 -126 184 153 73 95 152 -2 -105 -17 -94 -378 163
6580 163 58 -83 245 194 163 45 35 -190 101 -109 122 107 -163 -6 43 -24 199 161 33 -81 95 141 315
6603 315 60 58 123 47 -100 170 19 163 -93 -79 141 202 417 175 -23 160 290 -298 240 58 91 99 -113
6626 -113 -43 24 152 -28 -72 -22 -23 -255 -11 22 157 -113 -168 -84 -121 129 -36 101 114 88 -309 79 -108 -92
6650 -92 48 -67 -233 -29 133 22 -36 -7 31 -116 176 121 94 114 -131 -133 -65 -129 121 -259 -120 82 261 87
6674 87 13 -217 -66 1 11 -189 75 -46 56 -2 -124 -92 463 68 41 -187 74 -75 -306 76 130 2 -239
6697 -239 -77 -113 -153 -10 90 32 -15 -71 -83 -38 -31 -131 331 280 205 -52 45 106 274 120 -94 -230 -164 29 50
6722 50 234 4 -144 -152 63 -77 -66 -67 86 -283 -18 128 130 90 7 -240 94 294 -115 155 78 -26 13 293
6746 293 132 7 351 15 -94 162 298 308 389 51 29 -54 -359 -94 150 -162 -16 254 -7 235 -52
6767 -52 -143 15 24 -14 -37 272 -358 -180 65 -151 -68 -35 184 152 102 -224 -57 248 182 -17 -15 30 -394 251 -158
6792 -158 -81 64 315 -134 -136 -62 10 90 -127 -162 -74 104 -142 -89 -61 -160 23 100 174 135 67 -178 -133 93 27 -35
6818 -35 126 164 -205 -86 -218 176 -56 -79 397 -58 230 114 260 -66 -105 17 154 129 27 87 116 -21
6840 -21 286 -14 -54 -73 98 -118 105 142 -202 -24 21 -31 -20 -39 61 -145 249 425 192 139 -193 123 -292
6863 -292 31 -95 -287 -99 75 -44 -63 -87 -65 -13 -12 35 51 172 -220 14 -16 -74 -234 127 -188 -85 -73 -24
6887 -24 56 -148 213 14 52 49 141 -347 62 -44 -113 28 48 -204 51 76 194 48 -130 0 136 -413 9
6910 9 105 416 -103 183 -53 -201 56 -26 206 -77 -122 45 87 130 -20 355 50 29 -244 -52 -35 185 11
6933 11 78 -54 60 18 92 -7 98 156 140 -197 -118 -254 66 77 126 77 -360 63 -231 -99 95 73 -149 -93
6957 -93 187 171 73 5 -35 96 33 86 -157 -73 -13 -113 -81 -140 -95 -13 -170 -26 349 -14 37 64 12 -78 -28 3
6983 3 18 280 -323 12 158 -52 -79 -267 29 -183 71 78 -137 -28 -134 180 -2 154 127 130 -68 115 -12
7006 -12 19 -76 80 161 -67 -43 -280 28 -79 12 -12 -83 3 -192 -159 483 -137 144 -267 -39 -35 145 57 43 -169
7031 -169 35 101 -52 -88 -28 -141 12 102 295 5 -60 -51 -137 -38 -387 -169 -217 -147 -100 -116 -207 63 -17 -3 -50 -170
7057 -170 -93 -6 -2 -127 -123 41 71 -80 -74 -251 -227 -225 -139 -82 333 1 234 100 171 43 58 134 -85 122 76 448
7083 448 -160 -25 -15 164 201 -93 -16 42 81 -72 79 -48 -254 196 -148 -95 385 213 -171 -107 -158 172 -171
7106 -171 -160 134 -75 219 -63 178 36 -25 151 58 -107 -84 207 64 63 124 12 47 62 22 105 227 -58 141
7130 141 46 -61 91 34 -221 -82 -68 -105 131 319 -25 -105 -47 -260 12 -85 -105 -22 245 -80 -245 -171 39
7153 39 207 -7 -193 -132 119 190 -24 -12 -154 73 161 -123 -11 -88 58 -149 -58 73 235 -289 -213 -130 -90
7176 -90 23 -18 134 346 -46 173 345 -86 -270 -225 -52 -70 -34 19 260 58 185 32 74 129 -95 -265 280
7199 280 -4 -136 -16 -2 54 -114 250 222 86 -153 -129 -4 0 83 -38 88 103 -174 -98 -169 113 80 129 -224
7223 -224 171 113 -201 147 -102 191 83 -3 -276 -51 42 2 -44 145 -125 -192 71 230 -184 -122 196 -84
7245 -84 39 203 143 289 -165 194 311 -66 -73 -57 -63 10 227 -109 138 152 270 93 116 -113 99 -265 94
7268 94 12 -78 -48 -8 264 -133 24 -12 139 -184 -341 -5 90 -89 11 -176 -227 156 131 -9 -420 -43 -79
7291 -79 111 -57 -60 101 -188 -200 8 -207 104 85 53 -181 143 152 118 -145 65 56 120 245 270 -204 90 -16
7315 -16 -198 -102 -75 142 59 111 -35 -112 57 172 62 278 -209 -119 80 -39 -49 -167 237 128 26 -178 314
7338 314 74 89 159 -168 -184 58 217 -160 -96 -25 -42 37 161 47 3 -78 220 -179 -82 -4 -39 34 110 65 -284
7363 -284 -150 -22 134 -408 -114 219 -220 -170 76 -69 139 -384 -147 60 41 118 -117 133 219 99 -102
7384 -102 222 -80 101 24 65 14 -56 -87 117 175 1 203 35 -252 -68 -48 73 -119 293 -215 -99 94
7406 94 445 -143 -33 93 -13 267 35 140 110 95 90 -98 70 -77 -105 51 -490 -200 -26 294 4 217
7428 217 55 -125 -48 -41 -142 393 -160 111 137 236 6 40 113 -17 -192 208 171 30 -10 345 -51 108 58
7451 58 -154 136 130 161 -33 172 -341 -103 209 296 234 -95 -207 -2 -263 -164 33 -13 -19 -106 -76 6 -166 167
7475 167 353 -190 -19 126 -28 73 -38 -1 139 -152 22 -66 125 -226 130 -68 -70 128 6 4 -250 -66
7497 -66 -63 -49 25 8 78 132 -167 -138 -231 -272 174 111 64 -16 -312 -223 -198 -324 -357 -109 -202 220 -108 214 129 -271
7523 -271 51 69 354 10 239 140 -268 -89 -6 -280 141 -345 -387 101 281 43 -150 131 -11 73 -198 -229
7545 -229 -263 73 147 146 246 -35 -182 131 227 -50 127 91 -53 78 182 -183 -65 -99 -57 -56 186 -19 9 -34
7569 -34 -213 245 35 -198 107 -155 -33 -250 7 34 162 -191 23 51 37 -78 52 152 476 -186 -45
7590 -45 8 -59 133 -42 49 -23 141 210 206 51 124 -22 12 149 269 -69 28 -36 151 -87 133 251 226 183 -90
7615 -90 155 -12 37 -314 78 -182 31 -117 140 380 64 -35 -80 -113 -169 -9 115 -58 -56 -83 49 -85 44
7638 44 -123 -155 56 -73 -70 -37 -110 64 -196 -92 272 30 -12 10 45 41 -61 -292 185 -443 -166 59 -237 -2
7662 -2 49 -260 -250 64 21 -25 -129 -85 -142 5 125 143 -30 20 92 -139 -221 96 -62 -39 60 -28 -104 -36 -51 86
7688 86 -368 -181 81 87 -308 -77 -33 150 493 -111 -115 -98 -137 -49 -226 22 -40 -248 112 52 -131 82 20 224
7712 224 -331 305 195 -97 121 -19 -219 -131 84 -42 146 -90 -206 -79 -198 36 -7 -53 72 29 272
7733 272 65 -123 -104 38 151 216 -92 -278 11 244 -130 131 -79 151 -53 -204 -65 118 -62 0 -131
7754 -131 -168 6 -38 -36 -265 -420 53 -1 169 452 -170 10 132 -105 -84 443 -162 43 -130 -211 218 -75
7776 -75 -43 -24 -143 30 -1 -158 114 -255 -5 -160 -187 -178 -77 205 217 -105 -17 -85 -50 -71 156 -122 -80 3 -46
7801 -46 176 28 128 121 -169 358 191 505 -113 28 -147 401 -273 148 92 -80 165 159 -62 129 177 3
7823 3 77 16 101 -305 30 93 -1 -191 -40 81 105 -8 -118 292 -66 242 -86 -37 -71 285 -150 109 361
7846 361 397 60 -134 190 9 348 25 -86 -120 -111 97 149 -16 38 447 -156 263 -126 -87 -220 -274 -16 26
7869 26 137 -87 94 -40 -270 66 108 -132 -72 -139 -32 -51 28 139 223 78 -88 74 -136 -50 231 -44 322
7892 322 -237 35 56 193 -100 236 -237 103 99 74 -80 110 335 -177 53 295 -174 -260 40 -283 138 -337
7914 -337 -137 -46 157 -165 -31 -11 -371 -67 -8 341 8 4 90 -64 84 -85 -228 -85 -64 213 -178 -76
7936 -76 409 -171 26 10 -84 -170 -35 109 70 227 -344 -141 155 -60 36 209 -66 -134 60 -76 -56 -157 -257
7959 -257 36 175 63 25 -165 -139 136 224 -4 -18 -16 -30 -145 -275 43 69 122 54 130 288 138 49 -325 50
7983 50 -1 90 -129 89 -51 264 172 114 -111 -50 182 164 133 362 35 -285 -63 -134 50 -281 -14 203 2
8006 2 65 26 49 21 190 -76 -150 86 41 -130 72 -98 64 -22 -56 55 30 -32 -84 -113 -260 176 -46 -12 -198
8031 -198 115 -73 165 116 278 -46 -163 48 -124 23 -38 -51 375 -136 -185 25 115 17 -73 92 -37 145
8053 145 -108 51 12 35 -150 151 -220 134 -111 -266 110 46 295 -45 -22 31 -308 131 127 28 -15 38 -227
8076 -227 102 18 180 54 -183 -41 -71 -141 136 75 203 47 -282 -114 -83 269 106 124 -68 18 26 177 -344
8099 -344 221 -14 -169 33 -268 13 179 -99 -11 143 -116 205 113 165 56 109 7 -50 -40 139 177 -403
8121 -403 -77 -69 40 -55 -128 -32 191 -119 -11 63 274 120 -39 116 -471 -137 107 122 3 210 -115 150
8143 150 32 -84 56 -34 -29 -6 -181 -109 50 171 -76 -9 -13 -158 148 63 -313 -2 252 -21 -198 -239 117
8166 117 58 -49 80 239 67 159 -23 -199 -161 21 97 85 154 -120 -151 89 -241 143 -182 -426 -2 23 25
8189 25 -108 -21
8191b1
$$ Imaginary data points
##PAGE= N=2
##DATA TABLE= (X++(I..I)), XYDATA
0 0 0 0 0 0 0 0 0 0 0 0 0 0 -3 8 -8 8 -8 8 -10 16 -16 17 -21 24 -28 32 -36 41 -46 52 -60 65 -73 84 -92 103
36 103 -115 126 -141 156 -172 191 -211 234 -260 287 -321 358 -401 449 -508 579 -668 779 -927
55 -927 1136 -1447 1960 -2973 5742 -27910 -105722 -74157 -5486 48811 38803 -3690 -37108 -25744
69 -25744 12984 42094 31027 -5437 -35771 -33681 -5693 26230 34613 14239 -18615 -30895 -13759
82 -13759 11569 14912 -7528 -29003 -24257 515 16921 3746 -24847 -38499 -24023 961 10174
95 10174 -4042 -23689 -28612 -17264 -3953 -2719 -14542 -27741 -29441 -15626 3779 10690 -3576
108 -3576 -25417 -33604 -19203 2936 10183 -4032 -22226 -21415 -503 17925 12640 -10263 -26548
121 -26548 -19668 2745 20043 17930 1882 -10952 -9056 3878 14968 14652 3461 -7489 -7035
134 -7035 6860 21086 20972 5646 -9505 -8512 7422 20661 17400 2491 -6208 85 13039 16944
148 16944 7760 -4330 -6210 3483 14332 15849 7113 -3140 -6573 -875 7788 10773 5109 -4396
162 -4396 -6980 942 11069 12939 1689 -11320 -12431 -468 12337 12201 -380 -10840 -7923 3977
176 3977 11093 5504 -5987 -11215 -5934 5043 11545 8046 -2577 -9915 -7940 1601 10120 8965
190 8965 -385 -8721 -6699 4330 11959 7182 -4554 -11271 -5126 6392 11429 4811 -5706 -8697
204 -8697 -3022 4426 5167 -205 -6636 -6649 -1455 4619 4747 -1027 -7846 -9984 -4526 2876 4824 -1123
220 -1123 -8816 -10227 -2974 4277 3418 -4940 -11682 -9051 183 5849 2733 -5634 -9967 -6688 552
235 552 4015 1095 -4519 -7239 -3999 1868 5541 2653 -3890 -8086 -4533 3437 8393 5224 -2932
250 -2932 -7136 -2629 5244 8172 3260 -3853 -4870 676 7681 7928 2238 -3303 -3484 952 5807 6225
266 6225 2663 -1463 -2166 1305 5669 6092 993 -4078 -3833 1704 7094 6202 -42 -5231 -3853 1990
282 1990 5765 3252 -2657 -5360 -2015 3226 5085 1711 -3436 -5443 -2551 2207 4128 2260 -2101
297 -2101 -4721 -2762 2058 4472 1543 -3501 -5583 -1826 3958 5950 1579 -4310 -5362 -612 4258
312 4258 4776 781 -3456 -2731 875 4296 3849 84 -3215 -2879 686 4166 4125 966 -2853 -3207 304
329 304 3667 3132 -718 -4019 -2733 1581 4373 2637 -2272 -4437 -2860 1485 3186 1207 -2259 -3684
345 -3684 -1932 1251 2069 265 -3150 -4183 -2155 1284 2884 341 -3177 -4787 -2088 1694 2924
360 2924 -68 -3542 -3896 -519 3208 2933 -869 -4258 -3696 150 2966 2423 -14 -2486 -1935 161
376 161 2746 2859 67 -2278 -1968 952 3668 3306 38 -2815 -2446 1258 3860 2821 -294 -2532
392 -2532 -1442 2032 3223 1714 -1600 -2378 -983 1846 3014 1440 -1039 -2432 -779 1345 2125 1030
408 1030 -1619 -2410 -914 1849 2453 558 -2316 -2894 -792 1991 2465 -26 -2200 -2357 -203 1881
424 1881 1835 -218 -2317 -1751 159 2171 1923 -113 -1909 -1678 648 2466 2152 -74 -1848 -1396 758
441 758 2753 2149 -503 -2380 -1075 1537 2715 1954 -954 -2018 -931 1095 2267 981 -793 -1915
457 -1915 -683 916 1734 916 -1487 -2039 -1188 812 1513 352 -1635 -2229 -717 958 1555 5 -1966
474 -1966 -1661 -251 1080 992 -555 -1975 -1361 88 1426 1274 -644 -1990 -1762 -5 1404 837 -591
491 -591 -1876 -1276 649 1542 1356 -448 -1913 -914 760 2109 1066 -550 -1253 -548 972 1982 939
508 939 -759 -977 -292 1267 1723 626 -775 -1559 -573 945 1702 883 -862 -1517 -415 1140 1445 221
526 221 -1326 -1340 -337 1168 1423 -11 -887 -963 -266 764 891 -363 -1328 -917 95 1320 595 -530
544 -530 -935 -1208 -6 1195 649 -396 -1143 -1009 446 1210 687 -484 -1254 -345 675 1656 477 -624
562 -624 -978 -312 893 1592 573 -242 -1154 -416 776 1391 342 -770 -1280 -460 866 1457 710 -771
580 -771 -1300 -257 926 802 243 -837 -1217 13 1051 706 -166 -1332 -1090 -181 576 567 -229 -1181 -946
599 -946 -117 687 648 -490 -974 -819 103 1388 893 -533 -1105 -537 494 1179 645 -542 -1063 -307 909
618 909 1093 553 -428 -970 -508 628 1092 528 -415 -1072 -388 865 1083 444 -767 -828 -142 1163 1367
637 1367 524 -568 -1123 -352 847 965 49 -776 -1074 174 754 718 -122 -828 -1135 193 831 707 4
656 4 -811 -684 -289 796 538 -183 -882 -842 191 983 579 -328 -881 -722 384 755 476 -495 -758 -436
676 -436 234 483 432 -284 -912 -143 423 982 502 -427 -448 -73 606 917 261 -849 -650 30 957 813 42
697 42 -358 -938 -246 1142 880 201 -499 -574 -72 563 658 -145 -384 -763 117 590 834 -315 -647 -693 261
718 261 1091 444 -127 -717 -537 452 585 335 -477 -575 -295 321 540 263 -259 -496 -299 336 545 499 -420
739 -420 -551 -102 553 999 201 -442 -576 -247 475 1068 364 -631 -564 -62 583 528 246 -624 -840 -182 458
760 458 769 20 -424 -762 -449 401 533 29 -705 -564 221 506 495 -207 -627 -461 163 475 295 -308 -206
781 -206 -351 220 290 316 -233 -413 -331 -5 630 151 -307 -883 -577 302 396 549 -105 -659 171 445 399 78
803 78 -503 -290 -360 770 523 245 -258 -265 106 371 601 -63 -379 -480 325 163 301 107 -636 -372 -254
824 -254 320 613 139 -562 -521 2 457 223 123 -436 -514 275 827 357 -51 -674 -640 -69 512 336 -280
845 -280 -390 26 371 65 373 -480 -330 -407 538 381 208 -304 -416 -352 102 425 -4 -287 -587 -149 559
866 559 548 395 -551 -288 -43 453 517 279 -204 -376 198 437 286 131 -148 -476 -201 560 494 -62 -282
887 -282 -436 55 520 289 39 -333 -237 119 217 110 -386 -538 -302 -99 14 295 -140 -249 -514 188 300
908 300 293 79 -621 -193 77 503 142 -266 -355 -253 442 841 277 -152 -462 -53 206 157 -25 -245 -256 250
930 250 324 415 -70 77 -136 54 277 99 -281 -315 -139 46 186 247 32 -181 -183 224 593 353 89 -213
952 -213 -183 -339 234 81 -35 -180 -187 337 717 375 -145 -244 -99 312 238 -101 12 -306 -253 107 190 363 -421
975 -421 -442 101 37 424 124 -331 -356 -121 476 255 -54 -173 -252 50 383 277 220 -40 -283 78 351 249
997 249 104 -214 -137 -160 58 127 -37 -271 -46 -2 368 247 -128 -398 -57 -11 304 447 -46 -225 104 175
1019 175 167 179 -201 -369 -268 220 273 -204 -425 -131 -371 -197 319 151 -281 -266 -292 346 500 82 -20 -362
1041 -362 -174 238 94 206 62 -218 -84 327 531 411 -461 -152 -135 304 46 333 -257 -157 39 212
1061 212 188 40 -396 -147 -280 157 359 133 -349 -191 -144 149 38 16 -89 -319 -21 152 30 -118 -86
1082 -86 18 285 35 45 11 -125 -326 68 58 220 -537 -256 -227 33 218 -327 82 -53 -67 -223 348 277
1104 277 -288 -348 -15 -119 50 360 -66 -275 -64 -73 80 15 159 31 163 161 226 50 73 32 -3 340 48
1127 48 203 -89 -105 28 274 288 213 -68 -205 -91 222 -97 124 -188 -115 -51 -116 416 -6 -214 -64 -88 -281
1150 -281 21 -234 -286 -32 144 87 11 114 -223 -74 200 -22 173 115 -212 -205 187 -52 -56 86 40 -75 214
1173 214 104 252 -129 -254 195 -6 80 112 -188 -528 49 1 274 261 -159 279 -80 -92 243 130 -138 -368
1195 -368 -137 -163 -35 -16 -120 -246 21 129 132 -244 -167 -167 24 278 312 -278 -107 -265 17 151 -17 -49 -262
1218 -262 -176 9 5 242 14 -197 25 308 102 218 61 -344 -53 62 -15 134 -355 122 -277 -255 479 0
1240 0 81 -188 -155 -155 169 -91 -62 -192 -71 -208 41 128 -232 -175 -45 -59 -138 138 -106 -97 -198 431 6 214
1264 214 -157 208 -326 172 9 38 -37 -66 165 25 0 -230 97 58 5 199 -30 -167 -184 -21 57 -379 -163
1287 -163 -104 -99 -35 231 -191 -28 -398 -106 -301 206 106 298 -174 -382 -28 161 249 -137 -168 -287 -8 -108
1309 -108 88 150 62 -188 218 0 -75 19 -221 -146 69 235 265 44 -346 -325 -41 50 262 131 -81 146 -13
1332 -13 202 130 -167 39 136 73 185 67 129 -95 -74 213 86 -208 -166 -381 -113 232 3 242 -252 -96
1354 -96 -52 347 47 178 94 -132 -34 141 96 -30 -249 76 -7 239 331 144 -342 -118 152 -209 -60 73
1376 73 -29 -259 -123 218 -81 127 17 -133 -63 174 -189 -173 -9 -51 -62 100 126 -231 -102 -49 -14 86 -76
1399 -76 148 -123 324 69 268 162 -66 -51 -57 -150 -81 -84 48 2 -114 129 9 242 -164 -43 102 106 -160 87
1423 87 -149 -77 -256 228 -103 -220 -125 164 46 88 29 46 -277 -152 -229 -82 5 -22 -116 -124 172 199 -27 53 55
1448 55 -167 302 -116 13 -124 131 0 -43 34 91 39 -7 -111 260 194 69 267 -82 258 41 -78 -203
1470 -203 -18 54 61 136 -37 9 -132 -71 -184 -187 103 51 263 -309 34 97 46 -169 9 166 -173 204 210 -278
1494 -278 -91 46 -268 -17 -29 196 123 -152 -95 12 100 -209 92 -51 67 -195 254 -76 -198 -297 -254 21
1516 21 -188 -31 -213 -286 -247 134 338 260 -312 -208 36 47 249 -300 123 24 -429 187 89 220 109 -76
1538 -76 125 107 138 -35 159 87 -101 -112 2 -68 -248 208 -131 311 -88 -161 -31 -31 113 35 288 -110 55
1561 55 149 -148 -203 -143 -245 91 175 -124 242 -213 -9 28 -150 116 -114 131 157 -34 127 181 20 -40 21
1584 21 117 201 57 -238 2 -101 -192 253 96 -200 -138 496 -283 52 149 -85 66 -187 -200 113 55 -87 -54
1607 -54 -288 -132 213 -99 128 -108 -299 -234 95 1 -300 -105 -112 -77 14 76 -5 64 58 20 15 8 -3 -35 67 105 -43
1634 -43 286 61 54 -414 49 230 -152 -89 64 135 -236 133 160 -153 -115 70 -14 150 252 -100 -254 -48 -75
1657 -75 145 40 -70 11 -4 -181 -402 -164 107 84 247 77 29 177 -77 235 61 6 108 -12 -237 -95
1679 -95 165 1 253 -204 28 250 -237 -117 -13 41 29 121 27 134 -133 -107 -377 227 267 -15 -101 -146 20
1702 20 -123 38 9 80 -342 142 290 -125 -177 147 133 190 -223 -91 62 197 16 -252 246 78 -15 198
1724 198 131 15 6 -291 189 41 -276 16 -74 150 44 -157 43 156 -190 132 -41 -216 -154 26 52 55 99
1747 99 342 28 115 -109 3 -129 -36 46 -255 343 -94 -246 -22 159 -60 -304 -24 -95 -46 -307 174 50
1769 50 -59 49 37 -340 -151 146 -229 -8 220 82 287 88 -132 -66 102 -8 -19 -201 -181 94 70 120
1791 120 -117 118 310 -11 -43 -24 -61 164 -20 46 -295 70 100 364 166 -151 -111 31 -19 -56 37 -357 3
1814 3 154 140 11 198 168 49 430 -82 21 72 6 -65 -9 -170 -237 110 -217 315 8 26 -48 282 61 -122
1838 -122 45 -24 -54 322 0 161 -150 -232 -42 135 114 14 28 -86 -159 1 166 131 -127 44 90 -47 -327
1861 -327 -58 -222 -7 66 -156 -334 66 -37 -341 -97 65 -130 178 -10 -64 133 -70 79 56 64 24 239
1883 239 263 -57 -92 -206 -232 -131 -308 -150 38 60 -57 -44 -60 45 -29 -61 -69 169 -288 -178 -32 -283 -60
1906 -60 3 -103 -220 52 -33 106 163 19 36 -60 -45 -102 -170 150 77 -135 -146 -179 88 107 -46 -63 173 293 -179
1931 -179 -220 -186 105 -87 140 -49 -176 172 62 -128 -62 -114 0 -56 -75 143 -6 208 140 -4 -221 -270 60
1954 60 115 178 -64 70 120 -116 52 -25 -166 42 28 104 216 -115 -174 -96 -4 230 135 35 -42 -175 104 241
1978 241 3 67 -58 -120 135 -44 -61 -13 205 -152 -1 -104 -150 -144 -6 -84 -171 104 322 -273 -71 87 -198
2001 -198 82 11 -168 42 35 39 -204 -147 -164 28 -70 79 -141 -421 -276 102 220 143 16 -178 179 71 130
2024 130 -218 73 70 -92 -35 -181 91 304 -119 -137 -163 217 6 -127 -164 232 56 -52 237 -179 -54 -210
2046 -210 -147 -185 183 172 21 -320 -14 -25 -8 -35 71 -317 66 -190 83 -199 -18 49 -248 -79 -194 63
2068 63 79 41 5 -115 -26 43 7 14 -70 72 376 -599 66 -61 124 -203 225 -260 7 65 -285 -80 79 -113
2092 -113 1 122 -162 192 190 223 -55 160 -101 310 -11 169 -227 -183 310 58 4 102 -137 -252 178 51
2114 51 -63 33 97 284 226 51 -3 -144 10 -58 -238 81 226 -176 -171 95 -112 -17 -265 -35 -113 -251 253
2137 253 15 172 -11 -115 132 -30 -210 -72 5 -36 -74 -192 62 87 318 -188 -14 -204 114 43 -159 -39
2159 -39 -238 -25 -158 -140 -152 71 -330 -439 283 299 31 23 -143 -46 23 314 -121 -120 -97 120 -135 131 -70 -206
2183 -206 -92 -122 163 43 246 298 165 147 -357 -137 -19 27 -258 62 -56 190 125 -243 322 32 27 -144
2205 -144 -197 -170 87 -15 -30 2 -139 -194 -120 21 22 5 63 -36 4 -205 -13 -226 -109 211 235 -159 -14 -179
2229 -179 195 384 96 -36 -227 256 -29 -132 -216 -28 70 -164 -319 -74 221 -85 33 128 238 -169 -166 -123
2251 -123 57 -39 159 -134 289 -116 132 -1 -84 54 -6 -147 -394 -45 -8 -280 54 -21 272 345 156 -77
2273 -77 -371 -118 -166 271 169 -175 -21 115 5 -221 -95 -11 -31 -56 20 226 45 -233 -93 -108 49 -107
2295 -107 90 205 120 12 -202 -105 265 -73 79 -89 -60 -172 88 -164 168 -176 21 -108 151 48 243
2316 243 26 46 -220 124 53 -39 -230 -160 -218 359 -11 11 59 126 493 88 248 -242 102 3 186 -24 255
2339 255 137 -18 -125 -34 17 52 -351 95 -38 93 249 -164 -18 51 50 132 -21 -243 54 -146 16 93 12
2362 12 -31 258 -229 63 112 147 37 -107 224 203 -184 -150 -52 13 208 -122 93 -199 121 -58 -321 -172 59
2385 59 70 -24 -5 74 35 22 25 -330 203 -59 -59 135 -130 324 58 106 -104 -185 -96 -313 -30 -49 -296 -132 -232
2410 -232 78 -8 -62 116 129 41 21 -268 -157 8 -80 -44 -280 130 68 26 -130 -181 -298 -193 -448 -16 -46 21
2434 21 -17 68 153 -237 -116 -83 35 -34 -37 -424 21 -139 -298 252 62 -90 -82 198 -99 47 137 61 -239 -167
2458 -167 131 -121 95 93 -102 -46 17 54 -29 -163 151 108 65 -29 -79 -58 74 -171 40 -7 202 -109 -65 13 -28
2483 -28 -3 -93 -20 298 247 -203 -69 -297 -162 147 -124 -59 96 -43 209 -126 105 1 78 125 62 -173 -149
2506 -149 -296 -108 385 125 190 -75 -223 159 -59 -40 273 184 -81 176 100 85 -429 56 193 -32 -22 197
2528 197 -22 -83 -24 2 -52 30 249 -124 -25 -138 111 -125 -349 -142 -117 -129 -124 229 119 -158 95 169 343 438
2552 438 -267 -9 -144 -333 -33 -69 -198 -84 29 -348 -135 -106 -29 60 -7 6 382 -49 87 162 247 -79 165
2575 165 69 10 39 -81 -439 31 49 -58 -135 -32 -107 -123 -81 88 -96 -262 65 -315 -112 226 42 -111 -259
2598 -259 -76 -88 -60 322 128 62 -50 -102 78 100 -2 33 -74 -3 244 165 211 -4 60 -182 -44 64 90 217
2622 217 -418 243 1 66 27 -148 -128 62 3 -57 -122 28 87 -149 19 404 36 46 -31 -35 -202 -107 1 -117
2646 -117 217 -26 212 141 145 -164 -133 -368 -32 71 175 206 85 150 91 53 238 70 -264 -196 61 -145 8
2669 8 213 19 102 158 -69 -52 -153 135 -210 52 16 -25 141 139 172 -22 139 8 327 -130 192 31 -67 -137
2693 -137 128 72 -108 -89 83 181 -29 231 2 -2 166 409 90 -47 -284 -63 -94 6 -67 -103 -136 68 -120
2716 -120 -383 249 -81 -59 -79 415 331 -49 13 146 71 -297 -56 -243 76 3 -22 -96 70 255 -137 -152 135
2739 135 97 128 -113 20 -61 9 207 -78 -165 -148 -66 -77 -136 -100 -37 131 -76 160 232 224 -121 77 -134 97 -2
2764 -2 -41 46 -37 3 205 130 -28 -274 39 -190 -226 205 201 -96 -134 123 -131 158 -244 -23 16 -100 -83 18
2788 18 -174 -232 145 6 196 83 -18 -211 -51 -81 365 -144 271 2 104 9 223 -221 -252 228 -1 98
2810 98 -84 108 189 111 55 -43 187 -69 -39 -73 302 -22 90 147 104 61 -75 -68 -97 295 -138 5 13 -54 140
2835 140 220 -45 215 120 105 143 -191 -72 -253 -8 161 43 16 -129 197 82 197 65 -44 17 -107 -55
2857 -55 280 220 -275 -9 -54 -136 10 29 64 -110 -197 -36 153 72 33 -200 230 14 -95 39 32 -91 -174 86
2881 86 196 -81 -48 -67 -220 -160 246 97 149 -149 -42 249 153 2 -46 137 79 -80 -24 -90 -137 97 165 -22
2905 -22 175 -177 107 126 184 87 -187 -168 189 47 -76 -254 51 39 28 169 58 188 22 -122 77 -46
2927 -46 41 87 -124 -87 104 52 30 42 -137 -222 -112 137 -128 -67 20 124 -186 -15 -180 283 -121 -137 -90 74
2951 74 -233 188 296 108 -106 -106 -172 277 -147 -151 -146 -61 -246 -228 2 -238 -143 137 46 -64 -3 -61 202 151 87
2976 87 165 -212 271 -114 180 -56 313 -33 54 189 -249 -55 -31 -45 -68 182 133 67 -232 6 -103 -147 -45
2999 -45 76 -153 -277 48 -99 68 432 -88 -138 58 62 -105 -100 -178 141 116 -139 -181 153 -220 25 -137 -34
3022 -34 151 -53 -104 176 -19 62 6 -173 -319 -50 191 -275 388 40 196 135 209 -55 42 -13 -114 84 2
3045 2 254 -27 -252 5 -72 54 223 -79 -273 -56 56 -17 38 -305 -253 -58 -223 108 -94 49 65 146 221
3068 221 137 -132 37 -246 108 -98 -8 242 17 7 24 33 -141 98 -21 -96 11 336 -243 -109 176 48
3090 48 169 -183 34 56 235 46 -33 -115 71 37 66 -106 156 -26 -231 81 54 -146 121 126 36 -96 372
3113 372 -380 -390 -176 28 -3 -12 -334 251 -43 57 0 -112 8 87 157 13 -18 -51 -30 -13 113 -2 376 222
3137 222 23 -95 253 -55 -51 -2 32 -240 -6 -338 -67 99 36 31 95 -2 277 -97 -109 -52 130 48 28 194
3161 194 -252 34 251 -33 -11 122 -13 238 -412 -16 2 208 -62 -26 49 -102 -205 243 -66 10 20 -9
3183 -9 123 -39 42 56 207 128 81 -137 166 240 -8 410 -143 35 263 -140 181 15 159 51 46 107 -217
3206 -217 67 -311 -8 -45 124 30 -241 68 -141 17 -78 -44 -109 -112 144 -271 -43 95 120 -113 -26 -305 68
3229 68 164 86 157 -46 29 88 169 130 -137 160 -219 -500 112 113 -116 50 93 -73 -62 16 -96 -3 107 61 67 -7
3255 -7 274 -35 -208 92 194 -68 280 -122 -35 177 163 229 -170 -219 -83 153 106 -22 74 139 63 239 19
3278 19 24 137 -92 -33 -216 48 41 24 -155 270 60 -20 12 -79 -248 -67 175 -1 -11 83 -240 -128 360 171
3302 171 -189 -273 18 20 -41 -28 -3 16 -286 63 -132 -10 282 -317 -14 35 -114 3 -170 115 205 23 35
3325 35 -154 142 -164 217 -115 -108 294 -94 -22 -138 -83 52 44 113 -152 -31 108 -36 -41 108 240 -114 67
3348 67 46 196 -93 -230 -6 -311 130 276 221 207 -173 -18 -130 21 -250 150 40 -89 -125 78 237 118
3370 118 -112 136 -168 -338 -114 72 48 87 151 -226 246 -194 -262 -171 289 181 -82 -1 -184 7 -63 179
3392 179 43 238 256 51 -26 103 323 78 5 -163 6 148 -31 86 -81 19 -17 149 65 236 -62 106
3414 106 -35 268 -10 97 25 -202 -135 -77 213 23 -201 -64 22 -42 -64 96 -23 110 202 156 -46 -147 0
3437 0 -273 -244 133 -310 -76 -52 -120 -15 126 199 -141 -174 -208 -295 70 32 171 -29 256 -119 -163 -42 -23 113
3461 113 -92 183 57 304 -67 46 -113 46 200 -176 -131 -103 -60 53 173 13 -28 201 17 -11 156 -27
3483 -27 21 -174 -129 -36 -36 -143 123 -15 -93 -53 -149 -177 -198 246 97 23 -5 140 -98 15 75 31 -18 -186 -169 -75
3509 -75 199 283 -112 153 -1 101 -46 -46 -109 -140 -337 48 224 -120 52 -234 -108 -7 -77 -84 -277 -112 79
3532 79 -105 135 -112 -63 -42 -185 -94 37 -23 -6 132 37 49 -81 80 -63 -174 230 3 -194 -36 -45 -25 229
3556 229 -165 133 -54 -184 -17 147 -22 -279 26 -73 -38 126 56 144 104 66 -236 18 32 -82 -68 -91 -76
3579 -76 165 38 51 -138 47 -88 106 -57 88 57 -130 135 -322 3 234 -91 128 84 -156 52 -38 -58
3601 -58 -91 125 -187 110 -70 -30 -14 -157 -164 95 118 -60 49 -76 25 119 173 67 105 103 -165 -54 25 236
3625 236 -22 -234 -97 -63 -150 50 -163 -5 -30 -20 50 42 2 -48 39 131 55 6 -171 -187 -81 53 -15 -127 206
3650 206 90 -110 -132 203 154 -164 245 -137 124 -401 37 3 -199 -143 -324 -58 40 183 43 -61 -124 -114
3672 -114 136 523 -200 -121 88 -144 -47 169 139 -173 106 -135 100 50 164 -29 141 51 -121 75 300 162
3694 162 -86 153 162 20 13 222 -163 44 155 208 81 -27 -303 20 -18 -74 -21 -237 57 -78 40 -203 -202
3717 -202 -2 49 11 25 194 154 -7 -78 178 -88 -101 -149 -164 -154 208 217 26 -427 -64 253 31 -171 -101 175
3741 175 -179 -315 -222 -7 57 374 -10 -231 152 343 -68 -138 -79 -36 -22 -99 -85 4 107 251 172 10 133
3764 133 196 -103 155 79 131 -10 138 262 50 237 230 109 -75 -27 -76 301 105 201 -120 -13 -97 135 -46
3787 -46 20 -7 69 -30 -8 100 -233 -93 358 -156 -76 85 -266 -71 -222 -66 47 -228 -154 167 25 110 101 352
3811 352 -153 -117 275 147 -146 -148 -113 4 2 -6 -125 -76 23 314 -177 20 -86 -164 44 -65 15 -8 50 -122 112
3836 112 -11 49 -81 -6 -45 -43 236 43 -116 -47 -205 -169 -11 -223 -114 231 29 -23 2 224 42 -294 415
3859 415 -70 120 218 31 -49 -56 -52 45 24 -7 25 -162 282 -110 -97 279 -191 -221 84 87 -66 -40 -236 -185 -4
3884 -4 -70 -191 155 163 -235 85 391 252 234 -93 60 85 59 -74 -149 -18 113 -6 -175 23 -96 269 295
3907 295 -26 -151 31 -284 -47 115 -94 38 47 127 90 97 -186 -209 237 -24 -108 27 283 -42 -118 136 -23
3930 -23 -198 -52 -367 -133 -269 -48 -54 75 270 -72 -61 -176 50 117 144 -142 -186 37 313 266 80 152 -116
3953 -116 -137 -61 138 -128 -12 135 183 -239 -47 94 -222 101 112 50 -199 123 226 57 -80 28 -76 63
3975 63 132 7 -310 -96 -91 81 76 80 -73 -250 13 196 41 163 133 119 172 -123 282 -106 -286 -180 10 47
3999 47 -101 317 -8 41 -176 312 -228 -58 287 -75 242 -167 257 200 2 -1 44 -30 260 38 -87 281
4021 281 -41 -67 -94 -167 226 7 -144 -277 -234 75 95 -102 -268 -103 333 122 204 -131 -84 -16 -86 -81 -25 -404
4045 -404 -41 -142 41 21 -89 94 90 150 179 83 -290 81 -79 -137 -111 436 130 -46 -238 -233 -52 -128 136 -151
4069 -151 -10 -139 -149 37 164 -65 -156 -1 -88 172 99 -59 -16 34 56 235 75 -58 -147 -166 -45 -251 -224
4092 -224 -20 106 -71 -108 55 244 -85 253 -162 222 -233 -169 -207 -55 -35 -212 -96 -64 -87 58 2 72 -151
4115 -151 187 -162 -44 112 -46 -10 239 -24 -309 228 176 47 87 -189 -209 -182 160 -91 185 56 21 237
4137 237 -59 -39 36 127 -53 58 -19 -74 -89 3 -98 57 139 -139 147 -2 -28 85 -119 -206 98 -29 -14 -142
4161 -142 132 -23 254 -105 -144 -183 -202 71 -84 -142 -213 87 353 147 -29 12 -94 -72 40 162 -134 122
4183 122 -134 -27 105 -170 -31 -482 -97 328 35 -95 -226 33 -115 -254 252 -144 -42 77 228 51
4203 51 13 93 54 301 206 54 -376 -117 253 -61 114 -93 144 139 85 186 5 304 140 -75 136 176 -19
4226 -19 -292 239 124 159 -185 -45 -199 -20 -124 242 101 73 -33 116 153 59 55 181 -54 -170 242 137
4248 137 -207 34 -86 165 221 -48 54 -236 -82 95 -75 -133 105 60 -153 -121 166 21 -128 -41 -161 -69
4270 -69 -382 -81 89 -9 -29 140 41 40 1 251 191 -244 199 180 63 68 -162 235 158 -202 -53 -100 14 -165
4294 -165 -35 -125 189 -4 -166 72 42 102 11 199 -122 165 191 40 -208 -110 -113 -107 84 194 -68 -198 85
4317 85 -169 71 11 -7 -218 -473 272 71 38 102 3 223 79 -94 -37 169 -39 -99 -83 10 -222 19 -139
4340 -139 168 20 -132 71 -256 -96 -142 -305 -130 100 -61 65 39 5 -55 92 121 -63 -127 0 54 58 -170
4363 -170 220 -258 126 110 -97 -5 16 -62 -298 186 130 -167 82 -114 35 54 -93 -68 -30 -63 173 53 -71
4386 -71 297 -29 -175 108 -240 -193 -80 -17 163 142 279 -22 -60 29 125 -126 -152 -186 99 276 -160 132 98
4409 98 -45 97 158 -221 -59 112 217 182 -176 213 -386 -45 -5 142 -159 -182 -118 -187 -33 12 145 5 -99
4432 -99 -64 -80 -143 -56 84 77 41 -74 -147 -96 -151 -191 -116 -370 -223 -78 -251 -46 190 269 0 -1 319 -389 -119
4457 -119 -45 39 10 -255 -142 -75 -71 -171 169 72 116 71 31 -104 177 28 -104 169 -22 25 -81 64 -67 78
4481 78 -85 13 -21 -49 217 53 120 -14 45 189 -89 -188 -13 -53 -47 132 -28 -38 53 164 -136 181 190 304 115
4506 115 175 -16 146 31 35 138 -80 -83 185 34 291 253 200 -123 2 59 -6 47 -249 77 58 -32 -163 -116
4530 -116 -81 23 -187 -17 -110 14 -91 364 -165 53 116 221 -63 -96 -107 -149 -77 240 116 99 315 -23 -151
4553 -151 313 -94 -73 244 -13 -254 88 169 25 58 49 118 160 92 145 258 -285 107 -107 -133 51 43 214 234
4577 234 92 -96 -71 85 -53 69 62 133 46 104 -116 -424 -95 37 -66 -154 104 14 190 -128 -42 -25 53 -104
4601 -104 -6 -207 59 -149 -138 26 -143 290 268 133 -100 -90 68 -14 -88 -54 -51 105 37 100 230 217 194 27
4625 27 -7 -11 123 161 -106 276 -149 -273 -34 -15 -53 155 -73 68 107 -228 267 44 -32 119 58 -45 178
4648 178 85 -137 -22 85 48 -6 -124 97 -48 -197 -57 -119 -94 -32 -17 -33 -196 -102 50 17 59 -235 -109 18
4672 18 -111 37 124 63 -99 -63 -1 -440 13 -64 -206 -194 56 -295 -146 -191 -87 158 -16 -17 181 292 -66
4695 -66 -60 40 -194 150 -48 -69 -86 174 5 -18 320 -30 -266 92 -132 87 -213 -149 -201 230 208 180 68
4718 68 -122 -94 -144 -147 9 108 -57 57 -4 182 158 146 -1 -159 205 -45 -110 33 -195 16 -73 38 84 161
4742 161 23 148 -89 -44 22 -37 78 -334 -98 63 18 -161 -7 -152 -344 162 -235 155 71 2 217 -7
4764 -7 -60 -351 41 -172 123 -123 -109 -28 -70 -133 -239 -52 0 184 67 -90 75 -100 -222 -16 -152 97 258
4787 258 -216 -33 112 -183 397 -300 -13 -300 -66 -16 20 224 -168 -182 200 -232 -229 105 192 324 -112 -92
4809 -92 174 -140 -6 116 139 257 0 148 7 -16 228 181 55 -203 -55 232 -99 97 328 -297 10
4830 10 227 34 170 -272 165 -82 -191 -206 203 -56 -205 130 195 159 401 -110 -141 -62 215 37 -18 -74 178
4853 178 51 -60 -162 146 -26 -115 -114 267 259 -90 57 -16 173 -161 -78 83 260 -277 24 69 -8 -330 -153
4876 -153 418 -92 -41 129 -226 -62 2 -177 -305 214 -243 -12 -225 -107 206 118 -49 18 312 -152 105
4897 105 -99 52 147 15 -195 181 -107 -35 202 21 -161 -34 -239 -80 24 -73 188 21 -249 -160 224
4918 224 -123 -180 115 115 28 147 80 190 132 -62 -198 -234 -145 -132 31 -187 137 56 12 29 -109 -31 142 244
4942 244 -106 -154 358 234 -253 202 195 -52 -44 -67 277 -138 44 -45 -210 56 185 -22 41 24 -141 130 -139
4965 -139 175 392 194 27 349 -296 -12 -21 77 -204 -200 8 99 387 -16 152 -41 263 164 65 -189 -64 2
4988 2 -122 24 -166 11 -69 -216 67 157 -21 -200 -163 -86 81 41 -12 -151 19 493 182 94 -98 54 -83
5011 -83 111 -192 -115 -46 77 -131 70 -86 79 -178 -160 192 -5 120 191 -35 -86 20 -112 -38 -52 -90 125
5034 125 -50 -80 91 -12 31 352 22 46 -74 -140 7 37 -94 41 -232 -187 8 48 10 204 103 -153 34
5057 34 -42 22 255 -225 92 453 -178 83 55 -155 -72 250 97 99 -197 -140 4 -148 58 -23 19 -170 55
5080 55 -32 18 138 -64 8 -142 -140 81 94 31 -150 -58 147 3 14 -71 173 240 2 13 239 121 83 -111 63
5105 63 -154 103 100 33 -33 -58 -182 -81 -44 21 -188 10 216 -134 -33 70 5 -192 76 98 -247 51 -25 -112
5129 -112 -85 -132 45 -218 -34 57 24 -189 -33 77 62 -168 269 168 3 -2 -22 186 -187 65 133 98 313
5152 313 -39 -80 117 -161 -73 -8 -38 -6 -181 125 -2 66 53 164 -66 -310 -184 102 -224 120 -248 -98
5174 -98 6 27 -99 -220 7 265 -139 356 209 -251 94 106 61 120 66 167 -68 -62 59 312 -213 -130 -126 87
5198 87 72 151 164 -67 173 91 -231 108 107 111 107 -34 22 -39 -17 -26 -76 174 238 67 -165 -310 147 27 -180 101
5224 101 364 190 8 -218 -6 40 51 -116 229 275 36 62 77 207 19 -115 74 133 -166 2 -244 119
5246 119 -202 -15 21 -14 89 61 188 -100 -74 -45 -131 78 -48 -321 -5 139 -274 14 -97 29 -140 -31
5268 -31 -71 93 170 -71 -107 99 37 -5 252 0 -61 -64 35 -104 -36 -84 -48 74 217 -67 -267 -79 248 49
5292 49 164 -183 114 24 78 160 13 -333 268 355 -130 -135 2 144 -87 -55 143 18 -38 210 -50 -128 -105 -107
5316 -107 -37 224 -63 -19 59 -208 -280 -11 25 50 33 -30 -189 -240 -222 -165 -177 315 139 50 -48 -60 96 16 155
5341 155 -155 228 -136 -47 -201 -260 239 -148 144 -25 -28 90 38 242 99 -90 160 -79 161 121 -57 123
5363 123 108 -25 77 -41 41 119 -209 -73 44 -17 162 115 77 149 122 -91 128 -144 -52 -182 27 187 -91
5386 -91 -126 -33 -33 20 279 166 -342 -206 218 -65 196 60 -33 -101 123 241 -105 -197 64 361 83 98 -111
5409 -111 184 88 25 -120 -49 -93 64 9 -41 -93 87 226 163 184 -114 -71 -199 320 -85 -116 95 -99 17 -81
5433 -81 -40 124 304 97 133 -165 -153 139 -228 -5 -55 146 -84 164 112 6 179 -181 80 114 218 -33
5455 -33 187 -140 110 -80 -250 177 81 -27 275 -30 24 40 220 12 -405 273 96 318 -212 83 -44
5476 -44 -46 72 -73 -53 -190 -58 -72 -343 -63 185 9 -81 130 157 75 -209 -127 -72 -34 148 -112 -123 157 21
5500 21 -119 113 -61 -101 -163 92 147 -159 -11 -103 110 -63 256 -257 -114 176 -21 103 -43 17 278 131
5522 131 -192 -41 -240 2 -153 -228 162 -52 44 72 151 -76 -359 -64 -175 -217 -94 -9 44 202 310 71
5544 71 14 -21 -28 -107 -108 61 -96 -129 -156 -247 -120 -325 64 -4 -174 204 80 -93 131 -346 -100 216 81 -152
5568 -152 42 30 65 16 -68 14 101 21 -202 201 -27 24 150 79 -256 229 175 -117 18 -51 -34 -35 130 381 -143
5593 -143 186 -70 300 163 -254 -69 -29 -137 10 148 -148 43 -163 -47 -116 -119 -46 118 -55 121 229 -94
5615 -94 -9 105 -139 -289 164 33 12 170 -80 341 -162 36 -261 -24 14 -226 -41 92 -205 -52 142
5636 142 -283 -85 -292 27 -18 -156 44 109 167 202 95 253 293 -3 7 -87 77 150 24 211 107 92 -365
5659 -365 -21 -25 -232 86 -11 169 -102 50 167 -86 29 -110 -65 -185 -72 75 -146 50 114 -6 -53 -48 40
5682 40 276 121 -116 -168 328 38 15 242 -68 -1 -51 -73 347 93 57 65 -64 137 -148 7 -9 111 -93
5705 -93 171 246 -145 -291 -147 60 -2 31 -40 17 83 -65 112 -178 209 83 -23 70 -181 265 86 -2 -32
5728 -32 -358 -273 -120 45 -65 342 -132 -77 -174 38 166 -35 -147 11 -31 -108 59 -69 24 15 -38 -73 209 -82
5752 -82 -108 177 51 -21 -107 -152 63 -34 149 220 183 -48 -119 31 -3 -225 38 94 47 280 -27 313 -14 -150
5776 -150 -109 277 323 198 -190 40 -6 78 147 -77 176 -149 47 -139 -316 -410 -101 -212 121 96 -15 146
5798 146 -258 116 299 -26 129 -139 242 226 97 0 130 -197 -25 157 145 108 12 84 211 48 185 13
5820 13 90 -79 17 -68 284 -170 -161 18 323 204 145 50 -14 87 -136 133 20 -115 487 -44 10 76 127 98
5844 98 -193 -110 173 195 120 -102 -124 -77 47 123 -52 -10 55 171 -220 -28 252 204 -21 -50 57 -22 -217 121
5868 121 -145 45 63 81 -60 27 -153 -144 -70 55 123 -75 189 170 121 325 -78 -205 -62 -184 129 -203 116
5891 116 243 -238 -113 114 -348 -287 -70 -57 -14 415 -67 -54 186 -256 -68 -295 115 2 -85 -219 68 -37
5913 -37 -233 -197 150 262 314 67 101 145 -84 254 174 -277 46 -51 63 73 26 -137 162 16 132 -151 128
5936 128 -210 -205 91 -89 0 217 -141 -193 258 -73 181 145 166 224 31 356 -81 151 -1 -70 -308 28 -117
5959 -117 -146 365 327 202 155 78 202 197 -68 -25 297 -46 -129 -77 -194 35 99 268 197 -104 -296 -170 83 -226
5983 -226 78 98 -131 -93 -105 70 -59 -291 -91 1 284 147 27 -67 251 -24 60 -113 -34 265 -146 165
6005 165 194 -249 41 -119 119 -35 66 -4 56 325 188 198 198 48 -53 104 -146 67 266 -168 -87 118
6027 118 -139 164 105 120 270 -266 -167 -3 45 -422 -8 83 238 88 261 96 145 24 221 0 -48 50 -52
6050 -52 50 0 -197 29 -103 -18 -216 147 -42 104 -204 159 193 5 -19 -119 -141 -196 163 192 45 -2 221
6073 221 -7 24 100 -260 -29 170 -126 20 142 -63 -208 73 -73 55 -44 25 267 -62 -191 103 -127
6094 -127 87 -116 2 -8 74 -644 -201 -188 142 178 35 -134 93 -247 -79 170 -145 84 243 265 -58 160
6116 160 -39 123 -160 -57 -84 100 -85 -24 -55 248 34 -190 -140 61 -102 -85 -69 -127 29 -56 -194 185 -152
6139 -152 235 -10 28 95 -34 -212 -121 -25 -142 171 -353 110 93 257 -249 2 24 308 100 -68 -50 175
6161 175 -102 63 28 -22 10 -182 -150 89 20 -142 100 -48 45 18 44 46 -167 166 -44 -62 178 -83 134 -194
6185 -194 111 -2 185 181 14 -88 117 -26 160 43 50 208 79 19 -90 -228 -121 153 111 -221 32 -16
6207 -16 -180 1 315 125 17 45 -134 85 -77 14 61 -123 -78 -47 -45 136 -125 151 -206 -43 85 196 -126
6230 -126 -68 76 -32 216 -106 166 0 76 1 241 145 128 15 111 -8 242 137 60 116 59 -328 -81 -124
6253 -124 83 -189 -85 75 172 224 -47 -178 43 -36 90 79 176 216 -123 -62 4 -44 229 98 -172 -190 -43
6276 -43 -102 -133 114 -179 -248 59 -47 178 -80 65 5 279 0 38 119 -58 -7 142 229 91 107 128 200 53
6300 53 39 44 -39 -112 -52 -55 38 -138 -104 -201 -64 90 -140 168 -175 -219 15 85 -28 47 -48 93 114 128 -112 -153
6326 -153 -106 -16 -23 -81 55 49 -37 82 175 -254 -35 -23 -71 -82 -164 27 -50 -134 -318 -6 -34 -127 -21 16 17 79 -127
6353 -127 -21 -110 102 -181 200 31 -97 57 115 -26 -202 144 64 -104 -275 145 85 50 250 256 259 189 73
6376 73 117 -21 77 -31 -129 -12 129 65 177 -37 -16 68 -322 47 151 -33 -49 21 265 149 -202 4 207
6399 207 -167 -154 -497 -24 -1 15 32 324 -25 5 35 -322 221 -70 66 -176 97 -13 74 -13 150 130 -195
6422 -195 -92 -27 -331 87 -174 136 317 129 42 93 -161 122 -44 40 -263 -34 -55 -28 153 -172 232 -57
6444 -57 114 -253 -88 347 235 -41 -22 -234 122 94 -200 194 108 -385 -88 -213 -93 43 205 -10 -111
6465 -111 -11 -81 4 63 11 262 -168 -84 13 5 -195 -51 -39 157 -88 -30 -98 121 -67 110 -168 -157 -28 -188
6489 -188 352 105 -9 -51 -2 -227 -20 -96 51 134 230 185 286 40 -130 -2 -23 96 62 247 -213 53 -69
6512 -69 -92 19 19 0 -358 -80 181 368 73 233 -100 -8 -126 110 34 -293 294 -60 19 22 -84 -42 346 5
6536 5 52 59 -6 20 196 94 22 139 -62 -139 43 21 113 -199 19 -5 110 144 237 -26 2 -132 70 23 374
6561 374 230 73 20 164 -333 185 200 -311 277 1 -63 -36 237 -63 5 85 -254 140 260 23 332 -301
6583 -301 -462 43 -184 137 94 38 -127 -156 -155 -68 111 109 -166 -148 140 -22 -76 184 -19 -87 189 244 -120 -194
6607 -194 -6 72 -55 13 209 207 -109 124 -75 -156 30 58 223 -70 -223 -20 73 27 70 173 371 -19 -224
6630 -224 -169 155 -106 368 -32 -67 10 9 -36 23 134 -74 22 78 -47 200 -18 13 128 -266 -103 -223 -142 322
6654 322 -206 -76 70 -24 86 54 223 17 -167 207 -1 -364 -86 -202 -106 43 219 -7 -125 98 -78
6675 -78 -61 -4 -5 33 7 7 53 74 -9 409 -134 153 -116 118 36 -120 -42 -172 157 3 192 11 -313 125 90
6700 90 -165 -222 -65 5 -170 -24 217 191 70 -162 -12 -104 102 -16 -23 -101 -99 -111 -273 -245 153 -111 256 256 9
6725 9 -93 10 49 -51 47 -64 225 -177 131 116 13 152 93 -14 -51 336 -21 -317 271 217 -5 -113 -37
6748 -37 39 165 253 32 129 8 29 -23 181 94 -87 -190 -126 2 172 0 -119 -167 -156 -183 -53 -158 102 -299
6772 -299 8 178 -33 493 -165 236 -192 163 350 -142 -53 323 72 -10 159 21 77 255 -123 160 99
6793 99 -240 -8 285 200 316 108 273 -171 -85 93 -75 -271 -389 92 -161 91 158 50 -169 66 192
6814 192 123 -93 -4 73 -58 -203 7 -20 -147 -103 -92 47 54 215 -71 -247 129 136 150 -158 211 109 -71 -164
6838 -164 -69 196 -43 -148 71 242 17 -92 86 80 -208 160 162 23 29 -154 212 -217 -82 -127 -263 109 370
6861 370 -11 244 -48 107 130 -58 177 -264 154 -34 98 -20 308 214 -35 -62 -291 158 -102 -50 -146 106
6883 106 -230 169 272 316 -225 54 -31 118 95 -243 -61 40 257 67 156 164 183 -75 8 175 53 83 295
6906 295 140 114 50 -39 133 -100 -40 211 -152 -142 -23 66 222 -2 -129 -114 -127 37 -151 344 -198 -335 -182
6929 -182 1 -26 201 -45 241 98 -48 -61 -69 108 -19 -4 -227 47 -200 -204 27 -58 8 173 -168 33 90
6952 90 243 -135 60 95 -356 -5 26 34 -46 1 147 54 -267 48 45 -204 -180 46 20 18 -127 38 143 128 -280
6977 -280 46 -171 -24 49 163 149 -161 125 -102 123 -41 120 -245 -56 86 153 381 -17 142 -139 128
6998 128 262 -3 138 318 52 -25 51 -161 170 -241 -111 -35 -59 111 26 -90 -53 -39 260 64 12 -115 -132
7021 -132 192 -58 -8 104 37 167 106 -168 7 -59 145 -27 -14 105 -47 -263 -84 -4 -137 -67 -94 4 -49
7044 -49 -43 316 245 190 43 64 -50 77 -64 140 -193 232 94 112 -206 -360 -32 143 429 191 -230 67
7066 67 -119 232 46 -397 -129 -203 -10 -117 -49 -76 -63 -226 -9 -259 174 -91 240 29 -288 -85 -212 258
7088 258 -117 -109 -115 36 -31 -87 -229 124 -169 -157 -163 -233 -302 -285 -79 -119 -94 -186 198 8 70 54 82 -92 82 60
7114 60 152 191 23 -93 -71 -28 -144 46 3 -149 -89 -12 187 -142 29 -144 -218 64 271 -143 147 151 -38 -59
7138 -59 21 266 -136 -25 186 331 -246 -75 169 -134 226 -52 -177 -291 402 308 98 123 -26 13 16 41 122
7161 122 166 101 -93 -192 39 53 -109 98 150 17 -328 120 100 -86 154 4 115 -165 121 -487 296 -393
7183 -393 247 65 103 91 30 -167 8 92 -86 -79 -206 155 -83 -26 -217 -75 -23 244 247 219 -30 -119 -165 -23
7207 -23 106 -38 73 -163 -250 -170 27 67 227 181 -101 -3 41 -183 -290 87 -280 111 -305 161 -178 -226 270
7230 270 -28 339 54 328 -116 -53 30 179 -227 -122 38 -25 101 -4 22 -89 124 224 34 -192 34
7251 34 76 7 41 -88 10 37 74 30 -94 57 -84 44 -293 113 30 -15 69 -314 264 99 203 -95 124 -396
7275 -396 -72 155 -144 48 124 7 -56 173 347 -337 -16 126 187 105 -78 -75 32 85 98 -72 -175 -210 196
7298 196 125 -194 -144 -74 -159 80 -161 124 168 -51 209 -50 111 290 -61 115 33 -118 41 194 49 17
7320 17 -179 43 72 -135 -179 -109 205 4 -26 105 -66 -76 -75 452 -274 187 38 -116 -17 44 317 -34 -89 114
7344 114 46 123 69 -195 82 -197 126 -118 1 259 -162 -64 171 52 268 70 -368 -259 -312 180 90 109
7366 109 261 126 224 -110 176 -146 -261 -193 333 -9 280 59 69 -13 -121 -136 31 157 -106 173 79 5
7388 5 178 -18 -265 83 110 -123 43 115 5 -298 100 -28 -67 -187 -44 47 -19 -130 -119 10 -96 101 93
7411 93 -82 79 237 34 147 60 123 -70 -207 294 149 91 -176 85 -11 -83 -164 96 178 92 320 150 -72
7434 -72 -52 -148 104 -123 -291 -69 70 -81 85 -32 69 -180 20 81 24 308 -112 123 185 -207 -56 -54 -79
7457 -79 254 121 -116 118 -4 1 -118 193 -108 -291 106 -80 209 208 112 -110 153 -157 -377 -149 -175 77
7479 77 -253 -33 -294 -108 231 299 -38 -189 23 39 129 -38 -153 173 -70 -166 -84 89 13 -68 105 -31 200
7502 200 112 -121 -98 -14 241 27 11 -109 -199 172 50 74 -96 -31 56 34 354 51 239 -121 44 -218 31
7525 31 20 -26 -46 59 -245 114 135 211 -26 31 201 232 121 89 -266 -158 110 -21 -209 -116 273 193 -94 204
7549 204 -173 16 14 238 100 -321 -41 286 -107 -47 -25 -53 -80 -275 204 140 48 -114 -247 -3 -122 220 -46
7572 -46 35 -9 121 240 -5 10 -101 -334 36 -231 48 131 79 -34 -98 100 -116 -147 72 -162 -124 -287 145
7595 145 -169 67 197 -214 -45 -206 -241 112 -79 357 120 -52 43 4 77 -85 96 -60 39 161 183 50
7617 50 -38 35 96 77 281 252 -136 41 206 147 -244 105 95 -140 390 -18 95 -191 224 66 -31 107 -209
7640 -209 -62 -272 -193 210 -142 26 70 105 187 -185 65 75 74 243 -189 101 -310 -91 371 11 110 48 -256
7663 -256 168 88 -131 216 -340 89 64 41 -21 215 313 7 -94 -43 -87 -91 -185 -64 -77 231 121 -99 84 218
7687 218 -263 262 139 -26 -96 -81 8 -65 -158 -258 370 206 83 -160 -147 -136 -185 -183 57 -147 241 -71 -180
7710 -180 53 69 -15 -134 33 -48 165 -28 -259 -86 -203 -220 -239 78 -10 -183 -178 197 10 -115 -74 66 -268
7733 -268 -221 -83 95 -24 -54 19 273 -47 195 -127 -104 268 -44 -146 -36 -104 -274 194 29 101 135 72 54
7756 54 19 -66 137 -25 -86 71 152 192 -104 -95 289 -19 -192 -219 207 -3 -7 61 152 171 -139 142 -4 108 -111
7781 -111 173 170 214 55 228 71 -87 -11 41 92 -56 17 -68 60 67 -66 53 143 33 241 -65 -40 69 269
7805 269 153 -82 -185 -113 -181 80 -8 -59 204 -35 -137 -85 8 133 -11 170 -1 34 9 -275 53 -12 -110
7828 -110 357 121 -2 -201 -271 -172 -101 -259 -3 -261 41 -69 193 66 -20 -356 -374 228 83 122 228 151
7850 151 -21 155 28 -146 196 -257 146 315 108 101 165 -118 -16 -79 -47 102 9 -13 2 -42 -48 108 -134 -71
7874 -71 167 -75 -157 -24 -189 6 -31 12 -291 144 -36 49 213 129 103 129 -37 351 47 -160 -27 -27 67 121
7898 121 219 220 -47 70 -149 -115 289 -112 -90 -161 88 -332 -62 -42 -135 3 28 -194 -32 246 -59 -153 130
7921 130 -176 42 -38 119 177 321 130 -97 99 27 95 60 -92 -225 75 -84 -207 -256 393 -180 279 -220
7943 -220 22 -133 -198 49 208 49 139 147 -291 128 -74 -146 64 -250 -341 -59 -244 2 -306 36 -50 29 169
7966 169 -26 56 -5 -21 -213 53 46 45 36 -122 -36 -75 -117 146 99 53 139 361 -78 249 -115 98 126 46 -103 -411
7992 -411 -351 112 27 76 120 11 -312 59 -88 182 -59 -178 -166 68 -223 -60 76 13 14 -43 21 -136 95
8015 95 453 20 -35 70 29 -121 95 240 -2 -138 119 -223 15 -132 -213 38 106 102 -9 -84 -245 213 -18
8038 -18 -322 -20 -96 -294 -20 296 -196 -98 -141 -7 140 6 101 -26 -220 -74 106 -126 57 78 111 15 30
8061 30 -162 -165 -387 45 -17 -10 82 -86 200 33 -98 42 -51 -57 -32 121 94 -138 -151 -17 -1 -75 96 -77 167
8086 167 84 -166 76 -465 11 151 -158 246 -213 -71 -6 -234 71 114 -76 317 -34 269 48 94 153 11
8108 11 -138 7 -64 -265 -96 201 -62 29 -393 41 11 -216 115 179 67 -102 -227 -229 95 -260 -54 79
8130 79 165 -47 245 -95 286 36 64 24 11 -204 210 134 -28 49 -71 9 211 -203 17 226 202 -49 299
8153 299 -82 236 212 -40 328 20 -148 75 17 -297 -127 211 -25 127 144 56 -118 92 -199 94 -237
8174 -237 185 339 54 -61 307 144 114 160 65 144 -167 -24 -18 71 179 -138 -2
8191b
##END NTUPLES=NMR FID
##END=
