##TITLE=1H_LR-694-K1
 CDcl3, 8 sc, 
 15.10.2019
##JCAMPDX= 6.0         $$ Bruker NMR JCAMP-DX V2.0
##DATA TYPE= NMR FID
##DATA CLASS= NTUPLES
##ORIGIN= UXNMR, Bruker Analytische Messtechnik GmbH
##OWNER= root
$$ XWIN-NMR		Version 3.5
$$ Tue Oct 15 15:36:58 2019 Russian Standard Time (UT+4h)  she@DPX200
##.OBSERVE FREQUENCY= 200.1315
##.OBSERVE NUCLEUS= ^1H
##.DELAY= (6, 6)
##.ACQUISITION MODE= SIMULTANEOUS
##.ACQUISITION SCHEME= undefined
##.AVERAGES= 8
##.DIGITISER RES= 18
##SPECTROMETER/DATA SYSTEM= spect
##.PULSE SEQUENCE= zg30
##.SOLVENT NAME= CDCl3
##.SHIFT REFERENCE= (INTERNAL, CDCl3, 0, 15.7039)
##AUDIT TRAIL= $$ (NUMBER, WHEN, WHO, WHERE, WHAT)
$$ ##TITLE= Audit trail, XWIN-NMR		Version 3.5
$$ ##JCAMPDX= 5.01
$$ ##ORIGIN= Bruker BioSpin GmbH
$$ ##OWNER= she
$$ F:/spectra/data/she/nmr/H-F/1/audita.txt
$$ ##AUDIT TRAIL=  $$ (NUMBER, WHEN, WHO, WHERE, WHAT)
(   1,<2019-10-15 15:35:54.17 +0400>,<she>,<DPX200>,
      <created by zg, POWCHK disabled, PULCHK disabled
       configuration hash MD5:
       00 E9 B6 7A A2 85 ED C7 34 08 36 98 17 FE 4E 26
       data hash MD5: 16K
       A3 86 44 AC D1 51 2E 58 0B 46 54 77 0B 53 38 3D>)
$$ ##END=
$$ 
$$ hash MD5
$$ CB EA 7C 37 26 DF DA C2 96 28 F2 B3 5C D5 76 D4
##$RELAX= 
##$RELAX= 
##$RELAX= 
##$RELAX= 
##$RELAX= 
##$RELAX= 
$$ Bruker specific parameters
$$ --------------------------
##$DU= <F:/spectra>
##$EXPNO= 1
##$NAME= <H-F>
##$PROCNO= 1
##$TYPE= <nmr>
##$USER= <she>
##$AMP= (0..31)
100 100 100 100 100 100 100 100 100 100 100 100 100 100 100 100 100 100 
100 100 100 100 100 100 100 100 100 100 100 100 100 100 
##$AQSEQ= 0
##$AQ_mod= 1
##$AUNM= <au_zg>
##$AUTOPOS= <>
##$BF1= 200.13
##$BF2= 200.13
##$BF3= 200.13
##$BF4= 200.13
##$BF5= 200.13
##$BF6= 200.13
##$BF7= 200.13
##$BF8= 200.13
##$BYTORDA= 1
##$CFDGTYP= 0
##$CFRGTYP= 5
##$CHEMSTR= <none>
##$CNST= (0..31)
1 1 145 1 1 1 1 1 1 1 1 1 1 1 1 1 1 1 1 1 1 1 1 1 1 1 1 1 1 1 1 1 
##$CPDPRG= <>
##$CPDPRG1= <>
##$CPDPRG2= <>
##$CPDPRG3= <>
##$CPDPRG4= <mlev>
##$CPDPRG5= <mlev>
##$CPDPRG6= <mlev>
##$CPDPRG7= <mlev>
##$CPDPRG8= <mlev>
##$CPDPRGB= <>
##$CPDPRGT= <>
##$D= (0..31)
0 1.2 0 0 0 0 0 0 0 0.06 0 0.03 0 0 0 0 0.0002 0 0 0 0 0 0 0 0 0 0 0 0 
0 0 0 
##$DATE= 1571139353
##$DBL= (0..7)
120 120 120 120 120 120 120 120 
##$DBP= (0..7)
150 150 150 150 150 150 150 150 
##$DBP07= 0
##$DBPNAM0= <>
##$DBPNAM1= <>
##$DBPNAM2= <>
##$DBPNAM3= <>
##$DBPNAM4= <>
##$DBPNAM5= <>
##$DBPNAM6= <>
##$DBPNAM7= <>
##$DBPOAL= (0..7)
0.5 0.5 0.5 0.5 0.5 0.5 0.5 0.5 
##$DBPOFFS= (0..7)
0 0 0 0 0 0 0 0 
##$DE= 6
##$DECBNUC= <off>
##$DECIM= 24
##$DECNUC= <off>
##$DECSTAT= 4
##$DIGMOD= 1
##$DIGTYP= 9
##$DL= (0..7)
0 120 120 120 120 120 120 120 
##$DP= (0..7)
150 150 150 150 150 150 150 150 
##$DP07= 0
##$DPNAME0= <>
##$DPNAME1= <>
##$DPNAME2= <>
##$DPNAME3= <>
##$DPNAME4= <>
##$DPNAME5= <>
##$DPNAME6= <>
##$DPNAME7= <>
##$DPOAL= (0..7)
0.5 0.5 0.5 0.5 0.5 0.5 0.5 0.5 
##$DPOFFS= (0..7)
0 0 0 0 0 0 0 0 
##$DQDMODE= 0
##$DR= 18
##$DS= 0
##$DSLIST= <SSSSSSSSSSSSSSS>
$$ [...]
##$SUBNAM2= <"">
##$SUBNAM3= <"">
##$SUBNAM4= <"">
##$SUBNAM5= <"">
##$SUBNAM6= <"">
##$SUBNAM7= <"">
##$SUBNAM8= <"">
##$SUBNAM9= <"">
##$SW= 24.0689530833862
##$SWIBOX= (0..15)
0 0 2 0 0 0 0 0 0 0 0 0 0 0 0 0 
##$SW_h= 4816.95568400771
##$TD= 16384
##$TD0= 1
##$TE= 0
##$TE2= 300
##$TE3= 300
##$TEG= 300
##$TL= (0..7)
0 120 120 120 120 120 120 120 
##$TP= (0..7)
150 150 150 150 150 150 150 150 
##$TP07= 0
##$TPNAME0= <>
##$TPNAME1= <>
##$TPNAME2= <>
##$TPNAME3= <>
##$TPNAME4= <>
##$TPNAME5= <>
##$TPNAME6= <>
##$TPNAME7= <>
##$TPOAL= (0..7)
0.5 0.5 0.5 0.5 0.5 0.5 0.5 0.5 
##$TPOFFS= (0..7)
0 0 0 0 0 0 0 0 
##$TUNHIN= 0
##$TUNHOUT= 0
##$TUNXOUT= 0
##$USERA1= <user>
##$USERA2= <user>
##$USERA3= <user>
##$USERA4= <user>
##$USERA5= <user>
##$V9= 5
##$VALIST= <valist>
##$VCLIST= <CCCCCCCCCCCCCCC>
##$VD= 0
##$VDLIST= <DDDDDDDDDDDDDDD>
##$VPLIST= <PPPPPPPPPPPPPPP>
##$VTLIST= <TTTTTTTTTTTTTTT>
##$WBST= 1024
##$WBSW= 4
##$XGAIN= (0..3)
0 0 0 0 
##$XL= 0
##$YL= 0
##$YMAX_a= 35008
##$YMIN_a= -43272
##$ZGOPTNS= <>
##$ZL1= 120
##$ZL2= 120
##$ZL3= 120
##$ZL4= 120
##$ABSF1= 10
##$ABSF2= 0
##$ABSG= 5
##$ABSL= 3
##$ALPHA= 0
##$AQORDER= 0
##$ASSFAC= 0
##$ASSFACI= 0
##$ASSFACX= 0
##$ASSWID= 0
##$AUNMP= <proc_1d>
##$AZFE= 0.1
##$AZFW= 0.1
##$BCFW= 1
##$BC_mod= 2
##$BYTORDP= 1
##$COROFFS= 0
##$CY= 11.3945322036743
##$DATMOD= 1
##$DC= 2
##$DFILT= <>
##$DTYPP= 0
##$F1P= 20.1720416913024
##$F2P= 0.152960286110954
##$FCOR= 0.5
##$FTSIZE= 0
##$FT_mod= 4
##$GAMMA= 1
##$GB= 0.15
##$INTBC= 1
##$INTSCL= 1
##$ISEN= 128
##$LB= 0.24
##$LEV0= 0
##$LPBIN= 0
##$MAXI= 10000
##$MC2= 0
##$MEAN= 0
##$ME_mod= 0
##$MI= 1.114404
##$NCOEF= 0
##$NC_proc= 0
##$NLEV= 6
##$NOISF1= 3.799351
##$NOISF2= 2.8
##$NSP= 1
##$NTH_PI= 0
##$NZP= 0
##$OFFSET= 15.70392
##$PC= 1
##$PHC0= -9602.692
##$PHC1= 72.00093
##$PH_mod= 1
##$PKNL= yes
##$PPARMOD= 0
##$PSCAL= 0
##$PSIGN= 0
##$REVERSE= no
##$SF= 200.130013532006
##$SI= 16384
##$SIGF1= 3
##$SIGF2= 2
##$SINO= 400
##$SIOLD= 16384
##$SREGLST= <1H.CDCl3>
##$SSB= 0
##$STSI= 0
##$STSR= 0
##$SW_p= 3612.71676300578
##$SYMM= 0
##$S_DEV= 0
##$TDeff= 0
##$TDoff= 0
##$TI= <>
##$TILT= no
##$TM1= 0
##$TM2= 0
##$TOPLEV= 0
##$USERP1= <user>
##$USERP2= <user>
##$USERP3= <user>
##$USERP4= <user>
##$USERP5= <user>
##$WDW= 1
##$XDIM= 8192
##$YMAX_p= 0
##$YMIN_p= 0
$$ End of Bruker specific parameters
$$ ---------------------------------
##NTUPLES= NMR FID
##VAR_NAME=  TIME,          FID/REAL,        FID/IMAG
##SYMBOL=    X,             R,               I
##VAR_TYPE=  INDEPENDENT,   DEPENDENT,       DEPENDENT
##VAR_FORM=  AFFN,          ASDF,            ASDF
##VAR_DIM=   8192,          8192,            8192
##UNITS=     SECONDS,       ARBITRARY UNITS, ARBITRARY UNITS
##FACTOR=    0.0002076,     1,               1
##FIRST=     0,             0,               0
##LAST=      1.7004516,     0,               0
##MIN=       0,             -43272,          0
##MAX=       1.7004516,     35008,           0
$$ Real data points
##PAGE= N=1
##DATA TABLE= (X++(R..R)), XYDATA
0@%%%%%%%%%%%%Qj6J6j6J6j9K7l2L4m2N0n8O6p4Q7r8J09j24J40j57J80k02K26
35A21k53K79l10L43l83M25m68N18n73O35p03P82q71R70j086J221j383J580j825
54i81K139k559L155m075N699r433L5754N309l5820P02r926L149K383k447p544
69a4495N448L398O820M916J980k924q39m165j370l22j225l082Q75L238M351R48
85C552j228k669N00Q21l73k328j772M01K226K185J440Lq75m82j333j216q02o10
103b560j128M91J691J685J170L20k10O6k31j634j992o64m09J522J729J22J40P06
121H14O42J70j76j203j353M8m66N76P16J01J24N82K86K58o39r68n77j67M67P76
141A1n33j37O31L87N41O5r37o68k14J72O3NJ78rJ67O52M41ok46m86o69K26n9J40
$$ y = [0, 0, 0, 0, 0, 0, 0, 0, 0, 0, 0, 0, 0, 8, -8, 8, -8, 8, -11, 16, -16, 18, -24, 26, -32, 34, -40, 47, -51, 58, -66, 74, -83, 97, -105, 121, -132, 147, -163, 180, -203, 222, -246, 272, -301, 334, -369, 413, -458, 512, -574, 647, -736, 844, -981, 1158, -1401, 1754, -2321, 3378, -6055, 29699, 35008, -812, -110, -10036, -6887, -4504, -6951, -14495, -9047, -5649, 1171, 6087, 8067, 5143, 4304, 139, -1231, -1553, -2778, -5860, -4985, -1747, 2604, 3552, 2324, -345, 155, 976, 603, -1725, -3497, -3096, -870, 1315, 2755, 2758, 1883, 1401, 68, -1148, -1950, -2560, -3688, -3197, -1506, 179, 1349, 1669, 1459, 1525, 1294, -340, -2332, -2996, -3405, -1883, -154, -32, 108, 814, 1456, 1626, 1450, 247, -1106, -1058, -1524, -948, -232, -131, -7, 575, 861, 1119, 480, -488, -1065, -1232, -765, 11, -522, -659, -28, 359, 900, 965, 28, -640, -854, -682, -619, -614, -436, -445, -278, 374, 815, 809, 563, 77, -592, -366, -425, -285]
165b85m76L77J98M86R0r6L9m53l6l8p9l42Q7N7K33M65m0L00k94M7j95J8m66k15
189f18J95oM93n9J53j03J09k4N6m2k06j66n14M56K78k55N58k73J52Po3J40m29
212a61M8j35K93j32j20J17J35J47j33M64n12J79k78O3q3J8o6Q5J88J12J59k4k23
235A41j33k42K33m74K16N6R6l6L92P6n0m7p9p3p2J95l70k68M69mJ65n5o3l4J06
260A45O7j50k65k1L29j20n3Q3J90m48L82j1R7k79P2p5o7Q6j0l4n4M3L11j52R1
285A57m57L78m2j10j40M85k53l1K29m5K80l99k4j44K93k03n4p8Q5J03l33L29J11
308A37m0Q0j08l7L7k62K35k40J10M6J61J47k31N6k30L9P1k15L01l57L97l57L40
331H0K0O8j50qQ1N0l64Q3r5K59J5R8m2O1m1o9J27k09K85l24q4q3M25m7j35j58
$$ y = [-285, -761, -384, -186, 300, 390, 294, 333, -120, -156, -194, -273, -615, -528, -471, -238, 227, 187, 487, 193, 240, 45, 63, -403, -618, -423, -429, 64, 5, 158, 55, 164, 140, 196, 154, -52, -218, -732, -276, 2, -253, 305, 32, 184, 191, 128, 268, -161, -113, -248, 45, -87, -207, -90, 45, 192, 59, 523, 11, 190, -88, -25, -108, -90, -156, -71, 117, 229, 388, 364, 141, 8, -234, -1, -475, -259, -203, -107, -143, 249, 325, 275, 228, 149, 76, 4, 199, -171, -439, 30, 26, 191, 136, 73, 39, 145, 212, 62, -203, -224, 105, -15, -68, 15, 205, -243, 139, 128, 225, -54, 18, -57, -124, -38, -48, -82, -136, -93, 218, 66, 157, -300, 78, 36, -74, -214, 271, 18, -13, 216, 171, 451, 52, 28, -116, 177, -26, -80, -158, -73, 30, -303, 26, 137, 97, 177, 69, 32, 69, -193, 42, -198, -88, -42, 119, 266, 35, 91, -139, -100, -29, -244, 57, -300, 97, -260, 80, 100, 168, 18, 10, 91, 141, -223, -140, -235, 24, 39, 137, 95, 156, 115, 46, 173, -36, 249, -75, -159, -242, 183, 136, 1, -157]
357a57K22L63k01P2j25n43L82k51M9K78Q7P0m0j75P9k69PN1k2J25N3p4Q6j08L92
382C51r4Q9j99l15n4q9K51N4J18j66K34qK17l21k84P5J81P2l11Q0n7J23L1K73
406B51j69J9nj54R2l7j28K91n97J35L70j67L04j42k57K18K20n82M46l34J42O2
428b2j07J26K00k63J35m0q4n1J65k24Q2J06j45K26k10J28k40L46l69L59J18k38
450bj3m2K43j34P0l37K79K8j32J79j92k3L1J14R6l99RL22K1J0n4J01m7m9l03J08
476a16Rr3L74m5P1m09K69l5Q0j17j35M6l8Q5J18l0J0J12k19K05j71J7om3R8J1
502D8P8j8j13Q2j27L71k46k57L66k74l0M47m62l1K13J71m02L17o8q4O0l89L03
525d5k19M30j74J24l2N0M2k26n6j50Q7L20O0k32q4J54m8r4J33J4M3k32L63j35
$$ y = [-157, 65, 428, 227, 299, 174, -369, 13, -238, -189, 89, 176, 246, 206, 31, 110, -159, -152, -101, -123, 2, 55, -19, 67, -41, 351, 257, 346, 147, -168, -222, -311, -60, -6, 112, -54, 180, 172, 389, 68, -216, -141, 40, 112, -199, -119, -176, -53, -22, 251, 82, 101, 96, -58, 34, -3, -131, 160, -437, -302, 68, -99, 205, 63, -194, 24, 244, -338, 108, -226, -84, -22, -129, -3, 197, -66, 69, 29, -55, -106, 59, -165, -83, 23, -122, 104, -106, 22, -218, 128, -241, 118, 236, -2, -15, -57, 186, 52, 122, -215, 64, 92, -40, 139, -53, -76, -45, 69, 165, -234, -225, 97, 118, 128, 74, 175, 128, 79, -224, -116, -107, -200, 174, 129, 200, -209, 60, 25, 105, -12, -147, -101, -139, -54, 64, 34, 44, 156, -63, 142, -29, -12, -18, -61, 37, 48, 126, 108, -5, 77, -50, 321, 75, -182, 184, -90, -120, 327, -135, -166, 47, 218, -184, 133, 65, -19, 41, -348, -45, -264, 166, -8, 116, 84, 134, 176, -50, -106, -256, -169, 151, 211, -21, -105, 49, 1, -93, 40, 54, 97, -135, 228, 93]
549I3J03k35J47p6Mj47j32K78l9J4q9J13j93j08J97J58p1K45l81N43l73Jl65Q3
573b30M04j80l2j73L16n8J95l85n9J43N6L0Q5k43K74j62k5K42k83j6J98m10M74
596A61j0k1j63j97K53k46L6K76Lk26m2K26j32J67m51K73J03n3j47o4K55K1J4M1
620G7j9k69j18L30j48P7J13j05J65K7J63j82j81J77l49M8L15j00J51j02M6O1j53
643B4J29l9p9l87L94r8R6j39J9k30K87K41p7r3O7j15O9K29n47K81j3k2j56j7L5
668a41J46n4R6K43k54j32L6L0K82k51J3K30j93q3j91K71j88K36Q8L7L5j12j92
691d8J13k02L73k47n1j54R0J47J9k39K91Q6l05L30j01k22R1P6p2o9j60Q3K13J00
715A42N4j64j6oRKM6J46m13K09j16L19l80K2j4N9J77j41M6j44K16m8J58j86K81
$$ y = [93, 196, -39, 108, 32, 36, -111, -243, 35, -4, 10, -79, 34, -159, -267, -70, 88, 17, 262, -119, 424, 51, 52, -313, -230, 174, -6, -38, -211, 105, 47, 242, -143, -202, -59, -3, 27, 112, -131, 143, -19, -44, 198, -85, -101, 97, -313, 161, 151, 130, -33, -230, 23, -223, -187, 89, 92, -134, -176, 50, -82, 85, -366, -93, 10, -43, -190, -254, 1, 22, 36, 77, 58, -211, -329, 1, -147, -70, 43, -62, 103, 130, 293, 111, -70, 107, -242, -194, 121, 21, 172, 70, 116, 177, 24, 153, 114, 35, -352, 42, -56, 40, -99, -80, -310, -23, 218, 141, 48, 115, 0, 69, 298, -249, 32, 19, -3, -159, -176, -141, 5, -49, 47, 290, 36, -96, -60, -30, 252, 1, 14, 244, 51, -32, -223, 48, -140, 96, 184, 221, 256, 144, -48, 65, -137, 236, -11, -62, -216, -126, 21, 40, -199, 92, 178, -127, 203, 102, -120, -29, 47, -25, -94, -254, -171, 42, 142, 196, 32, 16, 10, 19, 21, 67, 213, -200, 9, -107, 212, -168, -146, -160, -101, 76, -65, -19, -163, 53, 5, 163, -23, 258]
740B58n26J17j41KK24J51j78K46j8M3j75J24n60L69J33k20N7O6o5J16j49jpM4
764i0J50J52r5J1J81n12M8Q8K19k08n4O1j26M30l52L08r5K7l86R8K72k27k1j16
788b37N32l97K30j72j37K19k38J15N3J95k20l3J60K1k47k5J25M8K9J04j82K52
810A95k66q0L12j22l3L26m46M4R4j55k7K46k0J29j56K52k09j48P5q7J90o8O3K0
834A29p1j43K14J9j63Q3j44J1L21j66j86J49l4j35J7l2L94k74K41p0L1l22m9O2
858a18K86m53J68K95j34k91O22o38K98k0M5l02K3L55j75K02k77J77j6jk17J50
880b1p3K92K9k44M4K23l91J96J80o5j72M9J2j4O8K81j43n9l59j81J92J92O2O1
904A59J11j08j05J8l70J82L10k51Q0j23L60k02K9k3N9m48J75J58q7k85K66j06
$$ y = [258, -268, -151, -292, -290, -66, 85, -93, 153, 135, 178, 3, 127, -433, -64, 69, -151, -94, -28, -93, 23, -126, -127, -134, -90, 60, 212, 117, 128, 309, -203, -155, -67, 152, -56, -110, -49, -175, 255, -97, 211, 116, 143, -243, -145, 127, -100, -121, -237, 295, -102, 128, -44, -181, 38, -200, -85, -32, 163, -57, -90, 70, 91, -156, -181, -56, -8, 21, 125, -57, 195, -71, -151, 161, 39, 6, 332, -114, -70, 24, -131, -158, 88, 68, 197, 41, 293, 84, -64, 11, -76, 114, 46, 109, 129, 58, -85, 129, 148, -15, 68, -76, -65, 256, 90, -96, 53, 19, -116, -99, -131, 263, -11, 230, 160, 191, -131, -180, -118, 168, -285, -117, 178, 44, -247, 375, -263, 35, 15, 60, -242, -219, 136, -39, 163, -114, 63, 47, 46, -171, -21, -94, 198, 227, -17, 27, 250, -141, 55, 235, 170, -2, 47, 59, 45, 113, 394, 251, 192, -167, -348, -156, 36, 98, 159, 270, 162, 57, 75, -295, -113, 197, -54, 26, -97, 263, 61, 90, 67, 126, -322, -147, 11, -76, -361, -95, -201]
926b01K29M3N7oJ02k07L1j72p5N56m93N2L21m73M24j41j41p8J4j01M15k65J0K03
950A04j74j78M24j79J72k37K60o9j55L41j51K1j26J34n6r8o4L10k54K3J4m7k24
973b09J08r3k2J60OK23m48J27M86k20l07J22j50J43l1K43Jj67r8P4L12k48R6M9
997A57Jq5j49n7k30N70m41N52l26J21kJ32m36JP4J60O7l25L50p3N3k57N0p8L79
1022B08l58n3p3M10n8j00K10k02P6j67L62l56J84k34J80J76l2j71O8J93j90j40
1044f7j20K07o9J39L6r7P5k40j53L03K37m97J17l4LJ56n3M6j99L13n4K8J1O4j31
1069B1QJ08r9j86K25o9R9m22M16k61J06J4j7j36J36j75J69Q0j20N5L1Q9J13q1
1093A04j29J28j22k18K75j00r0L26m17J46k78L32J7M1j27m5L3K14O0k15K00l09
$$ y = [-201, 28, 71, 128, 122, 224, 17, 48, -124, -199, 357, -136, -84, 237, -236, 188, 47, -94, -172, -158, -259, 156, -109, -99, 104, -70, -248, 176, -3, 169, -68, 192, 123, -32, 309, 158, 179, 53, 187, 131, 33, -31, 279, 25, 48, 62, 15, -209, -101, -194, -216, -56, -50, 173, -275, -148, 338, 118, -189, -67, -217, -74, -105, 138, 139, -28, -126, -52, 260, 12, 108, 157, 158, 73, -76, -133, -363, 207, -234, 318, -8, 113, 111, 243, -193, -192, -118, 42, 109, -216, 134, 61, 114, -143, -93, -171, 208, -150, -203, -276, 134, 76, -24, 186, -16, 60, -107, 255, -101, 83, -151, 29, 205, 173, 2, 70, 263, 73, -67, -187, 20, -49, 90, 126, 29, 104, -136, -289, 14, 251, -246, -129, -163, -160, -4, -57, -11, -210, 103, 49, 77, 88, 152, 21, 29, 137, 38, -148, 77, 8, 107, -315, 101, -160, -54, -40, -57, -193, -57, -232, -63, 17, -103, -48, -17, 72, 185, 104, -25, 103, -19, -237, 38, -62, -152, 174, -243, -97, -375, -43, -26, 15, -112, -157, -124, 90, 150, -65, 135, -174]
1115a74Q7k30K50J16j65J61J94l2p3K7j45P5j50j8K25k98L19j76J06Q8M4j25j34
1138b8m9J97r6Q0k54P4J61N8k79J34m5j44Q6Q3R7k04L86k59p8J17J97k39q4K7
1162f2n7K84j67J61M5l30J11j79J56Q8J37l02j79N45J8l77O1Jq5K02j65K93k68
1185f9N07o45N36j79j21j3j94L8L59o1m62J46J65J08K58k50l1m26O9N12j84k40
1207a77L44q3j74N1J14j34J48j45K55l55m5J32K23l32K23J44k78p7M60j82k68
1228a56K9L09p1n2lk39K40K6j56J43k95J79K72m55J97n9J22k76K70j5L1k5r5j08
1252a87J73j63R7J83k03k16K36j0l8L15j62J85j34R8j92Q8J52o7m56K98L0k64
1274b37K08k97L53m2k21L72r8J54l52L61o5k84J20L2N5J86l92K29rN6R0k49l2
$$ y = [-174, -87, -317, -67, 49, -116, 45, 239, 207, 134, 161, 16, 91, -59, -77, 148, -150, 169, -7, 99, 187, 231, 106, -28, -77, 120, 24, 104, -150, -76, 85, 143, -136, -2, -47, -191, -105, -22, 75, -129, 257, -2, -80, 37, 234, -5, -89, -62, -119, 165, -2, 159, 204, -126, -15, -194, -38, 50, 187, -115, -294, 251, 269, -108, -47, -46, -131, 71, -94, 199, -69, 438, -207, 329, 150, 29, 16, -178, -140, 219, 158, -304, -158, 7, 115, 373, 123, 92, -334, -265, 247, 63, -177, 167, 84, -90, -39, 75, -59, 89, -56, 199, -156, -201, -69, 154, -178, 45, 189, -89, -166, 294, 112, -156, -127, 182, 111, 59, 56, -183, 57, 83, -73, 70, -225, -46, 226, -229, -32, -91, 31, -245, 25, 10, 41, 16, -79, -187, -14, -177, -80, 103, -100, -316, -80, -90, -128, 187, 25, 210, 76, 174, -18, 70, 222, 155, -301, -3, 27, -237, -29, -326, 27, -15, -236, 136, 38, 192, -160, 201, 136, -148, -28, 4, 59, 245, -147, 82, 73, 129, 219, -30, -62]
1297f2K26k16L24k70J05k30j28M31l28Q8M04n21L3K08N4n0j72J05j45l2J56O4
1319D4n4mL20k09l94N84l33J26j25pnP5J33j07NK2k02k12L67nq3R9J84l30J41
1344C0J59k99J32J2m5j19K69k40R7K50k94J25j39K13j93p1K23r1k62J75R9m6K9
1367A4k72K28O5j85n1K73J32k04j1J0J63k27J4n4JJ13j61P3K66p6j57J38j61M3
1391b6o1J97j93r5L6p2J98K81k18k56L96j71j39K60j04J06j32m1O4K16k86J52
1413A12J04j34k2k41J38N1J70q7k28K11K12k26l1N8k13K65K8l10LJ96p0P6qk09
1437a55L82l56J93Q2l0Q6l77J23n4K20k02O9l07O51k03k11M5j0K63n83N18n5k19
1460a30J47R3o3k9K5q6j3M18J1j21j51R0l90L43j46QP5j49K87n38M93q0k25J16
$$ y = [-62, 164, -52, 272, 2, 107, -123, -251, 180, -148, -60, 344, -177, -144, 64, 118, 68, -104, 1, -144, -176, -20, 44, -10, -14, 306, 97, -297, 287, -46, 80, -45, -52, -57, 18, 151, 44, 49, 71, -131, -343, 24, 19, -64, 35, 219, -111, 30, 189, -110, 22, 34, -11, -130, 139, -101, -4, 246, -48, 77, -62, 151, -42, -113, 110, 19, -243, -68, 31, -15, 14, -258, -30, 35, -150, -201, 72, 204, 0, -11, -1, 162, -65, -51, -105, -104, 9, -152, -79, 187, 111, -46, 92, -69, -26, -87, 110, -83, -178, -142, -214, -16, 265, 47, -209, 187, 16, -123, 137, 33, 139, 7, -34, 30, 246, -40, 112, 216, 82, 60, -181, -43, 8, 178, 91, -137, 74, 286, 60, 29, 87, -126, 139, 167, -143, -140, 56, -14, 62, 54, -155, 227, -129, 64, 146, 116, 202, -175, -52, -106, 114, -88, -19, -326, 325, 122, -89, -44, -54, 209, -374, 144, 89, -130, 17, 110, 47, 18, 43, -43, -56, 362, 373, 252, 101, 191, -199, 144, -2, 6, 81, -68, 219, -319, 174, 94, -131, -15]
1484a5ln1J45k6J39k10O1J84j23j32K65j04j0k43J49k98M14k18J12L2k76K81J2
1507H5j60k9K23q8k25J22K50p5k08m0L02l24L41k90mP1n5J02j42J48K22l75L62
1530B13j06L6n62K89J01p1r7J87j43J57K11p6l9m4l09Q1M11k98J02l32M35j15
1552C1J4l79K86J57l8P5j84k33K79J59l1N2k26j9k58K57J84j48J53j82k6K33j32
1575B4K08Jp5j53J48k35Q0K59m52K35j04K55j74l5k44m9L30KJ43k06K79j91k0
1598B6J98j62o5l1J62j21P1j12K10k19L02k74J08Np8n7No3q8K50k74J98J11j93
1622i1o8K7J24L3o8ll7m08K07K44n6J07j51J24J81k72J56J25k61J63j09j58o9
1645b60K84l1l56L83o0L44l02j48K20j08k9O9P7j03m1J4K51l81K86j22q1J05M4
$$ y = [-15, -18, -69, 76, 50, 189, -21, 40, 224, 101, -31, 234, 130, 120, -123, 26, -272, 142, -76, 36, 68, -208, 73, 85, -75, -104, 119, 31, -194, -72, 178, 103, -105, -145, 157, -167, 174, -116, -120, -49, -104, -2, -144, 4, 226, -149, 213, 107, 143, -419, -130, -29, -100, -197, -10, -153, 4, 215, 139, 100, 56, -253, -172, 239, -59, 43, -289, 146, 31, 45, -334, -48, 109, 71, 146, -38, -271, 8, 167, 136, 188, -38, -57, -315, -58, 126, -22, 131, -51, -77, 156, 24, 232, 233, 158, 5, 153, -82, -2, 257, -195, 40, -64, 191, 17, -18, -262, -311, 19, 21, 164, -42, 237, 46, 26, 224, 62, -3, -34, 128, 7, 78, -34, 176, -43, 259, -15, 93, 98, 20, -37, -32, -95, -183, 67, -207, -9, 102, -91, -159, -132, -8, 25, -43, -46, -83, -491, -284, -40, -96, 11, -140, -16, 165, -107, 49, 174, -87, 76, -33, -191, -260, 24, -7, -363, 20, -40, 304, 2, -146, 74, -34, -63, 6, 83, -20, -61, -47, 204, -177, 109, -13, -94, 11, 55]
1668E5p8n4J85n4j78K20PJ3k90J68k1M0P5J28l74k8P1L60j47l0J52m03L60j24
1692E3J03l68l1L62j56p2Lk1r8K36K2l28K64O9o5K32m23L30j75p9M5J79n2kK3
1717E1j1m6J49j6o4l30K72K8K8LN9j41J88j5j33J03q2l3R9k16J84k34Q7p9J36
1742a3j4rL0j03j08R8J6L08l27J23j25K57R6j84l06J21L34j00j17j14N2K08j47
1765b4R1P6m01Q3K22n4nR8k84Q0K23j69L34k95J56n3j20L5k97M92l36M83m37J56
1789E4j33N9J27j88o1J10j4jn5N9J08L36m80K2j14M45l45j63K33p0%m5kn3J80
1814Im9m2M3J37n61L25L28k43K48k85M07k77o0J59J00l03K8Q5J12km41N2L7L04
1838A11j92j71l4L99Om8m7m6J8n8J27Q2q2M2k01Q8j5p8j52M0L20j40jo6nP9J91
$$ y = [55, -23, -77, 108, 54, -124, 96, 103, 116, -174, -6, -27, 13, 88, 216, -158, -186, -115, 245, 98, 68, 220, -183, 177, 53, 156, -212, -243, 119, -37, -109, -106, -127, -225, 11, 33, -295, -31, 38, -27, 205, -218, 112, -63, -142, -97, 82, 30, 28, 51, 40, -6, 143, 127, 63, -267, 5, 33, 61, 64, 123, -18, 170, 155, 22, 125, 43, 10, 109, -107, 77, -157, -70, -149, -13, -27, -36, -6, -109, -217, -119, -103, 205, -122, 1, -124, 133, 229, 45, -261, -140, 194, 94, -23, -137, -85, 123, -24, 67, 143, -258, -175, 47, -7, -12, 86, -198, -118, 105, -64, 270, -25, 131, 78, -42, -7, -304, 188, -148, 335, -102, 54, -79, -20, 107, -81, -142, -32, -46, -47, -102, -43, 65, 401, -79, -57, -171, 274, -71, -234, -1, -71, -71, -116, -118, -171, 9, -40, -82, -39, 98, -463, -138, 190, -53, 195, -90, 317, 40, -20, 139, 239, -64, -36, 49, 161, 159, -282, -230, -193, 111, -81, -252, -286, 113, 119, 71, 24, -22, -4, -62, 65, 147, 65, 107, -94, -6, -21, -99, -251, -211, 109, -31, -32, -98, -103, -24, 167]
1865A67m19K1K90pQ9j55O6n4n2Q4J54J53k59k24J91N2j25r7R5L04n72J78p1J42
1889d9j06J40j0J43j33n9J10j69M31k59k08L54k34J31rk50J83k1k5R7l52N97j31
1912A71m53L51l22N35l80mM5j6J86l01M80j88k46J00q4j36L72l05J71J38P6l08
1934a18j1K47L4J23l53K62j53m1m0J3q0p6J52n0n%J78o1J90j34n9m2j12K29J53
1959B46m24M09l07J67j05j9k2J48k11qq7J80j03j73J64M35j06J23m67K37n7j59
1981a39J16J3J8j62J84J48r7j24J03J93l45K42m85K76M8r6m4L36l23LM01k71J27
2004A22k4n4O2j57r8J65j57q4M17N9m15M44j90M3k14j2j4L61O5l97K46k46L65
2027B87m47N9L07j62J77k9k30m4J0J27k83L03k72J39J3L14R4m71j50J08R7j98
$$ y = [167, -252, -231, 59, 52, 141, -14, 52, -2, -54, 30, 184, 337, 78, -146, 45, 97, -28, -125, -30, 274, -298, -120, -191, -49, -155, -15, -25, 118, -15, -74, 36, -133, 298, 39, -169, 185, -49, 82, 73, -177, 6, -15, -40, 57, -295, 302, 171, -282, 69, -253, 282, -98, -102, -57, -73, 113, -188, 292, 104, -142, -42, -126, -262, 110, -195, -24, 114, 190, -118, -129, 118, 152, 275, -78, 184, 31, -10, -50, -37, -117, -193, -41, -91, -96, -96, 82, 21, 211, 77, 18, -24, -136, 93, 246, -178, 231, -76, 91, -14, -33, -55, 93, -118, -126, -213, -33, -136, -309, -145, 290, 184, 307, -160, 77, 20, -139, -23, -10, 8, -154, 30, 178, 81, -43, 60, 253, -92, 150, -335, -59, -11, -107, -151, 185, -138, -135, 266, -5, 122, 98, 44, 106, -51, -149, 16, -141, -225, 192, 251, -164, 280, 90, 133, -81, -93, -107, 254, 319, -78, 168, -78, 287, -160, -101, 206, 44, 221, 192, -38, -82, -72, 55, -228, 75, -197, -58, -45, 269, 363, -108, -258, -150, -53, -251]
2049b51K21k59K00qJ80m5l0J51j40K3j74L2K76m53L78m0j3k36J71J80j23k26J76
2072a0J48k37O6K4R1k71K94l88K16j09K10p9q3L08l16L43l6m37R3O3L16k3n33
2095c50M21R5q2j26J8P7R7jk20j58l6M23l14J29K2J21R9j92k19R4L3j79K78j5
2119A5M2j64Q6R1k82MJ67L2K95j67l20K52Q4k51N9K09j51l05M98j17K7k14J29
2142A9J06l48J42K28l7j26p6L15l52j94J71J05J48k72oK75l37L90p2j84K47l9
2164A03j23j00O7J20j86J50j51O5J51j81L65j47n6k64K52q3r5Q3M7M7j7L3j64
2187h4m2J99K38m14L19j61j59P3n6QM8j74L3J90R2J0J83j12j95O3j11K3N0L4R5
2212A50k21r1J26L24p3j65j21J2l6J7J29j17J13k04K61p0k14L31j59K6k1N3NM08
$$ y = [-251, -30, -289, -89, -97, 83, 38, 8, 159, 19, 42, -132, -100, 176, -277, 101, 61, 48, -188, -17, 163, 40, -186, -10, 138, -99, -33, -9, 82, -189, 105, -283, -67, -176, 34, -45, -128, 180, -136, 207, 171, -266, -173, -110, 206, 183, -350, 71, 166, 84, -42, -24, 53, 150, 149, -71, -229, -265, 158, -156, -27, -5, 116, 215, 23, -196, -102, -69, -248, 30, 15, 57, -107, -21, 70, -212, -208, -41, -9, 286, 119, -201, 51, 135, -116, -57, 152, 1, -304, 194, 77, 104, -110, 19, 125, -223, -81, 147, 110, -16, -92, 223, -129, -323, -152, -47, 101, -171, -177, 98, -239, 151, 79, -105, 142, 103, -20, -120, -53, 67, -119, 31, -120, -55, 96, -85, 280, 133, 77, -187, 65, -18, -113, -30, 17, 64, 47, 80, -84, -126, 73, 311, -103, 216, 55, -104, -31, -87, -79, -31, -205, -172, 18, 110, 120, 303, 191, -4, 59, -52, -29, 21, 55, 150, -71, -162, -36, 288, 215, 50, -71, -59, -95, -78, 51, -66, 47, -157, 104, 34, -180, 151, -8, 18, -3, 50, 55, 463]
2236D63n23J66j83oN1J4K23j67J04J05o07K14J74L9q6k48K92J69J17j89J20n12
2258b70M41k41j79N06k18q8J6Q8k3J21j22r8R3j66L02j30L13l04K6m0Q3m7p1Q2
2282G4m31M65l49K19J15p8m%j77M36k61j48K46l69L39o7%k0J38q4J57m3j24k64
2306b30K41K49j78m07M34o2j20J40m91L79l5j3K12k1k44J48n8J04k8j48P7J46
2328I5q7M57j33l88J88L6p5n5k00K69j72K38j99j9r9J06J51k32K01p3p1J26j35
2351g1j5L58l23J51M2N3j16j30j40K65j20q3m0LJ41j19j1L41k72O7J68j90J73
2374A32k92M3K8k2L78j61j88O3Q9Q9j47p9J67K5p3k2k5%l8P5j99K65k30J67j23
2399g8l0N5P8k33M0K89n9j88O7N9Q2N9l41j20L35JQ4q9k47J78j5j74j2L62k02
$$ y = [463, -60, 106, -77, -83, -32, -18, 205, 38, 142, 247, -360, -146, 28, 67, -19, -267, 25, 194, 311, 122, 242, -270, 171, -70, -249, 257, 39, -49, -33, 55, 32, 153, 31, -67, 26, -140, 162, 32, 345, 41, 67, 27, 110, 63, -8, 74, -357, 108, -241, -22, 93, 15, 11, 11, -166, 270, 9, -139, 107, -262, 77, 10, 10, -10, 128, 44, 201, 158, 34, -230, 11, 260, 82, -325, 109, 47, -73, 67, -424, -45, -80, -93, 119, 98, -146, 2, -56, 48, 20, -128, -51, 95, 8, 465, 332, -56, 132, 168, 93, 38, -162, 107, -65, 173, -26, -45, -144, -38, 113, -119, 82, 9, -62, 64, -71, -86, 272, -51, 100, 142, 195, 79, -51, -191, 74, -46, -129, -169, -166, -25, -144, -155, 186, -86, -19, 149, -41, 132, -160, -117, -89, -111, 267, 106, -82, -19, 70, 159, 12, -67, 100, 125, 52, 30, 5, 5, -33, 42, -157, 108, -122, 45, -78, -108, -53, 25, -208, -168, 121, 62, -126, -59, 0, 82, 141, -200, -320, 15, 16, 100, 11, -236, -58, -73, -247, -259, 103, -99]
2424i9n0K34Nq0R4J39k18j82J60P6J39k9Ol43J28kQ2M6j05K05k86j2MJ53Op9K74
2451B66l51J36p1J71j68k55L09J1o1n7k21K13L70n6j44N8J7l45K18L5j62J79r7
2474eQ4k62L25J08k6m52L66k78K54k74j57M69k40l7K00k26L19j9j41O1k28L24
2496A65j57P3j44Ln0J3rJ02J66j80Q2M8k42K63q3j41j53J76R4k04J28L7q3L06
2520B10k97L22k23j21K78j26L6r0k52M11l08K90j07j06j7K92j92j71L15k34l8
2541a28J06k77L03l01K80l8J37R7k66K34J70l71L1L77n55K36m0k7k18j25L98k17
2563a94J39k2L33j40K8k9j2O4q2l32L00rJ56K0k91Q9K18j10q2J39l23Q7m4Q3M5
2588C1r9qJ19q0q0M28l08k27K74J65j34j18M3j30L56k20J36j43K19k05j40K08
$$ y = [-99, -149, 85, 90, 10, 104, 243, 25, -157, 3, 79, 218, 189, 195, -148, -20, -22, 60, 106, 1, 206, -80, -92, -88, 65, 71, -8, 266, -85, 51, -20, 151, -17, -272, 37, 48, -13, -70, -291, -78, 292, 236, 92, 150, 167, -178, 40, 75, -87, 92, -5, 79, -183, 142, 250, 224, -228, 138, -140, 114, -160, -317, 152, -88, -125, 75, -151, 168, 149, 8, 69, -159, 165, 8, 81, -63, -60, -110, -97, -106, -4, 162, -18, 64, 112, -130, 133, 50, -91, -244, -68, 26, -178, -50, -13, -96, 210, -87, 235, 12, -109, 169, 43, 79, -11, -263, 148, -160, 130, 23, -83, -100, 192, 0, -171, 144, -90, -128, -22, -299, 4, -297, -17, -55, 82, 179, -87, 147, 317, -54, -23, 354, -201, 35, -5, -32, -250, -375, 23, -194, -55, -77, 256, 116, 144, 115, 103, 167, 85, -247, 53, 44, 200, 220, -71, 18, 236, 126, 44, 183, -140, -53, -97, -14, 31, -68, -76, 43, -37, -117, 311, 3, -224, 50, 215, 81, -37, 6, -124, 232, 12, 148, 5, 224, 19, -121, 87]
2610H7L9J05k05J78j14m08L81j17l1P1l2J02l9Jj48k4J27j9k04K01M6K8Q5O3k45
2635g2j99L18q2K4O7K45j54r0j79K3J14k63rL35m8j88M69m70LN6J03j37J27K33
2659B26l01k81M74r0j5r7L86k95L7J38l57K06K0M9j37l58L38j46K44J16O2k1k44
2682d6K0R6p7j31K35m3mn8R8j12j54j04K70l02L48k80K49mO1K3j14O5k12L58k62
2707h0J46k68L68j44J92k06rL08j82m4k46q6L61k56J06J29j37L9K01k22n5K49
2729A64L9j31j16o7n2O5K68k01oK30k73kj38J65j9K74k64K86l42J63j24k43N72
2752B48l26k00L21Q8j76J95m8j60kJ99j04p1J36k04J51p3KN8k50QK07J41k6j06
2776HO1Q7K6j21j14Q3j6Ok13K61o5J31j51K2J0j18K1MJ56J75j98j19K13j89qJ27
$$ y = [87, 126, 231, 26, 204, 90, -318, 63, -54, -85, -14, -46, 56, 17, 18, -130, -154, -27, -46, -250, -49, -3, 25, 110, 173, -72, -271, 47, -35, -11, 56, 301, 147, 57, -122, -99, 15, -248, -257, 78, 30, -158, 311, -159, -156, -100, 3, -134, -7, 226, -75, -356, 118, 28, 13, -84, 302, 7, 44, 182, -175, 31, 51, 100, -37, -395, -57, -203, 41, 157, 219, 198, -46, -26, 70, -7, -138, 97, 54, 50, -8, 90, -22, -176, -280, -10, -312, 36, -244, 5, 1, 62, 85, -29, 36, -176, 182, -80, 66, -202, 166, 22, 214, 8, -1, 307, 125, 81, -165, -251, 110, -146, -40, 89, -48, -9, 192, -30, -85, 164, 203, 72, -44, -111, -163, -98, 170, -31, -37, 193, -80, -82, -220, -55, -74, 200, -64, 222, -120, 43, -81, -324, 248, -78, -278, 43, 131, -45, 150, 102, -58, -60, 139, 35, -36, 100, -104, 47, -26, -24, 34, -216, -208, -1, 140, 114, 8, 69, 156, 182, 61, -53, 30, 14, 20, -193, 68, 3, 134, -17, 5, 15, -103, -82, -78, 78, 253, 55, -64, 149, -40, -48, 79]
2802G9j71L9k0l4P47n23k73K68j33J16k75K31J74j05k90K89n0k82K59l31M63k59
2824h1L1K5JK44o4j86J48K62j36l87Q5JP6j60K06m3j07J91mm0J10j7q8J02l38
2849a69K17j42J82j05j00N6J28m47L71O2p4m6k1K43j01j69J55M0J25l96R8k2n
2872a20Q8k7k05J61k24M56k71L18l24p5K10J93l8k91J42k1J53m8qj20o1LJ10R9
2896A00Mk21l1jJ65k42J56K13k67K75N9l17L58j33M7J85l77J00pj95K89m10K66
2919A6J0K53j21l10K22l2J6P9r8K38j06L2q0l96J11K17Q2o1j00Q7q7j84J43k4
2943i3q5%L22K10j42m71K80p2J16p9K05k94o5J89j76K50j91J39K3j12q5J49l0
2966a2n8n9KK24n1k04J25J33k43J43j85K33j32j29RK51Q9r1l3K4K6j40j13L31
$$ y = [79, -92, -53, -73, -107, 640, 117, -156, 112, -21, 95, -180, 51, 225, 120, -170, 119, 69, -213, 46, -285, 178, -81, -50, -25, -24, 220, 156, -30, 118, 380, 244, -143, -58, -57, 19, -141, 65, 22, -85, 106, 102, 62, 172, 155, 67, 169, -169, 48, -94, 88, -17, -117, -61, 67, -380, -9, 53, -21, -67, -88, 155, 54, -115, 40, 80, 205, -191, -93, -115, -120, -32, -59, -264, -103, -327, 129, -142, 176, -148, -223, -13, 180, 142, -149, -7, -28, 125, 77, 69, -51, -112, -109, 1, 100, 104, -117, -148, -149, 16, -226, -70, 143, -124, 151, 210, -107, 251, 118, 165, 350, -27, 73, 66, -129, 160, -250, 16, 26, 279, 158, -152, 70, 38, 54, 133, 35, 273, 167, 199, 119, -277, -166, 51, 133, 72, -28, 59, -28, -212, -69, -93, -178, -178, 144, 354, 212, -259, 21, -51, 65, -14, 191, -103, -168, 21, -155, 95, -96, 43, 66, -46, -131, 18, -12, -70, -129, -127, 97, 46, -158, -33, 100, -143, 0, -185, 48, -84, -213, -204, 47, 136, 45, 12, 36, 62, -78, -191, 140]
2990A40k1k42Q6k09K31N4J4l4L7j08j76K81o1J89J0j67J3q9j3k6O2o2P2O4l6k4
3016a5P1M2P8k0p4q9J75l21N36n37L33m21K41J42K34j64j23n0k0J10j85J83k30
3039a04JJ47K4j3p4k0j92L01K87m86J99j20K9k3k16N94j16L9m94nN59L3m72K04
3063H2K21o01J34J53Q6k74j4J15K05m11K69n5k64L94J48l23QK44j15jJM2j52K74
3087A66k24P9j77M5K63k26o0L74l70J71l09L42KJ42l10J02J92k42J02R3l59L67
3109A63k98m2N20j19j13M2J56l49M4m37N86k08K27k9l90J47L2M1j31J47J21n4
3131E6J60q8j12o8K37j05l29J80P0m3j32K11J25k17L22n58K88Q2k85k4J88M5J66
3154A69l38L11j49K67j10m34L10j33lL27l81J90K81l62K4J64J44l47j44K34k3
$$ y = [140, 119, -123, -37, -246, -15, 39, 53, 19, 56, -52, -228, 53, -8, 181, 191, 24, 37, -52, -65, -91, -29, -91, -19, 45, 9, -15, 56, 98, 176, 156, 82, -7, 168, -153, 383, -154, 179, -242, -1, 141, 375, 211, 88, 38, 18, 128, -57, 126, -104, -103, 44, 68, 55, -19, -39, -231, 70, 357, -129, 70, -50, -21, -44, -260, 334, 218, 257, -237, -242, 317, 350, -122, 82, 303, -298, -164, -11, 75, -199, -213, -98, 107, -304, -35, -90, -354, 40, 188, -135, -127, 117, 2, 1, 2, 44, -108, 166, -58, 21, -156, -111, 152, -74, -134, 240, -130, 41, -268, 74, 76, 218, -92, 10, 202, -40, 62, 155, -204, 163, -135, -177, 343, 224, 111, 153, 309, -40, 4, -433, 153, -55, 172, 143, -247, -100, -68, -27, -158, -11, 110, 56, 216, 128, 16, -52, 185, 80, -249, -69, 1, -42, -174, 37, 162, -55, 267, -291, -3, 79, -206, -230, -42, 3, 169, -169, 142, -7, 260, 150, -284, 26, -107, -110, 217, -164, 26, 307, -55, -31, 133, 277, -70, -214, 20, -3]
3175ck92J94K52k1L4m53J56L35k09Q8l9j69K21j43P9P6j05J23l13M72j33k20k4
3198i4K75j74r8J48j70J02J02N8q6k0p0L27l69l59N04J15K21j73m38K52k42K85
3220I6o4J00l43O4L3K18l47J18K59l22k8M9J59J46j59Q9j89J18j90O4j53K27N9
3243Dq4K0o8L04J20n09K64k05j14L89J65j05J13l13O6mj5K10M4r4l60L1J57j06
3267i0r7L77k64N2R1K08j25k5M2j82K63m62l7K01L5J11K34m05K46r1N7j94j03
3290a58M7J88ko1J77k16m6n4K62J73l78J18J99j74k09K57kk84J05K96j90O3M1
3313A52k85J53P3k1j7J57l24R2K27j84o6J02J21l42J86q4M4J90k71J63K4j4k53
3336a77q7L21k27K65l08NJ60q8J79J81l33J13J18j83J68k47J33J86m38J59k1j3
$$ y = [-3, -295, -101, 151, 130, 164, -289, -133, 202, -7, 81, 42, -127, 94, -49, 30, 106, 1, 124, -189, 283, 150, -70, -94, 181, 7, -91, 57, -113, -11, 91, 149, 63, 43, -27, 300, -69, -428, 76, 191, 412, 239, -199, 53, -189, 96, 32, 132, -211, -147, -114, 104, -243, -125, 134, -188, -216, -167, -8, 138, -21, 68, -121, -3, -193, -129, -282, -55, 4, -80, -60, -128, 176, 296, -213, 51, -154, -268, 121, 286, 181, 294, -19, 47, 43, 28, 238, 282, 188, -172, -141, 16, -90, -187, 190, -74, -22, 69, 277, 152, 127, 169, -13, 250, -212, -249, -48, -13, 98, 332, -73, 173, 82, 139, -55, -158, -111, 77, 75, 14, 191, -25, -71, -125, 137, 310, -68, 50, 249, 75, -134, 123, 121, -163, -58, 238, 48, 111, 152, -133, 20, 93, 72, 55, 212, -112, -20, 207, 23, -43, 59, 180, -162, 24, -60, -16, 174, -97, 66, 90, 76, -177, -264, 57, -170, 95, -213, -208, -48, -136, 43, 224, -109, 4, 122, -61, 107, -140, -7, 179, -259, -100, -121, -134]
3358a34q9J79J82j83j46K61r2L39j22k91J50k34J44L23j81l43J16j72J95r0J04
3379h4j51M41j05j22M2O3m62K75J0k3j72L27j78K86p6r7M8O2j97o7J09p7K58k33
3403a23J82j95K74k05k8N2K05j86M3q1L8L6K94k61l86L93K22k68k0J12k32P4O9
3426IK91m91K31k10L79k15PJ75k36J36j53J66k76J98N5J34k50L4n3J99j17k3j52
3449a62L51k05j06K05k03J73l3Q1k33M8j60J32R5j4L8k09K34l9j26K78j85n0K89
3472A99j71k02L05j33j12j63L41m0r5J95q7L53m76m8L05j22R0j04N2j1k46J27
3494d3K11q6q8j00M43m92K10L7j78j13P00n11j86L43k4n2q6Rj24J29R1j65j25
3517b00J03M31j67j98J19r4j20J00L1j5J5L8K0jQ7q1j68O2r0J52l0J30J1k8l52
$$ y = [-134, -223, -44, 138, -45, -191, 70, -22, 317, 195, -96, 54, -180, -36, 287, 106, -237, -121, -293, -98, -188, -84, -235, 206, 101, -21, 21, 84, -378, -103, -93, -116, -288, 39, -139, 147, 71, -26, 22, 84, -113, -180, -71, -148, 110, -123, 59, -136, 138, -67, -95, -43, 162, -24, 19, -62, -24, 12, 306, 45, -341, 52, 274, 6, -14, 98, -134, -60, 9, 300, -191, 40, -170, 209, -6, 1, 176, -60, 76, -77, 89, -187, 11, 66, 200, -50, -16, -69, 130, 13, -10, -162, 189, -16, -122, 83, -120, 53, 20, 101, -132, -84, -244, -112, -17, -31, 7, -202, 32, -7, -133, 145, -40, -90, 199, 28, -174, 131, -2, -114, -277, 64, 24, -71, 124, 37, 390, -86, -134, 171, 49, 139, 35, 87, 76, -170, -43, 168, 82, -6, -106, 337, -155, 55, 92, -86, -199, 501, -10, -196, 147, 123, 71, -15, -6, -130, -1, 90, -75, -200, -97, 334, 167, -31, 88, -6, -126, -26, 5, -10, 5, 43, 63, 62, 149, 68, -100, -38, -128, 24, -6, 124, 135, 107, -245]
3542b45J37j02K69J39m25K39r5l1j49L83p4k3K70k10q2J49J24m07J14k32K49K66
3564B64k49J02j02n4j42J02J07n8L9n2J0L4K04k13K51k94J19l26R7J03R7r6K5
3587c2j02J03j4J6l4M0j5K5K85l83R8J24J65o14J83J89j49j81R0K13L19l16j17
3610a07O3%L43n78J20J30j52N63l09p6k94M26r4o5l16J31L94k67K61k4j87J60
3632A22m53K04N91l91M7l03L17l40J95l31J44L49l00J52k18M68l84N0K25q3K73
3653C34k45j96R9J70j67j5J62r2p3P8L7n3J72k55q3l49M56r4J56K85m22J38k1
3676B2j53J44j34k9M64l3m04J71K1J17J07j19k92J98K19n06K38m7K40l24O9J73
3698A42k1j75J07l3L3r3j35J57n3J76j47m5L6r7L38j63j14J82j39M4J55k88J33
$$ y = [-245, -108, -210, 59, 198, -227, 12, -83, -114, -263, 120, 46, 23, 293, 83, 1, 150, 274, -133, -19, -251, -2, 264, 15, 117, 15, -39, -181, -79, 28, -30, 9, -43, -33, 1, 205, -8, 243, -51, 68, -258, -161, -58, 39, -57, -32, -134, -31, -45, -29, -63, -23, -38, -13, 272, -111, -13, 111, 276, -338, -155, 34, -115, -296, -206, 7, 326, 10, -107, -44, -44, 299, -279, -159, -29, -181, 382, 73, -3, -297, 129, 35, -30, -346, -215, 179, -88, 173, 149, -38, 122, -331, -127, 464, 73, 120, -183, 134, -206, -11, -342, -198, 151, -149, 3, -215, 253, -131, -81, 144, 61, 334, 89, -107, -8, 162, -5, -20, 142, 50, -23, 55, 92, 39, 211, -44, -127, -476, -20, -114, 42, 327, -95, 43, 22, -131, 13, -121, -150, 314, 281, -123, 48, 69, 186, 293, 174, -118, 80, 299, -207, 31, -16, 224, -100, -31, 142, 121, -54, 53, 20, 53, -40, -175, -18, -71, 105, -42, -87, -51, -148, 190, 27, -87, 95, -44, 0, 155, -133, 0]
3721@R4l5l98K20J76r0NL99k60J25k66Jk96K35m7R9N1J4K82k38r8j88L47j89J43
3746H6K5j61K03k48J38K89l30l51M84J04m14J71Q5l23L85k49N2J69N1N6k58nk77
3769c18M05j46L7M0R3m2P9k53J47p6K7k08L53j68J6j42P9P0nQ5k11J89J0l30L68
3794I9J8j11L7N8N9m9j61k5q7L51k21j7Q6j13K16j91K6p6P9p3P7j9L6O1m88L55
3820g3j67K76j27L90o1m55M06J9k90PJ26p0l24K67K82k33J10M8k70J47P2L6m2
3843G4l8p1j00k7J4m7L49l3k12L7j02P9R5L9j48N0k11J98kL0k03L35J51k6r2m86
3869c47K60K94k75L0K93j01j14J0k72L95j40l4r4N8l5K5j44M21l34Q4R0k45J55
3892b0j26J57qk03K59j8j60J16k18L97o2j46J25j35J48k97K21l7j29L36j12p7
$$ y = [0, 94, 59, -339, -119, 57, -33, -28, 371, 111, 236, -30, -29, -325, -90, -137, -38, 13, 27, 309, 71, -27, -215, 132, -57, 86, 111, -50, 153, -95, 43, 332, 2, -349, 135, 239, -175, -4, 81, -242, 143, -106, -54, 115, 166, 222, -36, -41, -318, 87, -59, -22, 18, 111, 69, 148, -105, 42, -34, -7, -215, 138, -30, -14, -156, -77, -7, -12, 73, -138, 51, 61, -269, 99, 117, 6, 43, 101, 160, 111, -50, -75, -162, 189, -32, -49, 37, -76, 140, -51, -25, -101, -22, -95, -18, -37, -1, 60, -428, -73, -240, 36, -91, 299, 238, -217, 189, 208, -82, -75, 51, -19, -343, -76, 206, -27, 83, 131, -139, 8, 80, 116, 74, 36, -35, -135, -162, -148, -195, 154, 121, -91, -54, -156, -77, 18, 57, -91, -41, -252, -54, -56, -26, -229, 106, 257, 231, 139, -347, -87, 207, -68, -38, 255, 154, 40, 50, -222, 173, 33, -1, -95, -37, -72, -47, -191, 230, -104, -20, 70, -175, -20, -146, 11, 3, -200, 59, 41, -119, -3, -221, 176, 114, -32, 93, -42, 106, -191, 30, -7, -136, 200, 88, 11]
3914A1j14L3J75j73k8L41J77k43k04k90J23K83L0k30r0O9J21l69J26L11Lj3J07
3937A56Rm12p3L17J81j27J66j3j72J60m06J04j46J09K85j78R4k63K13k11M51l90
3959a46J18o9L49K7m34O4L80q1l88K76L1k13Q6K27k13j09N8J81j54L7J6j72K78
3982A49j55J35j89Q9k30J31K02j37K9k60L58k64J16K3K21k29l3J79L7J4l46K11
4004E1k1j26J69k96K96j19K66l39L60l5j26j68k3J07J15j17j8k56K93J09k08J06
4026B0Q0J22l88R9O5j15nJ2J62O2k67J30o8J94k41K69l79L70k11J97k77j93L94
4049C2O4j26J51j62J35j82K00j55m9M6j7J08J83j92ln7l08K59J61j77Q8M8m6K11
4073B12l35j5L14j5r1j35k20J35L69j9n27J70K91m54M59j69j35K53o1m0J43k24
$$ y = [11, -103, -70, 105, -68, -96, 245, 422, 179, -25, -315, -192, 91, 121, -109, -199, -130, -9, -378, -252, 59, 62, 49, 156, 165, -247, -320, -3, 178, 51, 217, 204, 32, 192, -214, -110, -256, -147, 138, -40, 54, -209, 4, -207, 244, -146, -28, -97, 252, 279, -155, -91, 289, 208, -180, 96, 127, -86, 0, 227, 14, -95, -37, 144, -10, 27, 43, -129, 149, -6, 129, -60, 29, -201, -70, 132, -5, 24, -236, 122, -142, -26, -3, 218, -11, -44, 135, 172, 186, -160, 51, 30, -96, 73, -223, 73, -46, 220, -119, 241, 206, 80, -88, -111, -4, 111, -6, -24, -280, 13, 122, -86, 20, 100, 222, -166, -67, -2, -117, -122, -110, 52, 114, -153, -23, -91, 103, -138, 131, -248, 122, -89, 108, -169, -362, 32, 96, -30, 121, -41, 94, -88, 112, -43, -92, -46, -63, 45, 228, 36, 33, -24, -332, -73, 88, -89, -1, 47, 1, 212, -123, -138, 176, 161, 70, -65, -285, -150, 219, 200, -327, -157, 134, -320, 139, -30, -165, 88, 27, -13, 130, -94]
4095i4K75o9j60n5J54j68L76o5j28j61m5J39K23l58K48m1m18L14N1J7J8K05k84
4118b6M9R4j97K40Jq5j91K60k63K3m65O77j21r9K22k82K37L16m44j36P8J76k31
4141a67L53l4l25J28N4o3j31o1M48l16L54q2J05n2k0k90q3K13J7j62L3J98j50
4164c3j01j15L8Q4Q1L41j64l44o2O4K16L10j01m38M29m16J05N6k19L18J20L5m72
4187b68R0L90j58k23p1J29J77q9j03K14j63n2J56j61N7N0O2r4L4j1L13j77k55
4210a53M32k94K77j44j25o4k4O0l3K40nk21JJ04j32j6L47M1m94K69j83j43M70
4233B10n25M41k14r5P0J41L5j45L36j52l54J64R9q1J74n04M69j87l9K20k42K99
4255A20N6l67J96j3R3q0N7k61K22j52j11K84J92l83J13j39L83k37rJ17k87M75
$$ y = [-94, 181, 112, -48, -103, 51, -117, 259, 194, 66, -95, -140, -1, 222, -136, 112, 71, -347, -33, 18, 35, 53, 258, -26, 23, 117, -80, 160, 161, 76, -115, 145, -118, -95, -560, 117, -4, -103, 119, -163, 74, 390, -54, -190, -112, 64, -167, 186, 152, -173, -45, 9, -54, -185, -246, 202, -114, 240, 158, 263, 211, 191, -99, -182, 31, 48, -114, -81, 117, -33, -134, -249, -211, -127, -46, 295, 131, -213, -275, -211, 5, 315, 214, -224, 205, -211, -106, -50, -269, 49, 169, 204, -268, -178, 212, 54, -169, -240, -111, 66, -23, -126, 88, -75, -127, 29, -132, -75, -25, 37, -57, -23, -34, 279, 102, -153, 279, -15, 262, 118, -7, -71, -95, -35, -68, 172, 167, -54, -53, 51, -81, -97, 250, 291, -203, 66, -117, -260, 210, -315, 126, -88, -183, -113, 28, 63, -82, 254, 102, -252, -88, 11, -70, 104, -400, 69, -118, -157, 63, -179, 120, 176, -191, 5, -8, 85, 5, 62, -199, 23, -129, -240, 44, 236, -147, -34, -173, 210, -27, -36, 81, -206, 269]
4277B69j12k84J53q7l8J78k23J33k04J37R2j47L17m16K08R9J34l0j53p7J02P3
4299A24n62O90O2k11j95K23L0Nj47M3o6p5j69M17j7l06K84k55orK34J09l81J21
4323e7J27j98L95m17R3k4J42r2L6R4l27K91l79L49K84ok70K56n0l91L40k69J06
4346C3k24K31J2L5j53r0J66j94J64j32K28l9j56K63o4L55k01k78N1o7M4l66K83
4369i9L37k3n01N46m4j25k01R7k5L20l86L47m8l73L30j51J07k24J51Q7k18l7J13
4392b0k6R4J1J51k65J89N2n2P3j86Lj11K64j46J46k64K6K21q4j86K15q9P1R9j85
4417AJ17j75L69j94k22j78L25q8n1K70l49J43j65J72j0K11P1n97L23j5j54M53
4439B57l03K84k19j10J89j38l6n7J68q2p9L10l3k60K47k17O2P8n15M43Q5k4M1
$$ y = [269, 157, -127, 26, -61, -99, 79, -144, -11, -215, -78, 14, -133, 184, -232, -24, 75, 209, 179, 26, -51, 51, 124, -438, 252, 314, 103, -92, 131, 161, 166, 19, 62, -4, -79, -248, 169, 152, -154, 130, -125, -131, -140, 94, 203, -178, -57, 70, -128, 267, -150, -57, -81, 61, -31, 5, 99, -228, 63, -316, 33, 317, 311, 41, 297, 247, -144, 196, -73, 33, -191, 40, 52, 87, -66, -156, 10, -184, -20, -152, 76, 37, -119, 144, 80, 435, 234, -44, 7, -60, -16, -382, -99, 238, 215, -286, 260, 216, 91, -110, -13, -38, 282, -104, 243, 195, -178, 152, 1, 108, -116, 35, 122, -96, -133, -20, -46, 48, 59, 210, -55, 134, 186, 134, 207, 21, 24, -87, 177, 31, 177, -87, -61, 160, 76, -110, 105, 16, 87, 186, 1, 118, -57, 312, 118, -104, -282, 43, -45, -96, 174, -175, -32, -197, -25, -35, 176, 247, -350, -27, -42, -196, 257, -46, 238, 19, -91, 98, -40, -76, -133, 35, -47, -126, 184, 151, -109, 138, -79, -17, 61, -454, -11, 74, 50, 91]
4462I1j14M7R7n5j38K24n0J01k79P1p5n4K1J21k19L47k98J56j80L38R3j45l2j91
4486a23K92k44J04J74n9k78K48j57J62j43K65j86J67p5k15j9J94Rk03J56m33K16
4508a48O2l7L61k80M1n1J67j91J1j07J23m3L30k03k91K49J32J16k48Q8p3KR0L6
4532A36j15k2p6M6r0K8j82K69j67K94k94P1K5l5L27j99j12k23K84o2j33J20K92
4555A82N6k91P8R0m7qL1L37m44J2m3m2L01K4l35J35k91K9L93l16K07k0k9k8q9
4580a08M08l09L68j89o7p5O7j20P3m0k64M06o8O1j87P2k09K50j40K50o5J8N7j48
4604D1k2K5K9k37j65L44L09l35j3j45J12j49J31J38r8K2j87j59J02mL26k87M49
4627B27l18J13L61k56j54j1n2j44rL25k0J59k84k45J60L8K12k63K80Q9j93J02
$$ y = [91, -23, 24, 121, 66, -72, 152, 102, 203, -76, -5, -80, -134, -113, 8, -211, 136, -162, -6, -186, 152, 245, 100, 68, -123, 169, -75, 29, 203, 144, -134, 114, -43, 119, -24, 241, 55, 222, 147, -68, -87, 107, 116, -87, 69, -364, -148, -86, -123, 238, -42, -1, -52, 115, -76, -65, -172, -49, -92, 238, 35, -256, -7, 125, 241, -7, 81, 8, 10, 100, 136, 21, -1, -77, -31, -121, -93, -275, -6, -173, 121, -173, -102, -77, -112, 215, 16, -96, -319, -35, -97, -230, -110, 182, 238, -53, 25, 115, 68, 60, 91, 428, -16, -4, -47, -89, 212, 236, -99, 36, -255, -226, 167, -149, 58, 38, 9, -19, -108, 300, -9, 359, 170, 103, 28, 95, -25, 48, 8, -256, 150, 82, 143, -44, 28, -181, 69, -71, 179, 114, 132, 189, 41, 19, 44, 73, -164, -329, 15, 324, -11, -24, -169, -57, -206, -75, 63, -35, -13, -200, -359, -257, -261, 65, -222, 227, -91, 22, 383, 127, -27, -38, -90, -234, -243, 82, 62, 221, -63, -308, -148, -110, 102, -161, 119, 208, 15, 117]
4649A17%p7L6J9j20J8k33L02R7r7o9J2n9j21L17o2l00K50k1k89O06l42K02l12
4673a26R2J14J80p8j92L02l21j68L28L4o2K0m90L42Q0j84L92m65L67o6l19J02
4695a18k11K23j6J51K63o4j16R7k56JO2J42m06K07J28l29L30J04k73O5J87k45
4717g4L94m05j5K03q9k16L10Q2k06l41M13j77K25k19J6M30l26J32p4R8j03k66
4739b08M48k57L0k1j15K17k03L47j52J01j10o8M6k68K88P2l67N3J12k7N4K8j7
4762a7M8k07J67MM1N0j4j75J47o2m4K17j14o5j66L71j97J22nj08k78M42j11K4
4786G0k05L19N1l27r1M7K46m40N14n7O9l73L94j72n0j4k98K08K32Q4j0m22L36
4809A11ML1j35j34j4J72j28J38r1k55K47N3j14MO2K67m58J98N7r4L4j7K5K94l62
$$ y = [117, 117, 40, 76, 95, -25, -7, -240, 62, 159, 62, -7, 5, -54, -175, 142, 80, -220, 30, 9, -280, 326, -16, 186, -126, -34, 80, 260, 182, -10, 292, -29, -197, 131, 165, 103, 123, -367, -25, 55, -129, 263, -202, 165, 99, -220, -118, -329, -106, -122, 29, 292, 228, 112, 209, -47, -46, 16, 158, -248, -41, 87, -242, 88, 192, -81, -16, 171, -74, 320, -85, -100, 103, 14, -202, 108, 190, -16, -357, 56, -121, 104, -115, -99, 331, 5, 137, 63, 161, 58, -208, 240, -17, 13, -8, -123, 94, -109, 238, 86, 187, 77, 9, 55, -213, 75, 147, -220, -167, -55, -82, -28, 0, -17, 31, -176, -9, -5, 36, 86, 72, -103, 44, -18, -62, 155, 41, -24, -190, 181, -16, 106, 101, -7, -285, 157, 46, 70, -135, 184, 235, -92, -183, -136, 110, -330, 184, 127, 196, -177, 217, 45, -5, -19, -317, -109, 123, 207, 197, -225, 111, 115, 146, 11, -123, -137, 35, -93, 45, -46, -301, -54, -1, -115, -111, -49, 218, -240, -42, 15, -79, -45, -62, -37, 257, -105]
4834a05p2m8R6K40n3J7j88p6Q1J37mj84J6J68r2Jj49L02n0O1m7k83L06M6n3j2
4860E5J91o9k19P4P7R4j37j83r0K09k79M70j58N6M8k42J69j13q8K56j67j93K84
4883D5J2m8j17L06j07k35K63l58K24m2J00p6L51j29k02J52j05o3R5l47L48pq2
4906b2j08K81K30m01P0j43J73j57K03j52L57l53N0J08J75n09n1K45P1j65K03j19
4928a4LJ09r3j62K41p1l08K96J59j56J66m03J94l4M21m68j24J60O9r9K44k55J43
4951A8rj34L49j09j68J52Mk93L49q3k0j24J31j40O9K89k38L48l05n8j36J71q8
4974b5J69k1k85k4QR8J35L2j01k17K08K52k67K38m96K28J96k59L2k3L64l07Q4
4997A9q4r2L1K62o7N5K33l44k83K98J18j70J01j70J49Q9j12l56K79K59l7l94p0
$$ y = [-105, -177, -225, -129, 111, 58, 75, -113, -189, -108, 29, 25, -159, -143, 25, -67, -66, -215, 87, 37, 98, 51, -232, 74, 120, 67, 55, 246, 177, -42, 32, 109, 203, 66, -117, -207, 2, -277, 193, 35, 91, 139, -103, 66, -47, -135, 121, -46, -239, 45, 57, 9, -108, 198, 91, -144, 119, -239, -15, -57, 43, -33, 318, 189, -13, 139, 34, -29, 66, -281, 67, 60, -22, -130, 151, 381, -20, 50, -93, 80, -77, 126, -26, 331, -22, 28, 136, 311, -198, -249, -4, 67, -98, 105, -14, -11, 98, 5, -157, 84, 13, -295, 1, 160, 4, 170, -233, -39, -73, 348, -120, -244, -84, -15, -114, 130, -125, 18, 9, -125, 224, 115, -53, 99, 103, -190, 159, 76, 56, -68, 63, -77, -8, 281, 43, 391, 86, 28, -108, 63, -25, 144, 123, -162, -186, -178, -80, 55, 87, -14, -231, -23, 229, -38, 200, -296, -68, 128, -131, -99, -122, 242, -65, 19, -65, -157, -126, 136, 69, 124, 357, 13, -270, 28, 146, -24, 77, -93, 56, 145, 33, -323, -44, 215, 178, -216, -286]
5020b86K62j59L6J85j18P6P0K60l94R1L00l41j9l9L05k55J58j75k85J84j15j67
5042d26M68p1J12K59m13J03Ol4KKk7lq6N7k1j71J15K95r6n2J5N6j47j44J85L6
5068B0j18QK08L7n21L66L75l95J5k09K85Q6K8L0k66Q0j45J09q9K25l4k46j83R1
5092b43K43j32L01j02k91K77l37JL94j98Q7M00l59k90J83J00l21Q4L22k68K50
5113A01l82K81p5J3P1O0r7J54J01j15j40j3L3j7M01n50J39K94l80kO9j95K55q8
5137h2P5J7j22K27j74m4R4K6J77k29O6l18L37L45l52L9k15K27k0J6P2k80j13M34
5161B03l33J76J1L8J75j60q7J08n7k27K18r6r1L90k48J43j71J06j94j9M12k82
5183A5p6Q4N0M5j39n1J11N4k25k23J70L40j28Rq2L2O6j69K34m83J21K00L5N7j10
$$ y = [-286, -24, -183, -147, 38, -80, -4, 66, 326, -68, 23, 323, -18, -37, -76, 229, -26, 132, -43, -328, -144, -259, -426, 42, -29, 83, 342, -71, 32, 38, 4, 6, 8, -19, -22, -108, -51, -72, -243, -128, 167, 71, 19, 34, 90, -57, -201, -16, 20, -98, -90, 118, 155, -366, 0, 375, -20, -5, -214, 71, 157, 185, 215, -51, 29, -116, -7, -96, 129, 95, -151, -334, -243, 0, -132, 169, 67, -224, 53, -284, -283, 111, -87, 0, 400, 41, -249, -66, 34, -287, -203, 119, -149, 101, -281, 0, -75, -62, 9, 69, -28, 126, 227, 112, -28, -41, -8, -25, 376, -174, -35, 259, -121, -123, -54, -249, 6, -82, -7, 10, -112, 115, -59, -103, -9, 17, 194, -35, 31, -287, 50, 395, 43, 82, -133, 94, 74, 90, 162, -118, -231, 203, -130, 46, 57, 95, 270, 110, 23, 131, 74, -153, 65, -31, -122, 268, 20, 163, -8, 98, -96, -115, 297, 15, -61, 23, 73, 118, -21, -72, 39, 93, -132, -355, -185, 155, 27, 36, -46, -14, 52, -117, 117, -366, -245, -45, -10, 47, -63]
5208f3m9q5K05l3l4K83l32M29l04qJ33j26P7k58J32l3K06j61q7J84j8j6j91K99
5232A50o2l15L45Q1k67J93j04Kj48M3P8j90J39K46o8j65K18j01m8l22L71J09j64
5255B1J72r7k12k4J70L7n1j57J06M6L19l74j16K21j45J32j53J15L13m11J9Q4J15
5278A30j27K15k17n3R3r5l1O9K3k09J20m7L20k46M17k43j03m1R7q8J08Q6j66k93
5302b81L58J08j47k56J78K3o5K34N4n8q1j36Q3P9o5k78L03j93L62N0k26L8J32
5325B16m75J15J63%K61l40K28j54nr3j1L26l60mp4L30K07k33K06m00k6j25M68
5348B20k31k05L98k94L54j31k01J16n1l0m1J71J49Mk11j0p5J11o6J05q1l7p4M69
5372C59j68k26LJ9mk14N0J20L4n3K07lM5KJ39m35J60j06L0j10K28qj86N27m99
$$ y = [-63, -112, -197, 8, -25, -59, 224, -108, 321, 17, 9, 142, 16, 93, -165, -33, -66, 140, -21, -108, 76, 58, 42, -149, 150, 88, -227, 118, 199, -68, 125, 21, 23, -125, -82, -4, -194, -55, 191, 123, -42, 176, 75, 27, -295, 76, 185, 21, 193, 96, -116, -140, 30, 67, 16, -141, -35, 11, 330, -44, -160, 61, -84, 48, -105, 10, 323, -88, -69, 15, 130, 3, 218, 1, -52, 41, -54, -85, -16, 7, -202, -82, -129, 191, -55, 362, 119, 16, -25, 72, -16, 92, 178, 12, -281, 77, 185, 38, -218, -40, -17, -82, 152, 206, 148, 67, -69, 14, 93, 28, -250, 53, -140, 222, 272, 46, 84, 216, -259, -144, 19, 19, 280, -60, 168, 14, 9, -84, -95, 231, -129, -133, -207, 123, 330, 97, 303, -97, -123, -248, 220, -11, -216, 182, -112, 242, 111, -90, 26, -25, -55, -96, 75, 224, 228, 17, 7, -68, 43, -23, 82, 1, -36, -110, 359, 191, -35, -32, -13, -17, -231, -181, -61, -27, -80, 127, 124, 169, 171, 310, -125, 35, -71, -41, -151, 77, 69, -117, 410, -89]
5397h9MJ57o1k49l2R6K05j99m9M91n66L19l13K80r4J18J12Pj57J50r1l87K45Q0
5421b3j30M8j12J69L72l69m9NJ15J5L8J19j70k83K44J19r3K30j67k68N3J43N6
5444F2j60J73L3J80n89J98Q0j92K55lO4K62k60j71l1n4j6q9J82J82r1O2J48M2
5468B67k65k50L23j73M71j60k23K1k34K44P0j75j57K24Q7j82J80K8j34K09j8l25
5490a72K90j4lj07mJ68l93K92L1j50K92m7k26L16k22k18L8J65Q3l04K49l16L42
5513I0J3l75O5K77l4j13k48K33L33j62j09N9j46L25j47P4o8qJ2j93kL45k91P0
5537@M2k46K86J46j08k34J68J3Lk33K87l90J16l8J16R6P3k72P9M3K78j79k27K5
5561a56J74q9K69j12j08J90j96J48k90J43j58L07k90O3M57m48K08n9j7J04j33
$$ y = [-89, -85, 72, 11, -238, -270, -174, 31, -168, -217, 274, -292, 27, -286, -6, -100, 18, 130, 137, -20, 130, 39, -348, -103, -23, -153, -105, -217, -48, 324, -45, -94, -89, 26, 41, 79, 198, 28, -255, -11, 108, 15, 245, 78, -190, -137, 6, 62, -98, 75, 108, 288, -301, -103, -23, -215, 40, 37, 101, 363, 103, -68, -99, -153, -169, -258, -76, 106, 15, 77, 225, 267, 2, -248, 75, -98, 373, 213, -10, 11, -223, 21, 91, -84, -241, -17, 70, -112, 68, 96, -38, 171, 153, -172, 118, 104, 101, -6, -10, 158, -235, 57, 88, -62, 230, 183, -43, 273, 51, -167, -129, 36, 119, -185, 64, -252, 90, 103, -272, -207, 70, 36, -77, -325, -92, 241, 79, -30, 29, -117, 208, 61, 135, 67, 59, 71, -122, -124, 221, -70, 0, 42, -204, 82, 228, 120, -114, 54, 67, 70, -163, 124, -266, -150, -188, -72, 24, 97, -175, -96, -53, 225, 46, -181, -156, 18, -71, 198, 86, -22, 168, -28, 120, -170, -27, -185, 122, -168, -105, 352, -96, 112, 53, 36, 140, 7]
5582Gq9j67K13J94l10L94m17J36j0K72o93L45r4L00L2N1P6r3R4l39J80J87o01
5605c32K07K0L24l4l87J11K24j45O5qJ53j50j47J64J36j71n8k02m9K41q9O9L5
5628b3k0L4M7J9k6m4mj54J17k3Q8N4j54J83j87P7K29m31L30l89P4J6M18k03j78
5653a50J91q7LK16J08k02l05J61l0K44l36J14p5J94L05k98J23m26L02j90K49k95
5675a84L13j95J6K10j70k55J8K73N7m18R6k23M63N2l51M30l0J9j47J94j32n7%
5698b1K17k6j41j11k79L91K60k70J08l11M53j74J01m1j53p6l6K49j40j0M2K59
5720B91j26j50L5P0k02R2N2n3j85j41L18L50j9n77K94J15l01j14L01j11j35K89
5742I3j37K95m98L90k33L1j5L51o1k03K65l12J82J1p8j16K66l46L4K32o9j44L6
$$ y = [7, -82, -249, -36, 158, -152, 242, -175, -39, -49, 223, -470, -125, -219, 81, 113, 164, 240, 147, 241, -98, 82, 269, -332, -125, -105, 219, 185, -202, -91, 133, -12, 53, 45, 198, 48, -99, 65, 201, 30, -28, -230, -279, -38, -127, -58, -23, -43, -9, 38, 57, 31, -13, -17, -171, -54, -77, 11, 65, -89, 94, -93, -16, 213, -218, 112, -277, -203, -187, 231, 28, -150, 41, -46, -43, 173, 281, 79, -226, -65, -95, 149, -187, -73, -148, 46, 351, 53, 176, -250, 52, -138, 111, -184, 129, -66, -50, 160, -10, -265, -247, 26, 83, -335, -239, -462, 1, 53, -298, 132, 102, 121, -26, 168, 36, -21, -21, 196, 170, 29, -82, -361, 30, 290, 20, 128, -183, 270, 96, 197, 156, 3, -73, -109, 140, 0, -10, 32, 291, 165, 15, 50, 120, -82, 10, 62, 9, -176, -317, 1, 351, 332, -245, 49, 164, -137, -251, 50, -61, -196, 93, -44, 251, -247, 143, -90, -59, -74, 277, 216, 13, 278, -34, 148, 159, 81, -35, 231, -115, -81, 151, 82, -62, -26]
5765b6O5j29M81m16J40k77J56J91j95L8m7L12l13J92k92J47n8K95o4J51k32n4
5787F5L1k1M0k12K73j91j55J73R5j46p6j48J68M2m2J29J75j66J7l71L96MK36l26
5811a0k07j03K21O9K07j40J25j63k37N73m41j71K43k98K96J23J20j91O3J52j90
5832D1N6k21o0M15k09J3J60l18J50k8N1R9l50J01M86n84J51K11l51L40P8l35L75
5855B71m22k3J53Q0l8m43K31K29o8j08L9N4J35j85K80p7k00M0J60J11m58J61J20
5878D2j58K49l54L06J3j64Nk23K11j44L28J30j97m5l9P5K1n2R0n9K42m39R9P9
5902A6j01K43k09N5l98O7L75k17l7J39MK43j21N7q8k54K54j51O2J91k48p1K92
5925A03k52L45R7k02k1N4k29K32k00P7k49J43k7OL70j72l73K90K0j14L67k68j16
$$ y = [-26, 39, -90, 391, -25, 115, -162, -6, 185, -10, 28, -19, 293, -20, 172, -120, 27, -31, 264, 200, 351, 119, 65, 96, 75, 115, -97, 176, -15, -170, 3, 98, -48, -124, -272, -104, -62, -104, 25, 200, 34, 51, -320, 76, 80, 316, -10, -217, -320, -99, -30, 177, 37, 162, -1, -238, 335, -106, -277, -34, -332, -36, 87, 207, 16, 79, 231, 41, 97, -124, -184, 231, 22, 35, 195, -123, 27, -1, 50, 149, -201, -100, 386, -198, -47, 164, -187, 153, 231, -104, 271, -151, -174, -21, 59, 21, -422, -191, 38, -30, -138, -99, -45, 90, -95, 185, 108, -92, -52, 108, 219, -239, -78, 42, -116, 133, -221, 85, 98, -66, -61, -284, -73, -217, 111, 241, 44, -1, -40, 35, 56, 4, 94, 35, 277, -162, -63, 16, -85, 158, -51, 4, -394, -327, 48, -169, -206, -67, -63, 180, 59, 116, 28, -226, 28, -123, -61, 130, -118, -189, 103, -149, 196, 293, 91, 70, 124, -105, 127, -73, 4, -245, -102, -129, -123, 247, 75, -298, -8, 12, -102, 265, -3, -119]
5948a19J49l4KJ9J95j15j74K75j54j89L63n9l1N5k81K6m3K67M1j58j8j88J36R5
5972F0O4k7l94J86J64j70L5J91k20J69L7l75J66K56k05J68q2j34J24J13j68J06
5994F4j99L4Q5j57pL89N7j82k00J54J59J0m4n01M41Q5j49l8j02P1l3o9m9K99l48
6019b30J00J27K67k28j70L67m02K96j19k3K50l67j4J47N1K59j62j87j08N0K71
6040A75j37j86J96k1n1J67p1p9o0J77K0k59k03M56K91l05M3j21R7k41R3P2k10
6063a57J00R6j95j0K71p4K7k76L99j71P2p4qO9j63J94Q0l39M44k07q4j42R3K4
6087c1K7M1J20k49P7K32k09j93n4P1J39k38N17k36L24k13r6m9L96n21R7J89j05
6110C6j92J78l2r4J51r9j71J07K26J19m42L40j17j03j1K02K8k6J23pj25r3j92
$$ y = [-119, 30, -4, -2, 17, 212, 97, -77, 198, 44, -145, 218, 159, 128, 183, -98, -72, -115, 152, 193, 35, 17, -171, -35, 60, 124, 97, -297, -111, 53, -117, -82, 109, -111, 58, 95, -280, -114, 142, -63, 105, 23, -111, 13, 126, -42, 64, -135, -101, -16, -173, -180, 209, 266, 84, -116, 38, 197, 207, 163, -338, 103, 188, 39, 1, -101, -30, -63, -132, -181, 118, -230, -130, -3, 264, 36, -134, 233, -169, 127, 8, -15, 235, -132, -146, 1, 52, 311, 149, -38, -146, -96, 175, 38, -148, 48, 27, -24, 143, 72, -7, -67, 110, 130, -129, -332, 124, 415, 110, 153, 32, 129, -112, -19, 53, -157, -57, 39, -156, -166, 105, 31, 58, -218, 181, 10, 82, 8, 0, 69, -94, 100, 180, -159, 285, 78, -6, -148, -55, -31, -4, 37, 157, -92, -15, 217, 8, -185, -239, -168, -29, -267, 250, 14, 338, 125, 29, -20, 376, -145, -48, 141, 36, -156, 22, -10, -104, 47, -52, -223, -116, 110, 229, -213, 127, 10, -93, -104, 98, 126, 100, 223, 216, 91, -2, -194]
6133a94L1M05o44K23L67l44kJ98J4k20o5K20l4Q2p7K55j98N2m34O85l65m3P2J02
6157H6n4R7P5k65P1Lk4j06RO0Q6J71k97K65j57j32O1J23j24JK66j76k69M07k86
6182a09J16J17J03q7L8k46p1J31Kp3L18j99k99J75n4J04R2l6R9j41P2K6O6K4k45
6207g7J75j63j96R9K92L3M5k22k6k3Q7n1p6J07L77l39k39J6M6K0L1K2l9K6J53
6232G8l4l9M9j03N5K32l23J37j2q8K15p9LK15r3m44L21k88Q8p4L19J40l44K5M0
6257dk3P7K37r7k4j54k82K24K9J03M3L3l26J28k08l3K71J43l5j34j06K5o7J54
6281b6l9K9J65n4j24K69l07K35j44K56k76j21L24l76K91J37l88L72k36K81m97
6302b29L49r1R8k56L7k2K53l58j48N87p9p2q2j0kn7L17m45J09R9k92J78L2J87
$$ y = [-194, -163, 242, -402, -179, 188, -156, -158, 40, 54, -166, -231, -11, -45, 37, -40, 215, 17, 69, -365, 320, -45, -88, -16, 86, 32, 129, 204, -61, 10, 13, -11, -117, -108, -48, 38, 209, -88, 177, 20, -112, -51, 72, -52, -51, 215, 39, -230, 177, -109, 7, 124, 227, 140, 178, -68, -139, -8, -6, -79, 239, 40, -259, -84, -138, -34, 58, 22, 121, -20, 52, 78, 144, 168, -77, 98, -65, -261, -162, 130, 163, 208, -14, -40, -63, 24, -27, -103, 4, 381, 42, -197, -181, -135, -115, -84, -62, -101, -75, 78, 44, 5, 54, -49, 6, 238, -85, 52, 40, -48, 167, 88, 91, 306, 213, -231, 90, -198, -110, -184, 135, 275, -69, -44, -4, -27, 50, 287, 190, 166, 12, -270, -46, -17, 86, 129, 162, -164, -36, -244, -277, -6, 137, 102, -32, -138, -113, -180, -26, -65, -36, 129, 75, -49, 220, -87, 148, 4, 260, -16, -137, 187, -189, 102, 239, -149, 223, -13, 268, -229, 120, 29, 127, -129, -92, -114, 139, -219, -367, 220, 141, 69, -13, -23, -25, -82, 235, -210, -101, -2, -294, -116, -84, 103]
6326A03o6j9k66M78j82r0j99K71k54n5L21n8L53k77j83N9K48k13l7K10j46K01
6348A99l28L7J61j28OR1m1m8L34l92Q3k40N11k96j02J69K56k72J2K0O1l8K7j50
6372f8l7L2Q1j85J88j99J33Mk68M78l56K17J10k90R9P1J36l32M83l93L29l73L5
6395a05K61k66jj9K55j30J00k3j7k4j44L2j4O6k4l0L44k24k90K06K12j95N1k18
6419a97Q7J85m4q6J21R4m02K47j02M6L31p6k14j08k8J5M25j24j31O0K60l39l5
6442a5n7K03j03r4K7p7J93j07O2l24M39M8k44J10p7j2o0M17l81K55j84m3j59Q6
6466i7kJ33p4J70j5J0o37N99o6J9K44j48k30J17j00N9Q6j84K38K75j94k82J42
6489F3L0j72Nj52M12j73J39j10n2Kk09J70N7j11K58j81o6K34l32J49J18j45J69
$$ y = [103, 37, 18, -248, 230, 48, -42, -241, 30, -224, -279, 42, -16, 337, 60, -123, -64, 184, -29, -66, 144, -2, 199, -129, -92, 69, -59, -53, 38, -3, -51, 283, -109, -26, -266, 245, -51, -153, 16, 272, 0, 12, 32, 93, 55, 82, -68, -105, -73, 8, -177, 11, -188, -55, -51, -319, 159, -197, 20, 130, -160, -61, 10, 146, -186, 297, -96, 233, -140, -105, 156, -110, -111, -130, 125, -5, 95, 72, 55, 31, -113, -81, -95, -29, -53, -83, 261, 37, -253, -47, 165, -30, 21, -197, -110, 75, 31, -55, 66, 160, -242, 5, -97, -51, 280, 204, -10, -118, -146, -131, 294, 170, 39, 99, 359, 20, -15, -72, 131, 28, -66, -39, -116, 77, -30, 32, -292, 147, 195, -49, 61, -16, -28, -88, 329, -52, 203, 19, -24, -183, -97, -99, 34, -40, 130, 115, 125, -512, 87, 21, 40, 284, 136, -94, 23, -77, -18, 68, -116, 122, 397, 203, -79, 63, 93, -79, -74, -226, 186, 13, 152, 42, -10, -8, -217, -47, 10, -101, 157, -24, -90, 144, -188, -39, 79, -66, 103]
6512A03k73R0K4L1P4kJJ53o7k01J86l37J69K87j28k58K12N8j40j71L73j48k15
6535a79O3K97l3N4l62J35N3M44k37L0l47l9J77l71kR0O18k28k42K4K4pN3q6Q1
6560A0J02j25rM9mJ50j5k98J5J26J16j4l9j0j53j87rK26K82q4n3L9j42k22N11
6585B62k25J20q7j75N6J13ol74K98j24K99j14K13k04J16k55L01p7k88J32J47k11
6607h3K08j70K7J50j21K65l78k06L40K25p3k86J46k79M79k06k73q3K42j87J69
6628i4j53O1L70j70J8P6J98k43J38j48j51J08k09J46n8K60j82j04j52L22J39k92
6650a20N9M36m72J39q8L69l13J22j89M0n8q7K43J21l11K53n8q8j2M0L14m24J88
6673A04n4j08j45k26J58L00J59j76L9j17j4J10m9K17l67L39n16K94L14o64M22
$$ y = [103, -170, -80, -56, -25, 49, 47, 48, 201, 134, -67, 119, -218, -49, 238, 110, -148, 64, 122, -18, -189, 184, 36, -179, -116, 181, 148, 202, -160, -25, 28, 472, 235, 265, -82, -121, 56, -315, -317, -227, 391, 163, -79, -55, -31, -38, 15, -71, 10, 112, -13, -22, 27, 23, 173, 158, -140, -125, 1, 117, 103, 64, 54, -99, -286, -295, -69, 213, 129, 76, 115, -27, -249, 262, 37, 157, 70, -105, -49, 64, 58, -316, -18, -142, 157, 43, 256, 52, 168, -87, 214, 137, -151, -19, 128, -83, 125, -45, -18, 132, 11, 276, -102, -308, 32, 257, 184, -102, 44, -235, 244, 38, -235, -318, -76, -263, -94, -247, -186, 184, 14, 32, 108, 306, 63, 201, 53, -98, 10, -199, -53, -111, 149, -33, -137, -289, 33, 172, -120, -61, 375, -97, 42, -46, 323, 10, 132, -57, -17, -75, -162, 81, 202, -109, 144, 86, -2, -14, 26, 340, -84, 104, 50, -58, -203, -429, -271, 29, 188, 12, 51, -66, -80, 30, -19, 198, -169, 170, -346, -52, 262, -402, 20]
6694B0p7J4K27j19j43L3m4LL76k78J02j91K65J46m12J08j17R9P9K46k33k68J34
6717c0p0J55J82k62j80J21L76l69J38j59K97n3k00nL6J9K60m29J23j25k0J48N4
6740GO7k4k09J45l0K83m36K49J19k47J9Q2k82L67o4j9M7m47L63j37q0L6O3K33
6764A05r3Q6j12j79M98l26NP8j86J87r9L1J98l92K85K87k23J58m42J51l0k81N01
6787B07n0k94M52j47J74p0k15J18l05J17Q2K8j63K27o5j06J35K45m04o8J66q2
6809a8J74r5j50J08j24MJ92O1pk19L1j89L49k50J96l3L1Q2j44J45l37J99k89N75
6833B92L1j59j31m7k0j02L35L5k32K88l60O5L10n46j62M87j13P7j39p0j61K86
6855c6q2J73J8J73m59R3J02j47M57j44l30L14q2m02J63K7K33j4j74j88J85J07
$$ y = [20, -57, -43, 184, 65, -78, -45, -89, -86, 290, 12, 114, -77, 188, 334, -78, 30, -87, 12, 91, 337, 104, -164, -30, -100, 55, 237, -25, -205, -84, 292, -77, 61, -98, 199, 146, -54, -59, -23, -4, 256, -173, -50, -175, -195, -47, 7, 74, 50, -159, -14, -44, 239, -197, 52, 171, -76, -57, 25, -257, 110, 46, 27, 74, -373, -10, -147, -227, -191, -128, 105, 12, 98, -14, -193, 305, -21, -16, 62, -124, 63, -36, -5, 193, -199, 86, 373, 150, 308, -134, 17, -13, -294, 207, 157, -137, 315, 168, 342, 272, 57, 175, -130, -13, 69, 97, -66, 161, 96, -10, 125, 370, -34, -102, 64, -18, 156, 61, -89, 19, -105, -101, 91, 152, 145, -74, -43, -232, 117, -133, 63, 30, 61, 143, -1, 144, -193, 6, -283, 292, 323, 164, 33, -14, -34, -136, 199, 234, 2, 290, -70, -5, 305, -241, -403, 84, -29, 48, -91, -161, -322, -36, -118, 55, 73, 246, -213, -120, -18, -165, 292, 148, -182, 132, 50, -352, -189, -162, 71, 57, -117, -305, -120, -13]
6877a3K78m62j31J22K80jn0j51O8r9K01k5O5O1j98J59j15J37k53J81l01M17N5
6900B25l18M7O0J65k36J52l1k47J24K51l00j32L12J23k80P3O5J18J40j91j55N9
6922B4J29j80o1J80k91L80j46J7j10K45P6m27L22k37J03K27m55K69k64K6J63n4
6944f4k32K20lQ0k62M58j14J60M7m35L70k98j82O12k69k25J66J15J9j70K85J1
6966B89m52L42o4l31L66k75O8J40l1Lk4M9lK9J16k49o2P7J43k88O8L27o2m24L72
6991A24k79L19k2l6j86K7J66j51j20K39k40J28Jk27K61q2o9L59j46o0k0k5J8R8
7015G7r5p5M8K29j73L7j20K11l05K71l29R4n2N9j39M82n1l34R0P6pk13L90j31
7039D0k37L54m10J1K08L89n59o1L47k77r6L01J19j7l11J68M14l77J06Nk17K66
$$ y = [-13, 265, -197, -328, -206, 74, 73, 23, -128, -60, -159, 42, 17, 82, 143, -55, 104, -11, 126, -127, 54, -247, 170, 225, -93, -46, 14, 179, -57, 95, 64, -183, -59, 192, -108, -240, 72, 195, -85, -12, 53, 171, 311, 120, -35, 24, 153, -27, -88, 92, -199, 181, 35, 52, -58, 187, 263, -164, 158, -79, 24, 251, -204, 65, -199, -173, -10, -64, -296, -76, -79, 1, -261, 197, 83, 243, 290, -145, 225, -73, -255, 357, 88, -137, 29, 144, 163, -7, 278, 289, -163, 179, 115, -216, 150, -125, -57, 83, 52, 55, 31, 80, 77, 106, 222, -27, -89, -12, 131, -157, -89, 238, 176, -248, 124, -155, 164, 142, 106, -80, -53, 113, -38, -158, 81, -159, -31, -30, -257, 4, -78, -147, 212, 66, 6, -14, -39, -21, 77, -18, -93, -45, 184, 11, 48, -72, 139, -166, 105, -224, -130, -182, -123, -262, 220, 169, -165, -75, 1, -6, -219, 171, 40, -197, 157, -253, -242, -34, 355, -204, -265, 82, -195, -291, 10, 129, 112, -199, -31, 383, 6, 112, 117, -100, 166]
7061A66k04l15K90Q2j21J53o4l43M37L3l58M29Oj69mR9k82K9J3N8J33o7K0J55
7085A76j05M8R7l59J01n0J06q2k76L21l6LP9N6krJ9j24j60J23NJ49Q4l04L45k96
7111i1l6P1k92N08m02J09jJ98k99J66M3K28m96L27l7j93K02Q8k08J96J88j85k29
7134a45L18l08N9J42p8J52j14K71l85Q7J12p4j05N8j99N5P8Mk1J33l33M35m7j20
7158b5K95l77JJ06J67k45K84p9j42M9L8q4j93K38M4j29P4M6K60j86o9l91K32J15
7182B9j03J17j83L09k68J39r6L6K31j19L3j36m3K53p3pl19K97m27L61J79o6k11
7205f7p6j08M63k25R9L9r1q0J26P3j02j14j72r0n1L23J28k00J67r1l58M22k28
7228b13K15q8K73j01l60L21J52j11j98k5j75N34j20J7l8j09l9k46L21K5J73j78
$$ y = [166, -38, -353, -63, 19, -102, 51, -13, -356, 81, 114, -244, 185, 191, 22, 18, 117, -165, -136, -123, -65, 68, 1, 21, 176, 71, 119, 216, -143, -42, -92, 14, -68, -344, -23, -59, -56, 23, 79, 77, 68, 87, -37, -197, -74, -69, 80, 164, -140, 205, -91, -127, -56, -348, 160, -242, -133, -134, 64, -235, -69, -26, 202, -294, 33, -4, -197, 5, 93, -115, 81, 269, 84, -145, 173, -135, -76, 66, -12, 140, 26, 297, -88, -1, 111, 37, -68, -10, -209, -154, -76, -72, -93, 40, -293, 142, 95, -25, 270, -107, -106, 0, 167, -78, 206, 127, -15, 34, 72, -12, -205, 33, 77, -52, 22, 68, 328, 142, 73, -318, -86, 29, -74, 43, -140, 169, -99, 40, -56, -20, 211, 92, 125, -11, -54, 199, 126, 119, -200, 97, -330, 31, 210, 144, -67, -143, -251, 212, -13, 86, 125, 34, -46, 80, 153, 51, -63, -235, -325, -376, -53, 75, -125, 42, -49, -407, 15, -213, 2, -86, 187, 86, -274, 47, 199, 88, -110, -135, -310, 224, 104, 121, 83, -26, -65, -311, 10, 35, 208, 30]
7250C0j19K38j47j20N28o15R5l8K06o6r7K73m19K27M1jj0m58M87o6j20K00M4k02
7274a09J68j72K02j9J9j10J96L3o1J49m32K31L6n1M9k62K22L3l26p3L09j87M93
7297C38m18K69l17K50p4k37J41K5K70j92pQ3j84j51J88K08l44J19k8J01Qj37J70
7320H1n9J61k65KN5j55J87N5k43K04N9j5k29M86n35P7J37J89j70k89r0L15J24
7343H2q2J0m18L70j03N6L04%k10R9m0m1J30j02j46O6L8l2K91l13r8K24J04j65
7367B4R7k78K00R1k68PN2Q3p5R5k1K02J03j71j18J93m33pJ37L62m05LJ48J67k34
7392d6m6K65k65K55l33J42j58J80J14j26j48N12j54k0k54k85Q5L48l4J04j95P4
7414A5o0q1l6R1N7L22k97k5J40k24K17q6p4j71K64J9J12k79j01K73j67M0lL08
$$ y = [30, -89, 149, 2, -118, 410, -205, -110, -148, 58, -8, -105, 168, -251, -24, 17, 16, 6, -452, 35, -31, -151, 49, 93, -109, 59, -113, 89, 70, 89, -21, 175, 208, 147, 296, -136, 95, 131, 80, 129, -133, 89, 122, -204, -277, 32, -155, 338, -80, 189, -128, 122, 48, -189, -48, -23, 247, 55, 48, 131, -53, -204, -16, 192, -152, -33, -61, 40, 48, -89, 81, 22, 183, -82, -80, -25, -180, 7, 62, -181, 23, 82, 67, -162, 324, -211, -134, 3, 192, 22, -267, -357, -42, 82, 0, 10, -408, -38, -141, -85, 219, 219, 9, 108, 68, 27, 157, 55, -91, -25, 13, -19, 272, -41, -139, 85, 189, 24, 121, -157, 43, 134, -134, -127, -75, 8, -67, 28, 7, 209, 312, 141, 23, 216, -217, -224, -87, 275, -130, -127, 21, 188, -46, -92, 173, -92, 163, -170, -28, -186, -6, 108, -18, -166, 346, 192, 172, -82, -367, -282, 66, 32, 136, -59, 15, -45, -126, -162, -71, -14, 308, 11, -14, 126, -98, 119, 33, -41, -212, 52, 71, 183, -96, -197, 76, -91, -51, -54, 254]
7438B54n19K97J2m05K45l5K59m66K38K57r4p7M8j29km3j64K03qO83n57L5m8J1
7462eP6j06j15J99qJ3J06o06M76j75J99n3j43P2N8J42J4l34L64j45K4J5J82Nn09
7487b54M16J1j60l53K29J46J03j68k6l4J08P2r0j92K00J84k22M13o1j88l43K67
7509E8l21J86l9j8J74J63j62J4O2j20J43J06k2j17R4k73j98M42j27n7J92j79O
7532Gj18K7L12q2k88N1J3L1j45L44l63R4Q7k63L14M25m42l20J08J59L51n50N04
7555B56k08m28P1J98M3kJ15J33j22k41K13P7q3N3N5p5N2r3J94l1l44J99J29j86
7579b5k46J16n5K71K8j52k14L50Q8j91l3k3q2j3K82K6K05l53J77j43J35l51L56
7602A53k40R6M50m15j61J81o5R9j22j51J73J93m65L73l90O50k54j71Lk0K01j29
$$ y = [254, -265, 32, 44, -361, -116, -151, 108, -358, -120, 137, 43, -34, 14, -115, -117, -160, -324, -121, -129, 554, -3, 32, -16, -5, 71, -35, -150, 49, 41, 54, 160, -446, 30, -145, 54, 1, -142, -70, -12, 130, 144, -190, 174, 29, 53, 68, 250, 255, -254, 162, 173, 13, -340, -111, 35, 138, -30, -56, -90, 18, 90, 0, -192, 8, 192, -30, 383, 322, 134, -209, 58, -263, -77, -116, -134, 40, 203, 41, 55, 117, -3, 140, 246, 224, 107, 201, -72, -270, 172, 45, -12, 180, 1, 7, -111, -84, 228, 146, -142, -91, -78, -47, -192, 152, -211, -117, -30, -293, 21, 446, 4, -316, -208, -49, 302, -248, 256, 48, -380, -309, -111, -68, -70, 45, 178, 56, -185, 28, 105, 22, 75, 130, 55, 107, 14, 208, 177, -167, 32, 161, -25, -271, -155, -210, 61, 89, -63, -277, 73, 161, -30, -63, -86, -168, -181, 101, 127, 332, -21, 156, 13, 148, -203, 153, -87, 9, 459, 44, -117, 64, -1, 98, -24, -175, -2, 191, -274, 99, -291, 359, 105, -66, -63, -83, 118, -11]
7624a1P7j9Qm7j28L27n4j42M43o03L6M30m29j67M43k46L9ko0M27m62J31j7K44
7648B18P2m2j40k24L50k35L0j63N8l9Q1j5J99m3j23o3J95N5k03P7M0k93N0p1J55
7673g4J44r7O3OJ4j26J69j81R8J91k74q1p4P5K1P6k59J34M29k31j7j45N9K58k89
7698a11K25N5k68p2J38p9K09l34j22J93K74l39N3o0J15K97l32J85P1j73Q0O8p6
7721cJ5L4L6o3N0j53M4O8k08K77j91K43j29J83p0j22q5O7P9J97j50J53r8J40m10
7746i6J32j61K69P0k19n4j92K87P2j40J72j54R7k10N6oK27m1K21k95k05JL13k57
7770a13N93q82O55k68N6J79l30K36o4K54l57p5O6M9m14N06l76L01J3k6M3m10M76
7793A12O8k55J49o6K0k3M5J47kJ5l2k59K70j93L87m46K26k63L31j87k60K8M2J08
$$ y = [-11, 66, 47, 55, 8, -120, 207, 153, 11, 454, -149, -113, 317, -112, -279, 164, -82, -43, -45, -105, 322, -140, -9, -26, 218, 290, 248, 108, -116, 234, -1, 29, -134, -76, -115, -34, -49, 150, 107, -16, -79, 116, 171, -32, 45, 85, -208, -158, -229, -74, 70, -27, 36, 42, 56, -70, 99, -82, 16, 207, -67, -148, -222, -147, -126, -50, -309, -175, 254, 23, 6, -139, -80, 178, -111, 114, 169, -99, -171, -33, -112, 97, -237, -359, -166, 108, -231, -178, -238, -123, 174, -158, 27, 98, -75, 5, 73, -3, 12, 46, 82, 19, 69, -84, -40, 28, -180, 97, -94, 149, 20, 203, 133, 11, -74, -7, 72, 269, 119, 272, 174, 314, -96, 36, -125, 144, 214, -5, -59, -251, 36, 108, -32, 140, -14, 83, -127, -71, -77, 150, 109, 330, 35, -170, -169, 144, -113, 480, -402, 253, -15, 41, 220, -110, 126, 62, 316, -41, -116, -50, -1, -415, 91, -285, 16, 29, 3, 46, -364, 112, 180, -75, 74, 8, 28, 5, 50, 197, 195, 210, 178, -81, 189, -4, 383, -63, 163, -100, 231, 44, -216, -188, -146, -38]
7817c8M9Lj5j00J25j52r6J71m8J2k6J77J38m1m30J53K72k01J00l57J6M82l39J52
7841Gk8P3j52k69K86o6K30J58l52L36M5j03j28k1Q8k57L26r7M8q6j16j41K76k84
7865b27J88J3q1l9NJ66j57p3K30K95l14n0J47J39lk34O2R6k06n3O6k1k6M5l7q5
7891a54L21l19K87l2j11J64l6k08P8R6l32K08l8K95j70j09q6L22j89M4O5l5j71
7914a10L43l64J96j01N8P8n3m75K67K00L01l23j19K08Mll69N2K32j30k40M35k54
7937a67K30m12K95Lj1J66P3j27j97K68k47K18J73m89J43J95k04J34p6J97J9j46
7959C8Q5J39l38q5J72K1O7Q1j92k7q9j1j7N78l36n5J22j77j2o8L2j68L56q0J15
7984A51J21j62j24o8K40j84l01N91k87Kj18J58L7j38J92j36J11J75k00k31J82
$$ y = [-38, 11, 14, -1, -101, 24, -128, -224, -53, -101, -89, -115, 62, 200, 159, -271, -118, 154, -47, 53, -304, -288, 194, -145, 7, -21, 52, -100, -369, -83, -149, 81, 239, -113, 223, 268, 165, 37, 16, 104, -153, 173, 76, 124, 38, -78, -219, 57, -227, -39, -26, -107, -146, -141, 25, -132, -205, 25, 320, 6, -44, 103, 242, 239, 5, 67, 163, -43, -96, -30, -51, -77, -32, -69, -154, 167, -152, 135, 103, -8, 156, 120, -88, -10, 86, -246, -38, -76, 219, 49, -60, -146, 176, -13, 31, 96, 61, -110, 233, -131, 65, -36, 22, 100, 47, -428, -161, 39, 340, 17, -102, 106, 110, 107, -262, -210, 22, -108, -348, 87, -167, 63, -349, -54, -51, -62, 104, 177, 50, -147, 121, -126, 92, 265, -224, -81, 114, -90, 44, -32, 165, 184, 38, 123, 262, -76, -161, 11, 32, 99, 180, -12, -39, -128, -139, -156, 422, 86, 31, 153, -24, -36, -104, -72, -240, 116, 36, 151, 272, 110, -14, -82, 158, -26, -327, 264, -23, -21, -139, 19, 56, -82, 110, -26, 85, 260, 60, -171, 11]
8005A1J09k77J17l0J08R6j16k9K01j26J8j38L19n5l19Q8j5L7o2J89k07L30j91
8028E8Q3j09l35L81j32K3j06K52k81J31K81l38J46j26j49J69K26m81L51k09K55
8049I0%l67K46%j26k0J9R1J26J06l77J88J95Pj34J6Q9k32J31J41j40M3J6m45L91
8074E4j97J51o2o2J75m5k1O3j0r4K46j69K8j12L47m90J33L44l19P1m0k11J78N0
8098HK07o9k47k5K2N05n33L51j73l3J3j44J48n6o2q6p0K98Kk16K68k58M0K74j63
8123AR3k46K53j66lpk1J40o9J03mM4l4j31Q0k28J11K24j44K68k58J78k21j15m7
8148a99J59m9K27j61j0K54k57K39J36j61l67K49J27k28k73K25L50k52J66k67j8
8169a10n3P9J66j34J01j69J77J01k45m1J06j51J97l31J44p0K77j19l1N3j08Q0
$$ y = [11, 120, -157, -40, -70, 38, 134, 18, -11, 190, 64, 82, -56, 263, 208, -111, -23, -38, -1, -63, 126, -81, 249, 58, 141, 32, -303, 78, -54, -31, -137, 115, -166, -35, 246, -92, 54, -72, -221, -52, 174, -307, 44, -165, 90, 90, -277, -31, -31, -157, -177, -158, -67, 59, 165, -212, -24, 171, 178, 44, 60, 149, -83, 48, 189, 49, 92, 108, -337, 54, -143, 8, -54, -116, 59, 14, -7, 56, 46, -48, 198, 29, 57, -55, 292, -198, -65, 279, -40, 31, -9, -220, -42, 8, 215, 146, -101, -126, -104, 401, -132, 219, 46, 13, 26, -118, 30, -26, -88, -174, -244, 54, 56, -160, 108, -150, -110, 164, 1, 94, -152, 101, -65, -68, -75, -96, 44, -25, 78, 74, 118, 84, -47, 33, -195, -84, 140, -4, 264, 6, 184, -37, -152, -199, -40, -89, 138, -23, -33, 221, -36, 203, 339, 178, -189, 60, 187, -41, -314, -89, 261, 9, 175, -92, -110, -163, -84, 82, -52, 49, -120, 57, 158, -87, -128, -22, -173, 24, -307, -163, -233, 44, -75, -106, -53, -161, -81]
8191h1
$$ Imaginary data points
##PAGE= N=2
##DATA TABLE= (X++(I..I)), XYDATA
0@%%%%%%%%%%%%%%%%jPj4J6j6J6j6J7k2K9l2L3l8M5n0N6o3O9p8Q9r8J07j20J33
40F9j45J61j79K00k22K45k73L04l38L77m26M85n56O47p63R20j150J516k186L833
60B519j3990l1801J1730P739O366Q492J132l331Q176P029L162N98k291o042k436
75b948k165o76J363J133n21K567M057K394j323l655k191L97J466n11j862k75J858
92h92K838J285o96j615j426j279o64k29K4M71N13J218J792J271j23q12j524l78
110b26n70j110j578P52J582J603J294j03l84K95j16r71n96j223o49O71L64Q45
128a20R43J13m95P0Q9o25n39p66o1O76J034K72l14JL65J69l14m82n42k31J18M31
150b08J51J86J28K98R8J61J7l97o28l68R6J8L3K40J01J3O23J64l42l77j68pk27
$$ y = [0, 0, 0, 0, 0, 0, 0, 0, 0, 0, 0, 0, 0, 0, 0, 0, 0, -1, 6, -8, 8, -8, 8, -8, 9, -13, 16, -16, 17, -21, 24, -26, 30, -33, 36, -42, 47, -51, 56, -64, 69, -76, 85, -94, 106, -116, 129, -144, 160, -178, 199, -227, 258, -298, 349, -414, 506, -644, 872, -1314, 2519, -11471, -43272, -31542, -23803, -17437, -8945, -7813, -11144, -2968, 4061, 7223, 7821, 5530, -512, -2948, -5113, -5789, -4426, -3293, -3814, -1247, 2810, 5204, 3881, 226, -1965, -1568, -102, -613, -2475, -2750, -892, 1946, 3231, 2535, 920, -506, -1785, -2449, -2678, -2654, -2183, -1670, -452, 1340, 2611, 2488, 1676, 152, -226, -796, -1906, -3484, -2732, -1150, 453, 1747, 1644, 1260, 1555, 1439, 468, -128, -1351, -2000, -1329, -965, -120, 823, 936, 441, 511, 600, -25, -564, -1330, -1391, -715, 319, 591, 277, 278, 643, 812, 498, 16, -526, -757, -639, -208, -57, 129, 257, 555, 653, 814, 831, 434, -194, -562, -466, -448, -415, -175, -74, -61, 562, 726, 384, 7, -161, -168, -395]
173c95L54n71N33L6M0J83L92J12l83l22m70j11N57r8m2JK92L03J86L0m00l55M50
196C22N0o83P9j14JO3N66j03J65l54J13j9Qq6k88K24Q3J85q1J06k49K36K95j92
220C27L8n13q4K83j8J15l3J49PN9J08j09j89l10l88K47K2K37l6J16p6M9K79J04
244C84j38m72J81k33L7n7j7K36J31O3J36j61k25J86j61K45k88J89m23K28K04j2
266C3r2q8Q3OP0q4N2R7j52k8l6K02J88j70j11J3J42j33j0J03l19K05J08j3L69
291D35k97k08K09j99k5K63k68k71L80J83k47P2r0J89J35n0m5l58j5J38K3k0k26
314b92qL84j89k40N28P5k32k66J08K26N5j06L1j6N5K85p3m38K48m57K86Q3o9L
338a9j11J49J68K19j12j43qj18N9l44j49K91j77Q9M8L06q4Kk42J17K00k80k52
$$ y = [-395, -41, -612, -79, -43, -3, 180, 572, 684, 301, -21, -491, -602, -45, -143, -185, -184, 108, 411, 597, 627, 227, -128, 322, 372, -311, -232, -346, -345, -282, 284, 181, 346, -8, 105, 86, 94, 8, -280, -56, 27, 212, 131, 237, -12, 224, 519, 327, 365, -148, -232, 51, 33, 148, 115, 264, 271, 330, 438, 329, 140, -170, -558, -311, -289, -52, -88, 28, -48, 1, 280, 384, 246, -226, -45, -278, -241, -298, -315, -79, 52, 115, 251, 90, -135, 51, -110, 135, -153, 36, -387, -159, 45, 33, -59, -147, -64, -58, 12, -72, -20, 77, -75, -103, -139, 63, 251, 81, -30, -17, 125, -8, -18, 85, -234, -29, 79, 66, 435, 138, -70, 139, -60, -85, 178, -90, -361, 19, 202, -45, 27, -63, 126, 261, 211, 166, -192, -207, -69, -46, -66, -292, -300, 84, -105, -345, 183, 258, 26, -240, -132, 94, 149, 43, 74, 58, 113, 398, 325, -113, 135, -322, -36, 47, -22, -19, -130, 19, 187, 406, 294, 151, 143, 25, 84, -260, -409, -118, -295, -206, -158, 148, 64, 66, -176, -59, 141, -139, -391]
361c91J98n7M91k75q5J29J71Q5k58O4k57%J61J10m3k05K56J16k25J73R6j82k21
384a49q6j01N42k54K04l09L35pl17J45K8j10k30L67J01k79P1O3M2M0J83j97n6
407B6j51j22J03R9m6K03l3m1K1n5Q9O1J15r0k95k59J67o3K65m7J02j8k9j02J03
432CJ25m75M30j3r5j83J14R3N1j97M52m18K55k05J54N2o1k11J24n6R8n3J68Q9
456B41o51L72M2l29J57J35K16j03l04Q9k9Q6R0R8J35l57M6q7J25j16K44q0j52
479a32L04l01o9J68N2j99J16j93J03K01J92j58Pj43j18J94J97k37j70K03OK34
501B57n48L65P8L9L7j87m6j57J25o3J41J50l21M04n01L47M5j23j05lK70k18j62
524a76L71l23r3K77J07j05j41k07K49l20J94R7o4K11m9J99l59L00j47k38J23J88
$$ y = [-391, -193, -250, 241, -34, -119, 10, 181, 266, 8, 72, -185, -185, -24, 86, 43, -162, 94, 210, -15, 158, 254, 72, -149, -235, -336, 206, -48, 156, -153, 182, 175, -142, 3, 31, -79, -309, 58, 159, -120, -49, 14, 56, 96, 279, 82, 26, -125, -247, -144, -45, -91, 112, 79, 38, 59, 4, 93, 154, 269, 179, -116, -375, -208, -271, -6, -53, 49, 31, 2, -100, 3, 128, -347, 83, 70, -25, -208, -94, -1, 50, -147, 305, -113, 142, -63, 91, 143, 82, -129, -5, -61, 37, -16, 152, 241, -410, -38, 4, -325, -168, -33, 183, 80, -224, -135, -164, -78, 12, 110, 245, -112, -66, -153, -28, -144, 100, 20, -132, 172, -129, -198, -30, 22, -177, -61, -254, -151, 50, 242, 84, 91, -52, -170, 24, 221, -16, -186, 17, 23, 257, -291, 74, 152, 191, 228, 41, -5, -162, -37, -100, 41, 191, -130, 274, -227, 120, 165, 42, -63, -66, 204, -14, -176, 195, -128, -221, 56, 163, 58, -83, -290, -41, -361, -167, -70, -134, 77, 28, 227, -132, 168, 21, -217, -94, 94]
546I4l93K65J22j98K00p1j20j74J89J99q6Qk7p2n9J99q8J53q7j6j25K0j32L81
570A82K4m05L79n2L5j53K11m50K69k38P6J74Ok94L39J0n5Nj9L0P1k1k06K07O7
595A92l01Kj29R4K05k44J28k60L09R6l4k68M79m6K1k65k81L50Q2j78J09j00j06
618a45J65qo9k72M31k33L54J9k00L98m59K23l42K7P3J34j66J28j56K79l68K40
640E3RJ49l85J02J25lj78m7J17k58M29m4k93j4J87R4n8j78L18Oj36j30%L53j33
665H5K31j29K60m82J35l9r6J15M4o23L77O9J64rj02l3N2l07P2L38Oj52N4Q8l14
690a96J98R4k19l15K45J69o7J76k27K17k05M6J93k18L31k96L15m33K65J72k44
711Al9M2L2n5K01M9k45p4n6J05j00l6J97q9j06j0J99p5M5j24K81j93P5r1J04j06
$$ y = [94, -299, -34, 88, -110, 90, 19, -101, -275, -86, 113, 27, 35, 8, -64, -123, 76, -12, 141, 54, 38, -87, -67, -199, 182, 206, -199, 180, 128, 163, 10, 221, -229, 40, -198, -122, 52, 58, -236, 103, 113, 58, 63, 44, 74, 145, 124, -82, 125, 192, -109, -107, -236, -142, 63, -181, -53, -313, -4, 92, 58, -210, 269, 223, 244, -21, -302, 48, 130, -48, 61, -39, -145, 20, 12, -57, -329, 102, -131, 223, 242, 42, 440, -19, 204, -138, -111, -38, 96, -70, 58, -98, 181, -187, 53, 62, 211, -174, -72, 53, 50, -128, -175, -58, -316, 113, 69, -224, -238, -51, 43, -15, -193, 125, 131, -5, -135, -135, 218, 85, 316, 187, 447, -35, 100, 61, -35, 80, 124, -499, -122, -53, 111, 102, 0, -33, 19, -288, -216, 122, 128, -24, 30, 118, -196, 2, 96, -123, -438, -193, -24, -91, 85, -142, 75, -130, -84, 109, -109, 222, -74, 241, -192, 73, 245, 1, -38, 4, 36, -19, 182, 231, -14, -88, -144, -39, -139, -175, 22, -67, -173, -183, 16, -59, -14, -138, 143, -50, 25, -66, 38, -68]
737f8o8M13j09k88j07M9L63j09pk03o3K35j84K66K11m24J60J24j88R7o3nL5j39
761g2J40l19L49p3j76M3K9n7J72k6l3qN5k48K40O4O8j9j53J78k17L09l12j64J66
786f4L8J00M6J23j33j00j59L3K12k93M20l94J51K42m45J8j49J77j79K49J42m5
808a0j42L21J03l41M2kJ62j14l0p8J37k53K95Q5k0j72P3j28O4j22J77kj44j78
832b77L65k24KJ6J4K92j22o3M1q5K0q2J18j13L56j49l20N32l28J57k88J04K5L2
856B3k87K55K3j20J96J30k74M4K74l64L01j90J01j36n8Pl19L43l47L43j2J95k93
879a65J18Nk95J42J94n9O7k6L00o08J93j1K80j81k4j51K13J74j69j87K95l1n7
902A7k57K18r5Kj0J12l3k59M91O9k57o6J50j65K70p2k35rJ55q4J77j03J91l71
$$ y = [-68, -136, 277, 168, -120, -227, -178, 185, 76, 69, -134, -197, 38, -146, 120, 331, -93, 67, 191, 3, 100, 37, 32, 67, -72, 68, -251, 98, 25, -151, -108, -79, -136, 36, 10, -23, -31, 24, -224, 16, 80, 148, 129, -24, 154, -63, 246, -66, -230, -64, -26, 74, 120, 243, 110, 10, -149, -116, 96, -197, 223, -171, -20, 222, -223, -205, -354, -177, -356, -107, 35, -10, -152, 169, 272, -69, -27, -29, 133, 19, -11, -89, 48, -205, 90, 175, 155, -17, 56, -72, -8, -130, 47, 45, -99, -277, 88, -136, -134, -118, -104, 188, 66, 3, 44, -41, -21, -103, 15, -98, 258, 109, -211, 321, -7, 150, -138, -34, -9, 23, -264, -9, 14, -106, 90, 220, -54, -10, 264, -100, 201, 11, 112, -24, -82, -75, -394, -51, -398, -55, -67, 128, -165, -47, -42, -337, -195, -1, -60, 7, -19, 281, -327, -134, -145, 135, -46, -70, -221, -8, 166, -3, -190, 105, 74, 17, -240, -22, -117, -115, -125, -13, -46, -305, 186, 255, -2, -68, 82, -83, 187, 115, -120, -129, 26, -58, 119, 16, 207, -164]
926a64M9L19j26K67k59j9pj56K8m5p3J39k3N3J02J0k34L53l9j24m9k22L36j22
950fO2j77m6L55m06R4L63m95M19j11K2k12K13n7p4N6Lj25M4r4J35j3K2J84j88
975c2L86m38J61k03K30k16Q9o8K31p1j95k1K09k10m3j31L38L39l91M6j80lN1n1
999a73J52k77J66Q4k19J81k5O5O0R9m59L93j51L01k80rK0l00J63J36K00k40J24
1022A1o4j10K17J47o0k78N2K15K40q2n01M76l09K32r0l9R3j12L9K80l86R9p6J42
1046A36l94J66j2J54J86R1MJ3o4l96K91k95N1Q9K33q3R5m00J43J86M0k80j89L80
1070A45k63L16j73n4L03j72k24J03oK4j69J61J0J55l75K28J7o1n3R8J87j74j5
1093Hm6J75k47J25N1k51M23j26j03k07K92j87j4K62K0l34K17J54l38J26Nj27L44
$$ y = [-164, -115, 204, 78, 345, 86, 67, 60, -96, -68, -113, -186, -47, -70, -17, 85, 95, -139, 214, 175, 51, 2, -220, 116, -6, 56, -121, -167, 188, -218, -124, 239, -256, 163, 52, 74, -138, 75, 18, -56, 0, 3, -122, -78, -172, -37, -50, -28, 156, -32, 354, -84, 77, -126, 104, -112, -23, -91, 140, 69, -126, -147, 62, -148, -191, -322, 16, 355, -36, 10, -170, -173, -122, -173, -21, -298, -132, -48, -267, -86, -111, -46, 14, 113, -346, 47, -104, 197, -83, -92, -72, -372, -209, -73, 127, -113, 11, -53, -163, 54, 201, 141, -137, -85, 130, 370, 288, -213, 263, -46, 186, 96, 57, 150, 38, 77, 357, -29, 70, -6, 136, -258, -92, -104, 50, 236, 327, 331, 344, 280, -116, 175, -120, -69, 20, 253, 170, 265, -135, 8, 194, 234, -46, -235, 145, -118, 198, 25, -29, 274, 102, -122, -19, -25, -1, -170, -9, 1, 156, -219, 9, 26, -35, -88, 10, 197, 23, 8, -38, 137, -110, 15, 66, -185, 238, 112, 9, -198, 94, -93, -107, 155, 175, -159, 58, 212, -126, 0, 5, -122, 222]
1116B22l86J56j02K38O2l00K6K8K2j9p2j17M33l21J70P8j04k13J48J57j53o2M3
1139f6N0j28M17l02j84O50o79M16j94%P5J10l57J25Q5m4k2%K8K52p4j46J84k52
1163e6J19k6k76R3M94k94j77q0N4J90K3j62P3j32K11J17l34L64l22L02j24Q8l16
1186a71j7L3n5M02l23K4m3K80k18K55j59p9O5K0k67L37k14K00L0l74K74K2l5o6
1210g9n7J0K49k80M51m47J44K61k62O4k36L22N8O3o11M59k94K42l7l50N61m54
1232b23K14L3J1N1k27L19n78O23j52O4q7M6r3m8j7J19k01K78L8k09R3k98R2L35
1256A83j44K5l4J9k47L1J66p0j25M75l34OJ08l1q2K46j16m6M9q9j85L40j47rK57
1281B46m53L69j26J89k37l3k30Q0K89K8q7o3L06k92J9lj25r7K09k15M08O9k99
$$ y = [222, -164, -8, -110, 128, 190, -110, -84, -56, -34, -53, -125, -242, 191, -130, 40, 118, 14, -199, -51, 106, -47, -109, -66, -16, -144, 273, -29, -213, 437, -242, 174, -20, -20, 55, 165, -192, -67, 18, -26, -48, -48, -20, 232, 158, 12, 196, -56, 63, 37, -239, -146, 348, 54, -123, -203, -149, 41, 64, -98, -25, -157, 54, 171, -163, 201, -121, 181, 57, 145, -171, -188, -155, -210, 192, -131, -107, -150, 130, -88, 167, 8, -71, -6, 14, -253, 84, -130, 70, 100, -274, 0, 22, -13, -79, -136, -126, 123, -157, 294, -153, -9, 252, -10, 54, -182, 140, 198, 261, -350, 109, -185, 57, 20, -330, 231, -223, -9, 24, 35, 86, -141, 178, -400, 223, 71, 135, 48, 94, 1, -47, -64, 55, -146, 132, 170, -39, 54, -244, -152, 183, 39, 64, 30, 49, -198, -167, -1, -71, -196, 279, -55, -49, 59, 28, -54, 192, 76, 30, 79, -10, -195, 145, -2, -11, 246, -207, 162, 36, 225, -12, -45, -275, -195, 94, 122, 35, -28, 278, -14, 5, 2, -123, -220, -11, -226, 182, 251, -48]
1304d8K4MK73k2l5q8k10Q7J74J74n34K60j46k0P4p0j3K86k04J63l6O1k44J70j46
1329f6k43K94n2j77J07L43L4l64K08k34K54Q8l53K54k57J37J55k19n5K08r5J40
1351A07o6K9N4J05K9l09N1J01k4J80k63k06J06L22o4j40M0j7R1j49K32j99r3M2
1375d1K1O4n5K03j21J23k99J57k74O06m99j91M89j92k32J52P3p0L8p5J34p8J16
1398D9j48J77k81J81K38n89J73K10j42P9j06L4k95M59J16k65J04j1Q0l11K91J36
1420A79l58j15K27J5k15K98m4N8N1nk01K71j37%l15L69m9l2K87k84J0k12L11J48
1444B57j91K00j98l69M62q9j97J19O4j74J07K03j7j88n1O5l70N70j14M5K4q5J51
1467B24P9k39q9R8Rq2K86l21p9J57j37P5M8J6j63Kl7L53m16K13oQ4k43n9J20K46
$$ y = [-48, -24, -20, 253, 231, 196, 108, -102, -15, 159, 333, -201, 59, -87, -107, -33, -103, -116, 170, -34, 129, 93, 154, -90, 80, -66, -309, -15, -67, -244, -137, 206, 240, -124, 84, -150, 104, 192, -161, 93, -164, -27, 128, -91, -146, 62, -33, 107, 41, 70, 124, 229, 258, -51, 0, 101, 77, 257, -6, -212, -106, 216, 152, 12, 52, 35, 126, -23, 209, 10, -83, -41, -20, 44, -11, 192, 71, 194, -105, 52, -222, 384, -115, -306, 183, -9, -241, -89, -16, -86, -48, -123, 11, -67, 49, -99, 78, -203, -22, 216, -373, -200, 10, -132, -53, -159, -125, -420, 39, 155, -110, -6, -17, 63, -248, 43, 179, -179, -294, -67, -52, -267, 31, -13, 45, 96, 91, -110, 161, 24, 24, -291, 78, 29, -3, 284, 0, 10, -202, 109, 257, 66, 266, 68, -301, 161, 72, -125, -6, 58, -116, -9, 194, 177, -11, -62, 3, -367, 203, 89, 134, 158, 73, 224, 303, 64, -25, 73, 82, 0, 286, -35, -114, 43, -94, -19, 29, 45, -118, -116, -153, 200, -216, -3, -9, 75, -168, -227, -107, 139]
1493A39j09m5r7L5jJ01L57o05JK51L51m26M4o0%j60K87k26O2K47k20k18L02J12
1517A22j67J7J61k3j38J35J40p1k20l59L82j18L2L33K7l34k62M10nK22j57j60
1539c3j05L20m5R0k1k99K15k56l6J50l11M87k79P2J68j55q8K55K0J2j19J63m37
1562b32r9N21K9j88o5Q1k42J69P8J5k94L45P3j80L4j64K37j8j95K51J5l4l7N3
1586A53o6l60J52K22p2J59j00O4j77J66j97K21p5l0m85M33N4q8L0J26j58K31k45
1609d2L4K24j61K76k97R2l8Q4k42j89L70j68J60k62K45J73l38j85M13p7J06J19
1631B97N6k24r9m2l66M40j16J91qo5O3l3o2j53j9K58m63N27j22k42K86l12L59
1654A51j37k98M62lk36O6JJ2J49J6j08J23k90P9J24Q2O7k09O9n5M6k10j00j06
$$ y = [139, 30, -15, -112, -77, -78, 23, 380, -225, -224, 27, 378, -48, -4, -64, -64, -224, 63, -163, -101, 146, -74, -292, 10, 122, -45, -28, 133, 110, -28, 107, 247, 176, -44, -403, -21, -139, -107, 226, 253, -81, -343, 67, 62, 284, 127, -33, -138, 182, 137, 227, 206, -93, 122, -134, -170, -20, -331, 156, -123, -51, 117, -38, -126, 129, 149, 161, 42, 205, -232, -331, 190, 219, 31, -34, 47, -195, -26, 52, 67, -227, 118, 191, 11, 45, -119, 118, 100, -95, 156, 171, 137, 100, 153, 87, -273, -121, 101, 29, 188, 88, 152, -25, 141, -56, 165, 90, 60, -425, 8, 62, -26, 4, 130, -28, 203, -42, -8, 216, 55, 331, 34, 126, 88, 172, -70, -259, 111, -57, 103, -159, 86, 259, -79, -264, 149, 72, 178, 297, 353, 129, 30, -12, -378, 62, -54, 137, 129, 64, 127, 94, 32, -121, -140, 118, -345, 182, 60, -182, 104, -208, 151, 14, -284, 178, 175, -61, 5, 6, 18, 167, 183, 75, 198, -92, -13, 111, 193, 260, 51, 120, 65, 111, -99, -199, -305]
1678c05J75K13j86J38J01J96n39M00k40R5J38k79N7M5j77K42j10l5j4j36R1L13
1700A83l34l7L5K01o4p2R9P1l3k99K32Lj94J47l26M02K56k40p9J66j2k45j28J88
1724h0J22l4p6J16j74J55l91N42j84K07k16q5k19M19j6J93k78k00L14j97j32j
1746b15K10j61K09j68k16M55K29o2n31M71p7k24J33NJ95k38J42q5J07K55m30j82
1768a78K49J71l02m1R1k53K81j5j82J22j38L29J18j88O3q4j14J19p8j96K46k31
1790b11K29l38J73J24j92J35l9L06P1l59kJ85P6j79r2J77l4KQ5j01j92J65k80
1813b91K22K03j79J19J24J15k80J64j21J41j36m8Mo5k15N96l40K1N2j01j39K39
1835H5K71n42j71L50l05K63J80n02N51k78L6p0J4K05l20K90O1J81q3l11J8O5L87
$$ y = [-305, -130, 83, -103, 35, 136, 332, -207, 193, -47, 48, 186, -93, -36, 9, -168, 74, -36, -71, -85, -221, -130, 183, -151, -188, -153, 48, -16, -88, 11, 82, 49, -250, -18, -15, -209, -62, -388, 14, 270, 30, -49, 117, 105, -140, -268, -80, 42, 8, -68, 48, -126, 29, -362, 180, -4, 203, -13, -98, -317, 102, 86, 279, 1, -199, 115, -82, -214, -215, -5, -166, 43, -125, -341, 114, 343, 281, -250, 221, 144, -80, 53, 58, 253, 15, 157, 72, 179, 434, 4, -178, 71, 242, -60, -101, -10, -263, 18, 3, -179, -57, -195, 134, 252, 64, 127, 43, -71, 48, -30, -226, 20, -211, 18, -320, -147, -23, -215, -80, -119, 187, 258, -101, -103, 82, 158, -21, -113, 64, 30, 32, 117, 16, -176, -11, -291, -69, 134, -45, 74, 198, 313, 33, 197, 76, 217, 81, 33, 37, -28, -243, 353, 13, 34, 86, -15, -154, 85, 356, -186, -357, -7, -312, -49, 131, -371, 180, -98, -62, -132, -118, 87, -233, 57, 118, 299, 216, -95, -77, -12, 375]
1858C75l81J35j91Q4j43n0J94K4j29J95j18J99j21q2k0J35q5k7j74l2r1M08q1
1881B4K69l68J7Q8R3ql95M45r4J35k23J46J4j93p2M27l20J59m9M0j70J8k53jL58
1906H7k1p5N1j14M9k71J85J86Q5J2l16L26j41q2k94M61l20O9K04K4j3k07M03l21
1930c3R7qq4K35l79J19j62L74k57O9L41k50j25P1J58j82j41N2j43L13j62O4L53
1953C20j60o0j41M17l28K18m57K08k2J63m23L71J8p6M1k74J82n4j24J20M69k59
1975A49j41K71j42Q1n93N72n5N1j29j95M7j42L85o1L0j37k08K71k08L14k8j06
1997B6K6m5j48K18r9K99j70m33K86J76l05O2J35J63k9k86L78k06L52n63K06j1
2019C2r8O0O2j00j79K79j0O8k67l2L7K56k17o5p8K67j19K50j88P6q1L29k13Nj13
$$ y = [375, -6, 129, -62, 22, -121, -171, 23, 47, -82, 113, -5, 194, 73, -9, -29, 106, 21, -6, -180, -212, -303, 105, 24, 293, -75, -58, 30, 123, 115, -280, 165, 71, 206, -17, 129, 143, -50, -122, 305, -15, 144, 95, 135, -35, -17, -270, -271, 87, 66, -9, 42, -72, -23, -294, -109, 77, 162, 174, -142, 184, 43, -39, -333, 128, -192, -123, 81, 105, 92, -115, 288, -33, 64, 56, -28, 207, -172, -53, -215, 159, -98, -29, 312, 62, -63, 8, 166, -16, -157, -105, -248, 65, -97, -33, 320, 160, 100, -41, 376, 48, 266, -191, 17, -5, 158, -265, 106, 124, 48, 89, -185, -3, -57, -181, -61, 408, 149, 8, 279, 137, 218, -375, 197, 142, 193, 64, -131, -84, -226, 159, 98, 128, -9, -217, 54, -154, 160, 132, 26, 52, 7, -141, 77, -22, 277, 107, -326, -40, 136, -169, -107, 28, 191, 162, -124, 254, 48, 400, -163, 43, 32, -66, -6, 56, -44, -223, 56, 46, 114, -153, -185, -148, 108, -109, -174, -252, 15, -104, 146, -42, 34, -47, 282, 69, 74, -39]
2044c9J44k4j9L90n86L07q4m8o5K8L28k84O3l83K26J65o5L5Ol08L17J6M5k35j23
2069a93N41m33Q2j97J42J29k1J87n48K08J85j22P9j87o2l6L72j25j01n5N7NK43
2092A50l01L61m55K63J77k91m3K32L04o16L10m2P9l66N21k11j23j03J61R0j87
2113i0M69l79O6j43K45k04o2O4j0J12p2j56n9N7K12J16j09JL7O2m64M07j33k33
2137b66Q2K30j00p5J22j09k18K46J78k5o5m7nN6q7P4J02J02Kl42K31r2M9k26K47
2162F4k57J50J00m8J40l63O3K87j37j84L36l40O06o04K33K14k54O8m3Q9P8k30
2184c2L1m8J02J60k06j81K80K17k46l05K6K19j3j23R8m1K54m80N70l75J30j07
2206g0m7nL70n2k10j17K85j98J06j15J4j17J34o0K55j24J9k85M01%m26J72J75
$$ y = [-39, 105, 81, 62, 452, -134, 173, 89, 41, -24, 4, 332, 48, 111, -272, -46, 119, 54, 89, 95, -213, 104, 120, 165, -70, -193, 348, -85, -3, -200, -58, 71, 50, 237, -311, -103, 82, -40, 39, -148, -210, -246, 126, 1, -100, -155, -98, -93, 150, -151, 210, -245, 18, 195, -96, -139, 93, 397, -219, 91, 49, 128, -238, 283, 72, -51, -154, 7, 97, -90, 379, 0, 66, -77, 168, -36, -98, -34, -44, 68, -4, -160, -219, -162, 50, 166, 57, 58, 95, 157, -307, 100, -33, -266, -184, 46, -54, -129, -7, -116, -334, -88, 90, 65, 0, -47, -52, 4, -83, -9, 93, 195, 197, -145, 86, -6, 43, -183, 64, -193, -43, 57, 9, 149, -214, -151, 136, -1, -185, 151, -189, 417, -187, 46, 260, 6, 74, 31, 120, 198, -32, -1, -49, 53, 213, 7, -174, 106, 323, 77, -228, -202, 17, 4, -119, -21, -62, 192, -288, 282, -93, 37, -70, -117, -122, 248, 196, -14, -131, 154, -44, 62, -53, -39, -156, -22, -82, 173, 49, 68, -217, 184, 184, -242, -70, 105]
2229A05o6K5k17J17L1j43Q1K39K6l04M22k52OqK46l25l9L9J79J84m72L3L33k08
2253C2m9j79J49k05M0M3O8j64N7K25l3Q0k02J64J54j19l04L8J26j87K51l7l44
2276c96N06l19J29O8m4J93j47J49j92j55J67J95j94p4J36k57J84P1J72j80J30
2297A42n5m14J64j9K07j9J29K32l94L14l16L4n2O6n8k72M24q6k01K58K5O9q5Q4
2321A77j41p8J64j96j59M73m46K22M1K3k47L49k61l6K13l30K21K9r4J82R6k06
2343dL16m98J66K35j70J52k71N8J11k62J70m1k40Q8K42M2k61J88K3p8N0j71J31
2366b4N4l4l2n2J9K3o8R3k3J9j08J25p7q0K00j8R1m48N24l50J36K27l09J03l1
2391d0m0K40l63J02P1J16p6j29j17J92K68l68L11j49k75K63o0L4L7J40k79r1R7
$$ y = [105, 39, 64, -153, -36, -5, -148, -67, 172, 198, -106, 316, 64, 70, 62, 308, -17, -56, -17, 162, 346, -126, -93, 240, 32, -17, -196, -47, -252, -212, -169, -101, -265, -208, 17, -16, 64, -138, 26, 180, 61, -243, -205, -79, -266, -15, -52, -396, 110, -209, -80, -12, -56, 137, -10, 139, -53, -208, -41, 154, -40, -114, 22, -235, -51, 20, 192, 12, 142, 87, -327, -163, -182, 25, 6, 135, 367, -27, 287, -29, 5, -47, 19, -39, -311, 113, 27, -174, 84, 109, 178, 93, 177, 36, -42, 122, -74, -233, 240, -206, 16, 57, 80, -167, 182, -79, -115, 98, -232, -11, 18, -76, 106, 202, -4, 312, -186, -20, 215, 45, 197, -74, -16, 95, -167, 3, -38, -278, -190, 52, 94, -167, 21, 44, -34, 16, -155, -24, 30, -4, -36, -88, -69, -46, -114, -21, -44, -25, -133, -8, -85, -165, 35, 17, 108, -340, 184, -166, -30, 197, -112, -9, -40, -80, 160, -203, -101, -30, 86, 10, -119, -236, -44, 224, -144, 167, 18, -257, 6, -54, -20, 17, 157, -122, -213, -116]
2414a16J81J08l93M04J77k52k44L61l42j03K88k85K15k89K72K75m72J18j46K52
2434IR0P7l6m2l68K02n8J14J89q5k35J92j70J81k96L22j35j77M32j49m7j94N6
2457a28j20J78Q9l2J80m15L13j31K88n79N77r0k41K21l50J22J98R0J91k68j13
2478b0J93j03O5j18k87L15O4j35J17n6q2qJ69k41K17k61K70K70o0l47K76k81J83
2501A40j85K42l86J45k68n3L72k09K13k3k12j38L3O50k08K29m14J52n1p1O9k37
2523b10Ok36N08J49J1j90j42K17k26K68k67p0o4K36o0M9j5j86J76J47j72P2r0
2546h9L63m44L78k51k24R2M21l16r0K11n7K36n8j50K8p5l6L70l86j4J57o2k17
2569b13K47K1j68M5J91k32J03J14pK9j55K40j85K70l42n0J45n8K73j33k18J00
$$ y = [-116, 65, 173, -220, 184, 361, 109, -135, 226, -116, -219, 69, -216, -1, -290, -18, 257, -215, -97, -243, 9, 99, 176, 140, 98, -270, -68, -126, -12, 177, 92, -143, 49, -121, 60, -236, 86, -49, -226, 206, 57, 10, -184, -128, -248, -70, 19, -13, 167, -248, 65, -66, 222, -357, 220, 130, -111, 110, -240, -118, 80, 170, 361, 93, -20, 173, 70, 135, 17, -270, 45, 109, -26, 91, 35, -47, -55, 114, -127, 90, -171, 99, 369, 309, -38, 238, -43, 140, -45, 197, -189, -44, -312, -365, 7, -202, 11, -12, -224, -362, -329, 321, 113, 342, -72, 80, 29, -42, 27, -210, -204, -440, 68, 217, 228, 38, -104, 113, -113, 155, -112, -182, -246, -10, -70, -21, -36, -222, -46, 101, -71, 1, -89, 274, -170, 208, -43, -267, -175, 246, -70, -160, 51, -6, 230, 172, 22, 50, -25, -61, 309, -77, -91, 66, 4, -213, 34, 55, -113, -68, 123, -109, -6, 108, 101, 130, -25, 215, 30, 300, -42, -92, 53, -5, 268, 135, -83, 17]
2591A7K18q6j38p1N0q6QJ32K87l51J23p3n9J79J53k63R5k09P6P0j84r0K02Q9j44
2616e5J46m0k02O7J14J33j89o4O6p0O8j5o3R6K04j91mJ37l5o9K7MJ43k30k8J49
2642I9r9J47l53q2L48j75qK00l71M86k4j63l31L56J12r9k55M69k09j98M60j64
2664A46l24J32k29J61p1J80J8k19L00m2k30K65j91J85j84MKN8j81L41l91L68l1
2687F7m57M88k56N8OP8K41q9j4k72K99O0k44L5K09J44j77k77jP8J97k61J92j96
2711i2k27O29l31J29k07J73nk6m1k80O51k59k68K4J54J11J20j96j08k50M54J37
2733B92l95j97J89J50q5J66k78J09R2J69k03K73l74k6j00J44J84K03l20o5K17
2754A45kk94P7lK21r3l46J63Q0L2k20N51k44l6j38L04k60P0k44J01K0j36K74J51
$$ y = [17, 235, 149, 11, -60, -10, -96, -88, 44, 331, -20, 103, 30, -29, 150, 303, 40, 135, -74, 2, 72, -112, -202, 0, 89, -55, 91, 51, -151, -84, 30, 163, -26, -90, -24, -94, -26, -41, -104, -8, 196, 5, 1, 138, 103, 34, 61, 65, 208, -22, -50, 99, 0, 147, -206, -288, 60, -115, -123, 77, -294, 192, 168, 5, -326, 30, 142, 43, -212, 257, 48, -150, 310, 146, -178, -46, -275, -114, -185, -5, 13, -206, 94, 52, -178, 87, -104, 81, -103, -99, -97, -39, -220, 121, -270, 98, 67, -390, 98, -158, -100, -94, -16, 225, 136, 122, -150, 149, 209, -35, 0, 209, 353, 176, -101, -102, -24, 173, -88, 104, -92, -319, 310, -21, 108, -99, 74, 69, 43, 2, -278, 373, 114, -154, -130, 24, 135, 255, 59, -49, -299, 155, 292, -103, -300, -111, 39, -46, 120, -158, -49, 43, 212, 9, 282, -92, -118, -218, -74, 110, 313, -7, -72, 145, 143, -151, -74, -77, 144, 51, -295, -132, -52, -20, -240, 311, 67, 31, -107, 197, -63, 7, -237, -136, -116, -252, 22, 173]
2778A73p3j43l3M68m10Qk5k4j87K38K33k01O0j58P3J22r3j11J05j8J73m23J95
2801e1J50k52K27M7q4k40L89k29J60j50J30p2o7j98L56l02J36K64q0K70l01j28
2823b5J62j41m8jj81O9J08K60K9j71n0j46M1J56m9r1J31J87j86r8J59j27J46K5
2847A59J75l38j69J60k06K72r2M1J11j55j07J94J11k46K04j67o8L10k09J9k16
2868b17L27l77j5L37l9k42N28k93j19J37j01J36l3%j59j39M57j73j1K03k0j57
2890C0J45k25J15j99j56M12q6oK8j26J08J01j82J8%l8N0j19J56lJ30j30k09M8
2914a38K73l1l32r8K34j85K80J1O3j55r3N3j4o3L38J07l79K59k96K57j07j23K82
2937A43k27J93k68N7n2K25l4l0j40K66J90k78j14J3R0n1J31o3K28k02k63J71p1
$$ y = [173, 100, -43, -76, 392, -18, -10, -35, -59, -246, -8, 225, 24, 84, -74, -1, 121, 28, -83, 22, 4, 177, -246, -51, 99, -153, 74, 121, 37, -203, 186, -43, 117, -33, 97, 25, -42, -240, 116, -186, -50, 214, 134, 404, 103, -25, 137, -4, -52, -53, -234, -165, -57, 203, 232, 61, 11, -135, -94, 62, 13, -78, 53, 240, 54, -44, 115, -12, 134, 159, 334, -4, -173, -13, -219, 53, -39, 2, 113, -42, -149, 45, 156, -90, 114, -53, -121, 189, -20, -1, -217, 110, -267, -282, 55, 16, -226, 302, 9, -110, 27, -74, 62, 29, 29, -130, -269, 188, 15, 4, 207, 187, 30, 175, -50, 65, -134, -290, 122, 36, 30, 58, -68, 40, 141, -41, -23, -23, -61, -11, -130, 26, 23, 153, 23, -186, -138, 135, 104, -228, -326, -92, -277, 3, 14, 77, -78, -171, -118, -132, -195, 143, 250, -129, 130, -166, 91, -16, -139, 143, -84, 109, -159, -102, -154, 71, 37, 7, -133, 133, 323, 45, -69, -56, 34, -17, 114, 51, 279, 77, -186, -15, -86]
2960h6P2l43N72k06k08K26j77M8L07j66k56L54j13k17K02k49K78j25L4j21J89
2981A5P0N8n5k51J72J66j90l24L55j47L14j69O3J03m79R3L26j77J11J70mk27p7
3004h4K73j09j50J09p5J8R2k04j8J79J25j51r6P5K2j28K91j2k32P3Q7rj13k4Q7
3029B6j54L8J17l9l7J85j60k24J64K56k98K18r2N4L02n23K04k17K29J19k67M3
3051e6m3k3O2J58k83K86K04l63K5k7J6N4k11L39k6k76N2Q2n5j52L99j20n3P0n6
3076CJ87k04J56j71L14n60L84j85P8R0m9j34J30L17l24J4j46J51j06J22k08K3
3098a18J12kk1J12m5J12j96n5j49J64K07l43J35r5J03j56M26j01o4K77j99O9J0
3121A83l4Q3k40K54m66K52o7j32N21l81j8k12L13k22K42J49k23k51K39k28L94
$$ y = [-86, -14, -357, 215, 9, -199, 27, -150, -102, 205, 39, -217, 137, 24, -193, 9, -240, 38, -87, -53, -174, 15, 85, 143, 88, -163, 9, 175, -15, -339, 16, -131, 183, 14, 77, 180, -299, -206, 120, -57, 54, 224, 220, -7, -84, 189, 80, -70, 39, -36, -18, 74, -130, -148, 31, 156, 5, -91, -16, 6, -122, 169, 157, -75, -2, 85, 76, -37, -61, 26, -128, -90, 27, -12, -49, 136, -24, -248, -84, 172, -126, 92, 0, 54, 356, -167, 37, -180, 49, 168, -99, -56, -99, -122, -60, 98, -185, 101, 305, -58, -33, -60, -44, 10, -201, 138, 112, -164, -112, -30, -85, -237, 162, 42, -11, 59, 3, 190, -14, 142, -29, 285, -275, 109, -76, 2, 92, 43, -91, 39, 356, 32, 46, -100, 51, -55, 67, -141, -118, -6, -8, -29, 83, 38, 150, -46, -101, -250, -86, 121, -222, -87, -182, -79, -235, 191, 90, 26, 303, 104, 173, 183, 149, 232, -8, 246, -220, 32, -35, -167, 354, -27, -45, -257, 56, -166, 76, 225, 2, -249, -10, -238, 156]
3142A56n2j36p0j91M95J30n17R8M36q31M49Q4j18L0m8M33o03n3M41m32M57K7L2
3165B17m30J03R7j05oK19o4J37l13K40r4K88p9n49J22K03Q3k76K0L16j29J26n07
3188c81L95L92l08j84o6J14K10o8N2O6k85M3K1k15L99m15j40L68j48J92R1k43
3210a10J14k32K47j30K27j21o9O3J20l61R8K81Rk10J24J61l53J06M9L69n28J1
3232a35J15j54M18k00k37N40l77M8M3j6j18J13mj46J36J52l33N10n57L07j26j11
3254a32J89k27K18j29J89Nj24l0K32l11K20Q3j95j88L7q4K23p2j05J60J4N9K60
3277B92n1l07J63j90J63q0J47Qk16R7k4r6L32k02K19l24q5M14l66K33l08J79k06
3300b08j95J61J45Q3k5L35m5l13Lm1J12k76k6J99L16l94j0K22j0l3o6K07K14m18
$$ y = [156, 104, -32, -102, -293, 202, 332, -185, -87, 349, -482, -33, 51, -67, -37, -85, 348, -255, -308, 133, -299, 158, 185, 217, -213, -110, -13, -118, -124, 95, 31, 168, -145, 95, 1, 289, 210, -339, -217, -14, 69, -207, -187, 129, 0, 126, -381, 14, 406, 98, -86, -152, -38, 172, 104, 156, 222, -63, -20, 1, -214, 185, -230, -370, -2, -150, 42, 133, -110, 4, -228, 19, -111, 116, -5, -74, -11, 109, -252, -154, 127, 136, -74, 50, 211, -142, -36, 13, 382, -146, -135, -20, -174, 244, 44, -193, 347, -30, 18, 61, 45, -73, 40, 36, -110, 26, 178, -155, 355, -202, 105, -21, -132, 57, -170, 48, -81, 108, 113, -11, -41, 191, -120, 100, 183, -12, -200, -163, -247, -24, -96, -201, -41, -27, 32, 292, 241, -66, 97, -93, 70, -10, 137, 145, -71, 26, 2, -94, 238, 36, 255, -69, -154, 260, -106, 127, -181, -2, -208, -403, -242, -97, -14, -39, 296, 251, -62, -59, -100, 12, -264, -290, -91, 225, -169, -179, 43, 33, 0, -66, 141, 355, -63]
3324f3k70M75l32L79k99R9Q4J50m35K70j57j00J72j99J51K4J86j08j45L43k35
3345a0j37M60p9R3n89M20k80k1K09l1pP2j41J04j02r2L49l09R1Qnn1N3Q4l18M79
3371B50m51M48l65j55K09l67O62J2k34P8M1J17j94j07N3O9K9k39R4L12k18l49
3393c05N79l08%O0j58K3Q6M8L0j68K20q9j65M05l48o5J21M2J25j52N1J45k28j71
3417b22K47l7K83l90L96r6k00J88L8j59q3J55l05K4M98k55l32J93Mp8r6L95k14
3440d6l2P5j44J88o3j31Q8R9j85K57k0p2j72J22J41k81J61N2l46K62l0k6J68m0
3464B5jJ18l27M68p6j63l89J94L25j34P4k23Q6L8J55j87Kj1j33M72l46P2p9k45
3488b85L30l30K36k02J92J90Q2k79J31k15K08J16j36k6J10l2n9o8R2L50m69J10
$$ y = [-63, -333, 142, -190, 189, -110, -11, 73, 223, -212, 58, -99, -199, -27, -226, -75, -51, 135, 27, -118, 225, -10, -147, 313, 234, 327, -262, 158, -122, -143, 66, 35, 28, 100, -41, 63, -39, -131, 218, -91, 0, 8, 3, -48, 5, 89, -229, 250, -201, 247, -118, -273, -64, -431, 231, 243, 9, 87, 128, 245, 51, -56, -3, 66, 95, -144, -50, 262, 44, -305, 274, -34, -34, 26, -132, -109, -23, 25, 55, -113, 107, 18, -147, 258, -90, -155, -34, 8, 133, -19, 32, 177, -51, -222, 25, -12, 271, -119, 277, 181, -19, 169, 207, 48, -35, 120, -185, -161, 337, 82, -250, -57, -53, -131, -227, 168, -46, -78, -3, -147, 41, -22, -153, -65, 34, -151, 106, 86, 14, -158, -36, 105, -176, -15, 37, -309, -47, -77, -103, 65, 25, 24, 142, -185, 283, 207, 44, -345, -151, 174, 40, 114, -109, -23, 15, 170, -17, -15, -26, -159, 313, -33, 39, -40, -285, 45, -285, -49, -251, -59, 131, 213, -66, 65, -150, 58, 174, 38, 12, 122, 90, 31, -37, 55, 405, -64, 46]
3510D6r7K9K54p5r7J72J8k04j60K76j97J12q1L5R6N9k57j20K63j28N8PK41j81
3534F9j20K93l86M04p2o28M60m6J18o5J4J52l30k33L62j46M6J33j82K27r9j64
3556a93Q4Qj14K55q4k1J59Rj76j54Q8K46K52l05k81J98k63L13R7r0k53J95OJ86
3580A62k19q6O6K1L05m35J95N7j99L8M70o10J34K52k04O3Q6K72m97J70K69m41
3602a31J96j49J41J16r8k94K88k3l6j14J28m9J81k42Om2j3R1j98K42J88j63j70
3625a45J40j18K25J10j64l6J91k55J68k34J4o8J76J54k07j89K60q3N8jL0q2p5
3648a31K63k76L45l03l1J82K9K63l42Q8k9M3JJ55l02K48k10J9n8o3K54k10J93
3671A28l42J81J03j5K53l11k05K32K0J78r5j22P6Rj79%p5J2J88J02k7m0K04l70
$$ y = [46, -51, -22, 232, 157, 60, 232, 250, 46, -114, 162, -35, 77, -4, 31, 127, 186, -71, -191, 72, -56, 2, 9, 250, 69, -51, 242, -144, 260, 188, -440, 20, -26, 92, 27, 41, 193, -137, -370, -8, -154, -108, 25, -157, 70, -29, -193, -109, -101, -215, 40, -44, -65, 94, 103, -73, -227, -139, 107, 359, 54, -227, -29, -292, 21, 118, 28, -225, -30, -24, 162, -57, -143, -77, -56, 249, -186, 9, 66, -133, -95, 375, -235, -101, 151, -53, 10, 96, 368, -129, 41, 310, -131, 65, -84, 57, 173, 75, -219, 69, 46, 10, -104, 24, -25, 156, -86, -80, -122, -135, -44, -242, 0, 188, 25, -145, -5, -123, 102, 212, 48, 12, 203, -52, 116, -118, -104, -172, 4, 158, -49, -238, 22, -61, -3, -4, 26, -56, -131, 132, -144, 201, -102, -133, 49, 78, 341, -1, 87, 58, 101, 102, 257, -45, 203, -7, 12, -46, -109, 145, -65, 128, -214, -33, 70, 55, 308, -3, -208, 24, 44, 222, 127, 5, 81, 90, -89, -89, -164, -152, 36, 138, 111, 71, 275, -95]
3695i5o9J70r7L56k46j0N4r3Pk35L45j91J97J20k8j15q2L54k45j51N1p9J2J20
3719E0K4M2k88K46j14r0O8k0K05kk11j34L21o2P8O6j7j41n4j46L02P7L4l26j30
3744b22J39q7Q1rJ13j18j18K89J37l86K5J45K3j4M7k68J87k00K49O5l36K54o3
3767f7R2l09J50L34k78P2j11r2J15J70K37m80k62M58J5mo9l5J23j30M01m60L51
3790B21m06L71l43P3M82l99R2j75oJ47N1j44K9K91k85K69l0k05k25q0J04L3K28
3813I3k9J74m47K10n9J66M1j90J23k99K27m8R8N5kj76k07M00l02J13L61l36r6
3836a30m2K53kj05K26k23O7k17J70p3k6K72O6q9j08j02N6J59r7q6L3J81j38j31
3860h6J89J35k62Jo5O8K04O3l05j29K28j3kj60M45k00n0j08k05M52p8K39l50N3
$$ y = [-95, -164, 6, -91, 265, 19, 9, 63, -30, -23, -258, 87, -104, 93, 213, 185, 70, -12, 342, 97, -54, -3, -82, -70, 50, 74, 116, -172, 74, -40, -130, -62, -82, 123, 121, -90, -224, 97, 35, 113, 179, 162, 21, -33, -179, 123, 200, 234, -92, -222, -83, -170, -89, -98, 15, -103, -221, 68, 205, -181, -156, -11, 12, -2, 45, -223, -36, -236, 13, 78, -258, -4, -67, 25, -284, -134, 200, -78, -6, -117, -209, -94, 76, 313, -167, -429, 29, 44, 40, -29, -64, 59, -71, 330, -130, 221, -185, 186, -157, -84, 398, -1, 91, -84, -90, 57, 108, -36, -7, 284, -1, 268, 238, 33, -192, -272, -168, -135, 93, 64, 238, -209, 1, -58, 108, 149, -41, 82, -217, 10, -38, 60, 115, 113, -63, -270, 130, -172, -59, 302, -34, -130, -172, 81, 79, -26, 200, -23, 44, -173, -3, -76, -102, 170, 236, 147, 39, -63, -7, 152, 55, -31, 2, 183, 45, -86, 103, 238, -24, -23, -88, -20, 184, 247, -58, -187, 41, 28, 26, -134, 311, 111, 61, -47, -252, 200, 122, 361, 11, 64]
3884F4r4L29k55NO6r6K29k31j6L39m74Q2J80k43L75j99j52K3J50j98m7L85k29
3907gL14m27Q5J32k93J59j4j10K84j30o8j96N21n0l01m1O0P1l6K3Q2l23L59K37
3931C31m50K00M8k75K06j98L6J01K10J8j07r8j24K80q9k51L39k23J8j08M04l67
3953i9P5M1N5j14n0K65jj17J01k03r5K36k95K97m7j39J60k9q2N3l9J67k81O1l8
3978a18K77k35p0J42O4j51p3J57L09j3k73K20j37m03L13j23j06L06n8j44J41j76
4000a51K03N9M4l21P9R2K47j97J56k11Q1J08k18K48m65K95l85L03L8o2J90M8q6
4023I5k81K67m6J99k04K08j17J03N8m86K44j77p5K38m1j24J7J82j8rJ11j48L37
4046C33l84N3k2K2K40p8j97N3P3k36L26j9j30O8k10J42j71J68J68n5k87R6N2p0
$$ y = [64, -30, 299, 44, 49, 115, 19, 248, 17, 1, 340, -134, -52, 128, -115, 260, 61, -91, -68, 82, -116, -163, 222, -7, 307, -120, -35, 97, -196, -37, -51, -161, 123, -7, -75, -271, 250, 200, -101, -142, -82, -11, -47, -24, 58, -265, 94, 331, -119, 81, 129, -146, 60, -138, -102, -1, 209, 227, 120, 22, -102, 178, 89, -162, 177, -46, -28, -136, 268, -99, -24, 17, 72, -42, -92, 173, 172, 55, 156, -47, -142, 94, -201, 96, 49, -90, 70, 41, -41, 12, -27, 140, -141, -80, -118, 159, -76, -146, -4, 60, -91, -164, -7, 302, 289, 16, 236, 99, -304, 9, -114, -220, 86, 28, -116, 25, -151, 52, 111, 155, -166, -87, 5, 252, 55, 211, 0, 81, 189, -29, 219, -246, 49, -336, -33, 5, -57, 133, 181, 95, -186, 81, 35, 234, 30, 238, 121, 224, 282, -204, 40, -137, -212, 26, -15, -139, -122, 60, 42, 33, 144, -4, 333, -51, 2, -20, 2, 242, 164, -33, 20, 93, -143, 183, 164, 34, 102, -108, 34, -137, 31, 199, 144, -143, -47, 5, -65]
4070f5j5Q1O6P5j78pL7j66J79q1O7n5K07k94J24R4o9J02j54K28j66K60k83M1n6
4095b8j57J84j28j46J25P2R8j25J64j48lJ89N5l31J03K3K54p4j25oj93K21L1p1
4119a6L5q3j40J07kj32M80k80J64J06m19L28j66J95j87N9k48K17M19j54n05K7
4141a95L4j16J88K0K9kJ20M2j77LK20j62q5pK6r2l2K97j05j07j69K14K83k12m6
4166c1l67L85j59O7o3k93K59j14M10l05Q4J67q1m7j4o5l41O58k53Q5r0J12q2J2
4190f6P1m5p6M25k02j04K54l54K14j7j33M2n8j56J82Q5n0pN6M1j21K63j87r9R2
4215E0J68l38j27J59J11k8m7J35J62l31J18q9J22p0P4J03k18K32J6j1k92J75j42
4238f8J22j55J37k89J67J78j01j08j7j8p8N4K16kRO3k18J64p3j01K97k96j3J77
$$ y = [-65, -80, 1, 67, 142, -36, -43, -6, -172, 7, -74, -7, -62, 145, -149, -25, 69, 0, 102, -52, 176, 10, 270, -13, 28, -28, -185, -1, -129, -275, -150, -78, 20, -105, 59, -89, -92, 97, 152, -179, -76, -53, 201, 127, 2, -4, -197, 24, 55, -16, 19, -64, -204, -97, -99, -231, 249, -31, 133, 239, -180, 148, -18, 177, -10, 49, -199, 18, 437, 283, -222, -195, -161, -277, -89, -69, -40, -42, 78, 120, -57, -54, 166, 4, -81, -88, -62, -154, -186, 111, 6, -101, -270, -56, 227, 15, -31, -398, -13, -172, -105, -168, -461, -202, -316, 94, -211, -127, 40, -41, -88, -102, -167, -508, 150, -103, -18, -108, 4, -78, -66, 5, -40, -116, 309, 107, 3, 257, -97, 117, 100, -33, 9, -49, -205, -23, 62, 12, 5, 61, 102, -19, 244, 57, -42, 50, 218, -120, -247, -88, 23, -5, -52, 83, 245, -86, 32, -57, 65, -5, 69, 172, -46, 186, 202, 191, -101, 74, -68, 54, -101, 36, -253, -86, 92, -9, -117, -134, -152, -230, -176, 40, 38, 47, 110, -108, 56, -17, -118, 179, -117, -130, 47]
4262D7J25k04o2K64m03M33l16K54J75m69M0L07k23j96K7m4J38J48r0R1j52L5J20
4285D5o2M3n2j49j12J91q2R9n2Q0J53j98J93l42K75k05J91k39J73Rj25K56j74
4308h4K04q8L8j20J51j3j02r2J20n7L10l74RK0J98J4j43M9M8p6n5O5r1J44k55
4333a80K01k78L03j10m2Q4Q4O0j21j71J44k40J07M73j34k96K64r2j41J51N2J64
4355B82k09j10J6K04p8R2k57J6K21k09P2j51L3K00K5j65j24K76J65j93J3j40j89
4378b10J68j45l3P3K7j4K47l55Q3K09j12J91M7m19Q3p1K60L4J48l18J74j16J70
4401A21j05k10K48Nl55L42j03Op5J09J53l9m22L15nQ9j16O6R7l93K34j50K26k46
4425b08J85j31q5K08K98l07j15K08R1l36K09J00k16J28j93j25K87j27O8j4j76
$$ y = [47, 172, -32, -94, 170, -233, 200, -116, 138, 313, -156, -116, 191, -32, -228, -201, -245, -107, 41, -49, 42, -110, -75, 45, -17, 26, -26, -175, -287, -96, -178, -79, -131, -51, 102, -96, 97, -245, 30, -175, 16, -223, -50, -41, -166, 90, -84, 120, 32, 70, -50, 101, 88, -14, -106, 14, -43, 267, -107, -98, -78, 120, 134, -9, 40, 88, 12, -43, 22, -69, 75, -180, 21, -257, 46, -64, -106, -22, 62, 122, 1, -170, -26, -266, -159, 314, 180, -116, 148, 56, -85, 66, 118, 282, 73, -37, -21, 183, 105, 197, -60, -44, 177, -32, 40, -111, -78, 122, 147, -18, -142, 134, 299, 106, 119, -21, -210, -42, -187, -220, -147, -120, -134, 113, -242, -159, 50, -62, 129, 176, -243, -160, -231, 29, 63, 211, -107, 67, -49, 121, 16, -194, 54, 59, -296, 46, -57, -51, -126, -17, 136, 97, -325, -10, -15, 74, -42, 24, 121, -272, -38, -188, 38, -208, -23, -154, -239, -31, 267, -40, -155, 53, 144, -192, 17, 117, -99, 29, -164, -289, -2, -129, -61, -75, -251]
4446b51M55Jl83L26j62K12j8k11j8L86l68J8k5kK42o29M97M9m3K61m46M5j48J22
4470i0N7MJ11k44J0P1L45m26L41l10K8L13k60J57j20K23J31m65J32K11k09J07
4492A17l03J28P5l0J84K3j12j24K10k54M8j39K21k53N03k47O0j62O7k08L64k45
4514g7m7k4R3l2k03K66j47K10L1J4q0j39J29r0J02K67N5n5k34J65k48p3j45J42
4538a20LQ7MJ99J09j23L22l04J38l51J29P7k60kJ54k05N3o8nL62k38J66m0p6M46
4563D57j55j64j75Q9q1l29P71m95K97m14K77l50N04l24r8K47k57J76k07L20l06
4584b17L28q9m3J56j48o6l61K49n8K26j62J1J29j13N02k12j32m8m9J08J17R7l5
4607A90k84K97p1K13m57K03oP2m5j00J39m7Mm85P66n04K64k50M9p1J54j42k4K83
$$ y = [-251, 204, 205, -178, 148, -14, 198, 180, -31, -49, 337, -31, -13, -38, -40, 202, -427, 70, 119, 76, 337, -109, -64, -212, -90, -33, -29, 82, -162, -152, -81, 264, -162, 179, -131, -103, 210, -50, 107, -13, 210, 341, -124, 8, 219, 10, 117, -186, -58, 17, -13, 171, 194, 82, -42, 168, -86, -38, -177, 44, -209, 294, 47, 107, -55, 12, -196, 168, -77, -124, -148, -55, -87, -290, -24, -171, 39, 70, 84, 4, -135, -6, -96, 6, 273, 328, 273, 39, 204, -44, -117, -262, -120, -117, -30, -26, 173, 282, 159, 481, 177, 315, -36, 93, 170, -90, -92, 62, -143, -90, -158, -163, 199, -39, 127, 87, 11, 457, 302, 138, -37, 52, -29, -358, 413, -82, 215, -199, 78, -272, 232, -92, -190, 57, -200, -24, -231, 89, -217, 111, 22, -21, 135, -13, -79, -440, -191, -249, -23, -185, -174, -45, -158, 344, 132, 0, -48, -97, 11, 128, 225, 190, -94, 203, 132, 345, -112, 91, 85, 157, 112, 12, 151, 104, 108, -377, 389, -115, 149, -101, -52, -123, 31, -111, -135, 148]
4631A48n5l03M24r8l47J38K42k10Q6k28Q3J35M6J74o2j21p8j09J0K94o02L26J99
4654I2j03j11O8r0P6%j35K98M7k50K23q4Oq7Q4k55R7q1K85P0k80K49m7j12k34
4679b74L15P5j89k02J50J21k48M97n02L15k99K31L3j87J15O0o7j85M9O0L13j05
4701G6N0j23j76R3K67l27l2P2m1L10J75l88J41q5l03N47k83q3J7J57K23k47L88
4724D28m55K27j53J86M3l74K16k93O4r0K69J86m18J60n7M5J72j09J15k97J96k3
$$ y = [148, 93, -210, 214, 116, -231, -93, 149, -61, 25, -203, -120, 15, 61, 235, 173, 52, -26, -135, -125, 169, -433, -107, 92, -11, -122, -54, -144, -68, -68, -203, 95, 142, -108, 115, 31, 37, -50, 34, -221, -124, -205, 80, 150, -130, 119, 72, -40, -274, 41, 116, -73, -275, -125, -4, -252, 245, -257, 58, -241, -10, 23, -164, -49, 11, -56, -241, -192, -132, 181, 76, 126, 3, -173, -80, 187, -140, -172, -100, -141, 169, 344, -44, 97, 12, -291, 256, -27, -110, -93, 64, 287, 40, 428, -27, 200, 47, 233, 276, -98, 118, -175, -111, -201, 68, 254, -164, -4, -61, -16, 156, 47, 162, -135, 61, 38]
$$ [...]
8191a38
##END NTUPLES=NMR FID
##END=
