##TITLE=1H_LR-693-RM2
 CDcl3, 8 sc, 
 15.10.2019
##JCAMPDX= 6.0         $$ Bruker NMR JCAMP-DX V2.0
##DATA TYPE= NMR FID
##DATA CLASS= NTUPLES
##ORIGIN= UXNMR, Bruker Analytische Messtechnik GmbH
##OWNER= root
$$ XWIN-NMR		Version 3.5
$$ Tue Oct 15 14:01:25 2019 Russian Standard Time (UT+4h)  she@DPX200
##.OBSERVE FREQUENCY= 200.1315
##.OBSERVE NUCLEUS= ^1H
##.DELAY= (6, 6)
##.ACQUISITION MODE= SIMULTANEOUS
##.ACQUISITION SCHEME= undefined
##.AVERAGES= 8
##.DIGITISER RES= 18
##SPECTROMETER/DATA SYSTEM= spect
##.PULSE SEQUENCE= zg30
##.SOLVENT NAME= CDCl3
##.SHIFT REFERENCE= (INTERNAL, CDCl3, 0, 15.7039)
##AUDIT TRAIL= $$ (NUMBER, WHEN, WHO, WHERE, WHAT)
$$ ##TITLE= Audit trail, XWIN-NMR		Version 3.5
$$ ##JCAMPDX= 5.01
$$ ##ORIGIN= Bruker BioSpin GmbH
$$ ##OWNER= she
$$ F:/spectra/data/she/nmr/H-F/1/audita.txt
$$ ##AUDIT TRAIL=  $$ (NUMBER, WHEN, WHO, WHERE, WHAT)
(   1,<2019-10-15 14:00:25.87 +0400>,<she>,<DPX200>,
      <created by zg, POWCHK disabled, PULCHK disabled
       configuration hash MD5:
       00 E9 B6 7A A2 85 ED C7 34 08 36 98 17 FE 4E 26
       data hash MD5: 16K
       49 21 19 9A BD 57 DC 2E 64 A0 EF 30 56 26 B6 F5>)
$$ ##END=
$$ 
$$ hash MD5
$$ D9 9B 52 9F BE 4B 2B 93 86 DB 1A 96 07 25 E5 34
##$RELAX= 
##$RELAX= 
##$RELAX= 
##$RELAX= 
##$RELAX= 
##$RELAX= 
$$ Bruker specific parameters
$$ --------------------------
##$DU= <F:/spectra>
##$EXPNO= 1
##$NAME= <H-F>
##$PROCNO= 1
##$TYPE= <nmr>
##$USER= <she>
##$AMP= (0..31)
100 100 100 100 100 100 100 100 100 100 100 100 100 100 100 100 100 100 
100 100 100 100 100 100 100 100 100 100 100 100 100 100 
##$AQSEQ= 0
##$AQ_mod= 1
##$AUNM= <au_zg>
##$AUTOPOS= <>
##$BF1= 200.13
##$BF2= 200.13
##$BF3= 200.13
##$BF4= 200.13
##$BF5= 200.13
##$BF6= 200.13
##$BF7= 200.13
##$BF8= 200.13
##$BYTORDA= 1
##$CFDGTYP= 0
##$CFRGTYP= 5
##$CHEMSTR= <none>
##$CNST= (0..31)
1 1 145 1 1 1 1 1 1 1 1 1 1 1 1 1 1 1 1 1 1 1 1 1 1 1 1 1 1 1 1 1 
##$CPDPRG= <>
##$CPDPRG1= <>
##$CPDPRG2= <>
##$CPDPRG3= <>
##$CPDPRG4= <mlev>
##$CPDPRG5= <mlev>
##$CPDPRG6= <mlev>
##$CPDPRG7= <mlev>
##$CPDPRG8= <mlev>
##$CPDPRGB= <>
##$CPDPRGT= <>
##$D= (0..31)
0 1.2 0 0 0 0 0 0 0 0.06 0 0.03 0 0 0 0 0.0002 0 0 0 0 0 0 0 0 0 0 0 0 
0 0 0 
##$DATE= 1571133625
##$DBL= (0..7)
120 120 120 120 120 120 120 120 
##$DBP= (0..7)
150 150 150 150 150 150 150 150 
##$DBP07= 0
##$DBPNAM0= <>
##$DBPNAM1= <>
##$DBPNAM2= <>
##$DBPNAM3= <>
##$DBPNAM4= <>
##$DBPNAM5= <>
##$DBPNAM6= <>
##$DBPNAM7= <>
##$DBPOAL= (0..7)
0.5 0.5 0.5 0.5 0.5 0.5 0.5 0.5 
##$DBPOFFS= (0..7)
0 0 0 0 0 0 0 0 
##$DE= 6
##$DECBNUC= <off>
##$DECIM= 24
##$DECNUC= <off>
##$DECSTAT= 4
##$DIGMOD= 1
##$DIGTYP= 9
##$DL= (0..7)
0 120 120 120 120 120 120 120 
##$DP= (0..7)
150 150 150 150 150 150 150 150 
##$DP07= 0
##$DPNAME0= <>
##$DPNAME1= <>
##$DPNAME2= <>
##$DPNAME3= <>
##$DPNAME4= <>
##$DPNAME5= <>
##$DPNAME6= <>
##$DPNAME7= <>
##$DPOAL= (0..7)
0.5 0.5 0.5 0.5 0.5 0.5 0.5 0.5 
##$DPOFFS= (0..7)
0 0 0 0 0 0 0 0 
##$DQDMODE= 0
##$DR= 18
##$DS= 0
##$DSLIST= <SSSSSSSSSSSSSSS>
$$ [...]
##$SUBNAM2= <"">
##$SUBNAM3= <"">
##$SUBNAM4= <"">
##$SUBNAM5= <"">
##$SUBNAM6= <"">
##$SUBNAM7= <"">
##$SUBNAM8= <"">
##$SUBNAM9= <"">
##$SW= 24.0689530833862
##$SWIBOX= (0..15)
0 0 2 0 0 0 0 0 0 0 0 0 0 0 0 0 
##$SW_h= 4816.95568400771
##$TD= 16384
##$TD0= 1
##$TE= 0
##$TE2= 300
##$TE3= 300
##$TEG= 300
##$TL= (0..7)
0 120 120 120 120 120 120 120 
##$TP= (0..7)
150 150 150 150 150 150 150 150 
##$TP07= 0
##$TPNAME0= <>
##$TPNAME1= <>
##$TPNAME2= <>
##$TPNAME3= <>
##$TPNAME4= <>
##$TPNAME5= <>
##$TPNAME6= <>
##$TPNAME7= <>
##$TPOAL= (0..7)
0.5 0.5 0.5 0.5 0.5 0.5 0.5 0.5 
##$TPOFFS= (0..7)
0 0 0 0 0 0 0 0 
##$TUNHIN= 0
##$TUNHOUT= 0
##$TUNXOUT= 0
##$USERA1= <user>
##$USERA2= <user>
##$USERA3= <user>
##$USERA4= <user>
##$USERA5= <user>
##$V9= 5
##$VALIST= <valist>
##$VCLIST= <CCCCCCCCCCCCCCC>
##$VD= 0
##$VDLIST= <DDDDDDDDDDDDDDD>
##$VPLIST= <PPPPPPPPPPPPPPP>
##$VTLIST= <TTTTTTTTTTTTTTT>
##$WBST= 1024
##$WBSW= 4
##$XGAIN= (0..3)
0 0 0 0 
##$XL= 0
##$YL= 0
##$YMAX_a= 382131
##$YMIN_a= -513945
##$ZGOPTNS= <>
##$ZL1= 120
##$ZL2= 120
##$ZL3= 120
##$ZL4= 120
##$ABSF1= 10
##$ABSF2= 0
##$ABSG= 5
##$ABSL= 3
##$ALPHA= 0
##$AQORDER= 0
##$ASSFAC= 0
##$ASSFACI= 0
##$ASSFACX= 0
##$ASSWID= 0
##$AUNMP= <proc_1d>
##$AZFE= 0.1
##$AZFW= 0.1
##$BCFW= 1
##$BC_mod= 2
##$BYTORDP= 1
##$COROFFS= 0
##$CY= 11.3945322036743
##$DATMOD= 1
##$DC= 2
##$DFILT= <>
##$DTYPP= 0
##$F1P= 20.1720416913024
##$F2P= 0.152960286110954
##$FCOR= 0.5
##$FTSIZE= 0
##$FT_mod= 4
##$GAMMA= 1
##$GB= 0.15
##$INTBC= 1
##$INTSCL= 1
##$ISEN= 128
##$LB= 0.24
##$LEV0= 0
##$LPBIN= 0
##$MAXI= 10000
##$MC2= 0
##$MEAN= 0
##$ME_mod= 0
##$MI= 1.114404
##$NCOEF= 0
##$NC_proc= 0
##$NLEV= 6
##$NOISF1= 3.799351
##$NOISF2= 2.8
##$NSP= 1
##$NTH_PI= 0
##$NZP= 0
##$OFFSET= 15.70392
##$PC= 1
##$PHC0= -9571.496
##$PHC1= 15.60093
##$PH_mod= 1
##$PKNL= yes
##$PPARMOD= 0
##$PSCAL= 0
##$PSIGN= 0
##$REVERSE= no
##$SF= 200.130013532006
##$SI= 16384
##$SIGF1= 3
##$SIGF2= 2
##$SINO= 400
##$SIOLD= 16384
##$SREGLST= <1H.CDCl3>
##$SSB= 0
##$STSI= 0
##$STSR= 0
##$SW_p= 3612.71676300578
##$SYMM= 0
##$S_DEV= 0
##$TDeff= 0
##$TDoff= 0
##$TI= <>
##$TILT= no
##$TM1= 0
##$TM2= 0
##$TOPLEV= 0
##$USERP1= <user>
##$USERP2= <user>
##$USERP3= <user>
##$USERP4= <user>
##$USERP5= <user>
##$WDW= 1
##$XDIM= 8192
##$YMAX_p= 0
##$YMIN_p= 0
$$ End of Bruker specific parameters
$$ ---------------------------------
##NTUPLES= NMR FID
##VAR_NAME=  TIME,          FID/REAL,        FID/IMAG
##SYMBOL=    X,             R,               I
##VAR_TYPE=  INDEPENDENT,   DEPENDENT,       DEPENDENT
##VAR_FORM=  AFFN,          ASDF,            ASDF
##VAR_DIM=   8192,          8192,            8192
##UNITS=     SECONDS,       ARBITRARY UNITS, ARBITRARY UNITS
##FACTOR=    0.0002076,     1,               1
##FIRST=     0,             0,               0
##LAST=      1.7004516,     0,               0
##MIN=       0,             -513945,         0
##MAX=       1.7004516,     382131,          0
$$ Real data points
##PAGE= N=1
##DATA TABLE= (X++(R..R)), XYDATA
0@%%%qJ6j6J6k4L2m0N6p0Q6j04J28j53J85k24K64l12L68m32N00n76O64p64Q73
27D65r93J127j276J439j619J818k035K276k540K826l141L486l867M286m747N255
43B760n815O441p142P930q822R841j1018J2395j4034J6022j8498K1678k5928L1950
57A7760m1215N7483r4431L28096O5419m06521K04003J6091j74828K6382L61189
68C59428K2703k28486q161J92945j21824k32177M1195J64730q5608q6990J38318
79A56073J27356j04966o6857P3740k5126j92883p3711J04718R7677L5287P0947
90B02255L1280j08283j59429n5029L6777M5197K4446K3546K5834O418l3311l4579
102E122O535k191p0435m9833N5044M4777o0515j3418J21950N5352j25026r4143
$$ plain form
0 0 0 0 0 -8 8 -8 8 -16 16 -24 32 -38 48 -56 72 -81 104 -120 144 -168 200 -232 268 -308 356 -408 465
27 465 -528 599 -677 762 -857 961 -1074 1202 -1338 1488 -1653 1833 -2034 2252 -2495 2760
43 2760 -3055 3386 -3756 4174 -4648 5193 -5825 6570 -7464 8558 -9940 11738 -14190 17760
57 17760 -23455 34028 -60403 267693 333112 -73409 130594 146685 -28143 -1761 359428
68 359428 382131 153645 145484 338429 216605 -15572 25623 190353 104745 17755 156073
79 156073 283429 178463 111606 185346 160220 -32663 -106374 -1656 96021 131308 202255
90 202255 233535 125252 -34177 -89206 -52429 -7232 17214 40760 66594 73012 39701 5122
102 5122 11657 9466 -60969 -110802 -55758 -10981 -71496 -84914 37036 92388 -32638 -126781
114a26781L6170l0798j07586P3679K08880P524j70951k3236Q5801p3964j16579
125b37841R4602J20633j01746j02750J23477J02034j15046p7483J05813K6511
135f1796j46764m8739J10192K2335p1660O0380J33339l9248j51863l4700M5894
146a82630j8367p424R1549N8857o7632n9657M1831L6284l9894l5186J4837N846
158a61586j9382J1362N2616L2978j7773k6572Q67j697m6229m6537L2648Q5309
170a03996M1381n775O611j2634q0756n7067O0841P8495k5441l9208N3234M7069
182c7246m3190k0463N8457l804r9261k0463R4670L6122m8984K2650Q3627j2305
194I810p9542l705K5895n1684l4751R3243J01195k1727n3776J0774J97n4048n718
$$ plain form
114 -126781 -90611 -121409 -228995 -155316 53564 61088 -109863 -133099 -47298 -121262 -237841
125 -237841 -143239 -22606 -124352 -227102 -103625 -1591 -116637 -194120 -88307 -61796
135 -61796 -208560 -257299 -147107 -124772 -196432 -136052 -2713 -41961 -193824 -228524 -182630
146 -182630 -200997 -208421 -116872 -58015 -125647 -185304 -143473 -107189 -147083 -182269 -167432 -161586
158 -161586 -180968 -169606 -116990 -84012 -101785 -128357 -127490 -129187 -175416 -221953 -189305 -103996
170 -103996 -62615 -68390 -61779 -74413 -155169 -212236 -151395 -72900 -98341 -137549 -84315 -37246
182 -37246 -80436 -100899 -42442 -46246 -145507 -165970 -71300 -35178 -84162 -61512 22115 9810
194 9810 -69732 -73437 -47542 -99226 -133977 -40734 60461 38734 -15042 -4268 -4071 -58119 -63837
207f3837O3436J6433m6799N344O8751K5876l3088j5801L362k5394k6936K2035
219f618M2517J1381k011K3520K6193j5083m8415l3224M259K2139K4187L4213L1698
232A14756j0036m2321j4530K6982L100l6807j0344L5724K1014l589K3932L0397
244A38278l0922n7723K991L3800j6854k7382L5743N1081m897j5335J6894j5886
256A09788o7456k1644N6531L7666j8340k861K7155o385l0161O349J5366l4476
268G1532m0911K3331M8707R008r243Q407l806l2576j7018J3266k405k4601L619
281D7310L9942K8203o171k0736k2089k3285j1929J0427K0001O206r684k639J5481
294G1037J3749j3155l1443k1161m462K420J4030K6667R541k0390j5068R378N17
$$ plain form
207 -63837 -401 16032 -30767 -25423 43328 69204 36116 20315 23677 -1717 -28653 -6618
219 -6618 35899 47280 45269 68789 94982 79899 31484 -1740 2519 24658 48845 83058 114756
232 114756 104720 62399 47869 74851 77951 41144 30800 66524 87538 83949 107881 138278
244 138278 107356 49633 52624 86424 69570 42188 77931 129012 124115 108780 125674 109788
256 109788 42332 20688 77219 114885 96545 93684 120839 114454 84293 90642 106008 71532
268 71532 30621 53952 102659 111667 102424 110831 107025 74449 57431 70697 68292 43691 47310
281 47310 87252 115455 109284 88548 66459 43174 31245 41672 61673 67879 58195 55556 71037
294 71037 84786 71631 40188 19027 14565 16985 31015 57682 67223 46833 31765 41143 41660
307D1660k9933k3781O042J2380Q006K2241K0147k1752m1455q455J4812o284j6157
320b2529O302J2404j137Q937K1830q081m3229k5876R641R875J1R753J1792o108
334a6415o511J0126k10k9684k7754K121J6771J4003J4752P144j3606j8393p81
347d8437L593j0824j4757j867R172J5926J9576O407j8050k4544q362J667K377
360f8123L877M158N28N965J7230P584j6365k5683j2246J834R508J6999J4220l509
374d4023q722N222Q107r120j8566r818o39R724K3226K2014k994j8601q693K465
388e0418j694m468M89j082K790J8800K3645J520k0419j8220m675K459P896J2158
402c1219M728l744M297J6223O458j3237j8880r978P92J3662K2662J1775p016p871
$$ plain form
307 41660 11727 -12054 -6012 6368 14374 36615 56762 35010 -6445 -14900 -88 -6372 -22529
320 -22529 -16227 -3823 -4960 3977 25807 17726 -25503 -51379 -41738 -31863 -31852 -22099 -10307 -16415
334 -16415 -22926 -12800 -13010 -42694 -70448 -68327 -51556 -37553 -22801 -15657 -29263 -47656 -48437
347 -48437 -44844 -55668 -70425 -72292 -63120 -47194 -27618 -21211 -39261 -63805 -72167 -70500 -68123
360 -68123 -64246 -60088 -59560 -53595 -36365 -28781 -45146 -70829 -83075 -81241 -71733 -54734 -40514 -44023
374 -44023 -52745 -47523 -39416 -48536 -67102 -76920 -77559 -67835 -44609 -22595 -25589 -44190 -52883 -50418
388 -50418 -52112 -56580 -56091 -57173 -54383 -35583 -11938 -10418 -30837 -49057 -53732 -51273 -43377 -31219
402 -31219 -26491 -30235 -25938 -9715 -3257 -16494 -35374 -45352 -44560 -30898 -8236 3539 -3477 -11348
416a1348K321M098l040q011q210l637J1191K3713J6297l403j4711j0400k926K926
430e140N483J031m124L256J6465J5143M5j2687j5481j0438K916J5453J2746j484
444B3184m107N399P316J92n898j0105j2767l023J7042K2281N239r033o116r49
458B8655k303k420n45m845o040Q213K1307J2771q758j6100p644j754P57M841O083
473C2218l396m399Q740J5974J914j7179j6497m154M072P670J0710O806n345q475
487B8659L430P980o999j7630o751Q926J0755P935P643k505j6215j1804Q238R636
501C1298q164j3241J046J1556P987O264M082j0063k2700r569J2739J1869m996
514A8108m089Q068O042l639k312k047j3444j4985O386K2328P781j2559q125N239
$$ plain form
416 -11348 -9027 -4929 -7969 -15980 -24190 -27827 -16636 7077 23374 19971 5260 -5140 -8066 -5140
430 -5140 343 1374 -2750 506 16971 32114 32159 19472 3991 -6447 -3531 11922 24668 23184
444 23184 19077 24476 31792 31984 26086 15981 3214 191 17233 39514 44753 35720 29604 28655
458 28655 26352 23932 23387 18542 12502 20715 42022 54793 46035 29935 22291 20537 21294 26135 32218
473 32218 28822 24423 33163 49137 51051 33872 17375 13221 17293 24963 35673 42479 37134 28659
487 28659 32089 40069 33070 15440 8689 17615 28370 36305 43948 41443 25228 13424 21662 31298
501 31298 23134 9893 10939 22495 30482 36746 40828 30765 8065 -1504 11235 23104 18108
514 18108 14019 22087 28129 24490 22178 20131 6687 -8298 -1912 20416 28197 15638 7513 12752
528A2752K120m451J110k87j4563j3848J4212K6771M028j6127q065J41q832p915
542a2954R884R844r318o702J7699J5189j7510k3326L205J0050n269r69J4080L5
556C938k1658j665K7760J0272k5241j8862N475J714n614J5043K4167q857k8997
569b2525j208J8485o133k1998O827K2717j860j2246J0000Q431k2501j8743K1453
582a9301K4037j5879k4467P214J5414m762J256K0487j964l8016j9212K6494K2304
595f395j1360m109J9282j24k8203n463K2774r59k4383P406L4175n51l4052m671
609c6633K4355N57j6435J2072J7217k7475l1522K5755M4692n920k7846N104O029
622a0050k8523j2575L8883K7219k5972j9459K6951J0183l4326j4748L1366J4118
$$ plain form
528 12752 14872 10421 11531 11244 -3319 -17167 -2955 23816 27844 11717 3652 3793 -5039 -12954
542 -12954 -3070 6774 -2544 -9246 8453 23642 6132 -17194 -13989 -3939 -9208 -10177 3903 3938
556 3938 -17720 -19385 8375 18647 -6594 -25456 -19981 -18267 -23881 -8838 15329 6472 -22525
569 -22525 -23733 -5248 -11381 -33379 -26552 -3835 -5695 -17941 -7941 490 -22011 -40754 -19301
582 -19301 4736 -11143 -35610 -28396 -12982 -17744 -16488 3999 2035 -35981 -55193 -28699 -6395
595 -6395 -17755 -21864 -2582 -2706 -30909 -36372 -13598 -14557 -38940 -31534 2641 2090 -31962 -36633
609 -36633 -12278 -11721 -28156 -16084 1133 -26342 -57864 -32109 12583 6663 -21183 -16079 -10050
622 -10050 -38573 -51148 -12265 14954 -11018 -30477 -3526 6657 -27669 -42417 -11051 3067
634C067k4120n83K7890q610l7565R996M7929L208m0454q929J8209j0098j4261
647c4321L5500M0178k5094m7688N259K7168j1571j6075K9364K5786k6629k5491
659b3614K3081J6380k9524j3180L9428K1041l6741k4389K5333J4905j8396Q596
671B920L7665j1527n7774j1477M5852J9183j9181P861K4116k4172m3083J4586
683a5031M2104p821k8270J9693K8291k6784l2814K2658K9592j7380j5444K7447
695B6241P146m4578k0238M4287L5726j9196j8948R768j0853l4279R819N1585J4385
708E0865l4794j4216J7718m485k4251J0944L3714m134k8670M128K0978j4278k5907
721a2388K0259L8153r145l6519m153J4943r987n481L7329K7596l4244m4365Q892
$$ plain form
634 3067 -21053 -21636 6254 -2356 -39921 -29925 18004 21212 -19242 -28171 -9962 -20060 -34321
647 -34321 1179 41357 16263 -31425 -26166 1002 -10569 -26644 2720 28506 1877 -23614
659 -23614 -533 15847 -13677 -26857 12571 33612 -3129 -27518 -2185 12720 -5676 2920
671 2920 40585 29058 -28716 -40193 5659 24842 5661 13522 37638 13466 -29617 -15031
683 -15031 27073 19252 -9018 10675 38966 12182 -20632 2026 31618 14238 -1206 26241
695 26241 33387 -11191 -31429 12858 48584 29388 10440 20208 9355 -24924 -15105 36480 50865
708 50865 16071 1855 19573 15088 -9163 1781 35495 31361 2691 6819 27797 13519 -12388
721 -12388 7871 46024 36879 360 -3793 11150 1163 -4318 33011 60607 26363 -18002 -9110
734i110K5420o870m481K9613R369l9877k1811L0722J7194k7134o281L4112M480
747C5346m0129j0649L1777P278k1147J1977K9561k2428m9364M864M2260Q652j4679
760A3319J0857P275l5236k8046K9270L5131j3255k0919J2968R477k4461j2244
772a5864K5832J5651j9225j0359J7382l9k7932n355L1590J9031j6214j4275K186
785B409j0426j8179J3516L8360O624l1579j6703J1938J942j2394J0258K3809p955
798A1620k9557J746K3719m995k1486J1479K5866j1564k8732L163J6163j0266o558
811a9402K8867J7637l3637l2534J4954K1727p779j167K2060k703l5985q467L1582
824d847J1127k2967m228K0142l797k4311L778K3231l837j7231J0554J7579j7525
$$ plain form
734 -9110 16310 9440 4959 34572 43941 4064 -17747 12975 30169 3035 -3246 30866 35346
747 35346 -4783 -15432 16345 23623 2476 14453 44014 21586 -27778 -22914 19346 27998 13319
760 13319 24176 31451 -3785 -31831 -2561 32570 19315 -1604 11364 20841 -3620 -15864
772 -15864 9968 25619 6394 -3965 13417 13378 -14554 -19909 11681 30712 14498 223 2409
785 2409 -8017 -26196 -12680 25680 32304 725 -15978 -4040 -2098 -14492 -4234 19575 11620
798 11620 -17937 -16191 7528 2533 -18953 -7474 18392 6828 -21904 -18741 -2578 -12844 -19402
811 -19402 9465 27102 -6535 -39069 -24115 -2388 -10167 -11334 10726 8023 -27962 -36429 -4847
824 -4847 6280 -16687 -20915 -773 -4570 -28881 -25103 -1872 -5709 -22940 -12386 5193 -12332
837a2332k7222Q514K5804J806q368N995M62k3364j3868K2869K4151q188j8086
850b1827K363O661r096l972J5634Q481j6258j0143J3666P946j5190o817J8574
863i978J1357j4005r016P802k398j5505Q151K9876K858k7461j0018J4828K186
876a1323j0397J1046J7243j3274k2490J1512K1640p950j6148J1216J3359j3777
888i343j1224J4363Q104j5122k196K3117N963k3328j1818J3835P204n353P174
901A376J2851j0310k0152M719J9592J986j1603O77O229m744l812R356P839q366
915E638q029P033Q884n579r287K580R440K466j368K729j481j0812n310J2187J3388
930B2479l246j0852r89M781j298M82P644J013j2448m517J3055P539q664n697O969
$$ plain form
837 -12332 -39554 -31040 -5236 -3430 -11798 -5803 -5341 -28705 -42573 -19704 4447 -3741 -21827
850 -21827 -19464 -12803 -21899 -25871 -10237 -1756 -18014 -28157 -14491 -6545 -21735 -28552 -9978
863 -9978 1379 -12626 -21642 -13840 -16238 -31743 -23592 6284 9142 -18319 -28337 -13509 -11323
876 -11323 -21720 -10674 6569 -6705 -29195 -17683 3957 -3993 -20141 -8925 4434 -9343
888 -9343 -20567 -6204 1900 -13222 -15418 7699 13662 -9666 -21484 -7649 -445 -5798 1376
901 1376 14227 3917 -16235 -11516 8076 10062 -1541 -864 5365 621 -3191 6165 14004 5638
915 5638 -2391 4642 13526 7947 -1340 1240 10680 13146 11778 14507 13026 2214 -3096 9091 22479
930 22479 19233 8381 7392 12173 10875 11357 19001 20014 7566 3049 16104 23643 14979 9282 16251
945A6251K815o944J081O880n077j0290O129J6117j113j3091k649M985k472p87
959A1835R216L516j2047p815R716R047m706o329J991j037m213M142P967l059r352
974H872L44P813J214n436l376l60k01K083O049J694p297p114J400N824K950l308
990A1151m220k091J102L073L410k39n581n765O44N843K094l939l704P01K121Q69
1006E469J586k072o695l887M947P079n64n613k821j45R38K632J909l483o909j015
1022h644O214N154k539m625k800l11J375L402N98n169m207J541N807K638k821
1037d387m995l721M21M046L629r68m860l511K013M981J645l343n014k272K056
1052a4280M601K928k269n449k461L234M458O61l641m262r72L164M543J801l736
$$ plain form
945 16251 19066 12122 13203 20083 15006 4716 10845 26962 25849 12758 10109 15094 12622 11835
959 11835 21051 24567 12520 4705 14421 23468 18762 12433 14424 13387 9174 13316 21283 18224 8872
974 8872 9216 17029 18243 12807 9431 9071 8870 10953 17002 18696 11399 4285 5685 11509 14459 11151
990 11151 6931 4840 5942 9015 12425 12186 6605 840 1484 7327 9421 5482 1778 2479 4600 5469
1006 5469 7055 4983 -1712 -5599 -652 6427 5863 250 -2571 -2716 -1778 854 2763 -720 -7629 -8644
1022 -8644 -2430 2724 185 -4440 -7240 -7551 -6176 -2774 -2176 -7345 -11552 -10011 -4204 -1566 -4387
1037 -4387 -9382 -13103 -12682 -8636 -5007 -5975 -10835 -14346 -12333 -7352 -5707 -9050 -14064 -16336 -14280
1052 -14280 -9679 -6751 -9020 -14469 -16930 -13696 -9238 -8577 -12218 -16480 -17452 -14288 -9745 -7944 -11680
1067a1680n459r61M028L596l29k514l432l6L879M423k53n769l589J077M146L608
1083i265j75l576l003M33M518L186k005m436k148K119M939K647j262l741k635
1098a4404K465L914J757j852l868q49L192M741K090l623l769n39K365L745K472
1113b163k313l897K80M543L646q89l223k219m90K994N252J451m017l457K223N035
1129B756R40j610j779k143K29M389N771j283n979j574L899L862o6n11j949k668
1145B284J188O289M694m115o052K8M023K157K75Q94k073l185K001O541J612n959
1161A0602n017L271M907Q55l80l67k743l185L942P392l53q076l823M101M213L5
1177A5374P46P62m952m989M956P450k759p677P20O450l84l504J840O15n757j641
$$ plain form
1067 -11680 -17139 -18100 -14072 -10476 -10805 -13319 -16751 -16787 -12908 -8485 -8738 -14507 -18096 -17019 -12873 -9265
1083 -9265 -9440 -13016 -16019 -15586 -11068 -7882 -9887 -14323 -16471 -14352 -9413 -6766 -8028 -11769 -14404
1098 -14404 -11939 -8025 -6268 -8120 -11988 -12837 -9645 -4904 -2814 -6437 -10206 -10745 -8380 -4635 -2163
1113 -2163 -4476 -8373 -8093 -3550 96 -793 -4016 -6235 -6725 -3731 1521 2972 -1045 -4502 -2279 2756
1129 2756 3696 2086 307 -1836 -1607 2782 8553 7270 1291 -283 3616 7478 7412 6901 4952 2284
1145 2284 3472 9761 14455 10340 4288 4316 8339 10496 10771 11665 9592 6407 8408 14949 16561 10602
1161 10602 5585 8856 13763 14618 14238 13871 11128 7943 11885 19277 18924 10848 7025 11126 15339 15374
1177 15374 16120 16882 11930 6941 11897 19347 16588 8911 9631 16081 15697 12193 14033 14648 8891 7250
1193G250Q525M943q429p954M053N741j555q08L346l596r351Q83J1504K956r090
1208H418l765M798K79n609J936N712l790p430M439R057n101j1522J526Q914p10
1223G152m456K150J238r411m414J1993R120q815j0480K772M192n101nR801L97
1238F133j2324l779J0721K367j1846k256J1164J907q992p44O553n251r699Q318
1252g728J4085n595j5656o43R002r01k942Q748M122j3862j1657J0085J1837n793
1266f898p179P030M138j0061m871R565L063r650o79J2953J924j5308o364J1203
1280a1134O098n029R38P045p574j6705L863K0760L999j3216l311O593m708r275
1294b1656R506J4337o306j4102O123J0993r418j1715J1202J3783q122q932Q084
$$ plain form
1193 7250 15775 20718 12289 4335 8388 14129 12574 11766 15112 11516 2165 3048 14552 17508 8418
1208 8418 4653 9451 9730 4121 6057 11769 7979 549 4988 14045 8944 -2578 -1052 7862 7152
1223 7152 2696 4846 6084 -3327 -7741 4252 13372 4557 -5923 -3151 1041 -4060 -4065 5736 6133
1238 6133 -6191 -9970 751 3118 -8728 -10984 180 2087 -6905 -7649 -1096 -6347 -16046 -7728
1252 -7728 6357 762 -14894 -15537 -6535 -7436 -10378 -1630 2492 -11370 -23027 -12942 -1105 -6898
1266 -6898 -14077 -7047 -2909 -12970 -17841 -8276 -5213 -14863 -15542 -2589 -665 -15973 -22337 -11134
1280 -11134 -5036 -10065 -9127 -2082 -9656 -26361 -22498 -1738 2261 -10955 -14266 -7673 -12381 -21656
1294 -21656 -12150 2187 -4119 -18221 -12098 -1105 -10523 -22238 -11036 2747 -5375 -14307 -6223
1307f223K685j5623l249K2258J1069j6437j2454Q218K393r125O895J9361k993
1320F775k2123k950J5460R59j0189O418J3917p324j5393M990J1349o608q270J3645
1334F56J3319j2350j7167N050J1896k927j000J2871K502j9822j2703J4807J5523
1347A0655n008m990P230q20j6053k657J7943O890j2083l109J3272q83j8113j455
1361i181J9002N731j1326j71R671r854j8376J0434K5879K85j8444j820P315r856
1375g11p858J8820J7687j4453j8441R402J0670j2073o890J8513J0090j7059r626
1388a929J3233K673j6208J069K4241M730k2303q898J1313L65q591J1801J9036
1401C0532j0473k5732J008J8067M11r081R193R837j4391j6324J0631J5402q113
$$ plain form
1307 -6223 -3538 -19161 -22410 -152 10917 -5520 -17974 -9756 -7363 -16488 -9593 9768 6775
1320 6775 -15348 -18298 -2838 -1879 -12068 -5650 8267 943 -14450 -9460 1889 -4719 -12989 656
1334 656 13975 1625 -15542 -10492 1404 -1523 -2523 10348 12850 -6972 -19675 -4868 10655
1347 10655 5647 657 7887 7067 -8986 -11643 6300 13190 1107 -2002 11270 10387 -7726 -9181
1361 -9181 9821 15552 4226 4055 13726 3872 -14504 -4070 21809 22094 3650 1830 9145 -711
1375 -711 -8569 10251 27938 13485 -4956 4446 15116 3043 -3847 14666 24756 7697 -1929
1388 -1929 11304 13977 -2231 -1162 23079 27809 5506 -3392 7921 8286 -305 11496 30532
1401 30532 20059 -5673 -4665 13402 13813 4732 13925 23762 9371 -6953 3678 19080 10967
1414A0967r268J2174Q733j6130j3906J1176J1506o971j921J3360j339k3062p852
1427a2533K0209J2613r713n091Q109n581j7622L982K1791L214j8107k964J2191
1440A0498m008j5033N880J7534l261j4342L970R014j1751j3749J4152J9338p724
1453A0518j6302L641N007j2122l494K0743J0839j9402j5029J0999P979j1382r06
1466h911J6439P55j9385l797J5632L89j4302L666J7871l833j8837l87J1570l693
1480f823p717J2530J2327j3866j8963N596J4583k324n694Q114L320j4810q226
1493b1953J3351J0097q790o723Q691L228j1817m468J0790N457q611j98J0067k322
1507c201j5737k236J5001P178q215k617M940m756j0647O155J6537r14j4533j342
$$ plain form
1414 10967 1699 13873 22606 6476 -7430 3746 15252 8281 6360 19720 18381 -4681 -12533
1427 -12533 7676 20289 10576 5485 13594 8013 -9609 -5627 16164 19378 1271 -1693 10498
1440 10498 6490 -8543 -2663 14871 11610 -2732 1238 10252 -1499 -15248 -1096 18242 10518
1453 10518 -5784 -2143 2864 -9258 -12752 7991 18830 -572 -15601 -4602 3377 -8005 -8911
1466 -8911 7528 8283 -11102 -14899 733 1122 -13180 -9514 8357 4524 -14313 -14700 -3130 -6823
1480 -6823 -14540 -2010 10317 -3549 -22512 -16916 -2333 -4657 -10351 -2237 1083 -13727 -21953
1493 -21953 -8602 1495 -7295 -14018 -5327 -2099 -13916 -18384 -7594 -2137 -10748 -10946 -879 -3201
1507 -3201 -18938 -21174 -6173 1005 -7210 -9827 -4887 -9643 -20290 -14135 2402 1488 -13045 -14387
1521a4387R833k749p724P001J0806p248j0730O912Q769q840q690J0876J1158p599
1535b612q827N844K848r804L56J6217M344j5059p407R275M373o400K701R958m405
1550A402j2626K653J2124r76r315K977R304l989q299L463O895m217m559Q195P165
1565A0197q764r927M972P894j153k093N043M55r386l278J0182O531o922n171N146
1580C726K334n257o02P135O44p019LP834n03q960n36Q431K409m632K76L251m940
1597C594o096O086R448k632q879O79N397j842k253M570K810o873m527O427N183
1612A1092n056l975M393L082l456j971L684o73n700J170Q525R03p661k771L954
1627E540R82j934K050L182m517n597L591O835j382n398L70K430j424j660L341
$$ plain form
1521 -14387 -4554 -7303 -15027 -8026 2780 -4468 -15198 -8286 483 -8357 -17047 -6171 4987 -2612
1535 -2612 -11439 -5595 -2747 -12551 -12195 4022 8366 -6693 -14100 -4825 -452 -6852 -4151 5807 1402
1550 1402 -11224 -8571 3553 2577 -6738 -3761 5543 1554 -6745 -3282 3613 -604 -5163 3032 10197
1565 10197 1433 -8494 -3522 4372 3219 1126 6169 6624 -2762 -6040 4142 10673 3751 -1420 3726
1580 3726 6060 803 201 7336 7980 961 964 8798 8295 -665 -1201 7230 9639 5007 5283 8534 3594
1597 3594 -2502 3584 13032 10400 1521 2200 7597 5755 3502 8072 10882 4009 -518 5909 11092
1612 11092 6036 2061 6454 9536 6080 4109 7793 7120 1420 2590 11115 12018 4357 1586 5540
1627 5540 6522 4588 6638 9820 5303 -294 3297 10132 8750 3352 3722 6152 4728 3068 6409
1642F409J268m518j977M775L381m405l735J613J856p07Q69K193k025n211J26N673
1658E585J366l411k206O23J15J94J493J274k966l536J529L518L99k889j210Q68
1674G46L62P5J117m66k705k562K619L801q66l200j252R90L09K03J704r93l604
1691c722j011L723K075j963j992o25L80l19J331J212k332k765J141L316M27k156
1707c280j331o31j32J200J867J1l486j418K302K076k34j879j286j154R69K240
1723d166J289j773k159n48J674J415M90j434k078o97J989K281L4j640j965m9J633
1740e704J796J0j915j528P42J670J390k73j424j864K44K217J752o16k128l73N71
1757e433J966R01m86j976j392J346K400J141j121j517n64P68J780J400j164k237
$$ plain form
1642 6409 7677 3159 1182 5957 9338 4933 1198 2811 4667 3960 4829 7022 4997 -214 -88 5585
1658 5585 6951 3540 1334 1957 2072 2266 3759 5033 2067 -1469 60 3578 3977 1088 -122 746
1674 746 1108 1183 2300 1834 -871 -3433 -814 2987 2121 -1079 -2331 -1341 -1032 -829 875 -118 -3722
1691 -3722 -4733 -1010 1065 -898 -2890 -3515 -3135 -3454 -2123 -911 -3243 -6008 -4867 -1551 -1124 -3280
1707 -3280 -4611 -5242 -5374 -4174 -2307 -2296 -5782 -7200 -4898 -2822 -3056 -4935 -6221 -7375 -6406 -4166
1723 -4166 -2877 -4650 -6809 -7357 -5683 -4268 -3778 -5212 -7290 -7987 -5998 -3717 -3683 -5323 -7288 -7337 -5704
1740 -5704 -3908 -3898 -5813 -7341 -6599 -4929 -3539 -3812 -5236 -7100 -6856 -4639 -2887 -3503 -5631 -6004 -5433
1757 -5433 -3467 -2566 -3052 -5028 -6420 -5074 -2674 -1533 -2654 -4171 -4735 -3967 -2187 -787 -1951 -4188
1773d188n20J941K218J66j517q30k69J266J990P98j641k183M52K652J043o59r95
1790b76q86k8Q18K966P0k097j936J558K457J37r91l30j078N7J795K466n95l420
1808F87j037K652J792k78l86l62j587O4K883J732j625l299J38K373R47n53p8r8
1826C965j281J13K497J011k953k474J837K932k66j047qo83j604Q77L887j1l881
1843B911k255K660K411j238k59R19j848k414J767L762j329m039L62L697J35k530
1859B712K85J094j959j568M102K499l890m338J894M020q38j543J832q02m569l86
1875a455O175K133m754l052L189J549l081m51L665o72m086J570M624j508o569
1890b723O22N630N98l730N88J937l743l774N637N890l939o505J638L989k184j871
$$ plain form
1773 -4188 -4708 -2767 -549 -383 -1900 -2730 -2999 -1733 257 1055 -586 -2769 -2317 335 1378 719 -276
1790 -276 -1162 -1190 -372 2594 2664 567 -1369 189 2646 2783 1792 1462 384 441 2236 4702 4107 687
1808 687 -350 2302 4094 3816 3430 3068 1481 1545 4428 6160 4535 1236 1374 3747 4694 4141 4063 3965
1826 3965 2684 2797 5294 6305 3352 878 2715 5647 5381 4334 4326 3643 2039 2916 6803 6792 2911
1843 2911 656 3316 5727 4489 4230 5149 3301 887 2654 6416 5087 1048 1410 5107 5242 2712
1859 2712 2997 4091 2132 564 4666 7165 3275 -1063 831 4851 4013 2470 4302 3500 -1069 -1455
1875 -1455 4720 6853 2099 -953 2236 3785 704 253 3918 3246 -840 730 5354 3846 -2723
1890 -2723 -2101 3529 4127 397 985 2922 -821 -4595 1042 6932 2993 -3512 -1874 2115 -69 -1940
1906a940M774K037o285l077N231K863n736k270N902K604n296j835L576o09n267
1921e328K488Q047p75r131j874O476R40l748K778M452n246p771L770Q147k292
1936I33n695K911M225m551n264M714M811n124l122P095L529r126n452P337N714
1951B935m778j876N194j485r881J33J1706L181r076k485N939j957p266M084R400
1966C768k632r002K766P233m815p971N520R625m155p269L263M017p442m131J0996
1981b29P737q976q694M873M120n347J35J0927Q65j2762l749R909K824p831N69
1996e629J0013j465j1314O06Q794j782p095N579J0083n959j2573K306R623j100
2010H7m026O766M247j1271q819R392J0373m899n540N895J841r931l623J1196N728
$$ plain form
1906 -1940 2834 4871 -1414 -4491 740 3603 -2133 -4403 1499 4103 -1193 -3028 548 -61 -5328
1921 -5328 -2840 5207 4432 -4699 -6573 -97 843 -2905 -127 4325 -921 -8692 -4922 3225 933
1936 933 -4762 -1851 2374 -2177 -7441 -2727 2084 -3040 -6162 933 4462 -4664 -10116 -2779 2935
1951 2935 -1843 -3719 1475 -10 -9891 -9758 1948 5129 -3947 -6432 -493 -2450 -9716 -5632 3768
1966 3768 1136 -7866 -5100 2133 -2682 -10653 -5133 4492 337 -6932 -3669 348 -7094 -11225 -229
1981 -229 7508 -1468 -10162 -5289 -1169 -6516 -6381 4546 5411 -7351 -11100 -1191 1633 -6198 -5629
1996 -5629 4384 2919 -8395 -7789 1005 -777 -7872 -2293 7790 1831 -10742 -8436 1187 87
2010 87 -3939 2827 7074 -4197 -13016 -3624 6749 1850 -3690 2205 4046 -5885 -9508 1688 7416
2025G416q716k911Q669O27j1814j479J1952L546p419m17O464n079j0498M757J5253
2040A0351l26j1309o81N672m799n669R328J0551p264j0993M406O987o190n006
2054d942R643P285q924o907O489L371q641p39J2969L793j2702o065P218K219n572
2069a505L604J0994l463j4605j368J1331J411o115L394O560n967j0294M191R599
2083G767k907o178N595O425q498q985N626Q608l712l028O810R19j1418n863J0689
2098A850Q884n694n246M582m43q991k44J2046L315r301l545O970o03q787J856
2113c351J0428M44q624L17N852m541q527N694J2294k501j0666N09N228m849l595
2128e888R543P546r013r914M918O444m591l084Q422L336j0180m599P693L219p936
$$ plain form
2025 7416 -1300 -4211 4458 5085 -6729 -8208 3744 7290 -129 -546 5918 839 -9659 -4902 10351
2040 10351 10025 -1284 -1965 3707 -1092 -6761 2567 13118 5854 -5139 -733 6254 64 -4942
2054 -4942 4701 11986 3062 -3845 2644 6015 -2626 -3365 9604 13397 695 -5370 1848 4067 -1505
2069 -1505 2099 13093 9630 -4975 -6343 4988 6399 284 3678 10238 4271 -6023 -1832 7767
2083 7767 4860 -1318 4277 10702 2204 -6781 -1155 7453 3741 713 7523 8442 -2976 -8839 1850
2098 1850 10734 5040 -206 4376 3933 -5058 -5302 6744 10059 758 -2787 4183 3580 -5207 -3351
2113 -3351 7077 7521 -1103 -786 5066 525 -8002 -2308 9986 7485 -3181 -2672 2556 -2293 -5888
2128 -5888 3655 11201 2188 -7726 -2808 3636 -955 -4039 4383 7719 -2461 -7060 633 3852 -4084
2143d084k24R965J372j0823l344P635R29n464L672Q342m827j2106O37J0810N26
2158C016n625L167M389p038p512O412Q386l914o428M797M579o731o041O931N555
2173C943n043k715O036O13r195l036R545N166n714l270M207j417p449K682J0400
2188D753K0r180j722O879j178n848K919P531k789p981K781N934m094o134N485
2203b624P631m240p229K830L690m745k126Q559M030q912n967N984M590m608r09
2218d046O457k41q465j158Q088Q59o789R87O816j629o945J183N425j919l944M739
2234e82N065n604o798L811N874k146k400L494R50o360j994O645L566m235l049
2249c763L331J394l873n87M584N45m167O94M070m09n313j92N235J042k885k24
$$ plain form
2143 -4084 -4308 5657 7029 -3794 -7138 497 1426 -4038 -366 7976 3149 -8957 -8320 2490 3016
2158 3016 -2609 558 4947 -2091 -9603 -3191 5195 1281 -5147 -350 4229 -2502 -8543 -1612 3943
2173 3943 -1100 -3815 2221 2834 -6361 -9397 148 5314 -400 -3670 537 -880 -8329 -5647 4753
2188 4753 4773 -4407 -6129 750 -428 -6276 -3357 4174 1385 -6596 -3815 2119 -1975 -8109 -2624
2203 -2624 5007 767 -6462 -3632 58 -4687 -6813 1746 5776 -3136 -9103 -3119 1471 -3137 -4046
2218 -4046 2411 2170 -6295 -7453 635 1494 -5295 -4308 2508 879 -6066 -4883 542 -1377 -5321 -582
2234 -582 4483 -1121 -7919 -4108 1766 -380 -2780 714 1664 -4696 -6690 -45 3521 -714 -3763
2249 -3763 -432 962 -2911 -3498 1086 1631 -2536 -1842 2228 1819 -3494 -3686 1549 2591 -294 -518
2265e18J955k392k533L291N151j282n210l78L385o72j416K632J963l379k846L769
2281A520L098l156k963L133K670k338j803K613J72l576L78N276L50m857j230L134
2297B421O33j518J720J733k222l897K282L892p29l402J024J345r28j039J958R18
2313D191k663p64K986J182k483j296R80O59m53O70J146j798j929Q11K248O53j305
2330B835j392P8J53N32M79N4p48j018N8J394M38j254j257N54Q64J83m85L6o80
2349H24j174R83J906j72k191r57J041J197k66j19J22j759j133J640J762j221j795
2366a312K61J070l85J10J034j169j764J68K525J91j811p15P64q9J70Q69J92j961
2384a852j129J590J012q7p92n65n27N04J059J82r26j085m45J262P40K23r01p13
$$ plain form
2265 -518 1437 -955 -3488 -197 4954 3672 -1538 -1916 1469 797 -619 2013 3976 597 -2249 1520
2281 1520 4618 1462 -1501 1632 4302 1964 161 2774 2946 -630 -252 5024 5374 517 -713 2421
2297 2421 3054 1536 3256 4989 2767 -1130 1152 5044 4315 913 1937 3282 2354 1315 3273 4191
2313 4191 1528 764 3750 4932 2449 1153 2133 2792 2339 3009 4155 2357 428 1239 3487 4140 2835
2330 2835 1443 1521 1674 2206 2685 2739 1991 973 1031 2425 2863 1609 352 906 1770 1953 1468 1504 824
2349 824 -350 633 2539 2367 176 -781 260 1457 1191 1072 1194 -565 -1698 -58 1704 483 -1312
2366 -1312 -1051 19 -366 -256 778 -391 -2155 -1987 538 729 -1082 -1797 -1033 -1122 -952 -83 109 -1852
2384 -1852 -2981 -1391 -379 -466 -1258 -1823 -2350 -1846 -787 -605 -1531 -2616 -3061 -1799 -1059 -836 -1737 -2450
2402b450m39J511O43o6j039r09j11O59J346M7j207r59M65J135J94k05o23n93l74
2421b975J378J007r13j003j74Q67K43M57J24j441p01O57J767J45j572R8l33R34
2439a435J31R90o22j537k41J539P07N5j201k67M5L46J029N06q13j501K40J618
2457d11M83n53p64L24m76L75J042j31o35j253P51J227N8l21o36k84L61J044N10
2476G11j99j502p24J432J451l54j032m59L45k45P63J526o21j546o84J890Q92p73
2494H71o37K01P4l86J003J020j157j743O20K271L22j686j19L67l60N1J934L25
2512B971j860j847J574J918q06o98R67m22j399O13K295k21k386k53K385L99j879
2529A351j03J278o50j128J919J561j678k954J295K857m1k012N49M63j738r61K929
$$ plain form
2402 -2450 -2889 -1378 -735 -801 -1840 -2749 -2860 -2201 -855 -808 -2015 -2974 -2509 -1374 -1180 -1385 -2008 -2601 -2975
2421 -2975 -1597 -590 -1503 -2506 -2680 -1813 -1570 -1113 -989 -2430 -3131 -2474 -707 -562 -2134 -2036 -2369 -1435
2439 -1435 -1304 -314 -936 -2473 -2714 -1175 -468 -413 -1614 -1881 -1836 -1490 -461 45 -768 -2269 -2029 -411
2457 -411 72 -481 -1245 -921 -1397 -1022 20 -111 -746 -1999 -1248 -21 37 -284 -920 -1204 -843 201 711
2476 711 512 -990 -1714 -282 1169 815 -217 -676 -331 -576 187 1713 1092 -454 -1138 752 1644 871
2494 871 234 435 509 123 1126 2146 989 -754 -134 2137 2459 773 654 1021 661 712 2646 2971
2512 2971 1111 -736 838 2756 1950 1252 2219 1797 398 1011 3306 3085 699 446 2831 3230 1351
2529 1351 1248 2526 1876 748 2667 4228 2550 -404 891 3748 3707 1695 2244 2707 969 8 2937
2546B937J727k704k046J775J871k053o75K112L88k447R1K514j67l578m74L817
2562C088R10k710m75J607j451k243K380M045k278m102M25K769r33j506J976J617
2578C119k818k033K360K348k871k200L182K007k996k176K104O00k669O10M229
2593B796N1n445j777L985J321k238M94K900k801m180J688M509l64l864J068K967
2609A110k219l598K104L313j942k306K861K087m129l644L857L432j767j992K399
2624d34l48m494l74N787K361m606k435K975K91l706J271M921o34m935N50L736
2640g4j280m417K420N010j151m196N78K524k703k288M854M491m184n395J988L070
2656g53j695r18N004R44n283l486M480K983l139j116M407P33n278j118M024Q00
$$ plain form
2546 2937 4664 1960 -86 1689 3560 1507 832 2944 3332 885 976 3490 3323 -255 -729 3088
2562 3088 3998 1288 813 2420 969 -1274 1106 5151 2873 -1229 -804 1965 1032 -474 1502 3119
2578 3119 301 -1732 628 2976 105 -2095 1087 3094 98 -2078 26 626 -2043 -1433 2796
2593 2796 2847 -2598 -4375 -390 931 -1307 -813 2087 -714 -4894 -3206 1303 939 -2925 -1857 1110
2609 1110 -1109 -4707 -2603 710 -1232 -3538 -677 1410 -2719 -6363 -2506 926 -841 -2833 -434
2624 -434 -782 -5276 -5650 137 2498 -2108 -4543 -1568 -1277 -4983 -3712 1209 575 -4360 -3810 -74
2640 -74 -1354 -5771 -3351 1659 508 -3688 -3110 -586 -3289 -5577 -723 3768 -416 -5811 -3823 -753
2656 -753 -2448 -3366 1638 2582 -2701 -6187 -1707 1276 -1863 -2979 1428 2161 -3117 -4235 -211 589
2672E89k896J182M701j791o616m6N235J312k439J502K511m305m945L245O342m63
2688C118m468J338K231l269k808M075M161k993l328L295J567m812k601N701M058
2703E265l601k619K686K61n494K35Q028J970o341l337M005N7l481K163O678j797
2719D678p194J78N078r97m078L227N683l196o124J619L949k459l000N999M284
2734G647o016n962L110M233k073r90N306J07o966l597O531L680m178r29M757r71
2750C689o624j83O257J232n032J088M640k151o917J224O736j02l688J624K984
2765D777n191n039M618P447k035n477J790K146m504k364O178M396m955m444M276
2780A619J915n634j240O813K812o178k489M629k33o126J875Q286j79p476j423
$$ plain form
2672 589 -2307 -1125 3576 1785 -4831 -4877 358 1670 -769 733 3244 -1061 -6006 -2761 3581 3118
2688 3118 -1350 -12 2219 -1050 -3858 217 4378 1385 -1943 1352 2919 -1893 -4494 1207 5265
2703 5265 1664 -955 1731 1992 -3502 -3267 4761 6731 390 -2947 1058 1115 -2366 -203 6475 4678
2719 4678 -2516 -2338 2740 1743 -2335 892 6575 3379 -2745 -1126 2823 364 -2636 3363 7647
2734 7647 1631 -4331 -1221 3012 939 -51 5255 5362 -1604 -5201 1330 5010 832 -97 4660 3689
2750 3689 -2935 -3118 3139 4371 -661 427 5067 2916 -4001 -2777 3959 3857 169 1793 4777
2765 4777 -414 -5453 -835 6612 4577 -900 890 3036 -1468 -3832 2346 6742 1787 -2657 1619
2780 1619 3534 -2100 -3340 3473 6285 107 -2382 2247 2014 -4112 -2237 6049 5870 -1606 -3029
2795c029M681j198l637M208O062m476p574K317N947k699l590M529L540n362m681
2810d962M360L634m124j922N783J929o577l577M804K752l760N82N184j684p432
2825e010j59O486J569m345L83L291k675n264K535O249j618m613K050L542l524
2840a103m347K941M724k194l140K970J531m800k956N752M012l605l219K221M93
2855g20l900P10N726J238n710j816L838K83l633Q50M684l70m885O31L408j552
2871a218l775K811M677j795m654O47K655j505j615M065L117m894l902K975K875
2886D64j253j482L144O66m341j087L662J676l304n24L655j68l649l81L369%j889
2903a442J143K657j828m321J423L552K26j966N54R75j789j539K059L141j732k509
$$ plain form
2795 -3029 1652 454 -3183 1025 7087 2611 -4963 -2646 3301 602 -2988 1541 5081 -281 -4962
2810 -4962 -602 3032 -1092 -3014 2769 4698 -1879 -5456 -652 2100 -1660 -1078 4106 2422 -5010
2825 -5010 -5169 1317 2886 -1459 -1076 2215 -460 -5724 -3189 3060 1442 -3171 -1121 2421 -1103
2840 -1103 -5450 -2509 2215 21 -3119 -149 1382 -3418 -6374 -622 3390 -215 -3434 -1213 -720
2855 -720 -4620 -3910 1816 3054 -2656 -4472 -634 -351 -3984 -3134 1550 1180 -3705 -3074 334 -1218
2871 -1218 -4993 -2182 2495 700 -3954 -3307 -652 -2157 -3772 293 3410 -1484 -5386 -2411 464
2886 464 -789 -2271 873 1539 -2802 -3889 -227 1449 -1855 -2379 1276 1108 -2541 -2922 447 447 -1442
2903 -1442 -299 2358 530 -3791 -2368 1184 1410 -556 -2 973 -816 -2355 -296 2845 1113 -1396
2919a396N58K000j195j319K095J572j585j352J831O19k136j343K829J821j683
2934A316j698J160L18j505L60L138K58l413q45K030Q10j646O25K068j370k257
2950f51P75K422r78k203J313K061q82j975R36J180j462n90K320R75k959j585J983
2967F80J674j273l34J037m33j741K08K176P1j591r6P95J36j076L29Q08o16q17
2985f3P64J276j035j178m2J369N12j005m8L21o93m51R28J021n19j857Q0J441k
3004H19p98Q43k05p85o35J466O26j204j021R41J004n35n96N50J01j178M45J163
3022A001Lj262l98J231k4n66M12J71r14j122J620R69m19j717R05K61p1j55M09
3041C34k17r64k7J256N32r50n02J67O54n68L86P1o70n74P61O33o1m72k88O4K54
$$ plain form
2919 -1396 -838 1162 -33 -1352 743 2315 730 -622 1209 1828 -308 -1651 1178 2999 1316
2934 1316 -382 778 1096 -409 -49 3089 3347 -66 -911 1119 1929 283 908 2976 1606 -651
2950 -651 124 2546 1568 -635 678 2739 1857 -118 818 1998 536 -54 2266 3241 282 -1303 680
2967 680 2354 1081 747 1784 1351 -390 -182 1994 2065 474 378 1173 1309 233 562 1370 754 -63
2985 -63 701 1977 942 -236 -278 1091 1603 598 550 871 178 -273 655 1676 1157 -700 -620 821 819
3004 819 21 864 659 -126 -761 705 1331 127 -894 47 1051 516 -80 470 571 -607 -162 1001
3022 1001 1004 -258 -656 575 551 -15 397 568 -346 -1468 152 1121 702 -1015 -110 151 80 -75 334
3041 334 117 -847 -874 382 914 -36 -538 -371 283 -285 101 172 -498 -1072 -311 322 261 -211 -499 -435 -181
3062a81p1M17k29o38n85P87O89k33o78l18J50N90M83k93o32j88J54L45O12j76
3082Eo95o84M35M63R6l07k17l20JL85P31k67j103J51O77R6j94L0k47m01K35P50
3104c80P4p20n15O61J76k40L4l4l75m97R10O55l81r17L34J01J07K06L64k53p64
3125a454J31J117j20k36n53J54L4P2Q26J20r21m10O97K63J05l23J47l63Q5M78
3145a51K57j69n42l04P35L52K09r06n6K27J99K24Q04k57p64j29M53R49m33q29
3165a31M49L25l26L0P59j0j246K86J248K9p33k86J29M39o50R13O89j185j034P90
3185D85J739p53q10M99K91o72j38J016J11j339m94J423O01j022p27J429l10q97
3203D32M53J168q80j377K46K087j42j407K65L29q08m38J251J262j160j582Q60
$$ plain form
3062 -181 -252 165 -64 -702 -1287 -500 189 -44 -722 -1040 -890 -300 183 -110 -742 -930 -776 -431 181 5
3082 5 -690 -1374 -939 -476 -380 -687 -904 -1224 -1223 -838 -107 -374 -1477 -1326 -649 -553 -747 -717 -964 -1365 -1130 -380
3104 -380 -306 -1026 -1541 -880 -704 -944 -910 -944 -1319 -1816 -906 -251 -632 -1549 -1215 -1114 -1007 -801 -437 -690 -1454
3125 -1454 -1323 -206 -326 -562 -1115 -961 -927 -855 -29 91 -830 -1240 -543 -280 -175 -498 -351 -714 -629 -151
3145 -151 106 -63 -605 -909 -174 178 387 -519 -575 -348 -149 75 879 622 -142 -271 182 1131 698 -131
3165 -131 318 643 317 347 1106 1096 -150 136 1384 1413 680 394 523 962 312 1225 1914 729 -305 485
3185 485 2224 1471 661 1160 1451 779 641 1657 1768 429 -65 1358 1959 937 210 1639 1329 432
3203 432 885 2053 1173 -204 42 2129 1987 580 845 1174 366 -72 1179 2441 1281 -301 559
3220E59J086j035p69P72Q24r67l60J307P7k069l20J926J160j229j092M84k6q09
3238d81P23J650n14k050m25J808L6r85J28J617p71j875O99J507p02j893J377K037
3256A886j205k046L30J605j138l06J818R34k741j711K053J773j210q41J722k08
3272G15k388l56K819O27k310m53K252k13k756M62K563k8k103O65J711j453k666
3289b912J280L139l62k055L71R85j774j142K525K446k371k055J045J198j519p99
3305b000K907Q68k537j468K022J047k844k60L769M39l231r48J940K77k129J008
3321a140L425j031m120O0L157j16j798J397K501k357l581J756L219j384k373K422
3337C7K110l032k703K228K598k414q32L134J198m927j593L837K403k968m80K408
$$ plain form
3220 559 1645 610 -159 613 1437 470 110 1417 1494 -575 -895 1031 2191 962 -130 354 328 -481
3238 -481 242 1892 1378 -672 -1097 711 747 -238 -110 1507 736 -1139 -440 1067 365 -1528 -151 1886
3256 1886 681 -1365 -1035 570 -568 -874 944 1878 -863 -2574 -521 1252 42 -799 923 715
3272 715 -1673 -2029 790 1417 -893 -1346 906 693 -2063 -1601 962 934 -1169 -504 1207 -246 -2912
3289 -2912 -1632 1507 1145 -910 -539 446 -1328 -2470 55 2501 130 -1925 -880 318 -1201 -2000
3305 -2000 907 1775 -762 -2230 -208 839 -2005 -2265 1504 1943 -1288 -2236 -296 -19 -2148 -1140
3321 -1140 2285 1254 -2866 -2806 351 235 -1563 -166 2335 -22 -3603 -1847 1372 -12 -2385 37
3337 37 2147 -885 -3588 -1360 1238 -1176 -2008 1126 2324 -2603 -4196 -359 2044 -924 -1404 1004
3353A004r37l904M92M896O33l374o96K912j512l298J871M233j033l440J447K533
3369A827k766l126L109L798j729l542J745J603l042j281M566K888m319k773K680
3384c62J323k734k1M711K42m883j266L885O49l639P65M805j076m599K51L468r80
3401E39k649K801L796l162m731J940L543j229j546K951J302m304k868L746L324
3416C453k660j436K955O67m434j179M285J708k860q53L443m85m748k27M912Q21
3432C362l022L22K456k100l996K559M660r99l776M29K453k308k390L553L345k585
3448A963l291K391J707l123j718L896K765l331k600K402P59l134l49N128P47m964
3464g52j450L181J28k398J400M017j639n084M99L762l62l159K106L018k250l687
$$ plain form
3353 1004 67 -3837 -3345 1551 2184 -1190 -1886 1026 -486 -3784 -1913 2320 1287 -2153 -706 1827
3369 1827 -939 -4065 -956 2842 1113 -2429 -684 919 -2123 -3404 1162 4050 -269 -3042 -362
3384 -362 961 -1773 -1794 2917 3159 -1724 -2990 895 1544 -2095 -1330 3475 2399 -2200 -1949 1519 539
3401 539 -2110 691 4487 1325 -3406 -1466 2077 848 -698 2253 3555 -749 -3617 129 3453
3416 3453 793 -643 2312 2979 -1455 -2634 1651 3359 499 -354 3089 2604 -2144 -2371 2541 3362
3432 3362 340 662 3118 1018 -2978 -419 4241 3242 -534 -105 2348 40 -2350 1203 4548 1963
3448 1963 -1328 1063 2770 -353 -2071 1825 4590 1259 -1341 1061 1820 -1314 -1663 3465 4212 -752
3464 -752 -2202 979 1107 -1291 109 4126 2487 -2597 -2098 1664 1302 -1857 249 3267 1017 -2670
3480b670J472L131j674k126K913K108l534l333K407L152j754j041K919J35m253
3495b148j737L944K135k313j177K222n36l308K67L907O49l488jK887r83l394J054
3512b020L740n41k737O36J618j875k448K362L563j301l082Q47J680k067j614L525
3528B86K388l136k832K277J614k293m76K918J068l136j364K814J82k595N89L374
3544A678O8l912n33K903l00j890J889K379k114l371J559K592n80j719J447J402
3560A498k375j905K244J971j812r62J894R69k858j194K426J261j487m34J712k75
3576F73k663j68K586J031j756n86J489p12j611O10K242l3k394Q3K127r39j298
3593a319P40J708m80j942Q32J673j650j405J815J719j075k143J031J135j273k77
$$ plain form
3480 -2670 -1198 1933 259 -1867 1046 3154 -380 -3713 -1306 1846 92 -949 1970 2105 -2148
3495 -2148 -3885 59 2194 -119 -1296 926 390 -2918 -2651 1256 1905 -1583 -1584 1303 320 -3074 -2020
3512 -2020 1720 1179 -1558 -922 696 -1179 -3627 -1265 2298 997 -2085 -1238 442 -1625 -3239 286
3528 286 2674 -462 -3294 -1017 597 -1696 -2172 746 1814 -1322 -2686 128 310 -2285 -1696 1678
3544 1678 1746 -2166 -2699 204 -96 -1986 -97 2282 168 -3203 -1644 948 368 -1351 96 1498
3560 1498 -877 -2782 -538 1433 -379 -1341 553 1522 -1336 -2530 -104 1157 -330 -764 948 673
3576 673 -1990 -2158 428 1459 -297 -883 606 -106 -1717 -1107 1135 1102 -1292 -1209 918 -21 -1319
3593 -1319 -579 1129 649 -1293 -461 1212 -438 -1843 -28 1691 616 -1527 -496 639 -634 -911
3609i11J983O16k099j323J894P45r22o64J800j85j927Q7J980k89j969R33J877
3626A626q59j891N18J583l81j374J274J192j497j620J501J221o18o91Q35K40j568
3643e09r1J512N38j659p3J106N0p65J29Q46m29o58L87R51m80j005O5Q68L44n41
3663E86l95L49J7n93Q73O66n29p78J70K86K34m31M06J38n68l76O81O22j000l41
3683A7L41P23l42o56L27P35q06o0R15K5j219m08J032K0l57L69L42p42l08L22M99
3704G69k35j054K38P76j34n79N97j18k61l67N11M89q37o69Q88k8J91k22Nl6l52
3725d28K15N11k69n92N4P3K20J40m69N3l3qOJ55J20j54m10l00J065n94j12k0j04
3748h81kM72Q0k51m21K3L45K44l22j39L82k57nK07O03o79n79J58O13l15j6N60
$$ plain form
3609 -911 1072 1688 -411 -1734 160 905 -17 -681 1119 934 -993 -906 1074 785 -1184 -251 1626
3626 1626 767 -1124 -606 977 596 -778 496 1688 191 -1429 72 1293 675 -16 819 1059 -509
3643 -509 -600 912 1450 -209 -282 824 874 109 238 1084 655 -3 384 1335 855 -150 -85 783 1127 586
3663 586 191 540 557 -36 837 1503 974 196 366 652 886 455 861 999 431 55 736 1358 358 17
3683 17 358 1081 739 83 410 1145 339 279 1194 1219 0 -408 624 644 287 656 998 256 -52 270 769
3704 769 534 -520 -282 494 360 -219 378 260 -1 -368 143 632 -205 -874 14 -14 177 -45 -40 -76 -428
3725 -428 -213 298 29 -563 -509 -436 -216 -76 -545 -492 -525 -533 -527 -372 -252 -406 -816 -1116 -51 -645 -757 -777 -881
3748 -881 -883 -411 -331 -582 -1003 -980 -635 -391 -713 -852 -470 -727 -732 -525 78 -601 -1180 -1022 -409 -724 -740 -180
3770a80o01j44N5O46R7m39l52L57M53j75j84K77k51m67M15M11r3n79M29j63J23
3791c65J2J29m0k97P2M82L47n07j35K20l34L41J02M35m26o59M77M74K35r06K12
3812a31J11J27j30O2J84l34j37J89O90Jo34K24q7K83j92Q1j65q8l79N50N63l31
3834D57m17l9M51mk73K80k17n77kQ04N99q38k81N09J91o00L73J08m14p16M47J050
3856H91k04n79m0N10l08p50J054L88r38j55N39M15o46n05N78K12j80l43M07M14
3876G60j284J46Q47N79r31K6J51o2p55O74Q71o50p21J2P66k37m01J99Q72o60k23
3897b1J34P86o28j040J094J065j042p35M00N88n14k9R32J93j263q19R91Q35o71
3916B56o16J350M2j487J56J023K6j348N70J358l29j566K53R10m13n83R69J098
$$ plain form
3770 -180 -781 -925 -870 -224 -127 -566 -918 -561 -108 -283 -467 -190 -441 -908 -493 -82 -175 -754 -325 -488 -365
3791 -365 -353 -224 -264 -561 -489 -7 340 -167 -302 -82 -416 -75 27 462 36 -623 -146 328 563 -343 -131
3812 -131 -20 107 -23 39 223 -111 -248 -59 631 632 -2 222 135 418 226 307 142 54 -325 225 788 457
3834 457 40 1 452 448 175 455 238 -339 -341 463 1062 224 -57 452 643 43 416 524 110 -606 -159 891
3856 891 687 108 68 578 270 -480 574 962 24 -131 408 823 177 -328 250 462 282 -61 346 760
3876 760 -524 -378 469 1048 117 143 294 232 -523 151 1022 372 -349 -337 429 192 -209 -10 862 202 -21
3897 -21 113 899 271 -769 325 1390 348 -387 13 601 87 58 990 1183 -80 -899 92 927 256
3916 256 -360 990 1032 -455 -299 724 750 -598 -28 1330 1001 -565 -312 598 185 -398 571 1669
3934A669j819j460J431J341q40o76O91O76j696n17J612R48j579n25J311K72j475
3951f36l51J584M07j376j70J563q61j688L11K075L35k096R8J150o41j402J378
3968c20J894j554j557Q97J290j220q87J527J186j540j095J248P63j699n93K009
3984C49J058k107r73J367L16j417N00K122m00k543m73K121J92j526P36J789j101
4001A0k174Q09K004n61j709J297J408j345j983J262J896j494n92J587R54k559
4017a190j573K411J970j807q95J466K42k377j75K812P96k384l86J533k66j899
4033a722K95L104n08j972k00K150j437j912J702K603j039j874N10J198j476j166
4049a744K595J531j926k224J461J370j349r60K704Q83k617j350J989J007k077
$$ plain form
3934 1669 -150 -1610 -179 1162 322 -354 337 1013 -683 -1200 412 1360 -219 -744 567 839 -636
3951 -636 -987 597 1004 -372 -542 1021 160 -1528 -1217 858 1193 -903 -805 345 -296 -1698 -320
3968 -320 1574 20 -1537 -640 650 -570 -1457 70 1256 -284 -1379 -131 632 -1067 -1660 349
3984 349 1407 -700 -1673 -306 10 -1407 -907 1215 815 -1728 -2201 -80 112 -1414 -678 1111 10
4001 10 -2164 -1355 649 88 -1621 -324 1084 -261 -2244 -982 914 -580 -1172 415 1369 -1190
4017 -1190 -2763 -352 1618 -189 -1084 382 624 -1753 -1928 884 1680 -704 -1090 443 177 -1722
4033 -1722 -1427 1677 1169 -803 -1003 1147 -290 -2202 -500 2103 1064 -810 -300 898 -578 -1744
4049 -1744 851 2382 456 -1768 -307 1063 -286 -1246 1458 2341 -276 -1626 363 1370 -707
4064g07M4K446N9k578n71K137M45k089J075K160j075k923J82K705j11j311R29
4081H17J165j873k151J358K859j364j028R21J007k084j307K218J486j535j051
4096e62J661N55l006r53L393J338k459m58J509l65k745O69L426O1k634k30J699
4113H99p32j835J559K211r61k142K69J880j454j216J778K049j594k221J200J126
4129H16j476o58K738R07k802j681J863J410k079K4K600m10k444q30K562J30j757
4146a087N24K592j060k959J101J782m86j595J560J651j777k377J048K204m33j397
4162g09J473N48k224j337K069K262j678j065J173M64k366m23K442J036k028o58
4178a021K113l61j969M8K102L29j871j91J689j096j784J340K515o82k297L44J481
$$ plain form
4064 -707 -663 1783 1842 -736 -1307 830 1275 -814 261 2421 1346 -1577 -1395 1310 1199 -112 817
4081 817 1982 109 -2042 -684 2175 811 -217 704 1711 -373 -1680 538 2024 489 -562
4096 -562 1099 1654 -1352 -2305 1088 2426 -33 -491 1018 653 -2092 -1423 2003 2064 -570 -800 899
4113 899 167 -1668 -109 2102 1141 -1001 -732 1148 -306 -1522 256 2305 711 -1510 -310 816
4129 816 -660 -1318 1420 2327 -475 -2156 -293 1117 -962 -938 1662 1252 -1192 -2022 540 670 -1087
4146 -1087 -563 2029 969 -1990 -889 893 407 -1188 372 2023 246 -2131 -1083 1121 688 -709
4162 -709 764 1312 -912 -2249 -180 2082 404 -661 512 976 -1390 -1813 629 1665 -363 -1021
4178 -1021 1092 731 -1238 -1190 912 1241 -630 -821 868 -228 -2012 -672 1843 1161 -1136 -792 689
4195F89j108j147J635J620j558j696J016J585j528r07J603J291j965q04J234M41
4211D01j353O6J915K71k071p84J744O3j060M50J389o25j971J72K011o28o66K14
4229d62J023j115j132J187J140o76r85J099N18j193j047R36J313p69p99J224K05
4246D67j505n12J481R09j049p11Q95J80j363L98J315K78j129l52Q50O6r96J88
4264e90J212l51q29m0J114n05r68M20J628o47j388K22J123m68p91J184O24j139
4282a89q64Q96R54o35m27R11O24j687q4J021J53o92k37J148R5j049l96J149k38
4301D53m41R1Q58n31q01K92L96K58m08J07O2L0p41Q05M98l68o17K28L92k99l11
4322d7L03M81k74k66J84J38j38o00R39N6p01N7Q2J14l13k3Q22k01j015J4R09K24
$$ plain form
4195 689 -419 -1566 69 1689 131 -1565 -549 1036 -492 -1399 204 1495 -470 -1274 -40 401
4211 401 -952 -886 1029 1300 -771 -1555 189 252 -808 -358 1031 406 -1565 -1393 618 -10 -676 -462
4229 -462 561 -554 -1686 -499 641 -35 -1020 79 597 -596 -1643 -707 606 -163 -962 262 467
4246 467 -1038 -1550 -69 840 -209 -920 -25 155 -1208 -810 505 783 -346 -698 152 218 -778 -590
4264 -590 622 271 -558 -598 516 11 -957 -537 1091 444 -944 -722 401 -67 -858 326 950 -189
4282 -189 -1053 -157 797 162 -265 646 1270 -417 -501 520 673 -19 -256 892 987 -62 -458 691 453
4301 453 12 103 961 430 -371 -79 317 575 167 274 336 366 -375 430 928 560 -57 171 563 264 -47
4322 -47 256 737 463 197 381 519 381 -219 720 776 75 132 214 328 15 -8 814 613 -402 -388 521 745
4344G45p64R4N93j03p86M31L17j40q52K79O29j7o12R5M95l78j57M49K97q48l78
4365f11Q20M83p12m37O84k16m11j51J245o26n51R9M92O2l47O8J42m19%K82L11
4386B07l15m89N18O7k17j36K86j50J6JL11n4k43K0k27M29k34J13k19K27m69M97
4408f1L7j70J21l82P5M98j07n47N62m6r1o6Q0kk46k83L40N13k16l47P37m04j42
4431a47M4L95j65n01jQ32o50k69L24K47o5l42L05P7l56k37N84K57n00r8N14m55
4453b07P7O6RO7l61j59M07l3k97M33l33L0J8J03L45J94p38J99K09M5k20J45j56
4476a57R3k16Q3L57k96l6k08K38k43J97R3k62p8L82j61J47j30l52QL73O7J3K6
4499f2j24j94K34J84J45o64L6N71m0l93K31L41l03l09K54K76j92k14K76K22k36
$$ plain form
4344 745 -19 75 668 565 -221 210 527 387 -465 -186 443 426 -186 -91 404 26 -131 318 615 -233 -611
4365 -611 209 692 -20 -457 227 11 -400 -551 694 68 -483 -384 108 170 -177 -109 33 -386 -386 -104 207
4386 207 -108 -597 -79 -12 -229 -365 -79 -229 -213 -212 99 45 -198 -178 -405 24 -210 -97 -316 -89 -558 -61
4408 -61 -24 -194 -73 -455 -380 118 11 -536 26 -20 -111 -177 -97 -99 -345 -628 -288 225 9 -338 399 -5 -147
4431 -147 -103 292 127 -374 -375 457 -193 -462 -138 109 44 -298 7 84 -272 -509 75 332 -168 -266 248 -207
4453 -207 -130 -64 -55 12 -349 -508 -101 -134 -431 2 -331 -301 -283 -180 165 359 -379 -180 29 74 -146 -1 -157
4476 -157 -64 -280 -197 160 -136 -172 -380 -142 -385 -188 -95 -357 -435 -53 -214 -67 -197 -549 -541 -168 -101 -88 -62
4499 -62 -186 -380 -146 38 183 -481 -445 126 86 -307 -76 265 -38 -347 -93 183 -9 -223 53 275 39
4520C9m30J103m61n92m9O26J38n23J11J32j57k41L73M01J44r16O05J42l65J0J55
4541B45L88l33M0J22P2p76J30N07N87q25p8K81o7j85j1M25R3m80j75N77M6o12
4563b9N5N78J08m73k52P46l58l66J99Q21k98q46P4M24l5m42N03M19m30q84O75
4584A89N35n88k72P10J63q80l88R10M2p84L26Q44j68j146p0R11J56q93M26N63
4604E86o71q31P53O37l4q24L00P09q84q35P20J058r81n87Q08L39p12l40O24N63
4624C98n55m12M95L46j177K05Q05O27q42l95P20q2r96N54J120n30r31j67Q81k08
4644a44n88O10J041r95p39L09Q10o05q38J216J027j482q88Q75Q44q51k90J326
4662F38K40j542r18J386R77j209L18P97m23j254m5J753j44j286J70J349o83j267
$$ plain form
4520 39 -391 712 251 -341 -390 236 374 -149 -38 94 -63 -304 69 470 614 -302 303 445 80 90 245
4541 245 633 300 340 462 534 -242 -112 395 982 157 79 360 293 108 97 522 615 135 -40 537 583 -29
4563 -29 26 604 712 239 -13 733 375 9 208 1029 731 -115 -41 383 348 -94 409 828 398 -486 189
4584 189 724 136 -136 574 737 -143 -531 379 421 -363 -37 807 639 -507 -577 334 490 -403 23 586
4604 586 -85 -916 -163 474 440 -384 -84 625 -259 -1094 -374 684 -297 -884 -76 263 -449 -789 -165 398
4624 398 -157 -569 -74 272 -905 -700 105 732 -110 -505 215 133 -863 -309 811 281 -650 -817 64 -144
4644 -144 -732 -122 919 -76 -815 -506 304 -301 -1139 77 1104 -378 -1266 -391 453 -398 -688 638
4662 638 878 -664 -1582 -196 781 -428 -110 687 264 -990 -1035 718 574 -712 -542 807 124 -1143
4680a143N16J170N5j300P06R56j196j192J211J402r69r45O65P76j329m33J495
4697D45O51j386m66J038O25k073M90J213Q14j717k62J198l59j579P16J913%k058
4715g97Q2J183n35r70J046J427j179j619O35J393o84r42J194J402j688j492J417
4732a27O73j076m10J733M06j881o27J268O03j079k0J685o67j854j04J768N37j346
4750e18K78J068m82j788L94J830q8j551O43J240j296j338J459J198q84j082J154
4767B37Q40j557r14J422J742j456p61Q81R8j456J70J863M17j677q37J406j4j168
4785g64K35J579K26j835L05J195k48j440R17J723j145j558L17J174q18p33J685
4802H15Q24j145j562J056P87n42r04J515K40j191j275J750N30r52m14J433K2j568
$$ plain form
4680 -1143 -627 543 598 -702 4 960 -236 -1428 -217 1185 216 -729 -64 712 -617 -1050 445
4697 445 1096 -290 -756 282 907 -1166 -676 537 1351 -366 -628 570 211 -1368 -652 1261 1261 -797
4715 -797 -715 468 -67 -1037 9 1436 257 -1362 -727 666 -18 -960 234 1636 -52 -1544 -127
4732 -127 546 -530 -940 793 1199 -682 -1309 -41 562 -517 -537 1148 481 -1373 -1477 291 828 -518
4750 -518 -240 828 346 -1442 -1048 782 694 -857 -214 1026 -270 -1608 -149 1049 165 -917 237
4767 237 1077 -480 -1394 28 1770 314 -447 434 532 -924 -754 1109 1526 -151 -988 418 404 -764
4785 -764 -529 1050 1276 -559 -254 941 693 -747 170 1893 748 -810 -493 681 -137 -870 815
4802 815 1639 494 -1068 -12 775 233 -671 844 1084 -107 -1382 368 898 -54 -468 965 987 -581
4820e81l26J139P90j108J21J023n29j590N57J022K56j390Q00J073j299j001Q71
4837a72J247o38q55N02O57j187p80J422O84q16r80J026M19j279k35J330Q97j535
4855b93m34Q24p8j083J72J778J27k022n5J392m96j010Q62J367o59j806O26Q70
4873H2l39q36J155O41p72j013Q66N72n99n26Q96P64j388q50R90P54q02M7R04J02
4893F48j804l51J496O45r88o7O51K6j476L50J347J75j400M03Q47k21j376P58R78
4912F41m42o29P4O55p90n15Q75P14q86k96L61O83n93k78P85K07n74r77R83N23
4932E21p54l18J014M48j237j61O69J52r64O19N59J97j075Q2Q62n31m27M00Q53
4951I09p12r09L55R94K1j151O56L65n05l65M77L47n34m17R41R7q06l80Q17O25
$$ plain form
4820 -581 -907 232 1022 -86 35 1058 529 -1061 -504 518 774 -616 184 1257 -42 -1043 -172
4837 -172 1075 437 -418 84 741 -446 -1226 196 880 64 -916 110 529 -750 -985 345 1242 -293
4855 -293 -727 97 19 -1064 -892 886 1013 -1009 -1064 328 -168 -1178 -316 1051 392 -1414 -788 82
4873 82 -257 -1093 62 703 -69 -1082 -216 356 -243 -769 127 891 -497 -1347 -357 397 -405 -358 546 648
4893 648 -1156 -1507 -11 634 -354 -421 230 256 -1220 -870 477 652 -748 -345 502 281 -1095 -337 641
4912 641 199 -430 -356 299 -491 -1006 -131 583 -303 -599 -238 445 -148 -426 359 566 -8 -985 -2 521
4932 521 -233 -551 463 911 -326 -487 182 334 -630 -11 548 745 -330 -248 614 83 -344 56 909
4951 909 197 -712 -357 637 658 -493 163 528 23 -342 135 482 -52 -469 472 569 -237 -617 200 825
4971H25j009K50K65k4p38K99P22J5m90k60O97n51m78L45O78l01p31L04O68m11
4991G5l32L54N42n96m34N70J32o18Q2M23J43k30l50M21j92k14NN16K71q17J10
5012a39M35M9o03r4P14K19p28n9L68l4l67K34L29k9o27L73M25l64j45J43N74n33
5034A41n01O00Pm1k64J8K13m47J25N73J31o44J47L23P4n43J00j8K27j39J92j17
5056A57P8m39J9L90K57k70l79L14n5J07J38q3l45q5L21J99k52j81J3K41j16j06
5078g7K05L40m08k65J82j0K64n07L65N2m58L64M6j89k09N9K04M1k11J39k72M44
5100I9l76Q7L31l76J38k04L65k60k02J73L18n46J70K78RO8m39K03O7k33Q5R2J4
5123a39r0K2J29J56m82q7J60J40j47lQ2J46m03L03K46k94Q5K7j67lK0M4M58k17
$$ plain form
4971 825 -184 66 331 307 -431 -132 590 605 115 -145 552 1 -477 -132 546 245 -486 -182 486 75
4991 75 -257 97 639 43 -391 179 311 -307 -225 198 341 111 -239 182 -10 -224 -219 297 568 -249 -139
5012 -139 296 345 -258 -352 362 581 -147 -206 162 128 -239 -5 324 295 -332 41 466 102 -43 100 674 141
5034 141 -360 240 247 206 -58 -40 173 -274 -149 424 555 -89 58 381 455 -88 12 -6 221 82 274 157
5056 157 235 -204 -185 205 462 192 -187 127 72 179 317 234 -111 -196 125 324 72 -109 -96 145 29 -77
5078 -77 128 468 60 -205 -23 -33 231 -276 89 141 -317 47 93 -96 -305 -246 -42 -1 -212 -73 -345 99
5100 99 -277 -190 141 -235 -97 -301 64 -196 -398 -225 93 -453 -283 -5 4 72 -367 -164 -97 -330 -245 -153 -139
5123 -139 -229 -207 -78 78 -404 -491 -331 -191 -338 -341 -259 -113 -516 -213 33 -261 -176 -149 -316 -319 -299 -255 203 -14
5147a4q0J23k29l4P9K3Q8K26k68J50k49L36P7l27K92j19l45j46P82l56k05M66
5169B70p3n93L1L43K94k39j21M62j18j86L2K29k87j76nL31j82k45L7M56j32j41
5191a3J03j01O9r6M30j83l51L1K67j5j25P6K13j17k11N3K90j8l90J13K81j02j74
5214C0K61M0j93l49M53K82m79l67M25K69q8l20K55J3j84l79N77O0k03k08N91J37
5236F23p62%M9K47k93k01Q30k12n38n1L45J9o04L30N78m07p01M63M85k19l08J58
5258a69O25n20l57M84M35o77J1M51%o15j29M40N53m89k04L83j12p08M15N93L2
5279D42p02K38M33n34n84K93R11n28m65M69L74l49m37R33q3m99j38N26j53k65
5299a18k43P22J40n51l23K83L85p62K37R75k4r75J06O15m27l91L20O05l31r03
$$ plain form
5147 -14 -94 29 -200 -234 -155 -132 -44 182 -86 64 -185 151 228 -99 193 74 -271 -417 365 9 -196 270
5169 270 197 -396 -365 -22 272 33 -88 374 256 70 102 331 44 -132 -137 194 12 -233 -196 260 128 -13
5191 -13 90 -11 58 -38 392 209 -142 -111 156 141 16 92 305 188 -23 30 320 302 -88 25 306 204 30
5214 30 291 331 138 -211 242 524 45 -322 103 372 284 -36 219 232 48 -331 246 306 103 -105 486 623
5236 623 -139 -139 -90 157 -136 -337 493 281 -257 -308 37 56 -548 -218 360 -47 -748 -285 200 -19 -327 -169
5258 -169 456 -64 -421 63 498 -179 -168 283 283 -332 -461 -21 532 43 -161 222 110 -598 -183 410 442
5279 442 -260 -22 411 -123 -707 -414 497 -31 -496 -27 347 -2 -439 494 411 -88 -226 300 147 -118
5299 -118 -361 361 501 -50 -373 -90 295 -467 -230 745 721 -254 -148 467 40 -351 -31 574 243 -660
5319f60K61Q28m27n21L46Q58l76j212O29Q82k89n24M71K08q35m51Q96N80n48o45
5339e29N98N94j202m07J356K76j114J60Q77j35j069q9J279l89o27L43O28o25o37
5358g12M16P29j9q72L50P17j099l29O07R69q17q46P46N71o41o13J247J81j020
5377d35j34N80K05j005L22J063L06j503j74P55k82o39O96R20l38q49r9R26k88
5396B7n27P17M20p26q90Q75Q39q35m48Q80M33q91o88Q79L31j57p08J184jj128
5416d14o09J197L59o91n9O67L1j071l3J349n4j042J68R43m14j036M63J288o63
5435C79o85J67O55n85q10J201P84n37q04O62j07n49n44J198N81j201n75Q25L76
5454D31p03k02J350L04j492l41J201k34m22j44J111J65j368n3J080m47r48P21
$$ plain form
5319 -660 -399 429 2 -519 -173 685 309 -903 -274 608 319 -205 266 474 -361 -812 84 664 116 -529
5339 -529 69 663 -539 -946 410 686 -428 -268 609 474 -595 -684 595 206 -421 -78 550 -75 -712
5358 -712 -296 433 414 -458 -108 609 -490 -819 -212 757 -60 -906 -160 411 -230 -843 404 585 -435
5377 -435 -569 11 216 -789 -467 596 902 -601 -775 -20 -302 -941 -245 675 337 -512 -611 315 27
5396 27 -500 217 637 -89 -979 -104 735 -100 -548 332 765 -126 -814 65 396 239 -469 715 714 -414
5416 -414 -1023 174 533 -158 -217 450 481 -590 -623 726 672 -370 -202 741 327 -709 -246 1042 379
5435 379 -306 -139 516 -69 -879 322 1106 569 -235 427 320 -229 -773 425 1006 -195 -770 55 431
5454 431 -272 -474 876 1180 -312 -653 548 314 -108 -252 859 1024 -344 -397 683 236 -712 9
5472IJ028q27j089J13J198m79m05N80O59o46j119R95O35m90q95P55Q16j136o52
5491i50R05M57p87K03P14j18j277k41J532L92r75j75P54m56j004K80J410m67q15
5510f18K91Q91o91n66N64Q07n07r90O11O46r25m58J024O69r30n64R65Q1p25j03
5530e28Q49L96r73p31J353j27j027M35J089k78j249N12M42L9l87K32P17p22q21
5549g79L16R25l49m42N79O54j003o47Q56N90l12o97O28K53p46m52Q39N21p33k53
5569b52P06l6j099nJ135J78j205L62O05l45n62K66P09j0j214N72L51m63r1J00
5589b98J062o46o88N51R6m2p10J028Q1o23n56Q08L66r50r4P40N34r82l34R06q3
5610A66n32J8Q58l55p27M43K7L04n62Q8M47k46n43N1O35k26o5L11Q9m06m23N26
$$ plain form
5472 9 1037 210 -879 -766 432 -47 -452 128 787 141 -978 17 652 162 -733 22 838 -298 -950
5491 -950 -45 412 -375 -172 542 424 -853 -1094 438 830 -145 -320 434 -22 -1026 -746 664 197 -618
5510 -618 -327 564 -127 -693 -129 678 171 -819 -208 438 -487 -945 79 748 -182 -746 219 300 -425 -528
5530 -528 321 717 -256 -987 366 239 -788 -353 736 458 -791 -279 163 202 -185 47 764 42 -779
5549 -779 -463 462 113 -329 250 904 -99 -746 110 700 388 -309 319 572 -174 -626 213 734 1 -252
5569 -252 454 418 -681 -686 449 627 -578 -216 389 44 -518 -252 457 447 -767 -195 156 -307 -398 -298
5589 -298 764 118 -570 -19 77 35 -675 353 434 -189 -745 63 429 -521 -615 125 659 -323 -657 249 166
5610 166 -366 -348 510 155 -572 -129 -102 202 -360 -272 175 -71 -614 -563 72 -154 -219 92 181 -225 -648 -122
5632a22N88o46l7O37j33m06j34K82K52j44l40M90P1o25j86O97L6m39j44K45K95
5653B37j81M4N2p0k64M3N03j55l46K05K83l31o8K62k69J47m66M29M84l97k63K47
5675A26J11l10k45M52Q2l36R3L29K99m96j26K51J14k90n6K65L13n49L82p2N8m81
5697h6m6M16q7j83N1J94k49m16N79R1l15j27K25k4J30j17K28P8m72jK7O8J60n31
5721d07M42j01J01k33N9J95k51m7M33L6k49m10L59R7k56L67N8l9o25L03K60P3
5743A65l22j40L04J12n7k71L09q7n05J83M63o0m56N1M47j1o2J31m52r2j23M64
5765iN2P5j97j64L89l98j19O14l41J99k23P8K60m75J74j8j90K12L10j18j50j49
5787a88J08J67j77j9Q5j57J29kKK61l9l15K57J62m19k3K11Q3j98j15j09L17k09
$$ plain form
5632 -122 466 -180 -217 420 287 -119 -253 29 281 137 -203 287 358 -267 -453 244 280 -159 -303 -58 237
5653 237 56 100 152 82 -182 -139 364 209 -137 68 351 20 -48 214 -55 92 -374 55 539 142 -121 126
5675 126 237 -73 -318 134 216 -120 -27 302 601 105 -21 230 344 54 -2 263 576 27 409 337 395 -86
5697 -86 -132 284 197 14 65 259 10 -406 173 264 -51 -178 47 23 153 36 264 342 -130 -131 -104 -36 124 -407
5721 -407 35 -66 35 -198 -139 56 -195 -242 191 227 -22 -432 -73 24 -232 135 193 154 -471 -168 92 165
5743 165 -157 -297 7 119 62 -209 100 13 -492 -309 154 94 -362 -311 136 125 63 194 -258 -350 -473 -9
5765 -9 43 118 -79 -243 146 -252 -371 243 -98 101 -122 -44 216 -259 -85 -103 -293 -81 229 111 -39 -188
5787 -188 -80 87 -90 -109 -24 -181 -52 -54 -52 209 170 -145 112 274 -145 -168 43 126 -72 -187 -296 21 -188
5810a88K96m04M05k8k97J83M72j49m94Q6J66k32J66lL2j31J73J23k8l43L38J74
5832C17j42k81K05J48j19j78N4p7l87L73L19k7m21j17M62n3l16K93j16J18j82
5853a27O6N14l68m53K06K14j47K4J68k72j42K35k0K74l49J21k7J08l9p0KJ95o14
5876e01M64M13l71j69k04O25j03o5j85N6k85L72J33mj89L1k49J38R3k59L3J40
5898h6j11N3J86R5l57K03K64K2l4j41L9QJ42n94Q58k30n24NL30J02k10k69O94
5921D45k74m06L54J64j02j16PN32l97n67N45N4l47QN0M24m65l52P67L3n96L22
5943H3K38K14p91J37O84j94l71o6M17o8m18q0P01n2l39L0n2J00l15L49K27k79
5965A55k50K54J26m48M5L35M2k32l61L24R7k4o04R52j04k87j92N7L00l41O4K80
$$ plain form
5810 -188 108 -296 109 81 -216 -33 439 290 -204 -118 48 -184 -18 -21 11 -120 53 176 148 -195 143 317
5832 317 175 -106 99 247 128 -50 4 -73 -460 -87 232 205 -216 -333 129 76 -240 53 -63 55 -127
5853 -127 -61 453 85 -368 -162 52 -95 -71 97 -175 -317 -82 -102 172 -177 -56 -83 25 -14 -84 -82 113 -501
5876 -501 -37 376 5 -164 -368 257 154 89 -96 -40 -325 47 180 176 -13 18 -231 -93 0 -259 -226 -86
5898 -86 -197 -144 42 137 -220 -17 247 269 235 94 133 141 283 -311 547 317 -207 -202 128 230 20 -249 445
5921 445 171 -235 119 283 181 65 72 604 207 -360 185 239 -108 -100 -50 374 -91 -443 324 357 -239 83
5943 83 321 535 -256 -119 565 371 0 -66 351 283 -135 -215 486 434 95 125 73 173 -142 207 434 155
5965 155 -95 159 285 -163 -118 217 259 27 -334 -10 87 63 -541 411 307 20 -172 -115 185 -156 -92 188
5987A88P0o12j60O32k1l18J00K88O7q57L36L63J34o51M22K31k30o17L44M04k39
6008a26k50O25J74n74m65O52K38n26j62O27M3n86j58N43M94p84kL54n0r39M93
6029c79N86J06n38n9L14k76k00M51K95K39j009K64O49k14p02O39N04o97k42K73
6049DJ76n04k47O60N65p09j48N88j49o21P2Q99j1j015L11L48m6l86K46N64m54
6070A43k94K6N33J78p30K37O95p51o06N30O97p16j61Q45k2p23n71O30P26o50j61
6091a45M68k22o03RP61pn67j38Q96j78j032O71O41k32p10J88N19l40o33M68P62
6112E76m43o54O34N56o72o81Q16N78o54o87L49M58m39r2P17N70j403l59R35K48
6132C53p06J89M77J27p93k9M73l5n16M85O51n69o26K24O90n8o43K74O82p18n68
$$ plain form
5987 188 258 -354 -514 118 97 -221 -121 167 234 -623 -287 76 210 -441 -19 212 -18 -635 -291 113 -126
6008 -126 -376 249 423 -151 -616 36 274 -252 -414 213 256 -330 -488 55 549 -235 -237 117 67 -872 -379
6029 -379 207 313 -225 -284 30 -246 -446 5 300 539 -470 -206 443 229 -473 166 670 -27 -269 4
6049 4 180 -324 -571 89 654 -55 -203 385 236 -385 -313 586 575 -440 -129 219 173 -213 33 597 143
6070 143 -151 -125 408 586 -144 93 788 37 -569 -39 658 -58 -219 626 604 -119 -690 -60 666 16 -145
6091 -145 323 101 -502 -493 268 261 -306 -444 452 274 -758 -87 554 322 -388 -200 319 -21 -654 -186 576
6112 576 133 -521 113 669 -3 -684 132 710 56 -631 -282 176 -263 -355 362 932 -471 -830 105 353
6132 353 -353 -164 313 440 -353 -382 91 56 -460 25 676 107 -519 -295 395 337 -306 -32 650 -68 -636
6153f36N07O74n35k77N23J64m95n99Q99O86r65j23M53Q4o24l44J116O3n23j89
6173a41N08o7q37M58N25l43n87J93P83m59o77P91P78r50k87K18K31K69n88N05
6193C23K20n43m13K00L81j30l33N48L44n10n81N41K1j95q9M83L06j176K76O18
6213B91p7l03o3O91m29o14Q1J128m16o23J96N79n63q09P93K18O9p04L20M75l50
6234a10p32P30M73m62m0K55K2o90K9P56K6l15J03J40k50m87M93N2kj20J49L62
6256C82l98n89M84M33mo71J45L93k79j70L80K62kq31O1N98m25j49M72N47q61j71
6278c93L19N35o60l75R74J94q44j05N02q7m9o6K05m3m65k8R12k84m31K35J50r7
6300I9j46j68O42k12l38K1L18p5k50K66J59k37k03M65j42j86q1L81lk93j44M59
$$ plain form
6153 -636 -129 545 10 -267 256 420 -75 -674 225 911 -54 -177 276 360 -264 -608 508 571 48 -141
6173 -141 367 300 -537 -79 446 103 -484 -291 492 33 -644 147 925 -25 -312 -94 137 406 -182 323
6193 323 543 0 -413 -213 168 38 -295 253 597 87 -494 47 68 -127 -216 267 573 -603 -327 291
6213 291 214 -89 -152 539 110 -504 -423 705 289 -334 -138 441 -122 -931 -138 80 149 -555 -235 240 -110
6234 -110 -842 -112 361 -101 -141 114 136 -554 -525 231 257 -58 45 185 -65 -552 -59 -7 -9 -129 20 382
6256 382 -16 -605 -121 312 308 -363 -218 175 -104 -274 106 368 366 -465 -404 194 -231 -380 92 639 -222 -393
6278 -393 -74 461 -199 -574 400 594 -250 -355 147 60 11 -55 150 107 -358 -386 526 242 -189 46 196 99
6300 99 -47 -215 427 215 -123 -102 216 141 -109 157 316 79 -124 341 199 13 -68 313 310 17 -127 332
6322C32k13J85m18N06j71k16K77j9j58J97k78L61l23J2q7J57o5k26L01K12R2p31
6344b73l4M90j18j41N7K21m05k31L81J06j66j91L75o5l96n8Q63j11l11K02k78
6365h3K21m72K44K21j23l52J67Q6KJ38R8q3k47Po0P05k43l82K58j53n8O3K20j88
6389a4j22K08l77O46n31j34K56K08k02o3L17L06m95M5J98p9J18m56J55L26n82
6410b72K65o5J48j01pR1j09o1K24J92j32l08K93j51J42p9p4J80k86J02n0L1R8
6433G1p6M6Q5k98K7M08j8o8k98L33m64M2J94J23R6k20J26j53j18j0n1L25n2k28
6457a78J89O9L3O2q4j9k55J00K36k17J8j0J18J63j05o5j27J46l18J05Q5K17l45
6480a82K76p6P1m0j89j52L97j65J00j94L8n0R4l1O2j61N1J45k62O2J26K43R6m03
$$ plain form
6322 332 119 304 -114 392 221 5 282 263 105 302 24 385 62 74 -13 144 79 -147 154 366 458 -273
6344 -273 -307 183 65 -76 -19 202 -203 -434 -53 53 -113 -304 71 6 -390 -448 415 304 -7 195 -83
6365 -83 138 -334 -90 131 8 -344 -177 -91 -89 49 147 64 -183 -176 -236 469 226 -156 102 -51 -109 -46 174 -14
6389 -14 -136 72 -305 341 -190 -324 -68 140 -62 -125 192 498 3 48 246 167 285 -171 -16 310 -272
6410 -272 -7 -72 76 -25 -32 59 -50 -111 113 305 173 -135 158 7 149 70 -4 176 -110 -8 -58 -27 71
6433 71 -5 41 126 -172 -145 263 245 177 -121 212 -252 -210 -16 107 203 -17 109 -44 -162 -172 -223 102 50 -178
6457 -178 11 80 113 175 91 72 -183 -83 153 -64 -46 -56 62 225 120 55 -72 74 -244 -139 -54 163 -182
6480 -182 94 18 89 49 -140 -292 105 -60 40 -154 -116 -166 -72 -103 -41 -202 -151 -6 -268 -206 -80 163 259 -144
6504a44j7K97l83J79j56M05k46J47j06j25M0J71l3J63k91PK74j99l78K79J46p8
6526d8j04J65K56l51o4L6O3Mj41P17l90l74o5L95Q0j76k68M04J42j43j87L58j29
6549A80m6l3k6K35r9l94M58j04j0m1O4k9k15n5N22k88n5K62k04j77K7L9J93l8
6573A66j92J94L6Pj73P5O8l24L16l0j60J04l70J70J80o0l29M11R5l46K5J18J29
6596A10k51j26K13J94l40J25O75k40l86j28K09n32J35K33K23j52p2M01M3n66J41
6617i1K15Q0l71j31L48J41m08qM92l84m31M29L36l89j75L90K6N4k28J54j16J56
6639H9k84L83j67k35L5K8N24l91n99M13O30m06j03k36M54k50l94O35J47n14k80
6660e21M17J62k06j1L77J28n83K11J41Q2m59M13j4p3l92K27J57m3l71J90L68q1
$$ plain form
6504 -144 -161 136 -247 -68 -224 181 -65 82 -24 -149 -109 62 29 192 -99 -92 182 -17 -395 -116 30 -48
6526 -48 -152 13 269 -82 -146 -110 -47 -43 -184 533 143 -231 -296 99 179 3 -265 139 281 138 -49 309 180
6549 180 134 101 75 310 211 -183 275 171 161 120 184 155 -60 -115 407 119 64 326 122 -55 -28 11 204 166
6573 166 -26 168 204 211 38 113 181 -143 173 143 -17 87 -283 -113 67 7 -322 89 184 -162 -137 -19 110
6596 110 -141 -267 -54 140 -200 -75 600 360 -26 -154 55 -477 -342 -109 114 -38 -110 291 334 -232 -91
6617 -91 124 204 -167 -298 50 191 -217 -225 267 -117 -548 -119 217 -172 -347 43 69 123 -105 49 -67 89
6639 89 -195 188 21 -214 -179 -151 373 -18 -617 -204 426 20 -83 -319 135 -115 -509 126 273 -241 -521
6660 -521 -104 58 -148 -159 218 346 -237 -26 115 197 -262 151 137 64 -328 -101 56 13 -358 -168 200 119
6682A19o28M72M41m88k33N48R6j37l82L28M13r62J90N89j37j17j92R5J21k96J87
6703B7P4j44j48K65L78k09l03n7O63l15m99K66K11j74n17J82M57j20j42M12M04
6724G11o89n98M70L55k49l02K71J64n89L4M43L96m00j43M15R5q97j25Q52n6o49
6745d91M05K80o3l96PL28J33m71K87L66m30n28N09K63m00k33K08L51j83j40L18
6766A20K00k91m48N26j32k44J04M97K53p12j6M98j33n92Q1P51o8o21j48M18K69
6787C12m63K9O63m13n00K06M11j26j30J59L54n09l26M61R9k06j19M19Q7n46l87
6808e25Q41J51m54P9J17J79o20j42P40m3k63j04N58m93m64K38O68j72l02l0L72
6829C31p39RO67J09j49n81M92L96p77j74M38K11j79k54L46oj64j12N70j9q42J61
$$ plain form
6682 119 -509 -37 404 -84 -317 231 327 190 -192 136 549 -413 -223 366 229 112 -80 15 136 -160 27
6703 27 101 -43 -191 74 452 243 -60 -117 546 231 -268 -2 209 35 -482 -300 157 37 -105 307 711
6724 711 22 -576 -106 249 0 -302 -31 133 -456 -422 21 417 17 -126 289 384 -513 -638 214 158 -491
6745 -491 -86 194 131 -265 -258 70 203 -268 19 385 -45 -573 -64 199 -201 -434 -226 125 -58 -198 120
6766 120 320 29 -419 107 -25 -269 -165 332 585 -127 -143 355 222 -370 -289 462 394 -227 -375 43 312
6787 312 -151 -122 541 128 -372 -166 245 119 -11 148 502 -7 -333 128 227 21 -98 321 408 -138 -525
6808 -525 316 467 13 92 209 388 -232 -374 366 323 60 -44 514 21 -443 -205 463 291 -11 -41 331
6829 331 -408 -399 268 377 228 -353 139 535 -242 -416 22 233 54 -200 146 140 -24 -136 434 415 -427 -266
6851b66N01r1m46K72M36m65j40r1K74J42n16K08N02k42n30J45M17k32k01K68L98
6872C43l40m71M74L40k06m99L43M78n28m43K73L81k15j40N11n6l30l86K55L32
6892A16j72k70L59J46m78Q2J51J88o45K53L18J6o68J17P52k52j39L2o1N4j75K06
6914g0K93j28l31L35m3j78j70N25R1p81J85L53O7j55j46L69K24p82J53L89k31
6935c1o9l2L42p8k11j23K01p0j24J07L80J79o69j2N96l31l35N11M0l79j9J22j36
6958a41K39j56K11L60q99L05L51j44R9k17L64k91l64O3M42Q3m82p8K54L6k86K63
6980A2K2L6k04R9j4l10K3O82n26J96j07J3J57k31J40K29J55n40j69L43M4j19n5
7003a24K52k40r9l4j50M89m1k66L69k65j90K7M17j13k26PJ39J50p7j44rO1m3K37
$$ plain form
6851 -266 235 144 -302 -30 406 -59 -199 -290 -16 126 -390 -182 320 78 -452 -307 110 -122 -323 -55 343
6872 343 3 -468 6 346 140 -359 -16 462 -66 -509 -236 145 -70 -210 301 245 -85 -471 -216 116
6892 116 -56 -326 33 179 -299 -217 -66 122 -523 -270 48 64 -604 -487 265 13 -126 -94 -155 -101 -276 -70
6914 -70 223 95 -236 99 56 -122 -292 233 324 -457 -272 81 148 -7 -153 216 440 -342 -189 200 -31
6935 -31 -100 -132 210 132 -79 -202 -1 -71 -195 -88 292 471 -198 -210 386 55 -280 231 271 -108 -127 -5 -141
6958 -141 98 -58 153 513 -386 -81 270 126 225 8 372 81 -283 -220 222 305 -177 -255 -1 35 -251 12
6980 12 34 70 -134 -35 -49 -359 -336 346 -180 16 -91 -78 79 -152 -12 217 372 -168 -337 6 50 -69 -124
7003 -124 128 -112 -211 -245 -395 94 53 -213 156 -109 -299 -272 145 32 -194 -187 -48 102 25 -119 -128 -67 -110 127
7027A27Q1o30N10j65L8M6r2N37j87l12j74K40J84k11j10K36o4m6j8M44n27K92
7049A99k63R2M75n59j52J82M24n60J68J27P4l06M8K03k4q9K72%m44J44k57P04
7071D58n25k7K96j40J3j82K63k09K0K70k42k93M70l39M51j35k27J37J50j98o0
7092d9R9q2J4p5r8L62j70R3l4J60R7m42j02M32k59l8K38n5j1l30L9M56k85n1J97
7117A06n3k58J02Q1o4L3j44K32Q3n08K67j38K65j73k4K44l65M54k92K67l76K07
7139e4K46l99K32j97j30L01k62K74O1J2p1l39N05k85J96r2J52q6k56j1J08J55
7161F0K5j58J27J02j33r8L27j41k05J32j06K10k18j18L04L25n69K22mL1k45J0
7183a20M2J83o5l6J92k71Q3l8K96j78p7L16j19k47n2K12Lr6k5m5K34r0J2K15k53
$$ plain form
7027 127 208 -422 88 -77 -39 7 -85 452 265 -47 -221 19 203 -8 -118 118 54 8 -10 434 -93 199
7049 199 -64 28 503 -56 -208 -26 398 -162 6 133 207 -99 -51 152 128 39 311 311 -133 11 -246 458
7071 458 -67 -94 202 62 75 -107 156 -53 -33 237 -5 -298 172 -167 284 149 -78 59 209 11 -49
7092 -49 50 -32 -18 -93 -191 171 1 94 60 220 317 -125 -227 205 -54 -92 146 91 80 -250 -211 245 -40 -91 106
7117 106 53 -205 -103 -22 -86 -53 -197 35 118 -390 -123 -261 4 -169 -193 51 -314 140 -152 115 -261 -54
7139 -54 192 -207 25 -172 -302 -1 -263 11 72 84 13 -326 179 -106 90 -2 150 64 -192 -203 -95 60
7161 60 85 -73 54 156 23 -75 252 111 -94 38 -68 142 -76 -194 110 435 -134 88 84 115 -130 -120
7183 -120 -78 105 40 4 196 -75 8 -30 266 88 11 327 208 -39 -91 121 124 28 3 -42 192 102 114 329 76
7208G6ml37M81l15m4J19L08j45m55K81O1j16L9nM08j11l42J90r2j04j9K40l3r5
7232a4J71r2r1L76l69O2p3N0k26J64J62k19L44k77o5K41j77m8J50l31K85J10k67
7255a34j45N15q5k85j42J41J01j48k48N46lj25l93N21j17l80L92K63R6o05J76
7276e9N3K21q71P15K65m75j3J1L77m35q9M98l38R1n1Q7J67l66rK27M28n52q6L59
7300A55K32k13k11j09J68P0m14p2N52j75K3L00k88p6J40k32L58r5k34J00m4k04
7322b69J98L41l09O4P3L11l17k31R5L32m94k7K83K91n15J52J82J07m33K10O3k00
7344i3L06n94N42K71o29M9L36k25m33K11K72J6k72J41K23p4l25J85K93J42q86
7365e44M70K42n53K48J31K45m26m4J11L32k71oP3m8j61J18m0K01o5j95L64P6l30
$$ plain form
7208 76 72 -265 216 -99 -143 -24 284 139 -316 -35 26 -90 -51 -56 352 241 -101 89 -3 -107 -126 114 81 -14
7232 -14 157 65 -26 350 -19 43 -30 20 -206 -42 120 -99 245 -32 -97 144 -33 -81 69 -262 23 133 -134
7255 -134 -279 236 151 -134 -276 -135 -34 -182 -430 116 113 -12 -405 116 -1 -381 11 274 370 -235 -59
7276 -59 -6 215 -656 59 324 -151 -164 -153 224 -211 -300 198 -140 -49 -100 -13 154 -212 -221 6 434 -118 -204 155
7300 155 387 174 -37 -146 22 92 -322 -394 158 -17 6 306 18 -58 82 -150 208 113 -121 -21 -65 -269
7322 -269 -71 270 -39 25 98 409 92 -139 -44 288 -206 -233 50 341 -174 -22 160 267 -166 44 107 -93
7344 -93 213 -381 161 432 -197 -148 188 -37 -470 -259 13 29 -243 -102 121 47 -278 -93 200 342 -544
7365 -544 -74 168 -385 -137 -6 239 -187 -231 -120 212 -59 -65 8 -40 -201 -83 -123 78 13 -182 182 258 -72
7388g2j04L06j34j44j92P06m11m13K05M55j13l03M00L11m83l49O25j2k46j81K82
7409A33J32l39l63O01Mk21j65L57rn14l0M91J50j42m26M61kl87L55J88k0m03P3
7432g6M56l86rm1K80k32k67J60N56n64j2M17K53l17k63K60P9j55j80L02p6l44
7454a59J69O0j15j97k2N27j92l21J18N32j74o84L76M62l76k91J23L56k72L9j33
7475a74N04j96n46M90j28j8k30K16L8l25q8P92ro20K19K90L6o31L52N9L19n47
7497a97J18L42j88k45K19L00p8o52M94J05j2o20M03J52l87O9K53J25m79K02K0
7518e6K96j88l53N12k60J0l03N45L01q89N5L26J08k07j05N69k53k89J58K06j85
7539bn49K76O12k44l00K49PJ20n74L92L07l05n77M86J61o8r3K25q3r6p1K16Q6
$$ plain form
7388 -72 -176 130 -4 -148 -340 366 -45 -458 -253 202 89 -214 186 497 14 -335 290 278 32 -149 133
7409 133 265 -74 -437 164 168 -53 -218 139 130 -384 -414 77 227 85 -341 120 118 -269 86 274 254 -149 -76
7432 -76 380 -6 -15 -56 224 -8 -275 -115 441 -123 -135 282 535 218 -45 215 294 139 -41 261 185 -159
7454 -159 10 70 -45 -242 -264 263 71 -250 -132 400 226 -458 -82 380 4 -287 -164 192 -80 -41 -174
7475 -174 330 134 -412 78 -50 -68 -298 -82 -44 -369 -457 335 326 -294 -75 215 251 -380 -28 31 350 -197
7497 -197 -79 263 75 -170 49 349 271 -381 113 218 206 -414 -11 141 -246 -177 76 201 -278 -76 -56
7518 -56 240 52 -301 211 -49 -39 -342 203 504 -385 -330 -4 104 -103 -208 361 108 -181 -23 183 -2
7539 -2 -551 -275 337 93 -207 42 49 169 -405 -13 294 -11 -588 -102 59 -9 -102 123 40 -56 -127 89 175
7562A75n20L79q6M08n83k15Q62l67j53j7K84J78n81L90N6ok25o8K29n18J45M45
7584B12J90m25j78M17j23k24L09p9J72o50Q7L13J68k08l62N45J92m52j14J58J96
7605A44k57j28L70rk37lM57l88K20k24K91l15k79L22j3l6k61N49j92j59k22K07
7627a63L22k08j98O6J09Rl0PL69n63K68n3J03n80M53J50K11m17P2P6k43K98l39
7650b81Q08j98r4l76K35j38k03K74L21l52l51L70k9P0j51K52j20k20K6L15J6k77
7672a03j11K55Q1j93L8J47j1j08jK17K71n09k5L77n19J35N3K81k07RJ35K24l06
7695A30l08L94j12L0k61L36q7P0l88J85q1J35q6l0J2J81r3mM4Q0l77qO65n09%
7720h2l9K66O9k60N9R1j70r0L07j37k1j05K01l03J70k1r0J59J1k18J69Qk63N64
$$ plain form
7562 175 -345 34 -52 356 -227 -442 420 53 -100 -117 167 345 -236 154 210 204 -21 -89 140 -378 -233 212
7584 212 402 -23 -201 216 93 -131 178 99 271 -379 -292 21 189 -19 -381 164 356 -96 -210 -52 144
7605 144 -113 -241 129 120 -117 -120 337 -51 169 -55 236 -79 -358 -36 -49 -85 -346 203 11 -148 -370 -163
7627 -163 159 -49 -247 -181 -72 -63 -93 -86 283 -280 -12 -65 38 -542 -89 61 272 -145 -73 3 -240 58 -281
7650 -281 527 329 235 -141 94 -44 -247 27 348 -4 -355 15 -14 56 -95 157 37 -183 -157 158 174 -103
7672 -103 -214 41 122 -71 -33 114 103 -5 -6 211 482 -27 -52 325 -194 -59 -6 275 68 77 212 436 130
7695 130 -178 216 104 134 -127 209 122 192 -196 -11 -92 43 -43 -73 -61 120 27 23 67 147 -230 -238 427 -82 -82
7720 -82 -121 145 214 -46 13 104 -66 -156 151 14 -7 -112 89 -214 -44 -65 -155 4 15 -203 -34 -26 -289 275
7744B75k09j6l11M73j44J2m29L55k8po4j23N8LK28j10J26n69N76j13j69N4k40
7767c72O29M6m46J24R9l18k9O9N27l01j83K23n3P2l5J64k18K08l58J50l0j37r2
7790b61O75k10n6k89J83O2o9R7K27j20k85K43k52J42K01n60L76J4l53L86l89J33
7812a05J90j98L32j4l43L88l06J37j21K37m58L00j32K6N1m5r9n6J93O5j12J05
7834C5P4q6j82J62M04n85K00J93j46k59K96J87j92l11J79n5o9j62p8M33l9K3J7
7857C9j24l7n3rJ37k9L03j75J52j85P6J21qk28k58L29k5J9j08Oj0q9K47l03J76
7882c6M7P1j63J84l69K38R9q0l46M25q0o8j0L8J25M2j07k01N02n14J39K3r7q9
7906b27m4M37K55o24L11K6j92K8j54M28k87k8K09q5Q5l43J75M72j41l28k66K10
$$ plain form
7744 275 66 50 -261 212 68 80 -349 6 -22 -29 -93 -216 -158 -155 73 -37 89 -480 96 -17 -186 -132 -372
7767 -372 257 303 -143 -19 80 -238 -267 -198 329 28 -155 68 15 87 52 216 -2 206 -152 -2 -32 -169 -261
7790 -261 414 204 148 -141 42 104 35 132 359 239 -46 197 -55 87 288 -272 104 118 -235 151 -238 -105
7812 -105 85 -113 219 205 -138 250 -56 81 -40 197 -261 39 -93 -67 -16 -61 -160 -216 -23 42 -70 35
7834 35 109 23 -159 3 407 -178 22 215 69 -190 106 293 101 -210 -31 -86 -155 -317 -395 38 -1 22 39
7857 39 -85 -122 -175 -184 -47 -76 227 52 204 19 95 216 208 -20 -278 51 26 45 -63 -57 -67 -156 91 -212 -36
7882 -36 11 82 -81 103 -266 -28 71 -9 -355 70 -10 -78 -88 -50 75 117 10 -191 311 -203 -64 -41 -138 -227
7906 -227 -271 166 421 -203 108 134 -58 -30 -184 244 -43 -71 138 53 138 -205 -30 442 301 -27 -293 -83
7928h3q7k15M17L81l78o1J42L6q2j27K80j76J51j18l4J50l32J48R9J10n0k23K92
7951B40J18j85j49J21r6l07K11K67k05J16j68J72j53J5L9L10m09j98M11J4p5j48
7973e9M1j27m6L73k34K16k99J30j21L11l35o3M81K2l19K42j98j94r8M4K50j85
7995a68o6J57ML00p48R5L83j08l76M22K33l15k10L06J97j37K1J15k99Q8n11O51
8017C4J07m46J55P0J67m21J31M84m03K53k84L15o9k53J07K50k98j4J64P1j70j07
8039a57L06J02k79m29L76o4P6j26L91J25n51n4N7M01j46pQ9P8l32jJ18L4l10L47
8063D4K50l36j83k0M03j05l42M24L11m02j16k4L41k47m0j86N39q9l65L28k21k53
8085b89o7K79K23m09J70M15m6m77k94P75j76k67M2J42J33j16j45L48l27q3K17
$$ plain form
7928 -83 -170 -385 32 413 35 -26 116 152 70 -57 223 47 198 80 46 196 -136 12 111 221 171 -52 240
7951 240 358 173 24 145 49 -258 -47 220 15 131 -37 135 -18 -3 36 346 -63 -261 150 164 89 -59
7973 -59 -18 -145 -191 182 -52 164 -135 -5 -126 185 -150 -213 268 290 -29 213 15 -179 -277 -233 17 -168
7995 -168 -234 -77 -73 227 -521 -426 -43 -151 -527 -105 128 -187 -397 -91 106 -31 -10 105 -194 -106 -617 34
8017 34 141 -305 -150 -80 87 -334 -203 281 -122 131 -153 162 93 -160 -53 197 -101 -115 49 120 -50 -157
8039 -157 149 251 -28 -457 -81 -145 -69 -195 196 321 -230 -284 -227 174 28 21 110 188 -144 -145 -27 7 -303 44
8063 44 294 -42 -225 -245 158 53 -289 135 446 44 -72 -96 245 -2 -42 -228 311 222 -143 185 -36 -289
8085 -289 -356 -77 146 -263 -93 322 276 -201 -495 280 104 -163 -121 21 154 38 -107 241 -86 -169 48
8106D8K03l18J1K0j59K35j84N9M07n04l64M31J28p0l72N68K33k45j68K31P2m76
8128b14K65j47J26j54j32M82q4j25N5M4j68j82M19K5J4m97K50M26n67l08J58J81
8150a33l0K0J08J66m8m49N07J50m25J47Q7p6k0k52K21J75K9m23L07R0j87j50R5
8173i1K51l04K27K2j78N8j73M95m1l21J18M6j25l35M05K12n28Q2
$$ plain form
8106 48 251 -67 -56 -36 -195 40 -144 -85 322 -182 -546 -115 13 -57 -429 139 372 127 -41 190 262 -214
8128 -214 51 -96 30 -124 -256 226 142 17 72 116 -52 -234 185 210 224 -273 -23 403 -164 -472 -314 -133
8150 -133 -163 -143 -35 131 83 -366 141 291 -134 13 100 24 4 -248 -27 148 177 -246 61 151 -36 -186 -91
8173 -91 160 -144 83 105 -73 -15 -188 307 266 -55 63 109 -16 -351 54 266 -262 -180
8191a80
$$ Imaginary data points
##PAGE= N=2
##DATA TABLE= (X++(I..I)), XYDATA
0@%%%%%%qJ6j6J6j6K4l2M0m8N6p2Q5r9J16j34J57j81K07k39K74l13L54m02M56
30B41n12N74o42P18q03Q94r96J106j224J356j504J667j844K041k261K509k789
47a469L107l474L902m406N013n762O708p949R656j2163J6208k3799M2828j72946
61a44546l69399K75881J87138j23923K5922L00869j7558l11646n4666J88087q3273
72a27114k17242Q2959K16389n1252j09425J15244J03340j40640j18133O2710K678
83a80486j39337p831J76835J16350k0636k3187l5372j27556j20750K6371J16198
94b19401P7894J6848k08l622j9385m2416l3195J0677J2266l6569j6946P3774O1241
107a19042m5730k2423R0188K4293j40380r0274P6460M4682m7416P7605J73285
$$ plain form
0 0 0 0 0 0 0 0 -8 8 -8 8 -8 16 -16 24 -24 32 -40 45 -54 62 -72 85 -96 111 -128 146 -167 187 -215 241
30 241 -271 303 -339 379 -424 470 -526 580 -644 712 -792 875 -969 1072 -1189 1320 -1469
47 -1469 1638 -1836 2066 -2340 2673 -3089 3619 -4330 5326 -6837 9371 -14428 28400 -144546
61 -144546 -513945 -238064 -50926 -174849 -148927 151942 134384 -177262 -231928 -43841 -127114
72 -127114 -344356 -261397 -45008 -96260 -205685 -90441 12899 -127741 -245874 -183164 -180486
83 -180486 -319823 -327654 -150819 -34469 -55105 -78292 -113664 -241220 -361970 -335599 -219401
94 -219401 -141507 -124659 -124867 -128489 -147874 -190290 -223485 -212808 -200542 -237111 -254057 -180283 -119042
107 -119042 -164772 -187195 -97007 -72714 -213094 -303368 -226908 -182226 -229642 -152037 21248
118B1248l5622k06371l2046J20515k1103q9069R8659J31339r0596j06339J17003
129i2382J04826j21023r3510J06718N0363j23452k7536J44231N3913p5976K7114
140d6714R8050o3909j57035j728J08572K8845m561O9961L5618q4391o4355N2826
152b8821M8859l7925l1961L3159K9434n381J4927M4396J2721l8616l6225L008
164G575J0417j8095q642N7865Q3248J3320m9247l1328j7363m9449j6964Q5044
176F6381Q3321l2533n3620M0010M3084n0258l7760M5654M837p7240r31J09391
188A40336L9849o5045o123O0991k7094r2253k526N3431j5057j5371Q7494P4734
200B33366o2418r0810K996J8981l2475L154O6247J6889n1069l140N8173O194n8821
$$ plain form
118 21248 -14374 -220745 -252791 -132276 -153379 -242448 -143789 -12450 -103046 -209385 -92382
129 -92382 12444 -108579 -202089 -95371 -45008 -168460 -195996 -51765 2148 -73828 -46714
140 -46714 51336 -12573 -169608 -171336 -62764 -33919 -38480 31481 67099 -17292 -81647 -28821
152 -28821 20038 -17887 -49848 -16689 12745 7364 22291 66687 79408 40792 4567 7575
164 7575 17992 -103 -8745 49120 132368 145688 96441 65113 47750 -1699 -18663 66381
176 66381 149702 117169 63549 103559 146643 96385 58625 104279 109116 31876 30945 140336
188 140336 180185 115140 109017 170008 142914 50661 48135 101566 86509 71138 158632 233366
200 233366 170948 80138 83134 102115 69640 72794 139041 155930 104861 101721 159894 166088 107267
213A07267l0716J0422p009j0796L2275M2550r63k2243O0L630l1473m6444j2153
226C4407L1454L8196J9768R206j795l2387m8590j0457L0505Q015l0827m091M0521
239H3925J9395j9063l864O875l8772n2920J3099M6644n354k5861L0207L9872k5248
252F8935m3255j529j1199m6599n16O9208L5681l5732k3897J5338r440l6172J99
265a8978J8121k3081k6452L4824M9331n864l3966r036o820k8846j0338K2287Q857
278b9961j4855P778L4817J0489l0789l4796j7746n946O797K2148K0635m81j4648
291d6558o506R121K518k1455k8896o363J6066J7747J5794J4298m397k8017j8438
304h5086Q928M537k1608j1000K3208K4915O203N682K093k9273l7585L399K9689
$$ plain form
213 107267 76551 86973 79964 69168 101443 143993 143030 120787 120847 124477 93004 46560 34407
226 34407 65861 104057 123825 133031 131236 98849 50259 39802 70307 78322 47495 43404 83925
239 83925 103320 84257 80393 87268 48496 -4424 8675 55319 49965 24104 54311 94183 68935
252 68935 25680 24151 12952 -33647 -34163 35045 70726 34994 11097 26435 16995 -19177 -18978
265 -18978 -857 -23938 -50390 -15566 33765 27901 -6065 -15101 -21921 -50767 -61105 -38818 -29961
278 -29961 -44816 -37038 -2221 8268 -22521 -57317 -75063 -81009 -74212 -52064 -31429 -31910 -46558
291 -46558 -53064 -43943 -41425 -62880 -91776 -98139 -82073 -64326 -48532 -34234 -38631 -66648 -85086
304 -85086 -76158 -71621 -93229 -104229 -81021 -56106 -49903 -44221 -42128 -71401 -108986 -105587 -75898
317g5898M785j1557J0455J8368j123j573P451j4600l8055j0203L0183K5014J932
330e4821M600P257r131j1597M996k42k1517j2725K1688L0125J3271K609n003j8350
344d8840j6539N055J1811l055n770J0348J8933J3349P588p028k3963j8797M691
357e2217J6828J1133O544N838K285L158P948j364k0593j9781M334J9221J8458
370A792J4149N662j0024j2760K750O582q524j3013K198J5030J7208J7700Q025
383D6775j5593k4441n420R894M877l81M846O115O166J2893J1105j1737k6977j3208
397D914Q321J3888J1679R623Q08p205k30R225k072j8412j4473K544J4407J7587
411E0604J5089nj6754j3338J445M340l638o424j041N499J4414J7232J899j7960
$$ plain form
317 -75898 -71113 -82670 -72215 -53847 -54970 -56543 -49092 -63692 -101747 -111950 -81767 -56753 -54821
330 -54821 -50221 -42964 -52095 -63692 -58696 -58938 -80455 -93180 -71492 -41367 -28096 -25487 -30490 -48840
344 -48840 -65379 -60324 -48513 -51568 -57338 -46990 -28057 -14708 -7120 -14148 -38111 -56908 -52217
357 -52217 -35389 -24256 -17712 -11874 -9589 -6431 1517 153 -20440 -40221 -35887 -16666 1792
370 1792 15941 21603 11579 -1181 1569 8151 -373 -13386 -11188 3842 21050 38750 46775
383 46775 31182 6741 1321 11215 16092 15711 20557 26672 32838 45731 56836 45099 18122 4914
397 4914 13235 27123 38802 48425 49233 42028 41798 51023 48951 30539 16066 18610 33017 50604
411 50604 65693 65688 48934 35596 37041 41381 37743 31319 30278 35777 50191 67423 69322 51362
425E1362k0614p141M784P744O460J370l214K882J1078M220j2178j9158j1445P72
439A6922J1952J6770O854p909j0168J135L263n458j0526o932l161N989J9124J4745
453E2600p162j9217j0085N85n09j798J127k85p86Q967J4296Q70j9878j9633k795
468c703O169N726N061L561l700m913N320Q526p568k0476j2358O158J2872Q687
482I362N214r12j0498j0362K015N642p337j4068J056J5703J1610P07l521q831
496d220j6279o637J1589J1296p627j1535O031J4528M197l837n542j2590j7102
509c7728N46K0123J3453p053p526N988L619q350o452k267o421m997J2694K1720
523b651J075j8609r838P395M166n354j601J283p858m314J7514K2290n800k4366
$$ plain form
425 51362 30748 23607 28391 36135 42595 43965 40751 43633 54711 58931 46753 27595 16150 16922
439 16922 28874 45644 52498 44589 34421 35556 38819 33361 22835 15903 12742 18731 37855 52600
453 52600 45438 26221 16136 16721 16212 14414 15541 15256 14470 23437 37733 38603 18725 -908 -3703
468 -3703 2466 8192 13253 16814 13114 8201 13521 22047 14479 -5997 -18355 -12197 675 9362
482 9362 14576 13664 3166 -7196 -5181 461 -6876 -20944 -19888 -4185 7425 8132 4611 -4220
496 -4220 -20499 -27136 -15547 -4251 -11878 -23413 -17382 -2854 1343 -2494 -8036 -20626 -37728
509 -37728 -37182 -17059 -3606 -10659 -18185 -12197 -8578 -16928 -23380 -25647 -32068 -37065 -24371 -2651
523 -2651 -1576 -20185 -30023 -22628 -18462 -23816 -25417 -24134 -31992 -36306 -18792 3498 -2302 -26668
537b6668j0016N716n53k224J1755J0963q200p530J3723Q746k0475k1148J0156
550c5755J8205j459m031J0676j49j7912o7K4751N137k9206j6570J5846J3499j582
564a8617R572J4860j4295k9375J817K4176j464j7869Q928K4050k958j7470M044
577a4601Q878j7337j2875K4013K2687j8143k4515J2088K2037l345o458J0537n180
590b214l0943p492L5852K5615j6085j2524J2888l11k4873l259K6883M360k1103
603a3206N996L0122m607l5546k367K9585M462j9566N861J5454k0324k1418L0251
616D697M1344j5927l9362J547J4997j5037n824L8434K2438l2641k5134K3398J3514
629B6444l1042j1103L5119J6618k6709p347K5019m604l1820J1028M4084m408m6700
$$ plain form
537 -26668 -36684 -30968 -31521 -33745 -21990 -11027 -19227 -26757 -13034 -4288 -24763 -45911 -35755
550 -35755 -17550 -19009 -23040 -12364 -12513 -30425 -30492 -5741 -604 -29810 -46380 -30534 -17035 -18617
564 -18617 -9045 5815 -8480 -37855 -36038 -11862 -13326 -31195 -22267 1783 -1175 -18645 -14601
577 -14601 -5723 -23060 -35935 -11922 10765 -7378 -31893 -19805 2232 -1113 -7571 2966 -2214
590 -2214 -33157 -40649 -4797 20818 4733 -7791 5097 4786 -20087 -23346 3537 7897 -13206
603 -13206 -7210 22912 18305 -17241 -19608 9977 14439 -5127 734 16188 -4136 -25554 4697
616 4697 46041 30114 -9248 -7701 7296 -7741 -13565 24869 47307 14666 -10468 12930 26444
629 26444 -4598 -15701 19418 36036 9327 1980 26999 22395 -9425 1603 45687 41279 -5421
642e421q849K9703L156j1165K5580K6162l4556m9048J3563L9188n140j7892K2075
655B7356K0131k9963k7776K3757K0921k4755j3726L6040J5834l9620k3792L1539
667A5946K1882j9754l007K4959j4643n0434J019N6018K0450l0942q072J6918j9421
680A0919l5199K0611M5960r043l4764J2485K6214k5078l1433K5039L3117j9688
692A9140k3214J9953Q592l6325j1679M8113K9974l3245l2145R433K123j9192J4775
705c697M6557K765m6659j8867K3120M585j9214J0287L0030q241l2794J780K3534
718A3186q758k1957J8632L1734j7229m0593N71K6705N52o454K4557J3699m0885
731f240m0845K1075L8269l873j2380J7263L598l8420j7081L5838K1203k7360j1621
$$ plain form
642 -5421 -14270 15433 18589 7424 33004 59166 24610 -24438 -10875 28313 23173 5281 27356
655 27356 47487 17524 -10252 13505 34426 9671 -4055 31985 47819 8199 -15593 15946
667 15946 37828 18074 15067 40026 25383 -25051 -24032 31986 52436 21494 13422 30340 10919
680 10919 -24280 -3669 42291 33248 -1516 10969 37183 12105 -19328 5711 38828 19140
692 19140 -4074 15879 24471 -11854 -23533 24580 54554 21309 -10836 -1403 720 -18472 -3697
705 -3697 42860 45625 -1034 -19901 3219 7804 -11410 -1123 28907 20666 -12128 -10348 13186
718 13186 4428 -17529 1103 32837 15608 -24985 -24414 2291 2843 -3611 20946 34645 -6240
731 -6240 -47085 -26010 12259 8386 -3994 13269 16867 -21553 -38634 -2796 18407 -8953 -20574
744b0574K9621L780l8599q117L7524J0823k5377J196K2190k1201m0707J6048N0069
757A6676M760k8386k868O147k5641j7033L5649L4970k0425k9642J0194J3662j8783
770b0720r847K6458J4204k2821j4287J6402M010k1480m66L2189J1994k5606k0682
783c0652O279K231o826J5907L0418m612l8498j5139K0706J1545r732N934J7920
796E481j0530k8455M656K6738k409k1193Q666K2720j2720k8873P136K4265l793
809h311r178J9511R959l4543k7268K5636L0765p881j0810J3573l412l0840k590
822c5389L5816J1746k6334p959K0660m34k2128N162K5193k559j9945O113J6423
835F365j4852k2027J5185K9291j334j7720K87K041j5691m874K6158K1501j4851
$$ plain form
744 -20574 9047 12827 -25772 -33889 3635 14458 -10919 -9723 12467 -8734 -49441 -33393 16676
757 16676 21436 -6950 -9818 -3671 -29312 -46345 -10696 24274 3849 -25793 -15599 -1937 -20720
770 -20720 -30567 -4109 10095 -12726 -27013 -10611 -6601 -28081 -28547 3642 15636 -9970 -30652
783 -30652 -24373 -22142 -28968 -13061 17357 12745 -25753 -40892 -20186 -8641 -18373 -12439 5481
796 5481 -5049 -33504 -28848 -2110 -4519 -25712 -17046 5674 -7046 -35919 -28783 -4518 -8311
809 -8311 -17489 2022 11981 -22562 -49830 -24194 6571 -1310 -12120 1453 -1959 -32799 -35389
822 -35389 427 12173 -14161 -22120 -1460 -1894 -24022 -18860 6333 3774 -16171 -10058 6365
835 6365 -8487 -30514 -15329 13962 12628 -5092 -4805 -2764 -18455 -23329 2829 24330 9479
848I479k3000M291J1767m251l607J3305O489j6202r382J5181R891j3387n889J7707
862A2392R225j7068j1503J0430M241r493P958K4130l606l0363p894K1264Q248
875A7961j0468M952J3956j2964k0188J3096K2837q947j8655R575J4158j2027j1989
888A297J4471J0481j4116m395J8732L702k4658r934J9448J1902p859K8P817j0595
902A6321j7216Q118K1443r59j5675j375P992j818m676P143N382r148q427P006
916A4111Q617o860r485M714J0099K5n517j280k044p397r56J2536R693q041j4037
931D178J17P714K76k025L629m90j0743k987J2368O950j1389p776O906L714p041
946C401j509O280l076r171O537J3253m965j6076k359Q641O91j962N498P32j1734
$$ plain form
848 9479 -13521 -9230 2537 -1714 -5321 7984 14473 -1729 -11111 4070 13961 574 -5315 12392
862 12392 21617 4549 -6954 3476 7717 -1776 6182 30312 26706 -3657 -11551 9713 17961
875 17961 7493 12445 26401 13437 -6751 6345 29182 20235 1580 11155 25313 13286 1297
888 1297 15768 26249 12133 7738 26470 30172 5514 -4420 15028 26930 19071 19099 26916 16321
902 16321 -895 7223 28666 27707 12032 10657 18649 16831 12155 19298 24680 15532 7105 14111
916 14111 22728 15868 6383 11097 21196 21221 15704 14424 12380 4983 4027 16563 26256 18215 4178
931 4178 4295 12009 12285 10260 13889 13399 2656 -331 12037 18987 7598 -178 6728 10442 3401
946 3401 1892 8172 5096 -4075 2462 15715 10750 -5326 -7685 956 1647 -315 5183 5915 -5819
961e819n870J1157Q255q075q560K479J963k634K856N906m054r474P81Q346P0o840
977i513l392K842J576K129K700j502p611n079M345O485J040m844l837J05K591
992a1965K773J552k909n302k965L376O022P63m910l448K795K825m9q12k038m358
1008a8650j030O434O297k807p109j720K909K258J656L14l057m546J618P123L639
1023f671m519n137r66K311K548K819p94m254k468L941O358L84m742m591l80L894
1039a2267M624J906k532m427n58L399M682L92m446l499P70M704M194O58l580m171
1055a0151k37M913M358j131m107k416K260M049M144n72m626l993K212N315L076
1070C094j512l261j604J832M268K737j932n085j604L720N367J728j646l790j638
$$ plain form
961 -5819 -11689 -532 7723 -352 -8912 -6433 -4470 -7104 -4248 1658 -2396 -11870 -11089 -2743 -2673 -9513
977 -9513 -12905 -10063 -8487 -6358 -3658 -5160 -12771 -17850 -13505 -7020 -5980 -10824 -14661 -14556 -11965
992 -11965 -9192 -7640 -10549 -15851 -18816 -15440 -9418 -8655 -13565 -17013 -14218 -11393 -11442 -12254 -14292 -18650
1008 -18650 -19680 -13246 -6949 -9756 -16865 -18585 -15676 -13418 -11762 -11448 -14505 -19051 -17433 -10310 -6671
1023 -6671 -11190 -16327 -17293 -14982 -12434 -9615 -10409 -14663 -17131 -13190 -6832 -6448 -11190 -15781 -16161 -12267
1039 -12267 -7643 -5737 -8269 -12696 -13254 -9855 -5173 -4781 -9227 -12726 -11956 -7252 -3058 -2400 -5980 -10151
1055 -10151 -10388 -5475 -1117 -2248 -6355 -8771 -6511 -2462 1682 1110 -3516 -7509 -5297 18 3094
1070 3094 1582 -1679 -3283 -1451 2817 5554 3622 -1463 -3067 653 6020 7748 6102 2312 674
1085F74K399M957J226k924l798j17M339L890J227l178l686n87L919L783L27l624
1101H827k207R39M246L686j531m500k647J399M045K948K6l033l261J190N333K214
1117A7674l527l753q66J600L853L141j119m898k979L506M402o59l447j992j21
1132A0815J592L725K834l424o596l75N580K517k439k293j317j081J689N105J377
1147A7709o407o199J994N389J217k125j016k019j990J789M963o25p396l776M948
1162F456M889j239l175j646j701j099K951N079k998q689k865O638M481k244k401
1177B437l32l948l205N312N891m232q024J213O299n59m486j36J037l780j300P222
1193e91K676r224p473O076P153k300l965J310k233o723K573J1421R37j1371m209
$$ plain form
1085 674 3073 8030 9256 6332 2534 2417 6756 10646 11873 8695 5009 4422 8341 12124 12451 8827
1101 8827 6620 7559 11805 15491 13960 9460 6813 8212 12257 15205 15231 12198 8937 10127 15460 17674
1117 17674 14147 10394 9528 11128 14981 18122 17003 12105 9126 12632 17034 16375 12928 10936 10815
1132 10815 12407 16132 18966 15542 8946 8571 14151 16668 14229 11936 10619 9538 11227 16332 17709
1147 17709 11302 5103 7097 12486 13703 11578 10562 8543 6553 8342 13305 12680 5284 1508 6456
1162 6456 11345 10106 6931 5285 3584 2485 5436 10515 7517 -1172 -4037 2601 7082 4838 2437
1177 2437 2105 -1843 -5048 264 6155 1923 -6101 -4888 1411 852 -3634 -3770 -2733 -6513 -7813 -591
1193 -591 2085 -7139 -14612 -8536 -1383 -3683 -7648 -6338 -8571 -15294 -12721 -1300 -363 -11734 -15943
1208a5943O570J881n357R30N358k840p021M151P909n102j0786L702J0147o37o967
1223a4005P33K570o158k119J1387P119j0979j1090N189Q174k741j646P272k2j1735
1238a8051k753J2048L533j1014j825J1904K180j0215j562P702k250p053P625J1994
1252B263p720j5733K527J3353J332m889M446K972j2306q111J2981J3027o897r051
1266a1806N956N344q447m184J0244M694q750j496J1066J049j4568l493J4234P714
1280G557p696k803N067n113j1705P889J9968J203j7504n087R177l12o532Q733
1294B842J2534p703j4894N564J2349p032j0432J0924J2982r169j1854P071N853
1307I035j0821j527K0146P130k0751j2640J1819Q762o949L650J4332o198k2261
$$ plain form
1208 -15943 -9373 -7492 -12849 -11919 -6561 -9401 -16422 -12271 -4362 -9464 -20250 -16548 -6401 -7038 -14005
1223 -14005 -13272 -10702 -16860 -18979 -7592 -473 -11452 -22542 -17353 -9179 -11920 -13566 -6294 -6316 -18051
1238 -18051 -20804 -8756 -5223 -16237 -18062 -6158 -3978 -14193 -15755 -8053 -10303 -17356 -9731 2263
1252 2263 -5457 -21190 -18663 -5310 -3978 -8867 -4421 -1449 -13755 -21866 -8885 4142 -2755 -11806
1266 -11806 -5850 -506 -8953 -13137 -2893 1801 -6949 -8445 2621 3670 -10898 -14391 -157 7557
1280 7557 -139 -2942 2125 -2988 -14693 -6804 13164 14367 -3137 -8224 953 641 -5891 2842
1294 2842 15376 7673 -7221 -1657 10692 3660 -6772 4152 17134 7965 -3889 3182 9035
1307 9035 -1786 -3313 16833 23963 3212 -9428 2391 11153 4204 7854 22186 15988 -6273
1320f273k54J8997L610j1856L406J1681p588j5672O167J3930m922q957J0540J0498
1334B3307j4263j6192R070J5546k032n762O617j40j7516p342J8619J5764q973
1347A6703j1397M640Q00j1767k05J8334N758j5232o230J1863L73j5603M42J9896
1361A8375M122j5865m482R341n982j2804J1568K3277n311k3761l232J1971l588
1374C629n741J5674J2812j8149j9947J1164J4414r684q164J5926P559j8848j1121
1387a0476J4571O388j3954L25K0120O60k5081q361J6601N760p960O199J2614j3159
1401D247k4424N269K3071J175j2466L298P625j3260j3757J3226J6669q698j2766
1414a0791R293P884j5426j1304J4042J3954q491o981Q588j711j9040k700K3305
$$ plain form
1320 -6273 -6527 12470 16080 4224 7630 19311 11723 -3949 2218 16148 11226 2269 12809 23307
1334 23307 9044 -7148 1922 17468 15436 9674 16291 16151 -1365 -8707 9912 25676 16703
1347 16703 5306 9946 10746 -1021 -1226 17108 22866 7634 1404 13267 13640 -1963 -1521 18375
1361 18375 22497 6632 2150 11491 5509 -7295 4273 27550 22239 -1522 -4754 7217 3629
1374 3629 -2112 13562 26374 8225 -11722 -558 13856 4172 -3992 11934 19493 645 -10476
1387 -10476 4095 10483 -3471 -3146 16974 17634 -7447 -15808 793 6553 -1407 4792 17406 4247
1401 4247 -20177 -14908 8163 9338 -3128 170 7795 -5465 -19222 -5996 10673 1975 -10791
1414 -10791 -1498 6386 -9040 -20344 -6302 7652 -839 -7820 768 -943 -19983 -22683 622
1427F22J1419j5042j0573P037j640j2251N778K1136O1k1124m417J3893l93j2627
1441a8121N326J7144m665j7220K378J1338p805j0367J3838J7755j1973j9249L946
1454a7675J0577o425k778J7342O656k1491j4158J5247J2729j0095l690J3891k78
1467a48j8486k497J8156K251j3684K143J5719m330j9107J283J6115m07q394Q526
1481b860R221j4105j6710J0482J8283k706r225M475L382j1726n273J5309J0208
1494H755j0815q636Q312M651j0044l105J2650N311r227k818Q410j397j2749R30
1508i772J6885O064j1786n461N431j477o788P031J4717l772j6293o01J2086J91
1522F455p790N590R036o962j1276O903R935p219q177J0377J0386r690j0895O568
$$ plain form
1427 622 12041 -3001 -13574 -6537 -8177 -20428 -14650 6486 6547 -14577 -18994 -5101 -5494 -18121
1441 -18121 -12795 4349 -316 -17536 -15158 -3820 -11625 -21992 -8154 9601 -2372 -21621 -17675
1454 -17675 -7098 -13523 -16301 1041 7697 -13794 -27952 -12705 24 -10071 -13761 130 -148
1467 -148 -18634 -21131 -2975 -724 -14408 -12265 3454 -876 -19983 -18700 -2585 -2992 -11386 -2860
1481 -2860 6361 -7744 -24454 -13972 4311 1605 -7620 -3145 237 -11489 -16762 -1453 8755
1494 8755 -2060 -10696 -2384 2267 -7777 -10882 1768 7079 -2148 -4966 3444 2047 -10702 -9772
1508 -9772 7113 13177 1391 -4070 1361 -116 -6904 127 14844 11072 -5221 -5822 6264 6455
1522 6455 -1335 4255 13291 6329 -4947 1956 11891 4672 -3505 6872 17258 7568 -3327 3241
$$ [...]
8191a53
##END NTUPLES=NMR FID
##END=
