##TITLE=1H_LR-693-RM1
 CDCl3, 8 sc, 
 14.10.2019
##JCAMPDX= 6.0         $$ Bruker NMR JCAMP-DX V2.0
##DATA TYPE= NMR FID
##DATA CLASS= NTUPLES
##ORIGIN= UXNMR, Bruker Analytische Messtechnik GmbH
##OWNER= root
$$ XWIN-NMR		Version 3.5
$$ Mon Oct 14 14:05:47 2019 Russian Standard Time (UT+4h)  she@DPX200
##.OBSERVE FREQUENCY= 200.1315
##.OBSERVE NUCLEUS= ^1H
##.DELAY= (6, 6)
##.ACQUISITION MODE= SIMULTANEOUS
##.ACQUISITION SCHEME= undefined
##.AVERAGES= 8
##.DIGITISER RES= 18
##SPECTROMETER/DATA SYSTEM= spect
##.PULSE SEQUENCE= zg30
##.SOLVENT NAME= Acetone
##.SHIFT REFERENCE= (INTERNAL, Acetone, 0, 15.7039)
##AUDIT TRAIL= $$ (NUMBER, WHEN, WHO, WHERE, WHAT)
$$ ##TITLE= Audit trail, XWIN-NMR		Version 3.5
$$ ##JCAMPDX= 5.01
$$ ##ORIGIN= Bruker BioSpin GmbH
$$ ##OWNER= she
$$ F:/spectra/data/she/nmr/H-F/1/audita.txt
$$ ##AUDIT TRAIL=  $$ (NUMBER, WHEN, WHO, WHERE, WHAT)
(   1,<2019-10-14 14:04:36.29 +0400>,<she>,<DPX200>,
      <created by zg, POWCHK disabled, PULCHK disabled
       configuration hash MD5:
       00 E9 B6 7A A2 85 ED C7 34 08 36 98 17 FE 4E 26
       data hash MD5: 16K
       93 39 AD 33 F3 BF 36 F4 21 77 BE 78 7C E4 DD CA>)
$$ ##END=
$$ 
$$ hash MD5
$$ 53 29 3D 56 D3 10 10 41 13 37 98 26 21 54 E2 6E
##$RELAX= 
##$RELAX= 
##$RELAX= 
##$RELAX= 
##$RELAX= 
##$RELAX= 
$$ Bruker specific parameters
$$ --------------------------
##$DU= <F:/spectra>
##$EXPNO= 1
##$NAME= <H-F>
##$PROCNO= 1
##$TYPE= <nmr>
##$USER= <she>
##$AMP= (0..31)
100 100 100 100 100 100 100 100 100 100 100 100 100 100 100 100 100 100 
100 100 100 100 100 100 100 100 100 100 100 100 100 100 
##$AQSEQ= 0
##$AQ_mod= 1
##$AUNM= <au_zg>
##$AUTOPOS= <>
##$BF1= 200.13
##$BF2= 200.13
##$BF3= 200.13
##$BF4= 200.13
##$BF5= 200.13
##$BF6= 200.13
##$BF7= 200.13
##$BF8= 200.13
##$BYTORDA= 1
##$CFDGTYP= 0
##$CFRGTYP= 5
##$CHEMSTR= <none>
##$CNST= (0..31)
1 1 145 1 1 1 1 1 1 1 1 1 1 1 1 1 1 1 1 1 1 1 1 1 1 1 1 1 1 1 1 1 
##$CPDPRG= <>
##$CPDPRG1= <>
##$CPDPRG2= <>
##$CPDPRG3= <>
##$CPDPRG4= <mlev>
##$CPDPRG5= <mlev>
##$CPDPRG6= <mlev>
##$CPDPRG7= <mlev>
##$CPDPRG8= <mlev>
##$CPDPRGB= <>
##$CPDPRGT= <>
##$D= (0..31)
0 1.2 0 0 0 0 0 0 0 0.06 0 0.03 0 0 0 0 0.0002 0 0 0 0 0 0 0 0 0 0 0 0 
0 0 0 
##$DATE= 1571047475
##$DBL= (0..7)
120 120 120 120 120 120 120 120 
##$DBP= (0..7)
150 150 150 150 150 150 150 150 
##$DBP07= 0
##$DBPNAM0= <>
##$DBPNAM1= <>
##$DBPNAM2= <>
##$DBPNAM3= <>
##$DBPNAM4= <>
##$DBPNAM5= <>
##$DBPNAM6= <>
##$DBPNAM7= <>
##$DBPOAL= (0..7)
0.5 0.5 0.5 0.5 0.5 0.5 0.5 0.5 
##$DBPOFFS= (0..7)
0 0 0 0 0 0 0 0 
##$DE= 6
##$DECBNUC= <off>
##$DECIM= 24
##$DECNUC= <off>
##$DECSTAT= 4
##$DIGMOD= 1
##$DIGTYP= 9
##$DL= (0..7)
0 120 120 120 120 120 120 120 
##$DP= (0..7)
150 150 150 150 150 150 150 150 
##$DP07= 0
##$DPNAME0= <>
##$DPNAME1= <>
##$DPNAME2= <>
##$DPNAME3= <>
##$DPNAME4= <>
##$DPNAME5= <>
##$DPNAME6= <>
##$DPNAME7= <>
##$DPOAL= (0..7)
0.5 0.5 0.5 0.5 0.5 0.5 0.5 0.5 
##$DPOFFS= (0..7)
0 0 0 0 0 0 0 0 
##$DQDMODE= 0
##$DR= 18
##$DS= 0
##$DSLIST= <SSSSSSSSSSSSSSS>
$$ [...]
##$SUBNAM2= <"">
##$SUBNAM3= <"">
##$SUBNAM4= <"">
##$SUBNAM5= <"">
##$SUBNAM6= <"">
##$SUBNAM7= <"">
##$SUBNAM8= <"">
##$SUBNAM9= <"">
##$SW= 24.0689530833862
##$SWIBOX= (0..15)
0 0 2 0 0 0 0 0 0 0 0 0 0 0 0 0 
##$SW_h= 4816.95568400771
##$TD= 16384
##$TD0= 1
##$TE= 0
##$TE2= 300
##$TE3= 300
##$TEG= 300
##$TL= (0..7)
0 120 120 120 120 120 120 120 
##$TP= (0..7)
150 150 150 150 150 150 150 150 
##$TP07= 0
##$TPNAME0= <>
##$TPNAME1= <>
##$TPNAME2= <>
##$TPNAME3= <>
##$TPNAME4= <>
##$TPNAME5= <>
##$TPNAME6= <>
##$TPNAME7= <>
##$TPOAL= (0..7)
0.5 0.5 0.5 0.5 0.5 0.5 0.5 0.5 
##$TPOFFS= (0..7)
0 0 0 0 0 0 0 0 
##$TUNHIN= 0
##$TUNHOUT= 0
##$TUNXOUT= 0
##$USERA1= <user>
##$USERA2= <user>
##$USERA3= <user>
##$USERA4= <user>
##$USERA5= <user>
##$V9= 5
##$VALIST= <valist>
##$VCLIST= <CCCCCCCCCCCCCCC>
##$VD= 0
##$VDLIST= <DDDDDDDDDDDDDDD>
##$VPLIST= <PPPPPPPPPPPPPPP>
##$VTLIST= <TTTTTTTTTTTTTTT>
##$WBST= 1024
##$WBSW= 4
##$XGAIN= (0..3)
0 0 0 0 
##$XL= 0
##$YL= 0
##$YMAX_a= 298029
##$YMIN_a= -368046
##$ZGOPTNS= <>
##$ZL1= 120
##$ZL2= 120
##$ZL3= 120
##$ZL4= 120
##$ABSF1= 10
##$ABSF2= 0
##$ABSG= 5
##$ABSL= 3
##$ALPHA= 0
##$AQORDER= 0
##$ASSFAC= 0
##$ASSFACI= 0
##$ASSFACX= 0
##$ASSWID= 0
##$AUNMP= <proc_1d>
##$AZFE= 0.1
##$AZFW= 0.1
##$BCFW= 1
##$BC_mod= 2
##$BYTORDP= 1
##$COROFFS= 0
##$CY= 11.3945322036743
##$DATMOD= 1
##$DC= 2
##$DFILT= <>
##$DTYPP= 0
##$F1P= 20.1720416913024
##$F2P= 0.152960286110954
##$FCOR= 0.5
##$FTSIZE= 0
##$FT_mod= 4
##$GAMMA= 1
##$GB= 0.15
##$INTBC= 1
##$INTSCL= 1
##$ISEN= 128
##$LB= 0.24
##$LEV0= 0
##$LPBIN= 0
##$MAXI= 10000
##$MC2= 0
##$MEAN= 0
##$ME_mod= 0
##$MI= 1.114404
##$NCOEF= 0
##$NC_proc= 0
##$NLEV= 6
##$NOISF1= 3.799351
##$NOISF2= 2.8
##$NSP= 1
##$NTH_PI= 0
##$NZP= 0
##$OFFSET= 15.70392
##$PC= 1
##$PHC0= -9577.185
##$PHC1= 25.00093
##$PH_mod= 1
##$PKNL= yes
##$PPARMOD= 0
##$PSCAL= 0
##$PSIGN= 0
##$REVERSE= no
##$SF= 200.130013532006
##$SI= 16384
##$SIGF1= 3
##$SIGF2= 2
##$SINO= 400
##$SIOLD= 16384
##$SREGLST= <1H.CDCl3>
##$SSB= 0
##$STSI= 0
##$STSR= 0
##$SW_p= 3612.71676300578
##$SYMM= 0
##$S_DEV= 0
##$TDeff= 0
##$TDoff= 0
##$TI= <>
##$TILT= no
##$TM1= 0
##$TM2= 0
##$TOPLEV= 0
##$USERP1= <user>
##$USERP2= <user>
##$USERP3= <user>
##$USERP4= <user>
##$USERP5= <user>
##$WDW= 1
##$XDIM= 8192
##$YMAX_p= 0
##$YMIN_p= 0
$$ End of Bruker specific parameters
$$ ---------------------------------
##NTUPLES= NMR FID
##VAR_NAME=  TIME,          FID/REAL,        FID/IMAG
##SYMBOL=    X,             R,               I
##VAR_TYPE=  INDEPENDENT,   DEPENDENT,       DEPENDENT
##VAR_FORM=  AFFN,          ASDF,            ASDF
##VAR_DIM=   8192,          8192,            8192
##UNITS=     SECONDS,       ARBITRARY UNITS, ARBITRARY UNITS
##FACTOR=    0.0002076,     1,               1
##FIRST=     0,             0,               0
##LAST=      1.7004516,     0,               0
##MIN=       0,             -368046,         0
##MAX=       1.7004516,     298029,          0
$$ Real data points
##PAGE= N=1
##DATA TABLE= (X++(R..R)), XYDATA
$$ [...]
1943I64m93l7J19J63j73n26M19m5q64P01K53O2k99j23M10K30l67l78L99m19j51
1964a55J80R37l50l1m32K15k98j62M47q2r0J98j65M99p37k3J27L13j37l50J89
1985I3J02m1l62P32j13k88o07L94N0Nj59N47j45l06j08L86O2l83M6M40q0n72K08
2008i9J18J08k37Q4N3j60Rj94K09K18j26K00j0m82k39K56K50J14M1j39K82m33
2030a77k86O02k11Mo3j01K42o93K43M15M75o84k87L21k36k75M15L63p7l52m4K34
2052a72j35j18J63L08j6l93J90j46k0j70L17Q9p7j45K33K10l50L5P8K71o49OL00
2075a91O4j6L06l81K40n23r8L37O2Oj4L21k76q6J29K57j99j01J53j67j18P3m20
2098f42Q47n26K46K20o8j85k4J72Mj76j30O80l78j76J68l7J27k77K75k00L34k53
$$ y = [964, 471, 434, 553, 716, 543, 17, 436, 391, -473, 228, 481, 543, 244, 121, 531, 761, 394, 16, 415, -4, -155, 25, 962, 612, 581, 149, 364, 66, -96, 351, 269, 179, 377, 212, 711, -26, -49, 78, 391, 254, -96, 93, 195, 154, -208, 524, 411, 123, -484, -90, -40, -35, -194, 353, 208, -98, -206, 180, 242, -141, -95, 345, 265, -307, -99, 19, 127, -110, -26, 27, -133, -124, -318, -109, 109, -17, 183, 173, -309, -548, -292, -42, 72, 113, -26, 256, -177, -463, 139, -72, -68, -131, -232, 10, -683, -440, -25, 450, -234, -521, -200, -436, -711, -296, 67, -10, -362, -406, -172, -307, -425, -262, 46, 30, -363, -173, -319, -339, -509, -192, -103, -180, -325, -92, 118, -232, -197, -119, 152, -497, -491, -191, -127, -143, 163, -218, 22, -501, -599, -262, -200, -194, -208, 113, -163, -249, -120, 137, -62, -163, -10, -177, -295, -222, -642, 205, -321, -75, 145, 77, -108, -132, 40, 44, -132, -262, 418, 40, -136, 32, -5, 122, -155, 120, -80, 254, 1]
2120Ar4M74k12m26J14J82J21OK13j4K0l95J89j47r8J97K35r5j57M8n7J60k30j94
2144a59N03k99l3L07k7K19m93K60K05n27J40m3O8K78pJ05l65m7j92J78K22l74
2166h1L54Q4k16n1j72M30L02k41k92j46K48j81K0L07m0k73o5J21J42k89N8K87
2188C06n4j49J87J93o62K93n8N11l69m5K16J54l35j72K17N2k42k94N25j50j54
2209c0M7K3K20j70k85J81Nk64n2L59J53l49L0K52j39J90l18J24J86j76j34L31
2231A84l3m60k2L32P8m08J19K57k18K96Q1l00P1q3RM7Q6j01J17q5j04J18P5j72
2255a16k4n7M2l5O2K72m7k51j16M8j34K08j50K67j83K59j23l7L29m92qN1N5R3
2279h7r7J96j13R8J31k97J43r1k42%J85k5l2N0K17l84O62k16m60j65M18O6n0k32
$$ y = [1, -93, 381, 169, -257, -143, 39, 160, 166, 379, 365, 385, -10, 179, 32, -66, 131, 366, 271, 114, 162, 105, 265, 35, -159, 344, 45, 12, 319, 292, 511, 18, 278, 483, -44, 96, 53, 121, 399, 392, 497, 132, 85, -107, 71, 293, -81, 273, 357, 141, 90, -82, 348, 650, 409, 117, -29, 219, 38, 58, 365, 325, 52, -13, 108, 250, -39, 19, 306, 252, 103, 290, 483, -179, 114, 56, 567, 198, 153, 369, 523, 188, 16, 233, 285, 43, -251, 274, 124, -30, 17, 40, 260, 90, -195, -14, -9, -273, -325, 34, 187, -162, -132, 120, -19, 171, -147, -23, 163, -13, -147, 184, 151, -309, -331, 1, 79, -329, -210, 47, -171, 125, 206, -94, -23, -106, -97, -50, 36, -65, 52, -33, -137, -19, 56, -116, -140, -197, -155, -190, -128, 144, 97, -154, -270, -222, -356, -148, -298, -31, -214, 45, -78, -115, 214, -278, -286, -235, -180, -87, -184, 12, -101, -3, 128, -169, -26, -117, -359, -359, -174, -199, -231, -181, 36, -348, 314, 98, -362, -527, -109, -43, -93, -325]
2303c25L25q7J23j46P9Q7p20M75N88n55J13K15n19J26J64r8J26N0K6k35L24n20
2325c84J14K8k3J71l79L84l90L78loQ2j17r0MK00N6o2j39P3J54j22nr6J46R3l05
2351b38K30j41J74j92M2r9Q0M60j33l1o3K0J64k73jp5O7k21O8N3J12K76j50j5
2375A14J8J75j81J8j42J94M6j90j49J20M04k71j87K05k61J1n7L62m18L30K90k83
2397A48j74J30P4j98j6j24L45j84N3q3M02l27J85j34K04K4k61j10j52J81m0M12
2419C55j03l39M08j76j39L9K7k28k3K64l6p6K88k92j3J49L29l87P0K37l92L7J41
2442A40p1o3j71m1M89l28K58l12L18l21J90j08J15J27M8K6k70l69M81l8J52l41
2464h9K2k34L55l7J00j86O1k9J33k3l46K68J75J1m93K64n3J28k14J40L34n43J76
$$ y = [-325, 0, -87, 36, -110, -31, 56, -664, -189, 399, -156, -43, 172, -347, -221, -57, -155, -29, 21, 47, -188, 136, -384, -270, -242, -265, -94, -473, -89, -479, -101, -104, -110, -28, -145, -235, -231, -31, 25, -37, -176, -103, 51, -71, -76, -172, -26, 67, -238, -8, -149, 25, -167, -125, -224, -144, 316, 183, 152, 89, 109, 273, 0, -1, -76, -9, -230, -162, -109, 3, 279, 129, 114, 132, 307, 126, 144, 2, 196, 242, 52, -97, 23, 427, 156, -31, 174, -87, -76, -133, 229, -189, 141, 431, 148, -26, 104, 178, -20, -36, -160, 185, 1, 54, -29, 373, 46, 231, 97, 301, 325, 64, -46, -198, -17, -57, 355, 252, -87, 321, 145, 6, 45, 72, -156, -179, 85, 49, -27, 261, -31, -44, 105, 434, 47, 117, 354, -38, -1, 140, 69, 6, -165, -206, 283, -45, 213, -99, 219, -102, 88, -20, 95, 222, 270, 296, 26, -343, 138, 100, 252, -89, -67, -301, 54, 17, 117, -69, -8, -37, 96, 73, -273, -5, 170, 181, -312, -48, -101, 27, -187, -47, 287, -256, -80]
2487h0q2K46k68L18o2k44J62J65j96L3J07k34M7j23K44j66J39J9j0j56K76j79
2509d4j7m0k3p7K19J54k23j58L23j90J09O8k27j86L75l35K81J25j28j99J79J75
2531A61j75q3K53j86R3Q5l82M24j94n8J22Kk95M54k06j70L77k88J35j01j14J52
2553FQ9k4m4k82R9K99k34J71J13l51L32l65N9k99N30m2l0j22Q0k9K4o5oJ09L84
2578D02l44l3PJ5K9P7J68l47k25O45j48l26K41r0j70rK64m54J68J83k43R2R3j22
2602a27J12l01N72k73k35K46J80k02r0j7L47l98k3K86J61j75MJ56k44K3j78L68
2624A92j94Q5L5m65M64j74LK63j30L0j84qj03j45P83n11k7O7o4o8L73j27j00J41
2648A36m52K19R2j57o8M66l15M5k30J94M6J28l45M39j85k07R7J19M1J82k94j75
$$ y = [-80, -162, 84, -184, 134, 72, -172, -10, 155, -41, -8, 99, -135, -88, -211, 33, -133, 6, 25, 15, -141, 135, -44, -61, -101, -124, -201, 18, 172, -51, -209, 114, -76, 33, 101, -126, -312, 63, -272, 9, 134, 6, -193, -14, 161, -14, -97, 156, -30, 63, 148, -234, 190, -4, -62, 60, 62, -233, 221, 15, -155, 222, -66, 69, -32, -146, 6, 95, 71, 27, -255, -156, 143, -91, 80, 193, -158, 174, -191, -132, -431, 99, 57, 27, -95, -15, -44, -20, -85, -91, 18, 402, 58, 25, 32, 47, 76, 153, 321, -26, -251, 394, 246, -80, 161, 71, -99, -108, 156, -298, -130, 53, -190, -98, -5, -127, -15, -316, 256, -17, -252, -6, 174, -28, -118, -135, 212, -186, -209, 77, 238, 63, 67, 223, -21, 2, -176, 192, -2, 83, 118, -347, 117, -57, -54, 209, 79, 109, -75, -83, -186, -331, 452, -59, -86, -19, -83, -151, 222, 95, -5, 136, -316, -97, -5, -162, -230, 236, -79, -34, -264, -70, -24, 104, -241, 198, 13, -194, -97, 22, 63, 245, -49, -224]
2670b24K07j60J39N8M9O0OK69o46K37J85l28J00N2j43J17O2J69k8l44M65l18J62
2693A46Rn6j32J28m0j49K1J13jj05n4p8K05K3M36o22L29J6k43K27l43J32m8p4
2717a60J20K06p8n5j24k9K86l06p6K62l64O2L12J23o01L36J57k68J70j46P7J85
2739H9K5k33K82j9n6n4l22J37k1L35k84P5PL76j66j46m3K01k36k6J61k92K2M18
2763B30m10L12k61K64o3K19K6j46l15J68m5j31L89l9k94O2J9J10j66J9J75j03
2785B0j78J4J01K83m97N20n35J63K49j77P5J97P3j03p1K9l69J98J43j73J27J08
2807A97j20P3j34N7O2k31J48n1l2j2N9J02O7n25N03j36J35p0q0m3J0j49L92l68
2831a46J91k74L96k12j38M4j77J76K03L7n2j09Nn2j68M22j43j41j34N86l70M9
$$ y = [-224, -17, -177, -38, 20, 69, 129, 135, 404, -242, -5, 180, -148, -48, 4, -139, -22, 40, 209, 181, -163, 302, -16, 146, 155, 99, -33, 95, 55, -94, -73, 40, 39, -66, -120, -198, 7, 30, 466, -156, 173, 189, -54, 173, -170, -38, -86, -160, -40, 166, 88, 33, -91, -120, 166, -140, -216, 46, -318, -256, 56, 179, -422, -86, 71, -197, -27, -173, -96, 89, 114, -119, 163, 144, 88, 34, -288, -151, -172, 163, -121, -46, -39, 337, 171, 25, -18, 183, -53, -79, 82, -210, -188, 230, -180, 132, -129, 135, 72, 291, 317, 171, -144, 24, -21, -152, 237, 198, -96, -34, -15, 95, -71, -52, 123, 20, -158, -144, -43, 240, -257, 263, -272, -109, 140, -37, 38, 235, 308, 205, 134, 163, -206, -8, 135, -38, 89, 197, 77, 150, 16, 73, 135, -96, 52, 1, -31, -43, 16, 118, 185, -340, 163, 27, 162, 92, 12, -31, -21, -170, 222, -146, 45, -229, 167, -45, -183, -139, -316, -140, 63, 100, 48, -61, -56, -108, -276, 146, 3, -138, -272, 314, -56, -7]
2853gJ01k03Qj7rJ87O2n9J50j12l34j4L98l6l72K56j42J01K13l0J09k74P0l23
2877b77L67J09j93J81k42P6L6R2j41Q4P6Jl04j15L11m6J07p2%j63K94m32J49L4
2901f8J80j08l72M17j89J4Q8P1o1J44j45p8P7L5n9L53n0j75J56j26j58j83M98
2924B61Q4k73k29Q8M6J61j15K70ol56O1k39K13J25j42j37M3p8L52m5Pl83J61K81
2948A50j12j90r9K55k28J44P5J62p5J5l81P0K28o7o1Q4j31J41j5nO1J02l88M28
2972A63k25L7K7L3q8l5J26n1M8m1L6N4j91pK3J06j98K91k55M87m25o1L28l24J63
2997B1j68K63N1k57M10m90j6K50k74K24R4j64p6J5l7L51m19n2K30q5n8J12J7Q1
3021B3Q3j06lJ25Kk49J6K01L2k03O9j46J21l54M26J4K5k09m7K15J45k47J46J14
$$ y = [-7, 94, -109, -101, -118, -127, 60, 122, 63, 213, 101, -233, -247, 151, 115, -257, -1, -143, -42, 171, 141, 250, -24, 46, -277, 90, 199, 6, 187, -55, 21, 57, 149, 8, 92, 168, 169, -135, -250, 61, 15, 122, 50, 50, -113, 181, -251, -102, -68, 112, 4, -368, 49, -140, -126, -38, 33, -28, 116, -29, -107, -30, 5, -54, 299, 249, 74, 230, 104, -54, -237, 261, 345, 72, -157, -69, -23, 138, 23, 293, 287, -69, -8, -247, -34, 91, -51, -188, -145, -223, 129, 84, 91, -292, -131, 150, 38, -152, -251, 4, -224, -80, -5, 157, 82, 97, -284, -214, 14, -53, -114, -30, -161, -20, -35, -40, 21, 123, -265, 163, -62, -25, 2, 35, -53, -88, 38, -13, 35, -6, 30, 84, -107, -114, -91, 15, -183, 108, -147, 340, -85, -146, 182, -142, 21, -147, 116, 167, -90, 320, -170, -186, 64, -210, 14, 108, -56, -132, -117, -154, 197, -222, -274, -44, -129, -187, -75, -58, 23, 106, 0, -3, 122, 124, -125, -109, 92, 124, -79, -10, -156, -35, -389, 37, 51, 76, -133, -180, 35, 180, -67, 79, 193]
3045A93l28J88r6L44n28M97J3m85J02J41L2Q6p8q9p6J88l37L68l02J03kK35j87
3068a8R2k56N8l0J67p1J74j26K09j58k88M13j24k2n3K71r2l6k25l2Q6J82k81L06
3092A46m25K13K25j24k88L92j15L57o06L87P8J9k71Nq6J73j47J22j12R5J17l64
3114b09N18k36K29k94M4o6J56L9j43L26m32J02J20l45L05l15L52J04k47K33L9
3135B80m77L44m14L23m2k7J21l49J11J30j80M28l35J94J74j06k01K40j60N2o8
3156C8K5J11j39J00J51j84K39m62J91j83J38P4m6j10j14K33j24J49r8L56m94m3
3178a92K62R6j11J43j23j2L2j03J54l42K91J91k34N1J60l80j16K79j10J53j88
3199i9qk27M22lj03q8K02j24J77k84j18L70k41J70j27J68k96K68M8m58N08j30
$$ y = [193, -135, 53, -43, 301, -227, 270, 283, -202, -100, 41, 73, 159, 81, -8, -84, 104, -233, 135, -167, -64, -66, 169, -18, 74, -182, -124, -154, 13, -58, 116, -10, 199, 41, -247, 166, 42, 20, -33, 238, 146, 110, -115, -147, -61, 121, -160, 146, -279, -66, 159, 35, -253, 139, 24, 381, -225, 162, 240, 259, -12, -7, -93, 80, -67, 55, -57, 38, 155, -209, 309, 73, 302, 8, 52, -14, 142, 181, 38, 364, -68, 34, 154, -191, 114, -201, 151, 255, 8, 241, 280, -197, 147, -267, 56, 14, -13, 108, -241, -130, 0, -180, 248, -87, 107, 281, 175, -26, 214, 54, 106, 38, 63, 174, 35, 135, 286, 102, 341, -121, 70, -113, 25, 99, 53, -57, -171, 62, -62, 87, -11, 345, -149, -192, 70, 166, 55, 198, 75, 63, 95, -8, 146, -196, 95, 286, 52, 103, 263, -117, -233, 46, -64, 89, -99, -107, -334, 88, 85, -18, -106, 96, -28, 149, -135, -253, 117, -124, 46, -81, 87, -209, 59, 107, -351, 157, 27]
3221B7kk23J99j10J52j63K19j17k5q9K27o8k23K83K4mk36q5M70k22p3k65J94L39
3245B29r7j54mO3P8J4j95J82k11J89kk08O5Q9p2j65J99k0L71j23k04l2j23rJ94
3270E4k14K25K08j98j92k50J37r7O09k45r5j33K50p1L8k62J37J2K26k71k50M20
3292C8l2j33M59m80P3RK01j39k1n9J66K18l22L3j31P2L6QK20m82J6L15M7nl95
3317b88L56j4K29n15K25k1j37J91k09K32o8n1KL13j46L3j42L0J3m9K69l00M2r9
3341a04L49k46n1L88l0n68K19J46J47o89L71P6J29O7n6m2J80l65K15j11l1k82
3363b88N28k22J93n73L97M9Lr3j58K18j32N1Q5J09N2J21m12k98L71JM8Q2p0J59
3387B21m93L05P3k16J27P1m4j09L87l26l00J18J33m7Q3k0L9m0p0K95j50kj07k73
$$ y = [27, 25, -198, 1, -109, 43, -120, 99, -18, -43, -132, 95, 27, -196, 87, 111, 107, -129, -214, 256, 34, -39, -304, -110, 229, 132, -22, -26, 37, 115, 129, -66, 116, -95, 94, 92, -116, -51, 38, -34, -199, 0, -20, 351, 228, 24, -8, -131, -140, 54, -160, 65, 273, 75, -117, -367, -230, -327, 282, 37, -58, -191, 59, -12, 26, -236, -99, -87, 139, -132, -382, 38, 6, -127, 332, -148, -75, -66, 135, -4, -25, -84, 82, 300, -22, 11, -120, -48, -12, -4, 216, -266, -250, 65, 112, 107, -288, 68, 54, 283, -232, -7, -28, -165, 26, -183, 49, -19, -70, -68, 245, 99, 132, -10, 20, 33, -16, 253, -47, -5, -104, 245, -1, -52, 336, 306, -262, -43, 103, 250, -439, -68, 8, 137, 204, 148, 106, 286, -79, 136, 25, -6, -288, 240, 18, 211, -362, 35, 84, 87, -6, -164, 54, -78, -27, 58, 167, 219, 340, -72, -370, 1, 2, 50, 132, 62, 221, -272, 33, 106, -110, 17, 88, 44, -65, 322, -4, -304, -186, -53, -100, -17, -37, 2, -38, -108, 187, 37, 35, -72, -345]
3411c45J38K43N9j68j72M62k45J88M2j41q7p2RP0K36m24K48r3oJ48l04J02L47
3434B35m50M18L0P7k80k2j39J23k14J32N9j27J44J36j89J25n3qo3o8O1J74o1l0
3458A0l7j69J60k1K38j31J00j87j4K02k3k46K12J79k32j02j03M48j68j42K70P7
3480C21n02L54k0m47K48Jj6J25J5k05J67m03L59J60l32J62Kj1J43M2k16q2k9N18
3504C54k87J0r4K51l86j87K34L08l44l2J38j73K24J20j74J66r7pq6M8O9j6j06
3527f7j61K70o0J8K0r3p7M04j99J9k18O7L3o8L45l43L70m29K62j03k18M02l32
3550a58R2j1r6K18q1j42J16l0n6M02l93K18k59J03j75K58Lo1J03J73l84J55J06
3573A01ql14K73%k54K52K1MO6k14J76M6k23k7J83j9j8M4j6q8m0K41o5m1j54M64
$$ y = [-345, -207, 36, 95, -73, -245, 217, -28, 160, 202, 61, -26, -98, -89, -19, 217, -207, 41, -52, -58, 90, -214, -112, 235, -215, 203, 233, 310, 30, 8, -131, -8, -222, -90, -31, -158, -14, 122, -67, 58, 5, -3, -66, -134, -73, 101, 40, 10, -27, -196, -36, -57, 181, 50, 150, -37, -51, 151, 128, -118, 94, 273, 41, -61, -164, 284, 116, -26, 244, 321, -181, 173, 153, -294, -46, -45, -61, 64, 79, -126, 41, -362, -3, 157, -175, -13, -11, -22, 121, 163, -53, -135, -164, 354, 67, 77, -17, 234, -152, -339, -105, 203, -141, -173, -35, -208, 16, 136, -38, 128, 31, 24, -62, -14, 55, 39, -67, -228, 42, -18, 0, 20, -73, -150, 254, 55, 74, -144, -77, -44, -112, 233, -110, 260, -169, 93, -10, -228, 174, -158, -66, -77, -173, 45, -36, -178, -62, -92, -148, 254, -139, 79, -180, -77, -252, 6, 9, -52, 51, 224, -160, -5, 101, 93, -221, 52, 52, -202, 50, 71, 75, 141, -73, 103, 149, -74, -101, 82, 63, 45, 89, 73, -15, -55, 186, 121, 80, -74, 390]
3599C90m67j17K93k14K70l4J35l44L3j03O5J42k3Oj23j7K07J2M9j60J11m8rK81
3623C35m18k09K9J63K71k3l29K70M9j27Ol3J28q1j9%J28pm41L17n3qk4k4j21L00
3649G9K4P2rk07J19k10QJ82j41J69k23J0O0O5J56j76l4J63j37O9k01Qp6K0j35
3674c45J59k9N19l64K03p2j44K00m10J43P7j8K45l70K0l1J87J17k31K8L30l17
3696a03m0J30J42j44Q0j6J24k84K0j50J82L50l32l2J27j31j7R1L2q5j2k6J84J2
3720A02j86Q3P6k37J82k60K01J48j25k18K13j3q0Q4J38m67K92J0J22r0k49M93
3742B19j18j00j61m8K51k00N2J21j61j6L22r1j03j41L5j76O26l75j38R4J33J28
3764A53l53L60j26M1Kj69J94k89K44j69J57J85j84j28rJ88k10j80L3L19j10n9
$$ y = [390, -77, -194, 99, -115, 155, 121, 256, -88, -55, -158, -93, 49, 26, 32, -91, -108, 99, 111, 160, 0, 111, 63, 54, 335, -83, -292, -263, -100, 171, 148, -181, 89, 138, 11, 17, -16, 112, 31, 12, 12, 140, 133, -308, 9, -44, -52, -76, -100, -221, 79, 103, 175, 166, -41, 78, -132, -124, 58, -83, 86, -137, -127, -67, -2, 154, -22, -56, 107, -30, 39, -162, -154, -230, -210, -345, -186, -215, 304, -60, 143, 71, -73, 127, -283, -140, -63, -81, 164, -206, -186, -217, -30, 87, -144, -116, 214, -103, -143, -13, 129, -15, 65, 49, 173, -111, -91, -241, -59, 291, -41, -73, 54, -77, -94, -3, 29, -56, -68, -94, 90, 102, -84, -1, 75, -162, 20, -240, -39, 109, -16, -234, -21, -34, -114, -30, 108, -359, -67, -57, 65, -25, -274, 219, 101, 1, -160, -208, 43, -157, -105, 16, -145, -161, 161, 70, -33, -174, -139, -315, 311, -64, -202, -108, 25, 153, -200, 160, 34, 75, 77, -92, 102, -187, 57, -112, 45, 230, 46, -82, -91, 97, -113, -293, -260, 59, -51, -110]
3786a10j64K18j43lP2M6nK25j25o7J26j1l1K55m19j72M04j88J45k29M5J42o4K90
3810B37k08J36k16n8J4J23j82j70K05K36m42J90K43R3k12K56l28K08j36L21k13
3831I7J20l38O8r7J76K24j98l7j18J09N0L09q8m41Q1j3K13q5K62l71j94r4L71
3854F%OL2J16m51K91k41J74J5J76j76J60j61q9M24l99K3k43L79J7k56J47J13j55
3878i2K9k97N48l42L32k20N3K92m72L31J06k25j25L06o85M39oj03PJ91J16m48
3900b65M17J03k44R3k44k97M42K94m30J51P4J92j67L1l5o5K2nk4m0N5j67L51k08
3924C4j28K50k32m5M4P7r1J04Q8j25K26m86M66j39O0K7j54J14j92L11J21k98m14
3947c82N66o0m2k59k8L00rj26jR1r3n1m5K49m2L5q5k6J65k23J33j72Q7r3R4K32
$$ y = [-110, -274, -56, -199, -202, -130, -84, -89, 136, 11, -56, 70, 59, 28, 283, -136, -308, 96, -92, 53, -176, -131, 11, -53, 237, 29, 165, -51, -109, -95, 28, -154, -324, -119, 117, -325, -135, 108, 201, -11, 245, -83, 125, -11, 310, 97, 217, -121, -53, -150, 26, 250, 52, 15, -103, 6, 56, 365, 277, -164, -83, -96, 117, 32, 294, -77, -271, -365, 6, 6, 12, 44, 160, -291, 0, -241, -67, -52, 124, -52, 108, -53, -142, 282, -117, -94, -337, 42, 59, -197, -50, 63, -92, -63, -360, 188, -154, 178, -42, 11, 303, -169, 162, 268, 43, -82, 224, -461, -22, -28, -131, -124, 67, 183, -265, 152, 255, 11, 104, -140, -437, 5, 299, -131, 20, 94, 286, 119, 150, 115, 50, 72, 67, 43, 3, 58, -109, 242, 34, -94, 156, -76, -121, -77, 0, -91, 13, 101, -24, 202, -284, 182, 43, 103, 130, -24, 90, -102, 209, 330, 32, -382, 184, 124, 82, -177, -205, 95, 86, -40, -41, 50, -43, -94, -139, 110, 68, 103, 18, -8, 157, -66, 67, -105, -18, -111, -17, 215]
3973B15k06k22K54M7o5J06k22L07Qk62K23l03R4j50K12R4j76k07K45J65J62k13
3995A06k54J72K52k01j27J46m5q4K9L7o8k43M63k76J22l66M42l0j33R6m0j80L0
4018a52J12j0k09J39M12m27M09l54J13J58j80Np7l1P6j63J55N6r2p3M35j41m18
4041b57J70N19m66P6k21J48K90m06K35nr7J22m42N53l6k46J08J68r0j86L10k89
4063d2P4j83K88J89k11j06P0J23k37J00J74l26J36M4r3p3m33M67J52l39K61mk25
4086a94L89r4QK99l56k17L46l17Q4j87M58K05m47k17M64j57K1K8k31L16m27J72
4108e4J42k35P2o4J76J29J02m26M50m07m1O9P9K27k65r0J02o2J62J16k02j17J27
4131a0o0K16l55K76lk6m4N3k29K7J80l03M12j24j40j9J59J47j15RR9r2j94K95
$$ y = [215, 9, -213, 41, 88, 23, 129, -93, 214, 222, -40, 183, -120, -26, -176, 36, 130, -46, -253, -8, 157, 319, 106, -148, 24, 276, 75, -52, 94, 49, -35, -6, 31, -37, -280, 183, -93, 29, -337, 105, 75, -58, 38, -2, -182, -152, -40, -50, -259, -120, 292, -135, 274, -80, 33, 191, 11, 16, -61, -92, -16, -179, -24, 32, -60, -133, 302, 161, -257, -87, 432, -34, 42, -179, -31, 259, -147, 88, 83, -14, 108, -334, 219, 183, -63, 45, 213, 123, -63, 247, -42, 32, -151, 137, 326, 115, 9, 79, 202, -35, 65, 239, -87, 49, 93, 0, -73, -506, -39, 113, -226, 35, 31, -194, 195, 101, 109, 408, 52, -165, 181, -136, -52, -239, 219, 424, -23, -240, 224, 67, 88, 116, -115, 201, -226, -54, 88, -147, -75, -139, 37, 166, 268, -158, 292, -115, -156, -87, -8, 219, -46, -136, -34, -96, 66, 182, -20, -137, -10, -70, 146, -209, 67, 64, 38, -6, 47, -182, -155, 25, -278, 134, 10, -130, -149, 10, 157, 42, 51, 150, 58, -136, 159]
4155A59J30j07j55j6K19j47k61J68J84l5l8l86M18L7l90L37j75j9R3j4p8J05k84
4178b55L12LO3j86K32ON9k27Nn3P7j29M9j9J20j23l8k5j13J36J57j23K94k13m4
4203c5K0L2J0J11k54K38J49r0k8j24k01L44l63K61J54n8m46L68J76l05M4K6K70
4226B99j35J25j67Q7m04L32j84M4K45m16K27l0j69J65J77l65L45k21J12n0p0K81
4248B28k88l63M00N0p8J02j75L05l29K72P4j90N4J68j17j6lk53M8P5J38j22j03
4271a23J4N5k30O03n20J79J70J60n48Q9OK40k00r8L23O0N2j77j4k3p6n0l4M08
4295B66k13j55L50l17LJ85j38k6K2M3j57L6J16K60j03m47N06m46N79l34R4l04
4317a80N9J78m9r8L39k56N7j39K31n2j75Q7N5j89J16l13J47K59j08l4J10K41l24
$$ y = [159, 289, 182, 27, 11, 230, 83, -178, -10, 174, 139, 101, -285, 133, 170, -220, 117, -58, -77, 16, 2, -76, 29, -255, 57, 60, 123, -63, 169, 175, 234, 7, 12, -41, 36, -93, -44, -63, 57, -66, -104, -129, -242, -106, 51, -72, 222, 9, -35, -15, 17, 27, 138, -116, 122, 271, 181, 153, 29, -172, 172, -191, 70, 224, 166, -280, 88, 264, -41, 3, 29, 299, 164, 289, 122, 209, -195, 137, -47, -3, 242, -174, 53, 23, -146, 19, 196, -169, 176, -45, 67, 17, -53, 228, -60, -423, -23, 27, -51, 51, -124, 181, -148, 124, 198, 8, 62, 230, 113, 97, 94, -159, -111, -36, 102, -20, -123, -109, -54, -284, 319, -201, -22, 148, 308, -240, -151, -145, 95, -105, -203, 120, 180, 232, 55, 41, 18, -58, -108, -142, 266, 53, -102, 248, -69, -66, 119, -19, -45, -23, 20, -137, -101, 15, 275, 172, -275, 231, -215, 364, 30, 124, -180, -121, 57, 8, -90, 249, -7, 50, -89, 142, 90, -85, 2, 57, -132, -16, -329, -182, 77, -31, -65, 45, 286, -38]
4340c8L7m5Q1j18J0j89J42J50n4O4o2k25J18K70l26J44J60k78K28k33P1P9O9k00
4364a45Q9Q8J83j88j19K15n6l1R2k12J90k46OO5Q1j04J14J08J27j9K6k54p6M14
4388C48m64J38j45J9R6K97l25j89M34j25j38nP9J50j18j2O7O2N3m8N2k97K42p8
4412I3j16LJ38j42J42j52M7m7K04k00K25k09q9J83M0k99J07RK52l47J31j01J37
4435Im9j82L17q0j73J04K28M0l25K08J11j21p7J60j85J06o2K12m06j4L10p9J40
4458A92K47l41lj43M8j12K24k50J38L18l21K26l40J48o9J15j86J18K68l67J47
4479E7j09J20j4j05j40K03R6k66J35l5J48j03j5R9p8M0m4jR6j3k62K01k12p4K03
4504g3K7j16L85l23J76L59m48j23J53j5k19J82J83j65K30j0m3k22j4l2K09k59
$$ y = [-38, -1, -46, 35, -83, -73, -262, -120, 30, -24, 40, -22, -247, -129, 141, -185, -41, 119, -159, 69, -164, -93, -14, 55, -145, -56, 32, 215, 27, -92, 123, 67, 36, 128, -84, 106, -140, -134, -69, 12, -92, 22, 130, 257, 238, 264, 10, -66, 348, -116, 22, -123, -104, -8, 289, -36, -225, 209, 84, -54, -59, 20, 170, 52, 40, 107, 169, 222, 174, 226, -71, 171, 93, -23, -20, 118, -24, 118, -34, 13, -34, 170, -30, 195, -14, -103, 80, 120, -179, -72, -63, 189, -158, -27, -128, 9, -40, -222, 95, 15, -158, -54, 174, 214, -111, 97, 208, 87, 10, 170, -15, 91, 29, 241, -165, -179, 131, 52, 192, 439, 98, 95, -48, 0, -112, 112, -138, 0, 318, -3, 223, -117, 31, -38, 77, -109, 9, 277, -90, 57, -52, 68, 54, -51, -191, 12, 108, -158, -23, -58, 90, -13, -28, 71, -7, 33, -11, -12, 84, 71, -191, 10, -202, -276, -73, -46, -162, 223, -100, 76, 435, -13, -136, 17, 2, -217, -35, 148, -17, 213, 203, 160, -62, -76, -108, 101, -158]
4526a58O08m34o2q9j70L81n9RJ62R6j12k25N6O0j83L90n28J21J82j02j11Q1M9
4549c8J00l55L42J2k84L55j51J62k20J90q8o7P8OK5r1l34K33K14j86K46j39j87
4572a77P5O3r0R9j64O2m9q0L30j90J23L19l18p5L1K34q1q1K16l25K43k22L41l90
4596a06K29o8N1k18J39j05kOK10j86N2J71m32N27l71M26n47L77j84p%j27j11K67
4620iJ71M4k20%k6j56K36j59m2L11r9j14J49j91L13l86M0o1J65k33K79K87m50
4643a51J09j66J50L12k90j91J42O0K82J7j72l59L98k31KL10l40N4K61l19p0P5
4665a17J21R0j61Qj07K09j26L55l34k4j05J66o4PJ4P9jq3NM9n3P8o7j08j1K30
4691E0j18J66j14J8j65K64J63l67N5K58j4j95Q1J70k96OM1J21P5l27J09j7R9k19
$$ y = [-158, 450, 16, -46, -135, -305, 76, 17, 26, 188, 284, 172, -53, 3, 63, -120, 270, -258, -137, 45, -57, -168, -87, -38, 62, -293, 49, 61, -223, 132, -19, 143, -77, 113, 25, -42, 36, 42, 67, -24, -358, -125, 89, -97, 149, 10, -177, -102, -39, -129, -30, -194, -132, -181, -261, 69, -121, 2, 321, 3, -72, -41, 193, 112, 31, 247, -78, 165, -57, 284, -106, 123, 55, 106, -112, 27, -78, -80, -74, 136, -50, 2, 173, -259, 268, -103, 323, -224, 153, -31, -38, -38, -165, -276, -9, 162, 206, -14, -14, -40, -196, 40, -119, -161, 150, 51, -63, 86, -105, 208, -178, -138, -199, -34, -267, 12, 299, -151, -42, -208, -58, 254, -36, -227, -85, -25, 257, 274, 102, -257, 141, -90, -88, 222, -118, -64, 197, -122, -192, -117, 4, 94, -67, -59, -166, 43, -83, 272, -62, -86, -191, -25, -89, -82, -68, 11, 10, -73, -68, -19, -72, 6, -61, -169, -180, 50, -68, 98, -16, 2, -163, 101, 264, -103, -48, 210, 196, 1, 82, 252, -44, -38, 3, 124, 199, -128, -19, -36, 63, -156]
4715a56P7l4R1J68l54K90j80J94j58J19q1K27l14K38M6l01Q0K11Lm87K37j40K28
4738Dk57L53k12J81l3m2J30q3j7n4j02L50m2J1j91q6J0K6J63k70L02j28R9j91
4762g9j13M12j29n03M79J93k81K2m5K23m51L22j37J31N8k74j6M55m09n1K40o8
4784b1j30m44O43k70L01o6n4K2M3K06n71J59o3J55K0J51j35j97M48q6JK62o28
4807b54J28K02N5j57J30J67l76J01J63ml01L28k14J56j60KK55j94n9j28NJ61j28
4830a22L43k22lo9k21M72j53RR0k70M1M44l27j01%J88J6o5k19L35l00J25j27J60
4854B4o9JK8R0K49m12Q7k4mj55J26K66p4j19j30K83j2k01J9k14J06Q6J2K52LP
4880B25n15K61K00m78M12m89K37J71n0J23j33J01PK4jj63l7r5O7J40l12J64J95
$$ y = [-156, -79, -113, -22, 146, -208, 82, -98, 96, -62, 57, -24, 203, -111, 127, 173, -128, -48, 163, 166, -321, -84, -224, 4, -253, 100, -112, 69, 36, -6, 124, 41, 24, -30, -132, 218, 176, 187, -4, -90, -80, -54, 109, -161, 141, 13, 112, -79, -192, 220, 91, -412, 67, 260, -21, 1, -44, 179, -272, 50, -87, 44, 102, -172, -188, 267, -142, -193, 47, -21, -151, -595, 48, -222, 79, 13, -41, -19, 24, 230, -341, -182, -245, -90, -70, 81, -54, -251, 197, 111, 112, 374, -254, -126, 76, 131, -26, 104, 271, -105, -4, 159, 155, -146, 182, -32, 124, -36, -34, 221, 27, -32, -160, -155, 6, -122, 221, -1, -4, -73, -294, 178, 25, 34, 124, -146, -105, 339, 12, -89, -89, 99, 115, 50, -169, 166, -134, -9, -136, 24, -45, -44, -16, 74, 323, -89, -2, -26, -30, -185, -59, 207, 133, 14, -116, 167, 155, -46, -27, -241, -135, -49, -37, 215, 218, 225, -290, -29, 171, -307, 105, -384, -147, 24, -26, 97, -36, 65, 72, 96, 95, -68, -105, -200, -133, 7, -305, -141, 54]
4903E4Q1r1J16j62j90J43J49k5k62L74j58Q7k55K78m24K99M1J49l50o3M2o4J34
4926i7K34j76j77J71L66m06P4j4K36jk68O8QN9j18J31k9o2R1L8J8j89l8O9LK58
4952B49k54O6k17J27J46q0k84J48q7L22j21q3o3K92mj98jp4L20k36p2K43j35p4
4976g0KK07j95K82K2k58Rr6n5L15k53J18M8J1j64L25l00o2n9J12MK47k46L26n0
5001B20k56n2M8O3J36k79J94K10l68J75l73J08R6J95%j97L4R4r3J10j17rL4Jl2
5026e8m0j27K27Q4J73l43K55k00J60j6n7l7r8QK76p3j85K57n8m11N68l23J52k33
5050i9nL69k73J11o5L06l6m44K51j79lRj88L37L7j71J43r2J7n9l62K59J19L6j99
5075a81L57j80l00j1M52j17k17J77J14j26n1J52k71K87j09m1K8k41K87K8L8J00
$$ y = [54, 135, 44, 160, -2, -192, -49, 100, 75, -187, 187, 29, 116, -139, 139, -285, 14, 55, 204, -146, -209, -167, -231, -97, 137, -39, -216, -45, 321, -85, -11, -25, 211, 210, -58, 10, 18, 77, -41, 90, 61, -1, 90, 128, 146, -43, -81, -12, -9, 249, -5, 61, -156, -29, 117, 37, -247, -99, -186, 136, 15, -68, -131, 161, 157, -41, -42, -116, 204, -32, -104, 139, 4, -70, -68, 139, -56, 226, 248, -10, -1, -97, -152, 163, -90, 28, 76, 87, -77, 248, -52, -114, -173, -61, -57, 190, -56, 270, 220, -36, -88, -40, 23, 159, -120, 74, 284, -84, 91, -282, -174, -78, 117, 117, -80, -46, 48, -45, 65, -52, -61, -27, -26, -58, -98, -225, 2, 86, 259, -84, 171, -29, 131, 115, 58, 21, -77, -69, 207, 134, -51, 206, 148, -263, 305, -18, 134, -99, -104, 265, -8, 103, 38, 344, 308, -136, 115, -64, -67, -58, -246, 91, 128, -43, 100, 8, 25, -34, -396, -137, -18, 18, -181, 176, -4, -304, -315, 137, 20, -197, -20, 94, -32, -83, 69, -202, 85, -24, -65, -37, -278, 9, 37, 75, 175]
5097A75k62K67k35J13o9J07k46J95j60p8M19n62L96J61k22K67l19K24P8k63J84
5118A70j98mP5J16j86l44J12N7K83j20p5r9K22P4L2J00k9j79r5J98J35l02j85
5141b42J89J03j2o9K57l16J64k08j19J44R3j15J30j15K76J12m01Q4J57l6k28R5
5163e7J07J43l07K29k2K76m80N3P2m1P6j16P7K08k87k10L40j82q8L13k29K38n9
5186E4k15n4K50j26L36m5l64l9J92j60J32m45N50m1M5l87K8M87j47J91k89j24
5208a71K87O0k26J10K3k15r5M57r8k34k9M6p3J07Q6J8j7k3K18j28N8k18R0o0p
5233c4n2N8K11m20L38j88K07q6K9m8j48J30j9ol9J38o5J01Q2O0l72M0N9j67J59
5258c2KJJ47k05L51k80O6k20J44K64j16j32q4J22n9K7n0rk33K86l4J63K0k95M22
$$ y = [175, -87, 180, -55, 58, -11, 96, -150, 45, -115, -193, 226, -336, 60, 221, -1, 266, -53, 171, 249, -14, 170, -28, -32, 43, 159, -27, -371, -259, -202, 81, -39, -114, -213, 9, 83, 115, 215, 186, 7, -88, 110, 245, -57, -242, -53, 50, 38, -31, 226, -90, 74, -134, -253, -109, -16, -131, -1, -116, 160, 272, -129, -45, 112, 76, -152, -57, 50, 193, -114, 115, 93, 369, -111, -58, 14, -27, 49, -67, 10, 218, -69, -279, 61, -121, -209, 104, -125, 113, 54, -161, -215, 35, -91, 245, 200, -164, -203, -11, -171, -39, -484, 66, 25, 70, -317, -289, 198, 51, 242, -47, -171, 116, 176, -50, 60, 83, -132, -227, 230, 132, -102, -131, -85, -158, -51, 35, 53, 36, 13, 231, 103, 161, -57, 33, -27, -34, -86, -28, 183, -237, 101, -87, 120, 34, 63, 15, -133, -3, -22, -28, -67, 71, 6, 107, 189, 249, -123, -83, -24, -191, -32, -30, -29, 118, -87, 264, -16, 50, -170, -26, 238, 122, -10, -94, 28, -31, -4, -54, -63, -296, -10, -44, 119, 139, -156, 266]
5283B66j92N4P5l21j9P9M47o26K04l1K15k13p7L99k59J66Q1m1k19J36n6l24N70
5306C14o47J31L8j5m4M02k2o4l25M72j8k12k53K98r5N9j05o5P1r9k8J20K86k38
5330c9l9L05k1j11k11J19o2J47k02K56l64L04k68L22l06K24j7N4j55J18J06j39
5352B1j90J86k81J45K53k24M3J66j76m0L5r5J39l71L93j66mJ31j3J18L0m02K87
5375a5K45k85P8J24m55J45K04J49r2j41K3j03L22l20k0M07m77p4J78M69l56j05
5397i9J87J66o8j37Q5l45N1K27k4nO2o4K9n02M14J79j12j10j71K10N8m8R6l84
5421c05J26P0M6K28q6k30L8L46k39j85J7J65J76M4r7k77L47k6j97K01K32k21m22
5444b49M36J2k15j87L60n5l72K03J60m10M23k26L41j17j29n9J70n5jl7k4P2m66
$$ y = [266, 74, 128, 203, -118, -137, -58, 389, -237, -33, -64, 151, -62, -139, 260, 1, 167, 248, 207, -12, 124, 68, -256, 314, -333, -202, -164, -179, -223, 179, 157, 93, -232, 240, 222, 10, -243, 55, -40, 19, -86, -151, -80, -179, -207, -87, 199, -39, -78, 227, 206, 95, -116, 3, -59, 88, -114, 142, -222, 82, -186, 136, -170, 54, 37, 91, -64, 54, 160, 21, -169, 17, -264, -119, 134, -90, -47, 119, -57, -97, -62, -157, -18, -389, 4, -162, -166, -35, -48, 70, 100, -302, -15, 230, -55, 23, 147, -308, -163, 41, 190, 98, -43, -20, -123, 199, -121, -141, 266, -211, -285, -107, 362, 6, -99, 88, 254, 186, 49, 134, -211, -160, 67, 43, 38, 100, 36, 65, -437, -23, 156, 44, -66, -237, -27, 31, -17, 79, -305, -179, -109, -63, 165, 79, -151, -113, 233, -6, -191, -174, -9, 167, 211, 114, -163, 184, 158, -39, 162, 394, 173, -249, 187, 199, -16, -203, 157, 102, -270, -67, 93, -317, 106, -120, 221, 104, -25, -84, 86, 31, 30, -7, -31, 41, -425]
5467d25M91o4J64l4j17O0k28K83L5k80R1o1J66r1J43M3k05K70m71L91L1m2l85
5490b35K02K12l52L05r3J1Q2r4j99J00L3p2J12k37J82p1P0O5j04J36K58m30o1
5513a80p0M69j51L9m9K58o18R8R8J15P3k43K38m48M03q1K75j93K60n73L76r0J5
5536B1J98Lj15l98N15k62J20K39j99L59m88p5M7n0l0j8O3o3L90l80R7J55J8r6
5560E1j49J05j13l5K03j90K45j68J51k58l5%K61o1m1O2p9k1O2j28J78j70K39j50
5584d1K11l07L05j78m7L7k15K97j14o5K77J9k9l14L7Q4q6n1j35K18M69l33k39
5607b00L89k35J95l92M03p4j81O6M4J66k64J92p0M9j8m31J95k5Q8J91l16K62K47
5630B81m45J17N3j33j6K33j57K36m12J2L74M4K1O3j56O1j86M3J25L6j45j3L09
$$ y = [-425, 66, 2, 166, 132, 15, 75, -153, 130, 165, -115, -24, -85, 81, -10, 133, 176, -29, 241, -230, 161, 192, 150, -235, -33, 179, -173, 132, 39, 50, 132, 38, -161, -61, -28, -100, 12, -225, -43, -114, -44, 21, -83, 53, 311, -119, -180, -250, 219, 68, 107, 58, 316, -302, -204, -106, 9, 82, -161, 77, -371, 32, -49, 226, 33, 293, -280, 96, 6, 21, 219, 222, 107, -291, 224, -38, 82, 321, 122, 481, -7, -82, -35, -85, -115, -133, -70, -133, 257, -123, -26, 129, 147, 51, -98, 7, -106, -141, 62, -128, 117, -51, 100, -158, -193, -193, 68, 7, -34, 28, -51, -72, -10, -138, 40, -130, 109, -41, 170, -137, 168, -10, -57, -20, -235, 62, -52, -117, 160, 179, 150, -164, -127, -43, -129, -180, -315, -97, 372, 39, -200, 189, -46, 149, -243, 160, 86, -95, -29, 15, 181, -83, 109, 39, 88, 70, -361, -166, -191, -103, 88, -228, 34, 281, -164, -47, 6, -127, -143, 90, -67, 169, -243, -231, 143, 187, 208, 271, 115, 176, -10, 33, 158, 194, 49, 36, 345]
5653C45m8m34M63k25j23k7J70k32q7J55MJ40o3J54M8p7m5k15R4L7q6j29J41o5
5677a05J14k2n2kqL64k34M8Q4l43J30m4j06J43Q2k24L02k97J72q7R0o7P9l5k3
5702d1M2J26j35O2m5K57K8l90J78j8o1J48j94J18ol01J25M2K08j33P3q2LN5k10
5727a51J40rK03k20j34j01N10o3j96k09L08J00j18Q8l26K77p4m8k19M56l65K1
5749a30J16MK4R1k77J66j4j41J11j10L33k98J63L0k4q7K68j02j94q7j27N65l34
5772e4k27k3r2K1M62j84J98Mr6O8k11l12M16L92k45k96J92J4j08J23K3j75n1J3
5796a48P3R0n5j27K43N1j34J96o4J78m40pQ4L22L9m20l4M20l56J95j89J84j32
5819c1L57k41k46N0N1J48o7L7j54R5P4L2n4J69l62L13k4l88L96r1n1k1J6pj88
$$ y = [345, 297, -137, 326, 101, -22, -49, 121, -111, -198, -43, -39, 101, 38, 192, 240, 163, 118, -97, -3, 34, -52, -181, -40, -105, 9, -13, -65, -67, -75, 289, 55, 103, 187, -156, -26, -70, -176, -33, 49, -175, 127, -170, 2, -85, 5, -62, 17, -18, -41, 1, 127, -8, 54, 9, 266, 294, -96, 82, 64, 3, 151, -43, 75, 69, -232, -107, -65, 143, 10, 83, 1, 4, 59, -151, -11, -20, 183, -37, -171, -272, 238, 175, -21, -230, 78, 178, 60, 148, -178, 99, 25, -23, -242, 214, -151, -130, -14, -10, 14, 105, -172, -6, -20, -161, -50, -160, 173, -125, 38, 68, 44, -43, 225, 123, -71, -158, -285, 280, -54, -281, -304, -396, -375, 87, -97, 101, 105, 9, 77, -134, -446, -30, 362, 117, -179, 13, 27, -81, 42, 65, -110, -161, -148, -75, 15, -40, -167, 76, 127, -7, 189, 125, 303, -137, -144, -60, 262, 301, -119, -153, 267, -89, 106, -83, 101, -31, 326, 85, -161, -111, -60, 88, 21, 58, -96, -1, 73, 105, 51, 220, -142, 171, 147, -241, 155, 64, 13, -8, 8, 1, -187]
5844a87J10J18k39J96J70k92O4j17p0K35j04J75k75M63k45j13J38J77k57MK54
5865B05j94Q5Op9l75O39k78K4J25p7j82P1r0J72k16J47Q4L24k02m2q6j63K59j16
5889D1L5r6K24j22k14L01k67K97j22j75J28K6J04j91J53k71O6j29K45K51k95m9
5911f0K62k43J5K0l63M87k2q2Qk10K7J26J84k82j6J03P3L8q6j59l1J01M2K0J14
5936F6l94J55L7J60j09K9M9k40J77J7J75Q9j41m3r8j74M62k37l1J65K5l35L51
5959A55k56j87L98O1k76J32n9j54M31q6k78J96m22K54k31K74K86k65K63l29J57
5980F4r3J13j09J87k62J74N4k57L26m77J00J72KK31l25J28m2r7J36j91K68k53
6002a51M4m1Q9J11k31K26j63R3K81k57j1j72K88P5k91K52k13J62k28K93l3J01
$$ y = [-187, -77, 41, -198, -2, 168, -124, -60, -177, -247, -12, -116, 59, -216, 247, 2, -111, 27, 204, -53, -49, 205, 11, 96, 102, 23, -352, 287, 9, 33, 158, 81, -101, -30, -120, 52, -164, -17, 67, 391, 189, 147, 61, -102, 157, 41, 76, -20, 204, 82, -132, 169, -98, 199, 77, -98, 30, 56, 160, -31, 122, -149, -83, -212, 33, 284, -11, -60, 202, -41, -26, -6, -369, 118, 96, 14, 22, -188, -161, -35, 149, -133, -149, -46, 27, 65, -21, -180, -211, -110, -68, -48, 66, -328, -173, -136, 24, -85, -56, -7, -247, -70, -53, 122, 211, 70, 27, -71, -245, 217, -20, -51, 114, 139, -196, 155, -101, -288, 110, 171, -105, 27, -32, -186, 245, 159, -119, 77, -345, -91, -322, -48, 238, -27, 236, -93, 64, -29, 84, -25, 162, -100, 74, 128, -129, 197, -280, -180, -8, -6, 225, -100, 28, -14, -111, 25, -166, 102, -151, -107, -148, -59, 52, -179, 47, -116, -23, 258, 1, -10, -182, 106, 181, -110, 142, -71, 91, -137, 156, 123, 224]
6024B24k76q5P5%n2QJ07q5O9n5M8K81l36J17L2j36k06K67K79j94j04Qkk16K91
6049E9j46K86J32j26k85L73k09J7k92L19j65k4j29L49M35l14j09k24L20j10n2
6070A05j51K3j3K22J01k60R6M3r8m3p6j3J88l90N2N9J80J55j2L0k97J75j89j3
6094a26q0J65L83k12j29L24n29K20O6J00j24K23o8j72O1L6m7J66n10L15J6jK1
6117I8p5j70J33m5J72J00J34j83j45p7nM96m37J06j82M2J21pj32L21k33j70J81
6140D3n5J67k38j64L38P7n13N33j75K29j37k15K3K69k39J0J94om6k42k8R3J55
6163G3q5p9K87j46r5j4M00o03J63jJ55R0n04L42j90L63l50J69J14j40j89J09j1
6186a42K14L42n23q1K01l8K12m13J05j45p0M38p5K70l60l5K80k02l4mQJ47Kj21
$$ y = [224, -52, -137, -62, -62, -114, -106, 1, -84, -15, -70, -22, 259, -77, 40, 72, -64, -270, -3, 276, 82, -22, -14, -16, -232, 59, -87, 199, 331, 205, -80, 293, 84, 101, -191, 128, -37, -61, -190, 159, 594, 280, 171, -53, 267, 157, 105, -46, -23, -36, 186, 287, 27, 123, 166, 68, 25, -51, -64, 124, -266, -214, -155, 25, 180, 168, 198, -99, 76, -113, -126, -206, -41, 342, 130, 1, 325, -204, 16, 82, 182, 58, 281, 213, 41, 102, 138, 91, 257, -253, 62, 78, 77, 98, 23, -147, -14, -59, 113, 213, 347, 164, 19, -58, -63, 433, -4, 102, -80, -38, 83, 76, -56, 265, 32, -138, 43, -12, 155, -83, -247, 91, 168, -345, 188, 13, 242, 105, -110, -87, 182, -57, -47, 147, 141, 95, -147, -175, -82, 73, -12, -91, 196, 50, -45, -59, 341, -262, -99, -100, 55, 145, -359, -17, -207, 156, -194, -25, 89, -51, -240, -131, -142, 72, 414, -109, -190, 11, -27, 185, -228, -123, -268, -338, 100, 25, 295, -65, -100, 180, -22, -56, -60, -52, 95, 97, -24]
6210b4j75K13m5J24L0J1p7j8L5k62K71j54K55k20K32l44P6L21k60l6p1J60Nl7
6234A0k46L43J59m95J77J19j84n0J46J39j66P0J31m7K39l72k25L1L72l2l20J61
6256d0p1j6L00l81J38J34o1j28K46o6j68N1J36k17j61L25j84K17K34k16O5p7J39
6279A99k66j6K43j73R0j56j59M15r8N7r6k9k76M11J42r9l8l02L63k62M3k4J66
6302A35q6j09J43O8l98J62k60K86J08Q8l60K76Lk26j64M49O2J51k46O2k47K35
6324A32r7j34K92k29J12j11j37L35k64j5K53j14R4L9k06Q7K85m1j25k84J74K89
6346C35j89L6Q4o31N43k34o3J08j6Q0j20j85L07p4J2l26L22k94p9L52j34J39p9
6369a06k07K57m1O9Nj68J68k8P0k35J70J10K56k46k16N5k3R2J26M7l8j92K1K81
$$ y = [-24, -199, 14, -31, 93, 123, 134, 57, 39, 74, -188, 83, -71, 184, -36, 196, -148, -72, 249, -11, -47, -118, 42, 47, 10, -236, 107, 266, -229, -52, 67, -117, -167, -21, 118, -48, 22, 153, 106, 345, -27, -252, -221, 151, 119, -201, -40, -111, -127, 173, -208, -70, 64, 3, -125, 121, 55, -113, -62, 74, -143, -304, 21, -163, 54, 288, 72, 137, 60, 199, -67, -83, 160, -13, 77, -79, -238, 177, 79, 136, 40, 11, -265, 146, 288, 189, 151, -151, 212, -50, -7, -31, 135, 49, -60, 83, 151, -247, -85, -345, -59, 49, 137, -223, 53, 56, -170, -334, 115, 177, 328, 82, 144, -103, 132, 35, -99, 193, -36, 76, -35, -172, 163, -101, -116, 137, 23, 117, 156, -50, 37, 322, 281, 156, -128, 46, 335, 146, 182, 266, -365, 178, -56, -119, -11, -27, 53, -67, -252, 55, -19, -7, -333, -11, -305, -384, -32, -166, -27, -106, -313, -56, -97, -28, -23, -191, -23, -51, 19, -216, -46, 64, 320, 74, -142, -87, -110, -18, 108, 155, 117, -75, -54, 227]
6393B27m43J93l25K20J34Q6o7j73J04NL78l97M1m4N7j97k65K63P4K02k73K68P7
6416A45j42J27m1K7k16j45K32N6oK3J1N7k91J29o3j1J51r4K3P7P5l58J25j55J96
6441f8j22J49K24l65K96q6K07l13OqM2l1P6j6n7j03K34lPj9J96K8j95j84J63K58
6467C16l19n9J22L1j75L4J57Q5k21m8J66j59O3j51N50n28L36j95k18K97L8j69
6489d7N27k49m59k7M4M87j78q0k93J9K83J4l6q8j24M08l94n8n6M01k19J05k58
6512b78L12k02J32m6r8R9k2K78p8j63j36r1L76p1O4k07r5K15o1j3m2M26k56k22
6536a79o1M17k20j61K86k2O5m3o1K38k11q5K52j36J28q0l01P2j13J33M2J88k05
6559e7l36O1K70o0K08R6k02J52k29k21K76p7N04n91J36L60j67j26R3J16j10j76
$$ y = [227, -216, -23, -348, -128, 6, 92, 25, -148, -44, -39, 339, -58, -17, -61, -4, -201, -466, -203, -129, 73, -200, 68, 145, 3, 130, 89, 116, -100, -245, -13, 43, 37, 60, 71, 128, -163, -34, -97, -108, 43, -51, -28, 49, 124, -234, -109, -264, -68, -190, -41, 183, -182, 114, 28, 235, -78, -72, -80, -38, -69, 7, -9, -66, -169, 65, 62, 69, 50, 246, 274, 79, -105, 58, 316, -3, -62, 60, 91, -84, -50, 107, 192, -29, -77, 89, -70, -7, -158, 392, -136, 200, 5, -213, 84, 122, -47, 480, 231, -228, -255, -211, 276, 98, 18, -275, -256, 27, 41, 5, -83, -207, 201, -193, -251, -307, 94, -125, -20, -278, 34, -168, -36, -82, -180, -81, -103, 175, 97, -66, -202, -293, 83, 12, 76, -131, -226, -11, -72, -85, -127, 299, 43, -179, -240, 177, -43, -204, 82, 60, 125, 82, 21, 259, 48, -37, 215, 79, 207, 127, -174, -102, -215, -82, -40, 148, -57, -393, -332, -62, -122, 86, 182, -20, 132, -97, -318, -42, -119, 385, -206, -70, 290, 123, -3, 90, 206, 96, -80]
6581h0J15K3N4k29M8K72j43j35K15k34K22o1q5j25p4O4K57M4n2j79K90l1n0k26
6605a00J39q1l3J44Q9j39J06m4M06n53J31p0k09J63K48j05k35L35j45j07j56p7
6627b93K97O8KqM4m22J11J44M62m76J99J8k83k00O10l03J64m30K05o5L93j89K84
6650C32l50J87k16q3J68K26k02J57l74l8m4o3O45n87K45k46M15k92P6k77J32j8
6672b07L92j88J1K18j32k4J04l13K96k2k94K20K1l23R7J29k16K13q0j87K17J85
6694A17m8l02M46k20j20N1J66O2J32j3k05K08j57m79L8K12J34r1L2K06l55J02
6716h4J56j8N5j42J53k14M14n19j71J0M68l45M28k39M1j93K04P1j16j15J88j32
6738a00J77R0j34J8l1p2P0K72l74pP3p5j36K52j28R1L0j45J50k35L3K88J88o80
$$ y = [-80, 35, 58, 112, -117, -69, 203, 60, -75, 140, -94, 128, 67, -18, -143, -217, -153, 104, 148, 96, -83, 207, 176, 126, -100, 39, -42, -75, 69, 158, 19, 125, 81, 487, -66, 65, -5, -214, -51, 197, 92, -143, 192, 47, -60, -216, -293, 4, 72, 74, 66, 110, -312, -201, -57, 405, -71, 128, 146, -137, -337, 273, -30, 134, -296, -91, -156, 237, 48, 332, -18, 169, -47, -130, 38, 264, 62, 219, -155, -193, -237, -300, 345, -242, 3, -243, 172, -120, -44, -321, -189, -207, 185, -3, 8, 226, 94, 70, 174, -139, 157, 135, -159, 61, 82, -241, -144, -15, -231, -18, -98, -285, -68, 117, 69, -233, 213, -7, -127, -76, 90, 152, 284, 271, 66, 274, 117, -362, -324, -112, 22, -69, -37, 169, -186, -84, 72, 54, 109, -33, 120, -94, 320, -199, -370, -360, 108, -237, 191, -48, -7, -200, 4, 75, -41, -156, 32, -100, 77, 167, 33, 51, 20, -52, 18, 290, -84, -91, -18, -93, -229, 23, -105, -14, 16, -129, 21, -214, -181, 107, 295, -385]
6762c85M09j22l19M98j57O5k3R9k94O3J59K27l28J19P6j1M8k25L5l0l1J33l1J16
6786I1L6K9j34J78k21M11l98j74J24J68n7k41K67j0K26k92l43M40J7j60nm2n0
6809a40J82J03n09K15J83O2k21k2O8N7P9j21r4L20P5m58K56N8j08P2K67j52J33
6832C05k00k13P0p6jK41M7j03o1R6p7l99K27L86k97n3Q9Q9M6j49j68L23n2k40
6856a70J45M3k4j77L8J67l8K79l46P4N3j19K67l62Q7l08L16K14j31J9j54L25m28
6879b30j50M70k63K7O6N2l2o4n7J0L41j63j56j28J79J80k1j72j75K71l3J04k4
6902C2n2K16o33K16L16o2J7j53nK6K52q9k52L86m87K17M00m84L85j10j71J98k21
6925e8K48k91P3K84l35j29K39k1J14j33k37K83j49n2K20j44L75j18l67Q2L18m24
$$ y = [-385, 24, -98, -417, 81, -76, -11, -34, 65, -229, -166, -7, 220, -108, 11, 87, 76, 124, -101, -66, -96, -127, 6, -25, 91, 127, 156, 22, 200, -21, 390, -8, -182, -58, 110, 53, -188, 79, 69, 295, 3, -340, 100, 117, -43, -48, -90, -140, 42, 145, -364, -149, 34, 96, -125, -147, -79, -22, 57, -64, -158, 162, 237, -221, 35, 93, -15, 57, 324, 172, 305, 105, -108, -38, -114, -115, 126, 173, 70, 9, 105, 28, -371, -144, 242, -55, -108, -19, 70, 116, -33, -201, 122, 70, -170, -25, 18, -6, -183, -145, 22, -16, 263, -83, -9, 44, -75, 192, -170, -83, -391, -75, 139, 8, 27, -127, 198, -230, -380, 90, -173, -146, -80, -28, -60, -124, -181, -171, 170, 7, -149, -277, -98, 82, 61, -111, -286, -15, -48, 56, 32, -20, 196, -437, -221, 95, 33, 50, -103, -108, -82, 170, 81, -171, 215, -272, -55, 345, -139, 246, 136, -35, 163, -58, 190, -101, -28, 256, -79, -208, 31, 10, 124, -9, -246, 37, -112, -164, 56, -88, 287, 169, -198, -116, 202, -222]
6947b22L42l4l26L42l29K35L9OJ88k4j70j67J41j67ON7J91L9k29j14K1K28k93
6970b40L83p2j11N3k09L84j32j2nj63J30J93l44L03m43K15J64j6R5k36J52J6j60
6993e5J29j09K85m01K05q7K2K2j1mK35K7m54J98k76J43p8R8j68J93JR7r8J32k72
7018b26j04J91K88N4j34j52j8J57j40K35j99K73j50k09m4J72j81J34N35o83L74
7039A73o6j27R6j73K10j01J95k12K72l49R9k08J69K74j5j23k20J62J17l96J52
7060g1P9J18j88k2O2j51K53k7k1O2k23N4L2m3K43l24K36M9J61k66l8J50Rk06J80
7085A08k11J49Rk16K65j40j07%J97k08kK47q7jK38j19l16L02k59k9L7K92l31J53
7109b9J93M3N2m30J33J76l66K40Q6J69j67k28J84K14m07J31M6k24K27J66j54k53
$$ y = [-222, 120, 86, -240, 102, -227, 8, 47, 53, 241, 217, 47, -120, 21, -146, -140, -83, 108, 147, -82, -196, -175, 53, -240, 143, 71, -40, 13, -196, 188, 56, 44, 39, -124, 6, 199, -145, 158, -285, -70, 94, 78, 173, -63, 89, 105, -55, 74, -35, 250, -151, 54, -33, -11, 11, 0, -4, 231, 258, -196, 2, -274, -131, -209, -111, -279, -86, -85, 12, -86, 46, -226, -330, -139, 149, 203, 69, -83, -101, 56, -84, 151, -48, 225, 75, -134, -178, -6, -187, -53, 482, -201, 173, 107, -20, 76, -97, 113, 12, 207, -5, 267, -82, 17, -191, -22, 252, 237, 114, -106, 56, 173, -223, -71, 8, 126, -62, -84, -22, -173, 80, 53, 32, 94, -129, -75, -43, -86, 157, -167, 69, 118, 279, 13, -25, 125, 134, -72, 108, -103, 46, 55, -161, 104, -36, -143, -143, 54, -154, -156, 91, 4, 3, 241, 122, -194, 108, -151, -180, -143, 149, -182, -29, 164, 207, 259, -171, -38, 138, -228, 12, 98, 267, 100, -128, 56, 270, -137, -6, 40, -184, 43, 209, 55, -198]
7131a98L56j72kK12l01o6M05k82Q0k10J92NO7l51K14k76O06m02J32m0L60l18j61
7154a50J12J8K34m00J51K0j28n1K52K21k30j03O2n1M14l63PJ7O5k09K43j87L0
7177b6J09l2Q4k17Q9j55j50l9N36k76P5J31r0J06m1k24P5n5lK74P5k66J28M9m00
7202b43L70j0j66j47N3J50J56k72kK53k88K34O2j38J8o4L42q3k77L6J15k4J30
7225B05j18j08Q5K2l41L54r3L73n50P1QL74j20l93k04L68j5K55m02L22j13j09
7247a29K26r1K7q7J34Q7l30P9J97j07O2j55J38r2K28j97k01J83K90l19J17l1N3
7270H2l02R0j74L05J1J61m27K21j76L29k79J70N4k8J05k48K31j81j02L08J43n78
7292b85K05K82l02J27j42J23l2j02J69j24K41n3R8o6P5j16k18J91k01M55k18j86
$$ y = [-198, 158, -14, -16, 196, -105, -171, 234, -48, 32, -178, 14, 19, 86, -265, -51, -327, 279, -123, 9, -31, 329, 11, -150, -38, -20, 214, -186, -35, -15, -143, -194, 58, 279, 49, -54, 8, -43, 371, 8, 15, 32, 97, -112, 131, -56, -26, 83, 51, 135, -82, 7, -148, -298, -337, 199, -77, -2, 129, 39, 145, 104, -120, -45, -100, -103, 171, 246, -20, 108, 157, -243, 127, 117, -49, -196, -143, 7, 163, -109, -111, 142, -146, 88, 150, 12, 30, -34, 308, 225, -52, -16, 99, 75, 205, 87, -21, 64, 86, -255, 99, 6, 379, -171, -100, -92, 282, 162, -231, -435, -67, -82, 173, -229, 93, -20, -129, 97, 6, 33, -54, 80, 167, -163, -84, 113, 6, 68, -87, 51, -41, 187, -10, -211, -28, 262, -57, 60, 29, 82, -220, -130, -304, 1, 12, 173, -254, -33, -209, 120, -159, 11, 65, 37, 142, -106, 125, -56, -158, 150, 293, -285, -80, 202, -100, 27, -115, 8, -24, -126, 43, -81, 160, 107, 205, 139, 214, 98, -120, 71, -130, 325, 107, -79]
7314g9J1n4J53M4r5J92l17K03l7nJ22k28K1L78l27Q6p4J98k71K37l48N1L77l01
7338f3O3j6J13P6M2l78K02j6k6K38k13M3J4j55j1J49k99L85J2j07J2N0o2r6J91
7363A48k27J21L4j67JK90j17k43j87N44j74K9k34K93O9m75K70L0o3j8k54K77J41
7386H8k23M30k27J52k40K12n3j95J26j57j67K80k17J66q7L01J05j62rK5k32J67
7408H3j52J75l5l28L41k62K44J04P0l40L69m71K64k41R1Mj7J45j50L26l69J11
7430c8J86Q7m83p8L50j31j24L50Q7l76K4J11k74L12J34r0j24J3r9K0J29j59K23
7453E0k45J13L37k01k22K62J24P6l1j77j58M8J53Qk39m8J36J65j7J2k0J27J04
7476C57l85J51o4o4J80j41k9l14L27j27R9o7J89K3l15N37k32j63k85J73J33K82
$$ y = [-79, -68, -122, 31, 75, -20, 172, -145, 58, 21, 16, 138, -90, -69, 309, -18, 68, -6, 192, -79, 158, -190, -139, 238, -63, 0, -16, 97, 173, 215, -163, 39, 23, -3, 235, 22, 65, 79, -76, -87, 62, -237, 148, 160, 53, 65, 115, 53, -43, 148, -79, 42, 76, -91, -90, 200, 83, -160, -347, 197, 23, 52, -182, 111, 180, -295, -25, 5, -58, -76, -330, -53, 88, -135, 295, 68, 220, -20, 192, 139, -56, 70, -87, -254, 26, -191, -25, -112, 189, 294, 132, 123, 148, -84, 83, -69, 106, 71, -257, 84, -178, 66, 170, 240, -100, 269, -202, 62, -179, -88, -84, -101, 44, -106, 220, -149, -38, 148, 235, -248, -326, 24, -107, -231, 119, 206, -170, -146, -35, -309, 3, 137, 47, -77, -64, -163, -143, -14, -173, 50, -195, -82, 255, 54, -168, 94, 218, 294, 263, 86, -72, -24, 129, 137, -102, -150, -14, 151, 134, 146, 126, 253, 357, -28, 123, 59, -5, 175, 34, 5, -309, 18, -109, -10, -77, 112, 135, -180, 357, 125, -38, -323, -150, -17, 265]
7498B65j40j34K15n3k95J45j79L1L41k82L9Q2J82m31J11R9j39L28ON5j43PP7l2
7522A55p8k77K10k0j01J77J5k2q2r5K89k82L46l75J97j50q1K12n2O9K6l64L78
7545I5j70K01j29l0L4l64K76O0j82m6L06k66J35j81J98J31j33k9K6J63k71J54
7567b2j26j10M96m37L69r9m3J08j21jN8j57Jl8RK47O4j69J70j5Pp4k88Q3O4r3
7593a17K94l0q9n4j50O2J53q5k97O94l98j33K95j56l53L32K0m8O4J68k35q7K13
7616F3j41K02o9k19K11J14k53N9M1P4j77L70k00O0k47Q4K40m95J13L38o6j90J24
7639C6jL6l08L61L5k2m98J91K31k40M32k94N1j11J94l60M81j76j86J45j21J56
7661C2J81k50Q2j50l0J20M1J8J1m8L7q8%J0l8Q3j25K49k92K01Q3k4l0l3j2O6j39
$$ y = [265, 125, -9, 206, 153, -142, 3, -176, -145, 196, -86, -47, 35, 217, -214, -103, -4, -143, 185, 191, 246, 103, 110, 187, 155, 77, -200, 10, -10, -111, 66, 81, 59, -23, -118, 171, -111, 235, -140, 57, -93, -174, 38, -14, 55, 81, -283, 95, -75, 126, -3, -33, 1, -363, -87, -27, -209, -255, 51, -215, -80, -261, -63, 68, -65, -94, -68, 95, -176, -22, -148, -258, 238, -199, 170, 71, 28, 136, 15, 14, 72, -85, -84, -122, -113, 134, 198, 29, 199, 184, 191, 117, -171, -88, -24, -117, 177, 147, 58, 4, -146, -84, 69, -16, -313, 381, -17, -150, 145, -11, -364, -32, -12, -60, 4, 172, -63, -150, 63, -78, 124, 55, -164, 47, 161, -92, -33, 8, 82, -95, 275, 75, 135, -112, -28, 212, -283, -170, 168, 102, -88, 36, 35, 71, -237, 124, 159, 137, -361, -170, 61, -179, 253, -41, 10, -101, 93, -267, 214, 38, -148, -3, -124, 32, 213, -37, 45, -105, -135, -15, 26, 44, 55, 7, 44, -44, -44, -34, -72, 11, -114, 135, -157, 44, 127, 103, 73, 40, 28, 94, -45]
7688d5j58L50j02Q6N1m0m04J71N81m85j08K29k21k4J54n7k51J70J70K37p8l0j22
7711G4m4K37j76j49K03m11M84j67m5J81j13j72J57LJ17j20R6O3l33J77l3j59J51
7734B1j40L47m87Q4R4K9j22p3K03M3K3J45k64K9Lj0J88j05K94m40J1L84k47N2
7758F2N7M6m8m8J23j65R6q3L07o14M37j42l22M62k97K07j60L8K29j62J95k04K27
7781B41j32j72K3J52k85J63J22o1j31J62J72m58K83OJ64m01J32K25k44j32R0J13
7803C2o2P8l79K83l51N17m15L58k16L11J68j47l48N2K07j29K7K3K4J92m0j18J29
7826A96k40p5L3N8j9K24k11R8k06J26o1N2J0m6j69K19j62L4L0K19j37L09Km84
7850b00N4J9L67j34L6l5O7l8k75K40k18K13j40J80l02j37L15R9l85L27k2k56M36
$$ y = [-45, -203, 147, 45, 131, 182, 142, -262, -91, 490, 5, -103, 126, -95, -119, 35, -22, -273, -103, 67, 304, 226, 196, 74, 30, 267, 91, -58, 145, -266, 218, 51, 6, 187, 74, -98, 59, 62, 179, 59, 155, 218, -115, 62, 29, -130, 21, -119, 228, -259, -175, -81, -52, -174, -247, -44, -1, 22, 167, -97, -68, -65, -75, 113, 8, 302, -138, -127, 257, 10, 62, 119, 165, 117, 69, 192, 27, 123, 40, 347, -267, 170, 28, -294, 168, -129, 78, -82, -44, 185, 23, 218, 14, 241, 109, -63, -40, 112, -173, -10, 112, 51, -80, 82, 254, -204, 79, 85, 249, -152, -20, 205, -39, -171, -81, 32, -30, 48, -331, -48, -399, 118, -297, 61, -155, 156, 324, 177, -171, -119, 88, -41, -14, 9, 33, 225, 185, 67, 196, -44, -119, -86, -28, -47, 177, -34, 64, -142, -16, -77, -25, -15, -61, -230, -11, -173, -139, -109, 110, -27, 282, 284, -200, -146, -127, 240, 106, 142, 107, 174, 136, -139, 101, -117, 96, -44, 136, -166, -303, 12, 111, -274, 53, 31, -225, 211]
7873B11l18O9j61M68k28p9K0j58M78k40l5R5j95O5l79M27l10K9K80m9j08L09k76
7896h5K4O9J34j50L01l25Jn0r0p3K36k58J02M15l53K75l60K2K76k93Q3L30k03
7919B8o8p2K51p8k99K15K42k15j43P1m7J85n0n1J3j36J22m3K98k75K61n0K54m25
7943a2p8K5J03jn2K50j74o5m6K38l46K1K37m9j43J97o5L5k64K0P1K0K69m31K28
7968a2l2K21k0m08M66j24j58j45j14K75Q2N9m8k55K63J75l67Q7J6J56M5j05r7
7991d0j9p6K06M9j10LJ68n00L68K29n30N00l33K64l29k67M76j0j43J19O5P2j77
8014a5l3P0j73K21k5k45L46m6k89N7K09N6l28K22j50Q3o0k5J49K2k23J08rk36
8038c14K19J78k34J23P1K74m62K50j30Q8k07M59k41k1k03K52k8J34k37O0Q0j41
$$ y = [211, -107, -38, -199, 269, 41, -38, -18, -176, 302, 62, 27, 122, -73, -8, -387, 40, -270, -241, 39, -10, -118, 191, -85, -61, 8, 142, -8, 293, -32, -31, -81, -171, -244, -8, -266, -164, 251, -102, 173, -187, -165, 111, -182, -99, 231, 28, -40, -112, 139, 61, -238, -23, 219, 4, -139, -68, -115, 70, 20, -31, -18, -154, -32, -75, 223, -52, 209, 159, 413, -12, -90, -65, 38, 37, -15, 235, 61, -4, -50, 188, -158, -137, 100, 51, -92, 105, 40, 75, -189, -169, -98, -78, 191, -240, -12, -44, 177, 157, -251, 215, 91, -67, -212, -326, -51, 31, 90, 42, -213, 50, 225, -142, -55, -39, 117, 162, 57, -40, -59, -135, 71, 120, 10, 13, 181, -319, 49, 278, -252, 248, -85, 179, -150, -417, 59, 49, -94, 25, 90, 162, -15, -48, 22, -151, 70, 45, -200, 146, 100, -189, -132, 77, 133, -195, 27, -123, -40, -100, -125, 24, 46, -177, -69, -78, -314, -95, 83, -151, -28, 43, 317, -145, 105, -25, 63, -144, 315, 74, 53, -150, 102, 74, 208, -29, 31, 111, -30]
8060c0L9j6J61l22J28J01K27m2k28k68M86k10J18k21J82j47j02J21p0P7K53j38
8082I9ql11N50l89l18L47J90m47Q6J02L53k06L2L9k17L1L71l66j1k30J66R4K5
8105a8J76k46P8qK17l65J96k89K75K0J71j8k9j55M9j01J07N6k00K23m33J51J58
8128A5K0j61J10k5p1Kq3M21j22j70J66jl34K09p0j07K25K1J9l4Lj56K32P8k55
8153f8j27j22J62j12K54k91L29j2L09j38k49n2j84K95p3j26J80J13j6l34k9K97
8175Fk16J97P1l72N06j01J14l0J69j33k70m0Q3J38p0n5
$$ y = [-30, 9, -7, 154, -168, -40, 61, 288, 246, 18, -250, 236, 26, 144, -77, 105, -42, -144, -23, -93, -16, 237, 99, 91, -220, 330, -59, -377, -30, 160, -287, -201, -99, 254, 48, 80, 119, -98, -67, 304, -62, -73, -303, -137, -43, -18, 158, -88, -10, -18, 199, -166, 30, -259, 16, 36, 207, 189, 160, 5, 54, -47, 60, 116, -84, 139, -294, -143, 15, 35, -126, -16, -41, -112, -110, -193, 228, 106, -64, 102, 101, -233, -24, -94, -201, 24, 45, 64, 30, 33, -123, 109, 187, -68, -195, -317, -155, -267, -13, -304, 25, 13, 322, 184, -65, -117, -301, -6, -79, -205, -25, 88, 72, -262, -291, 6, -210, -13, 58, -314, 192, 91, 205, 175, 344, 211, -59, -99, -16, 122, 52, -3]
8191c
$$ Imaginary data points
##PAGE= N=2
##DATA TABLE= (X++(I..I)), XYDATA
0@%%%%%%%JrJ6j6J6k4L2l4M2n6O4p2Q8j04J20j37J58j83K11k41K72l09L48l90
31b07M39m92N53o19O87p63Q48r43J045j155J279j417J569j738J928k142K386k668
49a410K996l381L845m415N134o075P365r251J2279j7931L2006j29138k60070J81863
63a86183J22465p8234J9647K25176L3102j85796o3811R2502o0146j44493L9180
74a86591J41594p781m4573Q4011P0013q9542q2795K5953m342q2508o10R6503N4058
87b6610l006K4915O395p7711p9109J317K4849P208L1554M9585M759k3944l635
100f3433k322k7664j9689K459l751J543K7974K1842p665N089K3033j8803n1665
113a13052r726K4717n057n796M7548L8087l4755l7439J9900R579l7502m924M4491
$$ y = [0, 0, 0, 0, 0, 0, 0, 0, 1, -8, 8, -8, 8, -16, 16, -18, 24, -32, 32, -40, 48, -56, 64, -73, 85, -98, 113, -128, 144, -165, 183, -207, 232, -260, 293, -326, 361, -402, 446, -497, 548, -607, 672, -745, 824, -914, 1014, -1128, 1258, -1410, 1586, -1795, 2050, -2365, 2769, -3306, 4059, -5192, 7087, -10844, 21162, -107976, -368046, -186183, -63718, -141952, -122305, 102871, 135973, -49823, -113634, -21132, -81278, -225771, -186591, -44997, -52778, -97351, -13340, 56673, -32869, -115664, -89711, -94053, -176561, -177171, -80668, -26610, -29616, -4701, 1694, -76017, -155126, -153809, -128960, -121752, -90198, -40613, -35854, -59798, -63433, -65755, -93419, -113108, -110649, -114400, -112857, -84883, -63041, -70706, -65617, -42584, -61387, -113052, -122778, -98061, -103118, -108914, -61366, -23279, -58034, -95473, -75573, -65994, -103496, -108420, -63929]
126f3929O134l4170J3352M7250o207l9524O405K1443k5676k7618K6859L1880o152
139d9953N27K8629K166l6822j8171J2409K629l254K0062K3527m005j0904P928
152b5232N067j4385j1857L580M232K943J3020J7340O646m796p401q757q284l679
166c1563K423J0449K0179J6224J183q062p858j2706j3947M375J9645Q555k788
179F109J0752J6852m836j7095k086k48j5924o306K3169K3331q64o78J1492m370
193C9298k4667j1483P373o67k762K0846K7270o29j6473m438k800j5781p838J3626
207B0875J1603j755M466J6017M146j2700j0128n040q803m860J0018J4883O648
220D5370K124L755j400j0538j2717p628j406N331J0967J0664N883j60o814r351
$$ y = [-63929, -57795, -91965, -78613, -31363, -37570, -77094, -70689, -49246, -74922, -102540, -75681, -43801, -49953, -49426, -20797, -18631, -55453, -73624, -61215, -58586, -61840, -41778, -18251, -22256, -33160, -25232, -20165, -34550, -46407, -42827, -38595, -35652, -22632, -5292, 1354, -3442, -10843, -19600, -27884, -31563, -29140, -18691, 1488, 17712, 18895, 10833, 2975, -9731, -23678, -19303, 342, 8897, 6109, 16861, 33713, 28877, 11782, 9696, 9448, -6476, -12782, 10387, 33718, 32854, 32176, 43668, 39298, 14631, 3148, 10521, 9854, 7092, 27938, 55208, 54579, 38106, 33668, 30868, 15087, 7249, 20875, 32478, 30723, 35189, 51206, 55352, 42652, 32524, 27484, 18681, 13821, 23839, 38722, 45370, 47494, 51249, 49849, 39311, 26594, 18966, 17560, 22891, 33858, 44522, 50405, 50245, 43431, 34080]
234C4080n755k067m057k282O367J0763N604J061R38n252j3756q934K460K116j609
249A9677N737J2107M297n904m008m260j1232r576M557R487K762J288M444J067
263C0443o250n871k529o162o531K446R505N025O91R93k237p533o822k165j460
278A543j257K787O983M980O35l520o414p340l998L4J431K854L903J657J206k34
294E250k602p757p069j147J846K735M921N159j74m701k789j510n984n556R39N236
310a3203M032L654L844j585p933n270n66j655k375K554O527K499J190K371j971
325g887q679p068J17K285J661M438N240J346j889m65k571o483n426J446M526L660
341a5749M979M159j573m746k491j761l631j831K273M744L834M908K178l266o106
$$ y = [34080, 28325, 26258, 22201, 19919, 26286, 37049, 42653, 43714, 44652, 39400, 25644, 16710, 19170, 21286, 19677, 25414, 37521, 41818, 35914, 31906, 27646, 16414, 6838, 11395, 20882, 23644, 24932, 29376, 30443, 24193, 18322, 15793, 9631, 3100, 5546, 15051, 20076, 20767, 21760, 19523, 11990, 5168, 3003, 1543, 286, 3073, 10056, 15036, 15671, 12151, 5737, -1603, -5601, -5567, -4136, -1282, 2621, 4278, 5484, 5250, 2648, -5109, -12178, -13325, -11479, -8744, -3823, 1336, 1162, -3539, -6328, -7838, -13822, -19378, -18439, -13203, -9171, -5517, -1673, -3258, -11191, -16461, -17027, -18682, -21057, -18503, -11976, -9477, -8287, -5916, -7887, -16566, -23634, -23517, -21232, -19571, -15133, -9893, -8547, -10436, -10901, -13472, -19955, -25381, -23935, -19409, -15749, -10770, -6611, -8184, -12930, -15421, -17182, -20813, -22644, -20371, -15627, -11793, -6885, -4707, -7973, -14079]
356a4079l279o30j001J005M598M020K280K541J043m173o287l279P99J295M061
371a1086N294L279m31j13k29l669n022k029J940K748M741N825J966k749k416j610
387c561k539k408M4K668K672M369M904P19l683m848k155j160M27K395L675K226
403C745K066K185J87l802m861k122k31J934M203M844N58m8o76r75k909k715j554
420a71Q66K588M915L820r3j861k674k420k322l71R86J477K403L424K873p17l063
437I660l847k725j161J540K859K202J519J668R61j689l044l404k083p80K650M545
453H871K748J58m60j362k519k542j373p93L37K759M153L048j095k940k631k452
469C907j705k86J523J503J907K452K041p28l242m329k587l75J642K263L028J187
$$ y = [-14079, -17358, -17988, -18989, -17984, -13386, -9366, -7086, -4545, -3502, -7675, -13962, -17241, -16442, -15147, -11086, -5792, -2513, -2944, -3057, -3286, -6955, -11977, -14006, -12066, -9318, -4577, 1248, 3214, 465, -1951, -3561, -6100, -8508, -8464, -5796, -3124, 1245, 6149, 6868, 3185, -1663, -3818, -4978, -4551, -2156, 1519, 3745, 5811, 7996, 8183, 4381, -480, -2602, -2833, -899, 3304, 8148, 8706, 8658, 7982, 7007, 4098, 1383, -171, 695, 3283, 8198, 12018, 11925, 10064, 7390, 4970, 2648, 2277, 3263, 4740, 7143, 10567, 13440, 12723, 9660, 5813, 3088, 1927, 3467, 6326, 8528, 10047, 11715, 12676, 10987, 7943, 4539, 2456, 1676, 4326, 8871, 11619, 11777, 11317, 9955, 7436, 4894, 3521, 2728, 3065, 5824, 9977, 13025, 11930, 8990, 6359, 3907, 2202, 1916, 3439, 4942, 6849, 9301, 11342, 10614, 7372, 3043, 456, 81, 1723, 3986, 7014, 8201]
485H201N9m58r53k979l798j729J205K234K998K325O27j374l047j352j022k305
501a368j285J001L679K818J896J10k768m359k919J27Q41K90J754K561K075k41
517D212j481k051l844k599k30L053K346J192Q34Q01n75j905k426k276k210o25
533g784L176M617K051q74j583j622k984k370M12P25N20R13L707K223j284l482
549c639k069j255j111j60J926K059L16J265K092L61m491l796j416K27R06K956
565e829M398P37k613j415M18j625l786l30K471J831R58J967K139k213l328Lj02
582f319j709k260J852M093J410R20J492j285n032l485J260L207M94M36L158J295
598d73k034j868O78j389l141kL744J927q61N94K956k69l349q06K14k404k058L716
$$ y = [8201, 8260, 7802, 6849, 3870, 72, -1657, -452, 1782, 4780, 7105, 7732, 6358, 3311, 1959, 937, -1368, -2653, -1652, 2027, 4845, 6741, 6851, 4083, -276, -3195, -3068, -2227, -1937, -183, 2378, 4453, 4212, 2731, 680, -3164, -5763, -5993, -2940, -594, 598, 1432, 2233, 1658, -247, -2673, -4949, -7159, -7784, -4608, 9, 2060, 1186, -397, -2019, -5003, -7373, -6961, -6236, -5716, -4803, -1096, 1127, -157, -3639, -5708, -6963, -8074, -8234, -6308, -4249, -3933, -2668, -576, -215, -4706, -8502, -9918, -9691, -8785, -5829, -1431, -694, -3307, -4722, -4304, -5929, -9715, -10045, -7574, -5743, -4785, -2818, -679, -2892, -6220, -6217, -6319, -8028, -10288, -8436, -4343, -2933, -2013, -521, -1806, -6838, -10323, -9063, -5856, -5362, -4926, -1768, -473, -2507, -4375, -3697, -5086, -8227, -8229, -4485, -2558, -3419, -2825, 131, -138, -3487, -4293, -4079, -6483, -8541, -4825]
616d825O179J626k801p75o33l570k141K800L163n40n93K815K184k538k183J165
632f67n71k662k04L457J693j503J806L954n70n194l552R25O48N56L867M864r50
649E897m477j580J743j037k657J603L259q13j101L023L138k723l931J447J605
664C396l854k579L913M889m95l19K511j123p271k796M413L749j574Q67M231j514
680F444n125N99M098k086m977J403M642j149j651L595K932k831m032J113J84l885
696g26r96O179M713j589j838J02k896l592P82M157J006j651k34K301k24j288K94
713D500O07j996k792M47K052J349k26J581J771r79m403k640Q11P49Q71K655L333
730G690j235m562j013J820l65j563J059K199j588k224L099L394k381l595O82P31
$$ y = [-4825, 1354, 2980, 179, -596, -1229, -4799, -6940, -4140, -977, -1517, -2110, 705, 2889, 351, -1832, -667, -1238, -3900, -4104, -647, 1046, -457, 1349, 5303, 4733, -461, -4013, -3088, -2440, -1884, 1983, 6847, 5897, 1420, -160, 1583, 546, -2111, -508, 2751, 1938, 837, 3860, 6998, 4275, 344, 1791, 3396, -458, -3037, 876, 5765, 5270, 4951, 7462, 6339, -932, -3728, 685, 4434, 2860, 3727, 7958, 6444, 1319, 1918, 6016, 3930, -1047, 356, 4998, 3849, 2198, 5793, 8725, 5894, 1862, 2975, 3159, -726, -1722, 4457, 9170, 7581, 5743, 5845, 2949, -643, 139, 4296, 5302, 3651, 3417, 5718, 5494, 4206, 4500, 5107, 3111, 319, 766, 2818, 4167, 3941, 5522, 7293, 6314, 1911, -729, 82, 831, 1702, 4357, 7690, 6455, 1893, 880, 2700, 2335, 772, 1831, 4030, 2442, 218, 3317, 6711, 4330, 735, 1417, 2148]
746B148l196p02M088K899k195j44J947k179n378n26M077Q14j090J755J850k791
762A377k735J685K226k540k440J351J077o10O28L038j74l303j431O39j061j083
778c356J178K675J223m61p47j441j699q40L72J735Q06o71lJ98K97n28m05m56j292
797c415j064M09J974J319j77l65L59j010k554o91J275K92M16J629J773j294k898
814d022lJ081p22p50J726J37j335L77K568O94k504j553M85k21j243J352K541K03
832a189r39K27N86k075j862O87J345O64L55J187K84j786o00O50K32m18r37M59
850c130R67Q03Q24O76p43j607r74J23N66M63O15J042J158j66j319n13l11p83J49
869b160J531J175p12j41Q41K78p51o11M04l93q49O50K516O74j203k61Q7r40j147
$$ y = [2148, -1048, -1750, 2338, 5237, 3042, 2898, 4845, 2666, -2712, -3238, 839, 1653, 563, 2318, 4168, 1377, -1358, 327, 2553, 13, -2427, -1076, 1, -609, 19, 3057, 2883, -420, -1851, -1212, -2273, -3356, -2178, 497, 1720, 1259, 512, -929, -2628, -3468, -3096, -1361, -555, -1226, -1229, -1031, -734, -1262, -1667, -2123, -3415, -4479, -4070, -2096, -777, -954, -1319, -960, -1970, -4524, -5215, -3940, -3648, -3232, -1603, 170, -1124, -4022, -4025, -2944, -3666, -4416, -2690, -2553, -3888, -3511, -943, -249, -2753, -4306, -3821, -4042, -5285, -3933, -1392, -1189, -2128, -1901, -1315, -3390, -5252, -4565, -3220, -2556, -2201, -1014, -730, -2516, -3116, -2466, -2234, -2652, -3589, -3130, -2163, -1360, -536, 140, -603, -2210, -3184, -3061, -2495, -2032, -1417, -375, 783, 617, -702, -1215, -1526, -2309, -2160, -629, 546, -166, -307, 534, 812, 61, -550, -146, -539, -1388, -738, 1778, 2452, 1249, 988, 1075, 135, -1012]
888a012P12J392k21J12J883L10j294j275N04k60m34L96J388Q4n33L93J218k74
906C089j877k36J96m16P24J395J110n98m87l67k2j084o38N63P19O86N18M64n97
925C142n30r11nP39p74%L78J129M44J65l40r66j153q79Q66R45L85J21N45ln97
946B701n66n31n25n49J41J879O38n39mm54l33l75k95j14o00K21J159J096K09j367
966A792j56j436l03j03Q58L53L2J69J042k76m77j426n45r3k51Q85O05P04n99K54
986A029k27r3j237r37j51M69Q45J250K81o27j214n8j67o45k51J51N68K25O24N55
1006C90n09j170j004J9J51j29N14L89J66P46j77l63j124j057J63L38K84P63L95
1025a215j20m58P6l67r16o5j65L24O63R06L61r17p46o0j5k03j90J91J46P57Q80
$$ y = [-1012, -300, 1092, 871, 983, 2866, 3176, 1882, 607, 1111, 851, 417, 813, 2201, 2285, 1752, 2145, 3363, 3089, 1212, 976, 1172, 756, 1480, 2875, 3985, 3387, 2900, 2533, 2511, 1427, 789, 1352, 2071, 2757, 3275, 3739, 3142, 2612, 1701, 1696, 2435, 1661, 1661, 2039, 3168, 3612, 3777, 3437, 2471, 1318, 439, 1305, 2250, 2635, 2756, 3301, 3298, 2701, 2135, 1604, 1079, 530, 671, 2550, 3188, 2649, 2645, 2191, 1858, 1483, 1188, 1074, 474, 695, 1854, 2950, 3159, 1792, 1636, 200, -103, -206, 652, 1005, 1037, 1206, 2248, 1972, 1495, 69, -476, -569, -820, 65, 670, 1374, 775, 1029, 802, 709, -528, -1465, -1616, -1147, -302, 948, 1229, 602, -612, -670, -837, -1482, -1733, -1582, -1014, -789, -165, 390, -119, -1289, -2293, -2274, -2123, -2252, -1738, -1349, -1183, -437, -614, -977, -2101, -3158, -2995, -2657, -2373, -1610, -1215, -1335, -1793, -1717, -2084, -3000, -3065, -3230, -2906, -2243, -1337, -976, -1893, -2639, -2699, -2714, -2917, -3107, -2916, -2770, -2013, -1133]
1046a133j51n48j116m10q1M26L74M50L57NK67N94q37p80o65l21P74R20R96j59
1066a038k83k16nk38m87k82J50N39N79J190J64o01j029l55q5KK30R20o2N11P41
1087C45K63p96n23p61L01J38N92Q07L67J66j94j07r7o28m52M9L32R33P94K71o25
1108A175K01m73j4n46J22J09L71P40P10L36n03q32l69m50O20L00j32N10Q95K71
1128C041J0o64o84l97l67O44R19L29j56L11n7j45l02p31k77j52N71R24R74m26
1148C365m64mo35n6q65N35J20O9J038L90K38p64j032m67K23k28K98K01L74L61
1168B697N77O2n47j410n80J37L73M30O04K52kn31l19J69l40r49p5Q86mP46J23
1189B299K12j060o78O9M6l63k45N03P79L64k31m21n60q42o37O99O84L13j41kJ44
$$ y = [-1133, -1284, -1832, -2948, -3358, -3439, -3013, -2639, -2189, -1832, -1827, -1560, -966, -1803, -2583, -3248, -3569, -2795, -1875, -879, -1038, -1321, -1537, -1542, -1780, -2267, -2549, -2399, -1860, -1281, -91, 73, -528, -1557, -1912, -1997, -1995, -1765, -845, -907, -396, 345, 608, -188, -711, -1472, -1171, -1033, -441, 366, 733, 899, 705, 598, 501, -127, -579, -530, -198, 735, 1529, 1800, 1175, 1376, 903, 889, 343, 465, 574, 945, 1685, 2395, 2731, 2228, 1396, 1027, 577, 1197, 1497, 1365, 1875, 2770, 3041, 3051, 2387, 1703, 1306, 939, 1583, 2502, 2831, 2675, 2986, 2929, 2784, 2482, 1751, 1474, 1322, 1893, 2817, 3791, 3365, 2901, 2897, 2262, 2206, 1341, 1876, 1996, 2065, 3103, 3493, 3731, 2967, 1935, 1468, 1691, 1463, 1761, 1962, 2336, 2697, 3274, 3336, 2789, 1379, 799, 936, 1309, 1739, 2343, 2595, 2593, 2062, 1743, 1912, 1572, 623, 548, 1434, 1430, 2176, 2299, 2511, 1451, 773, 842, 888, 525, 280, 783, 1562, 1926, 1695, 1274, 714, -128, -765, -66, 618, 931, 790, 788, 932]
1210I32l27l20J47j033n40K44J247K15k29J02L16r03l94k54l87l68N0J190R87
1229F75m3j189k62o9p56j29P46L03o88K99M41N01p35n99J36j82n16K25J137j32
1249h37j61O7O18q78j125k39O97OO61O68j9q32o30J01N55l81r80N96O63k36J65
1270a521R25n8r64o00M56k14n20MJ022J389q91P0j07j099r85K26J484N80p94K97
1290a300M02k64m89L10M29r03j066J018J122j91l07O82K58n84j021M67O0n54L15
1309a616J730O33j138j028L67J1q24P44J165M2j105J96J118R3q58Q3J01m94o50
1328a430P53J198N1k02K18M69r08j014j72J202J96N1J018R1j284l04L22P99l37
1347G17l55m2K48K89r8R42O84j311r31M59J17n72N40J285n2p34J96L4q08p52P03
$$ y = [932, 605, 285, 432, -601, -1141, -897, 350, 565, 336, 438, 754, -149, -543, -797, -1184, -1552, -1502, -312, 675, 632, -557, -819, -888, -1644, -1773, -1027, -724, -1412, -1113, -672, -171, -906, -1505, -1369, -1551, -2067, -1842, -705, -837, -998, -931, -313, -1191, -2316, -2555, -1858, -1852, -1191, -523, -542, -1374, -2004, -1903, -1348, -1729, -2709, -2113, -1450, -1686, -1521, -596, -654, -1618, -2218, -1762, -1976, -2496, -2492, -1470, -81, -972, -902, -1009, -2108, -3093, -2867, -1383, -803, -1597, -1300, -898, -1162, -1651, -1341, -912, -1815, -2881, -1863, -741, -932, -1239, -557, -299, -883, -1904, -1437, -1377, -1931, -1616, 114, 747, -391, -1419, -1052, -1041, -1865, -1121, 44, 86, -1019, -823, 295, 388, -470, -387, -286, -780, -1430, -677, 521, 572, 370, 588, 1057, 149, -865, -1037, 165, 361, 412, 1430, 1521, 237, -67, 255, 1054, 717, 362, 320, 568, 857, 759, 1701, 2385, 1074, 143, 602, 719, 147, 687, 1972, 1920, 1186, 1382, 1416, 608, -144, 559]
1368E59J221j04n88L76Q7m85l06P30M53j263l16N95P60M3o2L24J30j521q3O54
1388A204R5m95P05O12N0q84n31K52J8l78K26Q45j26r03K9J186l78m56rj94o44
1409B24k47O59J320m10q08N07l35p59l76N7J563q73m3M66M56j335m75O79N42o33
1429A79j73M62l93m65P25R99m46j342j85M10m3j42N83Q75l33j096J51K70p86l50
1449a100O92N18k54l47R0N62p19m22P67r6n37n92O77P07j54J7R2l81j138N9P33
1470h26K38l26K91M80k04p45n9J42k71k07O16M77l03m35n8Q62n24j08MO2n29k20
1492a643J106Q05n61o85K51O4p27j55N52P68o84n7N07R7p26k43M82K88p80J03
1512a238N75L8o39O61Q71q17r42K84M54k98O0Q20L23o36r75R69J55l34n90P88
$$ y = [559, 1780, 1676, 1088, 1464, 1551, 1066, 760, 1490, 1943, 680, 364, 959, 1719, 1762, 1700, 2024, 2154, 633, 550, 1204, 1299, 804, 1509, 2121, 2171, 1287, 756, 1008, 1026, 648, 874, 1719, 1593, 690, 719, 1905, 1527, 1071, 1062, 868, 224, -23, 636, 1956, 1546, 738, 1245, 910, 151, -225, -168, 1395, 522, 479, 945, 1401, 66, -409, 270, 812, 179, 6, 468, 75, -390, 335, 1334, 888, -454, -639, -229, -272, -414, 169, 1044, 711, -385, -234, 36, -750, -1100, -408, 110, -144, -491, -401, 161, -558, -980, -213, -309, -846, -1438, -761, -54, -208, -191, -99, -480, -1618, -1559, -826, -588, -914, -623, -143, -347, -1092, -1151, -1009, -1280, -1487, -871, -394, -697, -1132, -1190, -328, -852, -960, -956, -894, -1423, -1643, -537, 268, -293, -978, -727, -663, -1390, -1545, -993, -225, -909, -966, -459, -362, -1088, -1331, -849, -561, -1341, -1238, -663, -625, -1264, -603, 268, -549, -1491, -1207, -753, -1051, -991, -171, 152, -484, -1459, -490, -335, -669, -1259, -471]
1532d71K58m51L05K08j12n96J07O20o3q48L46M71N57m14J08J84n90m03L9O64R3
1553A2q8M18m0J21o28M10j45j89o9M42L64O4m26R5J59l13l2J24j33k44O2P68M12
1576A144k04n09J20k16k40J76M27Q8l22J24O41q0n63jJ67K81p26L58M42k89k49
1597E69K17N84p14k30K68J97j86M51N67l26o70k23P63m0o36J41M23j47m7M45L04
1618A710q11l86j03L70J23j37J70p9P5O20k57l21o02R6J93L7K77K85k66m9L4k62
1640G17k41K8l71L67J84K10J37l08k8l2j45j7j78RJ10j03L45P5k60m28m2M8k14
1663a37L85P5r3Q7j37N47n18k2l00m5j89K13L36j09J72m21K53J04l10n73K26J68
1685b88l31M52L12O9m63l79K43J3k21R9J32m46P20J9J49o02p5l25M24j55K83J57
$$ y = [-471, -213, -664, -359, -151, -263, -859, -752, -132, -195, -1043, -697, -226, 331, -83, 25, 209, -381, -784, -745, -81, 12, -76, 342, 302, 423, -205, 205, 60, -129, -198, 244, 608, 672, 246, 341, 500, 187, 155, 279, 146, -98, -36, 732, 1144, 940, 431, 551, 335, 95, 271, 698, 786, 464, 588, 1229, 1149, 586, 585, 752, 1033, 307, 665, 1107, 818, 569, 786, 1370, 656, 426, 694, 891, 705, 1156, 1723, 1397, 727, 504, 1267, 1227, 591, 732, 1155, 1008, 961, 1406, 1710, 899, 513, 410, 780, 903, 766, 936, 857, 932, 1552, 1295, 974, 372, 468, 661, 698, 975, 1260, 994, 945, 979, 717, 476, 504, 133, 500, 684, 894, 1031, 723, 695, 663, 518, 501, 323, 332, 442, 339, 684, 759, 499, 71, 29, 77, -137, 248, 323, 230, 317, 180, 727, 209, 187, -113, -158, -347, -134, 202, 93, 265, -156, 97, 201, -109, -682, -456, -288, -619, -167, 145, 214, -249, -628, -385, -372, -593, -494, -362, -808, -88, -69, 80, -522, -597, -922, -498, -653, -370, -213]
1707b13j62l8J91k5l22l79j76N2N51J04M05l72k83J77l0m35J04j41k0L17j21L65
1729d51K31n34o9O1k43K55j28J82j36M19J68k81k80j7k5k59K52L77j24k04j15
1750i21O45k61k3m69J96j94L73K35K24k48m6O2l47P1j46J2k5M07m1M16O9o05J30
1773d86m2p8J25Pj37L49j5N2j19r6P3j42n4l3L50L26k03K24l31K5Q2j99p6n3K89
1798a62k8O87k37k0l68J19J8m67K50j48L65Q3J81P1j46m03k26M42R1K10q3Mn3
1821A80N8N3m3l62j14J44P5M94j92J40KQ5k95N6N8%l33L99J31K38m26p3O0K74
1845F09k38J25K20l67j25L2N93l9m68L30k42J30q6k47L25J5j44J25R3R7m28Q3
1867C93M6j87L56M9P8j33l45N11j89n5m11Q2L16j5J71O3Q2m95n7P4K27m30K77
$$ y = [-213, -375, -413, -222, -247, -569, -948, -1124, -1072, -521, -417, -12, -384, -667, -490, -520, -955, -851, -992, -1012, -695, -816, -451, -220, -754, -823, -762, -1005, -750, -878, -696, -832, -413, -245, -526, -806, -823, -848, -1107, -855, -478, -602, -806, -921, -276, -537, -560, -1029, -833, -1027, -654, -419, -195, -443, -489, -427, -774, -703, -849, -837, -862, -455, -496, -80, -11, -616, -486, -528, -606, -481, -474, -611, -262, -277, -225, -344, -440, -367, -509, -563, -596, -246, 80, -123, 101, -230, -205, -123, -322, -398, -451, -162, -190, 497, 260, 240, -128, -9, 9, -458, -208, -356, 9, 92, 273, 344, 198, -205, -431, 11, 102, 312, 229, 233, 180, 238, 291, 248, -114, -228, -84, -9, 485, 293, 433, 435, 520, 225, 281, 339, 339, 6, 405, 536, 774, 348, 275, 335, 609, 371, 496, 716, 349, 224, 256, 849, 810, 342, 672, 430, 560, 474, 227, 552, 567, 423, 548, 641, 738, 310, 393, 439, 252, 608, 657, 735, 602, 257, 768, 579, 524, 113, 195, 511, 496, 667, 730, 812, 317, 260, 334, 561, 131, 408]
1890D08N75n45Q4P0l3k66r3j42M42o7k11J69J92k11k45K86Ql29k86M47Q2J16m03
1913D8K15J46n20J49N7rl83K73M37j3m69j4L85L6m06r4L28q2m08M17M54j88n87
1936b28J75R5m09m7K02N14k20k01J0M95p33J68k22K19p1j39M43L18q67k62O51
1957a09J63m45k41K98o5P2mM35j66n02P4J24Q5J5j01K79k1k90L03K89o64l75M55
1980c91P00p25m26L56L26L0m54L29O5p15L7M47K94j43j8J61j16l74O4K36J26k67
2002d58o2M17N7m92J45K60j68l10L06L28l7p03M15O3K03l77O1N0n3j28L70J86
2024G3j77l11R5L44n93p3O66J65o87M93q9j10R9l54N01p7j08qjK77j24O5L70l43
2048I3k19p3J56j99L20Q7l1l09Q7O1J85j65k41J66J39q8j73J92M4J07j47O4L18
$$ y = [408, 983, 438, 522, 592, 559, 293, 200, 58, 500, 433, 222, 391, 583, 372, 127, 413, 421, 92, -194, 253, 335, 451, 48, 263, 409, -111, 38, 95, 86, -297, -24, 413, 400, -69, -83, 302, 338, -68, -162, 166, 84, -324, 93, 547, 359, -228, -53, 42, -367, -414, -212, 302, 82, -119, -109, 386, -347, -179, -401, -182, -253, -392, 51, 369, -498, -760, -109, 54, -391, -632, -334, -399, -327, -331, 104, -62, -564, -490, -366, -281, -266, -367, -88, -109, -399, -96, 193, -471, -846, -391, 309, -416, -842, -486, -160, -130, -584, -255, -190, -905, -868, -421, -127, -270, -288, -127, -243, -617, -553, -317, -191, -458, -520, -103, -46, -538, -393, -133, -301, -611, -305, 23, -14, -717, -302, -239, -36, -413, -352, -302, -355, -483, -113, 73, -104, -415, -320, 24, -569, -642, 24, 189, -498, -5, -94, -204, -105, -459, 42, -35, -143, -151, -152, 125, 1, 66, 436, 93, -126, -199, -43, -242, 78, 165, 134, -175, -88, -27, 158, -7, -248, -82, 57, -31, -204, -12, 32, 139, -8, 56, 374]
2071C74k66n40K00K82J22K02k32j44j01k32O43m4k17k14N60l03p4R1K30l5l1k09
2093F2k78L77q7K01K28j30j41J63j37j78M3P9K19k42Q8N8l17K48m02L50k18L9
2115B5LQ1k8j61K25K91k23l43L52j36J25n0K23K84o49j93J85K73o05O37q3N7k50
2138D0k65L38m1j13Q3J75o96O18k93M43j17rk25L89j84l82J80L54J1N2j45m44
2160b31L56m18J4M66o6O6l52J28J21k11J59K8k05ok9J72l16M39j43K09M7n63J07
2183b28k29K4L12L24k00r3kk72J69j97M61m24N12n23L75k03J84j57j88R3R7k19
2205c84L42J43l53k25L74O9k46j11L32k87j88L91k4K44l64k15M24k71J66l23L56
2226a50K2l49L23L83l20j80J28K67j69l30j39L20M3r0N8o3Jm2q1L79j42J84L3
$$ y = [374, 108, -432, -232, 50, 172, 374, 142, -2, -103, -335, 308, 264, 47, -167, 393, 90, 16, 107, 337, 302, 271, 62, -216, 161, 74, 275, 503, 373, 232, 395, 258, 80, 123, 202, 421, 179, 267, 325, 8, 256, -146, 204, -14, 25, 28, 109, 81, -80, 145, 436, 213, -130, 222, 86, 211, 161, 384, 668, 19, -174, 11, 284, -321, 316, 233, 290, 40, -225, 113, 72, -41, 42, 217, -479, 139, -154, 289, 172, 163, -62, 327, 143, -239, -59, 295, 306, 358, 213, -231, 125, -293, -279, 187, 121, 187, -165, -37, 84, -127, 32, 60, -145, -151, -180, -8, -324, 115, -28, 181, 228, -335, -228, -457, -433, -121, 203, 3, -90, -92, -364, -195, -392, 69, -355, 157, -366, 9, -194, -10, -167, -355, -262, -165, -384, -42, 101, -252, -477, -103, -34, -280, -391, -59, -346, -534, -143, -167, 77, -287, -502, -78, -349, -183, -506, -150, -128, -477, -154, 229, -91, -271, -143, 124, -45, -375, -514, -194, -151, -241, -183, -246, -245, -287, -368, 11, -131, 53, 86]
2249H6l94J3j20M87k85o5j13L73k26J77k14N3L06k46m8L33l02J80k66P9J79L7
2271B4J31j41k99L03j99K89k85K15l02L6L42l50M61j68m24J53J87J72k08j37J84
2292a6k1q1k02J61K67k31K92j1J5k89j64K99J9k34J13K78k82M11rR7l95Q7k06
2315a02Q2k61O90p9k90j01M38j3j80k07n7J24o1K16j79r2K65j72K36J21k94P1
2337A55l49L78K5Jl99K29J02j14L07K5j76J09Nk68L70k00j54k20M65r2L7p0M5
2360B11l51K39J30o8J45M4K6q0q6R1k21K77l20P4K47ml73j0R9J77l21K88rj52
2384E3L5P8j29J13J6Jk38L38l7k26J21j81L55k51j10O3Q7j14N3m0Q4j77J07k72
2408b71M26q7j21J58K14k05l17K48j55J77O9j28j1J14p9L7k47M09j35r2K1j23
$$ y = [86, -308, -295, -415, 72, -213, -278, -391, -18, -244, -67, -281, -228, 78, -168, -216, 117, -185, -5, -271, -192, -13, 24, 155, 14, -285, 18, -181, 108, -177, 38, -264, -228, 114, -236, 225, 57, -367, -214, -27, 145, -63, -200, -16, -37, -118, -320, -159, 108, -123, 169, 158, 173, -116, -280, 19, 38, -196, -83, 195, -87, 324, 315, 412, 17, 104, -102, -20, -281, 409, 330, 40, -61, 377, 364, 184, -23, -80, 44, -17, 199, 20, -72, 193, 21, 257, 378, 84, 155, -194, 184, 209, 210, -189, 40, 142, 28, 335, 360, 184, 293, 298, 30, 400, 200, 46, -174, 291, 199, 236, 166, 211, -140, 99, 229, 161, 306, 350, 376, 296, 210, 301, 80, 357, 37, 111, 358, 354, -19, -29, 70, 247, -74, 214, 205, 53, 88, 166, 37, 150, 166, 167, -71, 267, 230, 4, 125, -56, 299, 48, -62, 1, 88, -26, 27, -13, 71, -106, 1, -271, 155, 68, -53, 105, 319, 114, -203, 45, -110, 67, 136, 8, -3, 111, 32, 69, -178, 231, 96, 4, 25, -98]
2430i8J83k36J67J85l35J25O3l25J68qp4j30J97L04k68J62J70m44K1J06J42N5
2452A30l22K88J62k51l02K53j36J30j70J84j83k5M89l50M1l2m7P5P3j29J25k41
2474b38PQ2J12j38l8j30J95J26J12l81K90K53j64k20M7OP8j96L76l72M39j97K3
2497G2j78J26J80l25J46j6K3j18J82j76K6OK44k58r8j04K89J82k8k72J04j8j96
2520b07R8m7L91k28J62p2J34j03j37l2L30l21j03J16L1K62j53k39j8R7L1K39l1
2543B00m61L13O9j58J3L62l23K9R7j8J6j38j9n2l11J15J97M58j26j71k93L9j50
2566c12K72j97J53J62l07K93o3k28K10nL8j69J2P5N8K82m81M42o5j82L2o5KJ14
2590G1J73m02L38l81K40K64j6l19K11P1k20l3j10J24N9L6Jj07M3M4k67J51J18
$$ y = [-98, 85, -151, 16, 201, -134, -9, 54, -271, -103, -111, -185, -315, -118, 186, -82, 80, 250, -194, -173, -67, 75, 130, -192, 96, 258, 7, -295, -42, -178, -48, -218, -34, -217, -242, 247, -103, -62, -94, -141, -66, 7, -122, 3, -238, -231, -149, -37, -175, -213, -343, -148, -22, 90, -291, -1, 252, 88, -132, -85, -79, -1, -197, 179, -193, 246, 49, 72, -106, 20, 200, -125, 21, 5, 28, -90, 92, -84, -58, -52, 192, -66, -164, -268, 21, 203, 175, -97, 7, -11, -207, -109, -156, 235, 7, 169, 97, 231, 128, -9, -41, 289, -32, -135, -19, 12, 274, 121, -118, -136, -39, -8, 231, 200, -261, 52, 121, -37, -24, 338, 15, 44, 141, 123, 139, 1, -18, -70, -381, -266, -69, 389, 263, 92, -201, -162, -312, -40, -237, -84, 78, -229, 64, 1, -227, -17, -22, 16, -153, -141, -66, -8, 274, -207, 235, 170, -12, 20, -45, -43, 71, 244, -158, 180, -201, 39, 303, 287, -32, 179, 250, 30, -3, -113, 11, 70, 106, 107, 0, 43, 87, -180, -29, 89]
2613H9J46j69J28m9k21PJ53J09k45P7J70K2n57M51k05K97j46K37J5l56J73j91
2635f5K31r8j17J77N1O3o6k47j11J43N2n4K54j89k91K86j50L56m68P7J91K58j21
2658A62J03m02N5K92p4j3j00L70l18m0o4M1j86K34K60l82J41Q1k05jm3rJ21K20
2682B43j72l13J6L47n4L8k86J20j8L8k4K3n5K97j61p6P7R2j75J16J02L28l52o7
2706H4j44l3l2J1R9j81K89q7M2R5m66M67Oj43J43j97K98k27p2L12k98k8K83k36
2730a5m5N8j06r4K46N1J9j53n8J51Rj09J63n6l13J47K40k61L29J11k64O4j00p5
2754f1J8J08k53K27j53n2M3jJ75q5O2j7K58k75K9K3l7j20m6K66o1J76r2k16J1
2779g3j05K26j63J53OJ3n6J35j32J05n2J51q2j71k5M1j77J7K08K39j72j22K0K30
$$ y = [89, 235, 66, 194, 145, -76, -69, 84, 193, -52, 25, 195, 217, -340, 111, -94, 203, 57, 294, 309, -47, 126, -65, 166, 68, -49, 128, 179, 242, 176, -71, -182, -39, 13, -41, 213, 24, -267, 19, -131, 225, -243, -166, 25, 283, 162, 265, -137, -82, 210, 136, 123, 23, 393, 75, 35, -29, 12, -174, 60, 320, -62, 79, 160, -45, -46, -89, -98, 23, 243, 71, -242, -226, 121, 67, 105, -181, -61, -79, -41, -65, -42, -97, 200, 39, -37, 40, 132, -43, 73, 175, 503, 151, 84, -60, -93, -125, -114, -15, -196, 93, 6, 48, 143, -323, 144, 150, 7, 150, -47, 251, 24, -48, 264, -34, -62, 221, -15, -60, -2, -108, -202, 44, 95, 114, -39, -97, 54, 63, -46, 117, 61, -252, -105, 135, -126, 203, 314, 50, 114, 14, -61, -43, 65, -188, 39, -114, -166, -123, -124, 51, -34, 28, 11, 269, -6, 23, 46, 9, -111, -157, 109, 48, 224, 132, -84, -73, -178, 48, -115, 38, 44, 57, 1, 136, 4, 109, 57, 208, 126, -45, -70, -29, -206, -189, 19, 258, 86, -36, -16, 214]
2803B14m17L29k2j71O7n1M01m33j15J53j56K25r8J4K9L93l23Qk60j8L60J71k29
2826G1J52k08n5K51l08Q1O7J06J14k56j07rJ90j7m3J97m35O4p2L26l4J54l00q
2850g9L7O1r6J89k03j01J37L10l40j03K07k1k47j16K74j16L60k08o5K39k14k86
2872c81K31J48P1o0R9k91J78R4M3j37p3Q4M8p9K33j43j13J75O8k61J90j23j99
2895a98R8J25m55N82J14l69j06J09p0K2L2R5J84m49J42L85m15Q2J46k27J04j08
2917a77J81O3k64M82r6j12M3l35p7K17l3J81j11K76j26k9L3k02J0j17K43P5j74
2940d9L8lL9p4L34m51j24K44j46l2K04j04J18j04J19j61J62R5J90k00M0k11J58
2963H2r3k16m6K74j42J14K58k16j15p7J28o6K04k01J45k88O1K7L5J63J68p3p4
$$ y = [214, -203, 126, 104, -67, 0, -51, 350, -83, -198, -45, -201, 24, -74, -60, -31, 362, 39, 47, -213, -231, 129, 300, 71, 223, 15, -40, 211, -97, -16, 51, 157, 271, 15, -92, -101, 89, 72, 29, 226, -209, -145, -217, 109, 75, 229, -71, -79, -42, 19, -77, 112, -91, -192, -55, 255, -85, -188, 19, -2, -249, -365, -91, -207, 153, -55, -120, 119, -95, -381, -150, -2, 69, 9, 108, -183, -5, 89, 132, -5, -78, 6, 54, -25, 208, 65, -48, 127, 195, -66, 124, 1, -198, -100, 25, -430, 152, 266, -103, -209, -100, -170, -148, -116, -21, 163, -286, -144, 241, -174, -92, 54, -173, -69, -177, 4, 67, -197, 285, 189, 77, 120, -215, -292, -75, -108, 73, -38, 238, 112, 83, 116, -86, -76, -193, 50, 125, -49, -11, -14, 25, -49, 285, -166, -290, -46, -192, -224, -20, -124, -6, -110, 9, -152, 10, 105, 295, 95, 135, -76, 82, -11, -227, -273, 1, -141, -27, 231, 15, -100, -177, -49, -115, 89, -112, 33, -255, -194, -167, -132, 31, 199, 126, 52]
2986E2M8K22m55Mp4o0K45j69J66l5J48N3o3k85J06J72k68J58n3J50m0J26L0l35
3010a57J88J36k51K55k81J26J10j23J1m07L10K5M44j48k18j80O5J38j07K54k09
3031a9J4J74k49P7j18L38q9J34l17J26o6j26R5O7m7k04K06Q9K58l85n6j1N90m93
3055a2N4q1J41J43l09J74j95j3n3K89j04k6R2j50N3J75p7m6j24kQJ95L1j73k25
3080b35K97K7j55l6j9NL3J47m0K13l51N8L35j34q8j04J85l71L16j93J83k50l6
3103b13K46R4k1j80J28j7J8j4q6N4M1p6M06k86q0p5P5k15K39J92j83k8l8n7L73
3128B97k82R7j15J41j07J05k90K55Q5j17r1j87J52L3J13k70O8P0k11L53l9j53
3150i3P0J21k52J61o7J27j81r0r0N90l67j54J35K04l34L00k15J72K62n39r3K39
$$ y = [52, 100, 322, -133, -129, -203, -263, -18, -187, -21, -56, 92, 145, 82, -203, -97, 75, -193, -35, -88, 62, 22, 148, 178, -157, 31, 167, -84, 171, -110, 16, 126, 3, 14, -393, -83, -58, 386, 238, 20, -160, -95, 43, -64, 190, -19, -5, 169, -80, -3, -121, 217, 128, 262, -55, 71, 5, -121, -26, 41, -6, -210, -4, 85, 343, -42, -98, -109, 481, -12, 42, -39, 102, 245, -64, 110, -85, -98, -151, 138, 34, 8, 100, -50, 3, 178, 101, 55, -69, -71, -63, 132, 163, -10, -235, 62, 89, -66, -102, -121, -116, -83, 64, 24, 237, -114, -56, 279, 145, 57, -47, 138, -233, 83, -110, 73, -177, -213, 33, 127, 106, -74, 54, 37, 55, 41, -45, 9, 50, -26, 380, 94, 14, -61, 14, -201, 38, 230, 47, 19, -19, -76, 297, 15, 112, -3, 138, 31, 136, -154, 101, 186, 69, -22, -209, -57, -24, 89, -181, -113, -43, -254, 99, 60, -93, -23, 98, -154, 7, -60, 67, -114, -204, -294, 296, -71, -225, -90, 114, -220, 80, -135, 37, 299, -240, -333, -94]
3172i4M01m39M9J30r9k93J70J92n1k8M5R3j25j8p4j78K76q9j73K57O7O9k9q4k5
3197e0j3K30l08Q8m2L18k37l1J57j65l2J56K21j06m62L22j79R7m4J73J15k75R1
3220B4J76j81O1j7j0n0k95L56k13R5l4j28L27J51k92K95k52o7M8j54M05m08K1
3243a42O8Q1M3k23J13q4R1J13L8k33j8L86l76PJ46L75k76j29K86k59J8j5m2K21
3267A89j72p2J33k73L24p5m4J39k04j51M47j48k5J0j85J92P8j34q1N4K8j63J45
3290A2O8j43J29k8J38n1j77J54q0K3j06N9k47N47j33j32j17j99L20Ok9J07L01
3313D22k54j97J43j45J52O9k85K64J8l64J0J34K39j8j25J63l71N8j65J97P1K11
3335B27m74L37pk90K77J47j28NL9j96M1K55n10K78l62N26n2m1J27o7j84q7R7n2
$$ y = [-94, 307, -132, -83, 47, -52, -345, -175, 17, -34, -62, -17, 76, -49, -67, -141, -319, -43, -132, -305, -48, 19, 88, 59, -25, -50, -63, 167, -141, -53, -95, 223, -14, -45, 112, -53, -85, 71, 292, 186, -276, 46, -133, -36, -80, 93, 208, -67, 24, 200, 19, 80, 63, 53, 3, -292, 64, -149, -54, -88, -216, 111, 262, -30, 265, 13, -54, -6, -160, 245, -163, -142, -74, 7, 50, -173, -60, -144, -53, 60, 98, -135, -153, 233, -143, -136, 10, 385, 109, -20, 266, 7, 25, 10, -32, 189, 17, -55, 78, -195, 129, 54, 10, 149, -55, -206, 241, 93, 68, 78, -107, 85, 163, 29, -52, 2, 30, -133, 12, 80, -63, 66, 38, 176, 125, -52, 102, 22, 45, -61, -2, -249, 298, 165, 33, -84, -283, 37, 43, 14, 121, 422, 168, -29, 114, -31, 121, 190, -95, 169, 187, -177, -167, -33, 206, 188, 63, 226, -145, -87, -252, -55, 16, 227, -247, 90, 83, -207, 70, 217, 89, 94, 133, -63, -22, 233, -277, 1, -361, 165, 113, 72, 199, 132, -52, -139, -42, -94]
3359i4J13M17n72J08J50k76L81k90M11m64o0L61l44L35k67K50Q7k44k9k91L64
3380D6L1j30k01K27J24rM4j90Q8J47j46j16J3J90j8p0k46J96n2J9J86n8j60Q5
3404@L9O1j60l9q3K8j08M19j90o8k45K68L7J49j20mj23J89j21R1L90o41K01J22
3428I2m17J17K0Q6NN5j13n3j46M35m8J23J22l32j28K81j40J2K39j03k06J6j98
3451b81m3L28mO1k4l76J4K53k31L45J20k91O7M9J80j97j40K16o3K97m45K68k26
3474a23K36n9k08J57j10J27k46L43m1j60J63q3P8k73p2K95j03K4J18J97n53K16
3496g7J42J45l7q3P8k42kj83M27r6R0o4k58J78p6K67k80J84j71J91j62J35r3J5
3520B8K42k77J30o9l77M68J87m96M24k44R7j00P3j21o1L5K0J10J09l00K58lk2
$$ y = [-94, 19, 436, -136, -28, 122, -154, 227, -63, 348, -116, -176, 185, -159, 176, -91, 159, 246, 2, -27, -318, 46, 77, -53, -254, -27, 97, 88, 132, -58, 30, 177, 31, -85, -72, 118, 100, 30, -216, -20, -72, -53, 133, 75, -85, 0, 39, 100, -60, -99, -182, -154, -262, 157, -33, -101, -346, -78, -41, 108, -12, -16, -139, 50, -71, 20, 410, -231, -30, 92, -325, -208, -188, -102, -97, -42, -155, -208, -354, 81, 33, 156, 278, -54, -182, 99, -41, -29, 210, 107, -99, -83, -281, -324, 4, 0, 61, 37, -339, -325, -72, -303, 42, 162, -129, -62, -13, 167, -30, -170, 46, -17, 280, -165, 103, -123, 113, 54, -154, 3, -107, 20, -226, 117, 76, -84, 79, -4, 74, -199, -271, 24, -79, -55, 63, 260, -293, -77, 65, 210, 173, 90, 168, -74, -76, -259, 168, 72, 162, 98, -160, 18, -58, 209, -71, 113, -58, 133, -29, 106, 13, 28, 270, -7, 123, 54, -323, 145, 332, -164, 260, 16, 113, 13, 86, -35, -96, -61, -41, 69, 178, -122, 136, 133, 111]
3543A11l9J26k57k7M8n7j74K42N1j5J77j31O4M8j39j1J10l20L66k16R0J79l94
3566a68L02j71J92R3m8j18j28L4J72k47P5J7J14k35r8K74K90n7j72r6J36J28l86
3589i7K5k0k3j09J78q4M4M8P4j15N3rR4n64O00k01K9M03l75j40J08k28K03O0o2
3614a08j7K44k33K76l70L9K4O6rJ79l8O8j33r6J21m3r5K19L4n05K77Q6j95K73
3638F4L8j85j55J41M6Q5J83o5j61m4J0J08l42L2J87K1r5m8J75L09m67j04J73J38
3662D4J6j49n6J02k05O4L48l44M0J60q9j76J11P6J98j77p9K16k72J88J26J82p
3685C17l06j77J38o2L42J73l58l3j07Q7M6j36k5m3j38L57k89J08N4J91l57L76
3707A58PN2j19j65r8j4K31P4n4P3j66L29k72M0K45p60O22j66J26L72n48L61k97
$$ y = [111, 72, 198, -59, -86, -38, -95, -269, -27, 24, 9, 186, 55, 119, 167, 28, 17, 127, -193, 173, -43, 47, 226, -168, 134, -37, 155, 248, 200, 82, -46, -12, 160, -87, -12, 5, 119, -116, -214, 60, 350, 293, 121, 25, 161, 289, -97, -72, -92, -115, -224, -46, -130, -86, -38, 36, -79, -26, -35, 59, -505, 95, -106, -77, 326, -49, -189, -81, -309, -106, -46, -108, -125, 119, -114, 162, -208, -169, -145, -79, -88, 91, 53, 121, -12, -108, 13, -30, -125, 94, 128, -377, -100, -14, -209, 64, 102, -83, -238, -97, -51, 34, 217, 152, -9, -53, -43, 65, -277, -245, -58, -37, -132, -180, -5, 304, -163, -267, -94, 44, 60, -89, -145, -43, -248, -184, 164, -180, -140, 20, -69, -245, -134, -58, 140, -37, -116, 100, -172, 16, 142, 324, 317, 11, -166, -28, -90, 252, 425, 67, 34, -73, 14, 60, -76, -101, -144, -282, 75, -214, -106, -52, 139, -218, 158, 165, 217, 98, -67, -165, -179, 52, 126, 72, 145, -21, 308, 36, 76, 321, -439, 183, 17, 143, 515, -33, 328, 31]
3730C1J64n7l52M32l64J53j27J29J59k68J79L48k55k28L35o09L20O9J56j19j07
3751a1J07k34K13j15K1j69K44N1p8m4J81n3j68M07j85j41n6K28l30K43k58Q1j21
3774a87J80L45k82j88L17r4n0K1L0j34k81L52K4L6k92K7J05J02Lj99L15J58l57
3797d9K9k40K70n0Q7L9kl08K4K52J08l96L80j35k6m7L10j36j93J23k18N03o7k63
3821ej10O8nJ97q3O4j0l53K94J6m04L97p0Q7L3M7k82K45j82K92j90k10K55J1q1
3846B1k42O1K46J81k67o4J11k77R4K60l6j92L76j42l64J77o1L3o3J92P3J2l56
3869b27J92K63m48M52l35l01M73K10j55l4j31J64N6k95O6k4J25J71m6j11J37k11
3891il36L70L1P2J52l37L9j54N02l02k59L15L4o9N3q6j37K1rj39K60j29j1j13
$$ y = [31, 195, 138, -214, 218, -146, 7, -120, 9, 168, -100, 79, 427, 172, -56, 279, -330, -10, 59, 215, 96, -11, 96, -138, 75, -40, -19, -188, 56, 107, 29, -15, 166, 113, -55, 352, 167, 26, -30, 198, -132, 111, -147, -66, -187, -7, 338, 56, -132, 185, 91, 41, 62, 92, -42, -323, 29, 53, 89, -203, -176, -71, 31, 34, -165, 150, 308, -49, -20, -260, 10, -40, 47, 86, 84, -224, -200, 52, 160, -236, 144, 9, -17, -64, 246, 110, -83, 40, -178, 325, 258, -5, -115, -47, -52, 145, 62, 126, 116, -237, 57, 73, -331, 66, -4, 83, 116, 163, -119, 126, -56, 236, 46, -164, 91, 102, 21, -221, -160, 86, 267, 0, -64, 47, -230, -136, 124, 88, -104, 272, 130, -234, -57, -118, -85, -148, 44, 117, 129, -227, -35, 228, -220, 232, -103, -404, 69, 279, 124, 90, -41, 123, 179, -116, -50, -74, 51, 222, 176, 65, 202, -9, -345, 25, 56, 128, 280, -57, -18, -172, 330, 28, -231, 84, 118, 49, 102, 16, -121, -100, -109, -248, 12, -117, -128, -241]
3915b41K77l2Nk19J42J44J22l5N7L6n58L20k89K13K29l0j47Jk2pP9j01N1K57j53
3940I9j40J51k61R0j92O8Q7N4K5m9k85K45L90m83Q4Q1J77j69j64N6J00O4l7j90
3964a99P7L13n9O0q5J08q8j54k8L05l32L9J6J43N6m9r3l50M17M58p20K57m0l04
3988b52K11j78K66k71J28Rj58J81p5J99j31J37j17p3M86l62k00J42R0m0J01r9
4010fJ5j25J39q5ORJ23J43j39J79k96K43j81j21J61q1J10k9l34P1L94j80m1K56
4034B31o7n00R6K67o7J50j39k52N67l39R1o2j5j55L09N8n5J5n47M36j08j39M86
4057B61j45j61j32M39j91l77M66k76M20n31L4K47n3j42J17Q9P7k24K83P9j29j05
4079D6j89J77K30j76Nj14M47p1l77K56l19K09j3L7j50j31J56l8j37L74l85NK51
$$ y = [-241, 36, 4, 9, -210, -68, 76, 198, 163, 220, 256, -302, 18, -271, -58, 171, 141, -6, -5, -27, -34, 45, -56, -5, 252, 99, -41, 110, -151, -61, -253, -185, -98, -44, -19, -68, -353, -108, 282, -201, -117, -36, 141, -28, -192, -136, -36, 28, -9, -199, -122, 191, 132, 192, 107, 215, 127, -27, -55, 250, -82, -43, -27, 116, 172, 123, 30, -320, 97, 555, -165, 92, 52, -252, -41, -219, 47, -224, -96, -87, -245, -64, -139, 60, -71, 66, -51, -124, 362, 0, -200, -58, 32, -8, 93, -6, 9, -116, 23, -62, -56, -47, 76, 219, 80, 259, -37, 206, 25, -96, 65, -16, 94, 65, -269, -198, 196, 16, -25, 231, 164, -336, -240, 27, -40, 110, -29, -281, 286, -53, 38, -24, -39, -194, 115, 173, 118, 133, -414, 22, -86, -225, 261, 116, -45, -177, 262, 71, -306, 160, -116, 304, -227, -193, 54, 1, -141, -24, 65, 142, -82, 201, 280, 151, 46, -143, 34, 264, 88, 93, -21, 426, 355, -22, 234, -85, 124, 111, 148, -2, -133, 23, -15, -152, 222, -163, -158, 93]
4102I3o8k42P7L00j40M5P8n9j2kK05m80K12N5j63K61j62k17L86k75P1O4q7R3k31
4127a98J74j33L11k89K77k87k10K03Mn3J13j1K6M1mj6L0J09k44k04L77l7j55J99
4151B3J56j25l7k3j02K94j3j58J35k71k54N98k91K8M7J17q9M2m2K49n01J02J63
4174D8j32J44j25rR7m6l37J10K27r2K01k68K99J0k46K44k5qM6l41j5K36j32J64
4198E0l52K92m4L06j27k68K62j17J2K37k43J6k41L90j91l4L53m04P3K05l03p9
4220b07J52m7j9O3J20K37k85K0R4k01K32j74K5k9J45o0N3j7o3j78q6K59j69L42
4244B07o0j53J87m2rn63L20J36k6%Q9j24K74l46J82k54J94r1K23k46J12o7L03
4267B46o8k50K98l03M9j00K15j60K9n7L13j37j40j73J26R8J4o6L8j29r7L39K8
$$ y = [93, 25, -217, -140, 160, 20, 65, 143, 84, 72, 70, 275, -205, 7, 62, -101, 160, -2, -219, 167, -108, -37, 27, -60, 33, -198, -24, -157, 154, -135, 142, -145, -355, -152, -148, -201, -88, -99, -73, -32, -36, -52, -22, 87, -157, -361, 16, -21, -176, 23, 179, 54, 17, -6, -108, 186, 173, 15, 150, -121, -375, 223, -68, -40, 7, 124, 35, 77, 35, 284, -217, -115, 48, -84, 60, -65, -74, 23, -23, -360, -250, -23, -115, 86, -182, 117, 127, -119, 125, 100, 92, 138, -203, -218, 18, -114, 50, -302, -10, -54, 252, 125, -143, 119, 2, 14, 251, 8, 24, -217, 173, -18, -52, 301, -103, -30, 175, -128, -207, -55, -102, -121, -58, 62, 299, 14, 34, 128, -73, 159, -15, 10, -19, 126, 66, 119, 102, 39, -139, -225, 34, -135, 207, 147, -6, 181, 139, 130, -433, -113, 23, -3, -3, 86, -38, 236, -110, 72, -182, 12, -79, 144, -102, 10, -57, 246, 178, -72, 226, -77, -28, -128, 87, -73, -44, -101, 212, 75, -65, -238, -112, -14, 0, -66, -28, -157, -254, 85, 113]
4290A13J19j65p6O0q6j4K75m50P2K85l43K80JJ14j5l56L41J00j96N6j35J59K5
4313A64j93j2J1j06J77k6j76l2J01J22k60K35J27k23J34k1J0j2M5j95RJ41J17
4336A37j8n9Jj16NK17k80L2k07L49J75k60K13j68J75k46J33lk21L85k94J63k26
4359a13J80M0k66N7L75k32jj7j62k3J35J63j67rN1n7j10J47j24m0J68l1j66J69
4383c3j24K2p6p0J33K63q7j39R4J45j73k7J07j11L14j30j17j4j43J93K10P1m8
4406B60m44J93L4k84J40q3K03k00L58l02Q5R3j12J75j15mJ39j61J48j2p4p6K79
4429B40k24m3o9L39l28M3K2oQ7l41N12p3K0k47l56J86r1J86J1J9j34K83J11J22
4453B69K4l73K91j19j90L40l13J49k9l9m0K40J58k57%j70j44K24K5Q7k98J33n9
$$ y = [113, 232, 67, -9, 51, -35, -49, 226, -224, -152, 133, -210, 70, 71, 185, 170, -186, 155, 255, 59, 115, -20, 139, 164, -29, -41, -30, -136, 41, 15, -161, -193, -92, 30, -230, 5, 132, -91, 43, 22, 32, 20, 65, -130, -121, 20, 137, 119, 60, 61, -55, -50, 167, -113, -81, -288, 61, 236, -24, 189, 21, 196, -50, 83, 80, -141, 244, -50, 113, -113, 67, 107, -159, -102, 273, 41, 40, 23, -139, -162, -27, 136, -31, -40, 11, -46, -156, -9, -133, -173, -5, -36, -202, -33, -157, -135, -211, -281, -148, 115, 28, -111, -17, 128, -45, -72, 35, -76, 238, 108, -9, -23, -166, 27, 237, 308, 260, -184, 9, 43, -241, -101, -184, 19, -181, 177, -125, -40, 53, -59, 116, 1, -3, 136, -25, 123, 111, 37, -39, 240, 16, -27, -96, 243, -85, -42, -20, -26, 61, -280, 232, 159, 179, -68, -424, -238, -329, -143, -132, -113, -247, 36, 147, 269, 293, -80, 211, 92, -98, 242, -71, 78, 49, 10, -30, 210, 368, 111, 111, -59, -203, 21, 46, 133, -165, -32, -91]
4476i1K05l02J38L07k91K7j48J10j21K94k04n4Q0j0K67n53K87J16j42j03N65n02
4498a25k5K85j87N3K5P6nj71J82L4l6j54j26K77o4J63J94n25P5J80k94J90O6L42
4522D30m97O3J42J17j84n7O8k64L81k93K30k89R0M35n14j11L54q3j44k8K98K03
4544C47l11OJ23l14J06K81k16j44q0K62R2O3r4k74K01k66L07j99l4L79l01K29
4566A63k27j0K88J07l14j75K13j85M05l34Q6j42J97J24k60J22O8J56l12m2J80
4587A08k18l9K55K7J68k20J2m17N61p7M8n0J0k80J77J80k34r3J16p4Q6L9K18n10
4611b07K10l1J98o5j88R5n1J49n5m2J39rk80R3%j68M92k37P0J38l75L03K6l54
4635a49R0j0o2J04L8J38j20J25m06m4K36rJ94j1k06Q5l7p2K44j39J57m0l0k26
$$ y = [-91, 114, -188, -50, 257, -34, -7, -155, -45, -166, 128, -76, -130, -50, -60, 207, -346, -59, 57, -85, -188, 377, -125, -150, 135, -52, 1, 26, 102, 97, -74, 108, 142, 106, -48, -174, 103, 39, 202, 396, -129, -54, 126, -168, 22, 88, 430, -67, -4, 138, 255, 71, 14, 82, -182, 199, -94, 136, -153, -63, 372, -142, -253, 101, 18, -126, -154, 144, 347, 36, 42, 165, -149, -43, 238, 22, -122, -202, 60, 152, 215, 121, -153, 48, -218, 89, -110, -144, 235, -66, 163, -64, -74, 214, 321, 7, -168, 45, -140, 265, -69, 17, -125, 72, 196, -64, 58, 126, 282, -30, -72, 108, -110, -149, 106, 133, 301, 81, 93, -324, 237, 160, 208, 158, 168, -112, 65, 245, 11, -82, 34, -40, 46, 85, 303, -207, 3, -28, 170, 105, -83, 12, -39, 110, 55, 13, 152, 143, -137, -44, -44, -212, 280, 43, 113, 251, -124, 179, 205, -149, -59, -69, -131, -27, 11, 149, 29, 154, -252, -296, -60, -69, 125, 114, -92, -7, -44, -116, 128, -11, 146, 106, 76, -150]
4659a50L36l48J47q4K49N0L0j10k32o4L53o7o1j14l08N43l43M17m74Q6J70R6K9
4682A51j08J06j38K7j33P8J64o2k5J42l82J7L46k35L4J5M6l15L36J35k78j41K75
4705E5k24J49J21P3J04j41m8J5K5o1j22K24J90j09k93o4J29N0l15J43J61k76K07
4728gK09r5m4l00M55l0j15j2J2k85J86j02L66l93j37L74l3j42J41j75K45k55K
4751a35j94M17j6k21R6J93m60J12QK86j74J44J5j42K32m37K56J2k70J77k0q4O
4774a99K63k08K71N1j44M4J1k71q6J78M0m4pP7k4j49L22j41l6K69q5k36J54q1
4798c1M6J08l91L09k36K25J02m14L55J0j10L71k78k95L00l49L39J96q9N3j49k17
4820a45L62j05j67J76Q9l67j9L68k43P4j83J06j47J28J76j40J48m0k66K21J36
$$ y = [-150, 186, -162, -15, -99, 150, 200, 230, 120, -112, -176, 177, 110, 49, -65, -373, 170, -173, 244, -230, -144, 26, 122, 151, 43, 149, 11, 38, -95, -17, 147, 85, 60, 202, -180, -163, 183, -52, -18, -3, 43, -272, 64, 199, -79, -220, 55, -169, -20, 101, 174, 278, 137, 89, 104, 129, 68, -54, 170, 360, 251, -42, -106, 23, 73, -242, -99, 62, -214, -7, 202, 107, 63, -237, 218, 188, 73, 61, 73, -212, -26, -128, 238, -155, -292, 82, 49, -93, 48, -127, 118, -137, -135, -329, 88, 72, -149, -53, 140, -320, -208, -200, 86, -88, 56, 71, -71, 161, -276, -20, -8, -278, -101, -121, -205, -199, 64, -144, 127, 178, 34, 78, 89, -182, -268, -90, -50, -94, -101, -24, -48, -197, 125, -16, -52, 217, 132, -104, 50, -31, 15, 123, -268, 41, -195, 30, 132, -282, 73, 83, -27, 344, 66, -229, 71, -278, 61, 257, 168, 221, 72, -145, 217, 112, -55, 121, 210, -157, -176, 192, -51, 23, -160, -54, -201, -73, 103, -37, 111, 71, -195, 26, 162]
4841A62m69J19j52J23K94l9o8J87M9k40j44J88j41J40q2M04k75j93RL88l56J0
4863h6J88Qj36K45l52o5L72j52K8j01Q3j6o0J9J33j78J48k66K42k77J93k00J62
4886f8K96l43jK28o8j09L8Q7l4L6k62J34QK16l8l08M29k02j7k36j1L96l60J94
4910EM8r8J64Ok00j38J14J07j17P9j62N37o01K37J41j59J26k13J97O5k59KK19
4933A00m2n70M72L27l19L9k59L40l87L42J16j55p9K41p6r4j32K85l9k41K44k84
4955a71J51k65M03l17M49k98O1l6R5Q6p7m5l87M51n9o9L5K41l13J92l09R6J59
4978G3k22J25N1l1j21Q3K88L1j93j37r6L58m61M24l28J24J07j00q7J73J14l02
5000a27J67J8k32J17k99K81J6J87j64j53J08J29o6n0O9l36P6L92j75j6L7J52k79
$$ y = [162, -307, -188, -340, -217, 77, 38, -30, 157, 206, -34, -178, 10, -131, 9, -73, 331, 56, -137, -128, 260, -96, -86, 102, 110, -26, 219, -133, -198, 174, 22, 50, -51, 32, 16, -44, -25, 108, -70, 78, -188, 54, -223, -30, -230, -68, 228, -115, -116, 112, 44, -65, -27, 60, 26, 62, -200, -66, -58, 158, 120, -188, 241, 39, 22, -214, -225, 171, -189, 5, 53, -45, 119, 125, -75, -213, -99, 8, -109, -30, -192, 345, -256, -19, 122, -37, 89, -124, 73, 138, -121, -119, 100, 58, -512, -40, 287, -32, 7, -252, 88, -299, 43, 159, 4, -75, 166, 90, -4, -136, 149, 110, -131, 113, -171, -20, -285, 118, -199, 250, -48, 13, -23, 72, 158, 81, 36, -351, 100, 41, -28, 7, 248, -65, 127, -182, -86, 73, -149, -24, 27, -4, -125, -42, 246, 277, 84, -53, -149, 209, -252, 172, -156, -32, 75, -25, -112, 61, 175, -127, 40, 58, -174, -57, -356, -75, -59, 128, -36, -189, -81, 48, -18, -68, 1, -335, -259, 133, -42, -58, -21, 131, -148]
5023a48J2k3k1M25j84J60l46J49P4k02O3J83k45J60K77k76j32J84L09l25K0J10
5045B24P0l85Q9lK8q7J22J72n8j52K89k42O0R1p5k09J43j91J80M03o49L64o6r2
5069B6j65J54m6p7L63j59l38M45N0k47J74j42p2J2j23L80k01L4k13P5l2j11K18
5092Em8J44l11N9J85P5Q8nj16Q4o1j37Q2j61O8r9K04p7j58K42r3m2P3l33L43k3
5118a2R5j06J18p8M5J43m1k02N8j65J63J44r6k06J85j00l02J46K19n3Q8j6O1k69
5142a81J94j68R4j03L16j37r7J23q6k17Q6J55N5N5k59k7J57n0k54J44J34P7k61
5165b50K27j32L98M6k68L6k06J29j2N4q3J32k02L13k94J89n0j30K39k30J37K48
5187B91j28k78J92j78J76J91l53M83k90k66J9J24j20n5J01J31j01J35j58j84M76
$$ y = [-148, -136, -159, -180, 245, 61, 221, -125, 24, 98, -104, -41, 142, -103, 57, 334, 58, -74, 110, 419, 94, 114, 224, 294, -91, -2, -5, 23, -64, 58, 230, 172, 20, 309, 67, 127, 218, 143, -66, 77, -114, 66, 469, -180, 184, 118, 26, -139, 15, -31, -108, 255, 96, -242, 203, 253, 6, 180, 38, -34, -22, -145, 235, 34, 68, -145, -70, -102, -213, 5, -43, 101, -210, -151, 34, 109, 197, 192, 76, 160, 99, -38, 44, -117, -49, -148, 56, -21, -179, 63, -30, -72, 1, -332, 11, -12, 83, -23, 95, 17, 62, 205, 164, -38, 20, -145, 18, 162, 66, -140, 45, -55, -357, -211, 8, -45, 43, 27, 88, -181, 13, -155, -61, -164, 152, 15, -82, 41, -45, -262, -176, -21, 34, 89, -170, -197, -40, -90, -344, -200, -66, 11, -250, -23, -155, 243, 289, 21, 57, -149, -20, -32, 22, -61, 71, -131, 182, -112, 77, 27, -103, 136, -94, 43, 291, 163, -115, 77, -101, 75, 266, -87, 396, 106, -160, -141, -17, -137, -192, -91, 40, -61, 74, -84, -268, 208]
5208B08m46L76j88k43M99k41k47J67J07j26J57j16M27l37j2J41r1j00K22k84K1
5229a06Rr0J32N6jj8qJ5M17k54K5j32K6p1M7k9j6o3J26j98K8r3L24k72O1J52k70
5256b03L34M2jj55j85K13K58k34L8p0J75k86RL0J37j19J78N9l6o1q7K97n02j04
5280b73K15j59K25j54m7J9P4p2J82k35J04K80k11J76j38q9J64N2j72m8K34l7l1
5303E9r7m1J57J29j58L1Q7j20k35K31k78K64J27j53O8k14M19r9l47J02l1j76N61
5326B86m15L03j98J13m6Q5l1k7o6m4j19J90K6j8j66J32K08j73j38K50n6j88J13
5349B1M4l7J07K55j91j80M9L5p5R5j30j11J98Mj92J66J95k85k5L2J11k92J36l3
5373a03J10L64n37K0j58J58P3k7M7j83K99J45o7j26j85K09O8m86M97l57J46L11
$$ y = [208, -238, 138, -50, -293, 206, -35, -282, -115, -8, -134, 23, -93, 334, -3, -15, 126, 35, -65, 157, -127, -106, -97, -187, -55, 1, 0, -18, -26, -11, 406, 152, 177, 45, 71, 0, 47, 18, 2, -61, 65, -133, -105, -198, 126, -146, -85, 67, -203, 131, 173, 172, 17, -168, 45, 303, 69, 107, 37, 212, -74, -65, -35, 102, -17, 161, 220, 184, 123, 36, 333, -169, -273, -58, -217, 8, -146, -193, -174, -100, -172, 10, -225, -121, 159, -52, 124, -14, -103, 61, 113, -59, -107, 127, 90, 59, -38, -79, 78, 207, 49, 80, 167, 47, -188, 43, -235, 29, 156, 3, 71, -143, 276, 177, -170, -68, -99, -275, 286, -129, 174, -24, 89, 43, 128, 97, 70, 4, -40, -159, 31, 57, 39, -127, 5, 213, 40, -98, 152, 96, -92, 21, 65, 28, 135, 390, 199, 19, 68, 103, 28, 123, -7, -118, 80, 84, -108, 58, 253, -32, -57, -25, 86, -206, -70, -103, 7, 371, -166, -146, -304, -146, -73, -100, -53, -236, 63, 208, 141, 15, -170, 39, 107, -379, 118, -239, -93, 218]
5395B18k04k91K92n8%J72n7n0j02J30J66pk61J10K24k87j88L00O2j88o1Q2K36
5418B38m65L19M3j90j79K73j07J24q4L5k18K15j65J17j17J9J9J42J18m85M20j2
5440F0J15j26k3P3j30J70n2k61J29J82J49k89j20j55M20q1J37m56L9N35l22L58
5462C52k13n1j04J73k52K92o31L33J17j39M5O0L30l29k9n4J14p9K43q8J01l42
5484a51J63mO9j66J68K0j3J84j44l00J62M8p1K30j30Q7l82K95l0J0K4R0l93L16
5508H2o9J77k78R1n1P3O0j0k08l6N7J32R2j02j63K68n0k59p3N65l38L4k64K49
5532b1K19k48L54j30l08K57j38j5r8L18j77N9J26j35k15M6L69l35K55l03J30k42
5554b32M58k40J89l3k37J41j13L29J32q31M80j25k03J82J64k50j00L13N4r1L89
$$ y = [218, 14, -277, 15, -43, -43, 129, 72, 22, -80, 50, 216, 209, -52, 58, 282, -5, -193, 107, 169, -19, -80, 2, 238, -227, 92, 135, -55, -234, 39, -68, 56, -28, 7, -211, 4, -161, -44, -161, -142, -123, 19, 137, -348, 72, 60, 175, 49, 26, 99, -31, 139, 87, -174, -45, 137, 286, -3, -123, -278, 142, 61, 198, -258, -219, 316, -6, 352, 139, 88, -16, 157, -95, 197, -434, -101, 16, -123, -78, -18, 312, -17, -46, -100, 14, -65, 178, 90, 191, -151, 12, 8, 77, -89, 79, 99, 86, 270, 126, -174, -12, 36, -35, 195, 65, 152, -230, 65, 35, 45, 69, 159, -234, 82, 13, 190, -88, 3, -48, 25, 85, 75, -133, -169, -112, 20, 112, 10, -153, 115, 65, -194, -267, 298, -40, -6, -270, -21, 198, -50, 304, 174, -134, 123, -15, -30, -128, 190, 13, 72, 198, 63, -152, -106, 263, -72, 183, -120, 10, -232, 226, -14, 175, 142, -95, 46, -67, 262, 394, -437, 43, -82, -285, -103, 61, -189, -289, 24, 78, -13, 376]
5575C76l90k78L76r2J13j09j14K15K30k34Q5m0j56k7J07k01L48j04J3j43oJ56
5597A25k4p5J70l74K54j14O1q8r8P7K90l36J62j70N9J43J53k84r8J77j08k6j64
5620b88J68k18L87K24j20k87o2J21L3r4O5J54m25P81n24n4K89l53K35K63n71J99
5642g7k8O7J97p5j47rM16j99R4k04m07M00o2k4K07k9l61L17J42m69J09J67j28
5665a03J6K27l89L42N1l5O8k44M6M2J28l0m7o4J58q7M2j53J41j28k11L10l10J73
5689e7K34j62qn5j2J15m5Q0r4LK05l34N7L31n82M81p0l43L93n1K05j37n6J71r2
5714A77m6k52J07Pk72J69J73q3j95J57J32o0j32J55k67J24J52n8kJ31k81K86k72
5737a50L81k74L17m59J00J12L04m42m7K32L6j09K30p5k27k59K01J20j69K60j46
$$ y = [376, -14, -292, 84, -8, 105, -4, -118, 97, 327, 93, 178, 138, -18, -45, 62, -139, 209, 105, 118, -25, -31, 125, 101, 26, 196, -178, 76, -38, 23, -65, -163, -86, 204, -132, 30, -140, -81, 62, 215, -69, -167, 10, -98, -124, -288, -120, -338, 49, 273, 153, -134, -196, -75, -42, -136, -71, 83, -342, 439, -85, -139, 150, -203, 32, 295, -276, -77, -105, -38, 159, 84, -63, -72, 344, 145, 239, 35, -372, 28, -34, -58, 149, 120, -241, 76, 218, -251, -142, 25, -103, -87, 140, -249, 93, 144, 109, 177, -67, -21, 21, 149, 119, 72, 8, 166, 79, 121, -32, 109, -19, -230, 80, -230, -57, 177, 15, 7, -48, -60, 55, 10, 90, -4, -1, 204, -130, -73, 258, -324, 157, 87, -256, 137, 86, 291, 154, 98, 269, 177, 131, -121, -14, -7, -279, -110, 63, -20, -215, -58, 74, 14, -118, 37, -230, -106, 46, -12, -14, 117, -164, 122, -150, 231, -43, 274, -185, -85, 27, 331, -111, -158, 74, 110, 1, 231, 156, -71, -330, -129, -9, -178, 82, -64]
5758f4Q6l6J19k80K25j05N3j09P1KK32j69J69P7oj72k83k1J08J28M6m6P1J14k12
5783bj13m6o2J58j91J03J76J02r2J7j20O3j33O9K34J28k19l61N30k41N6Q3k4j2
5807A03j77P8m6k07L89Nk11J73j47J95j80K60k10j85mJ90k2Ok1Qj24lK20j14o2
5832h6J60l8M4Q4p2K4N4k67p6K82k55J10J94l77L04p3j1J63j79n2J44M54n01q
5856B2m1Ok24J97j47L05l7Jl6M2K3m04N08k07j26M5j04L30l79N14k83j2J04r2
5880EJ58j6k86K78j05k16K94j71N7J06k95J41nJ59j65J09n7J76l08L17m3k61N4
5903g4L72lk94J54lk5j19J49k19j70J83Q4J7j19j68M01l66L04q2N5J4k7j89K46
5927A21m8j56k24J10L11j84J92q9J48j05l58L11k0M8j33Q1j26n6K60k6N4k0j48
$$ y = [-64, 22, -14, 105, -175, 50, -55, -2, -111, -40, -38, 194, 25, 194, 271, 265, 93, -190, -211, -103, 25, 71, 25, 96, 210, -2, -115, -161, -223, -65, -256, -153, 23, 125, 33, 50, -70, -7, -140, -71, 163, 291, 72, -289, 241, 0, 56, 139, 115, 103, -74, 4, -42, -249, 140, 145, -66, 107, -40, 155, -25, 235, 25, -160, -164, 26, 4, 10, -11, -3, -127, -130, 90, -24, -86, 74, 36, 80, 164, 92, 116, 170, -97, -173, 109, -146, -36, 158, -219, 85, 12, 1, 164, -15, -67, 77, 531, 30, 22, -19, -13, -237, -40, -187, 118, 81, 82, 46, 88, 111, -293, 215, 8, -118, -73, -177, 153, -226, 288, 5, -7, 97, 5, 163, 147, -139, 139, 34, -182, 112, -59, -2, 104, -191, -50, -55, 104, -61, 48, -9, 167, -141, 176, 133, -128, -74, 298, 295, 1, 155, 152, 127, 8, 157, -62, -232, -49, 35, 52, -67, -235, 166, -200, 104, 22, 77, 91, 64, -125, 121, 73, -83, -307, -197, 114, -70, 122, 33, 181, 76, -282, 29, 9, 57, -76, 5, -121, -177, 83, 57, 111, 91, -57]
5950e7J26m2r8j24N27n93M06K5l07K70m2Jk0m1j76K75j50K6J39R6p7j37J09J21
5974B57m82o2N74o75K29J02K18o3l01K53J55l0m48K84q6O2j48Q4N4J1K18o3j39
5997Dm7j07L5K87o3j87J42o6o4j59J41k57M26J3q5j12J33j95oJ91k36J93J45k15
6021h9j91K97K7nk1nj78R6K06j53K7K53l51M84m22J7L20k10l14J2K54M5j11j29
$$ y = [-57, 69, 27, -71, -195, 332, -261, 145, 170, -137, 133, 91, 92, 72, 31, -145, 130, -20, 6, 145, 241, 164, 27, 136, 257, -225, -287, 287, -388, -159, -57, 161, 98, -203, 50, 205, 175, -273, 11, -75, -13, -161, -77, -23, -12, 206, 143, 4, -43, -150, -115, 172, 109, -78, 64, -2, -66, -225, -84, -341, 85, 98, 13, -99, 34, -161, -167, 24, -212, -19, 126, -89, -280, 17, 44, 39, 18, 13, -165, -69, 137, -16, 11, 264, -87, 397, -25, -8, 312, 102, -212, -200, 54, 99, -12, -141]
$$ [...]
8191a94
##END NTUPLES=NMR FID
##END=
