##TITLE=1H_LR-693-3
 CDCl3, 8 sc, 
 16.10.2019
##JCAMPDX= 6.0         $$ Bruker NMR JCAMP-DX V2.0
##DATA TYPE= NMR FID
##DATA CLASS= NTUPLES
##ORIGIN= UXNMR, Bruker Analytische Messtechnik GmbH
##OWNER= root
$$ XWIN-NMR		Version 3.5
$$ Wed Oct 16 15:18:50 2019 Russian Standard Time (UT+4h)  she@DPX200
##.OBSERVE FREQUENCY= 200.1315
##.OBSERVE NUCLEUS= ^1H
##.DELAY= (6, 6)
##.ACQUISITION MODE= SIMULTANEOUS
##.ACQUISITION SCHEME= undefined
##.AVERAGES= 8
##.DIGITISER RES= 18
##SPECTROMETER/DATA SYSTEM= spect
##.PULSE SEQUENCE= zg30
##.SOLVENT NAME= CDCl3
##.SHIFT REFERENCE= (INTERNAL, CDCl3, 0, 15.7039)
##AUDIT TRAIL= $$ (NUMBER, WHEN, WHO, WHERE, WHAT)
$$ ##TITLE= Audit trail, XWIN-NMR		Version 3.5
$$ ##JCAMPDX= 5.01
$$ ##ORIGIN= Bruker BioSpin GmbH
$$ ##OWNER= she
$$ F:/spectra/data/she/nmr/H-F/1/audita.txt
$$ ##AUDIT TRAIL=  $$ (NUMBER, WHEN, WHO, WHERE, WHAT)
(   1,<2019-10-16 15:17:49.98 +0400>,<she>,<DPX200>,
      <created by zg, POWCHK disabled, PULCHK disabled
       configuration hash MD5:
       00 E9 B6 7A A2 85 ED C7 34 08 36 98 17 FE 4E 26
       data hash MD5: 16K
       D0 C7 5A 22 36 D0 4A F7 A8 74 ED 80 8C 19 94 7F>)
$$ ##END=
$$ 
$$ hash MD5
$$ 2B FB CB 95 27 71 22 3F 54 6D 5E E2 52 F9 09 F4
##$RELAX= 
##$RELAX= 
##$RELAX= 
##$RELAX= 
##$RELAX= 
##$RELAX= 
$$ Bruker specific parameters
$$ --------------------------
##$DU= <F:/spectra>
##$EXPNO= 1
##$NAME= <H-F>
##$PROCNO= 1
##$TYPE= <nmr>
##$USER= <she>
##$AMP= (0..31)
100 100 100 100 100 100 100 100 100 100 100 100 100 100 100 100 100 100 
100 100 100 100 100 100 100 100 100 100 100 100 100 100 
##$AQSEQ= 0
##$AQ_mod= 1
##$AUNM= <au_zg>
##$AUTOPOS= <>
##$BF1= 200.13
##$BF2= 200.13
##$BF3= 200.13
##$BF4= 200.13
##$BF5= 200.13
##$BF6= 200.13
##$BF7= 200.13
##$BF8= 200.13
##$BYTORDA= 1
##$CFDGTYP= 0
##$CFRGTYP= 5
##$CHEMSTR= <none>
##$CNST= (0..31)
1 1 145 1 1 1 1 1 1 1 1 1 1 1 1 1 1 1 1 1 1 1 1 1 1 1 1 1 1 1 1 1 
##$CPDPRG= <>
##$CPDPRG1= <>
##$CPDPRG2= <>
##$CPDPRG3= <>
##$CPDPRG4= <mlev>
##$CPDPRG5= <mlev>
##$CPDPRG6= <mlev>
##$CPDPRG7= <mlev>
##$CPDPRG8= <mlev>
##$CPDPRGB= <>
##$CPDPRGT= <>
##$D= (0..31)
0 1.2 0 0 0 0 0 0 0 0.06 0 0.03 0 0 0 0 0.0002 0 0 0 0 0 0 0 0 0 0 0 0 
0 0 0 
##$DATE= 1571224669
##$DBL= (0..7)
120 120 120 120 120 120 120 120 
##$DBP= (0..7)
150 150 150 150 150 150 150 150 
##$DBP07= 0
##$DBPNAM0= <>
##$DBPNAM1= <>
##$DBPNAM2= <>
##$DBPNAM3= <>
##$DBPNAM4= <>
##$DBPNAM5= <>
##$DBPNAM6= <>
##$DBPNAM7= <>
##$DBPOAL= (0..7)
0.5 0.5 0.5 0.5 0.5 0.5 0.5 0.5 
##$DBPOFFS= (0..7)
0 0 0 0 0 0 0 0 
##$DE= 6
##$DECBNUC= <off>
##$DECIM= 24
##$DECNUC= <off>
##$DECSTAT= 4
##$DIGMOD= 1
##$DIGTYP= 9
##$DL= (0..7)
0 120 120 120 120 120 120 120 
##$DP= (0..7)
150 150 150 150 150 150 150 150 
##$DP07= 0
##$DPNAME0= <>
##$DPNAME1= <>
##$DPNAME2= <>
##$DPNAME3= <>
##$DPNAME4= <>
##$DPNAME5= <>
##$DPNAME6= <>
##$DPNAME7= <>
##$DPOAL= (0..7)
0.5 0.5 0.5 0.5 0.5 0.5 0.5 0.5 
##$DPOFFS= (0..7)
0 0 0 0 0 0 0 0 
##$DQDMODE= 0
##$DR= 18
##$DS= 0
##$DSLIST= <SSSSSSSSSSSSSSS>
$$ [...]
##$SUBNAM2= <"">
##$SUBNAM3= <"">
##$SUBNAM4= <"">
##$SUBNAM5= <"">
##$SUBNAM6= <"">
##$SUBNAM7= <"">
##$SUBNAM8= <"">
##$SUBNAM9= <"">
##$SW= 24.0689530833862
##$SWIBOX= (0..15)
0 0 2 0 0 0 0 0 0 0 0 0 0 0 0 0 
##$SW_h= 4816.95568400771
##$TD= 16384
##$TD0= 1
##$TE= 0
##$TE2= 300
##$TE3= 300
##$TEG= 300
##$TL= (0..7)
0 120 120 120 120 120 120 120 
##$TP= (0..7)
150 150 150 150 150 150 150 150 
##$TP07= 0
##$TPNAME0= <>
##$TPNAME1= <>
##$TPNAME2= <>
##$TPNAME3= <>
##$TPNAME4= <>
##$TPNAME5= <>
##$TPNAME6= <>
##$TPNAME7= <>
##$TPOAL= (0..7)
0.5 0.5 0.5 0.5 0.5 0.5 0.5 0.5 
##$TPOFFS= (0..7)
0 0 0 0 0 0 0 0 
##$TUNHIN= 0
##$TUNHOUT= 0
##$TUNXOUT= 0
##$USERA1= <user>
##$USERA2= <user>
##$USERA3= <user>
##$USERA4= <user>
##$USERA5= <user>
##$V9= 5
##$VALIST= <valist>
##$VCLIST= <CCCCCCCCCCCCCCC>
##$VD= 0
##$VDLIST= <DDDDDDDDDDDDDDD>
##$VPLIST= <PPPPPPPPPPPPPPP>
##$VTLIST= <TTTTTTTTTTTTTTT>
##$WBST= 1024
##$WBSW= 4
##$XGAIN= (0..3)
0 0 0 0 
##$XL= 0
##$YL= 0
##$YMAX_a= 717459
##$YMIN_a= -1035538
##$ZGOPTNS= <>
##$ZL1= 120
##$ZL2= 120
##$ZL3= 120
##$ZL4= 120
##$ABSF1= 10
##$ABSF2= 0
##$ABSG= 5
##$ABSL= 3
##$ALPHA= 0
##$AQORDER= 0
##$ASSFAC= 0
##$ASSFACI= 0
##$ASSFACX= 0
##$ASSWID= 0
##$AUNMP= <proc_1d>
##$AZFE= 0.1
##$AZFW= 0.1
##$BCFW= 1
##$BC_mod= 2
##$BYTORDP= 1
##$COROFFS= 0
##$CY= 11.3945322036743
##$DATMOD= 1
##$DC= 2
##$DFILT= <>
##$DTYPP= 0
##$F1P= 20.1720416913024
##$F2P= 0.152960286110954
##$FCOR= 0.5
##$FTSIZE= 0
##$FT_mod= 4
##$GAMMA= 1
##$GB= 0.15
##$INTBC= 1
##$INTSCL= 1
##$ISEN= 128
##$LB= 0.24
##$LEV0= 0
##$LPBIN= 0
##$MAXI= 10000
##$MC2= 0
##$MEAN= 0
##$ME_mod= 0
##$MI= 1.114404
##$NCOEF= 0
##$NC_proc= 0
##$NLEV= 6
##$NOISF1= 3.799351
##$NOISF2= 2.8
##$NSP= 1
##$NTH_PI= 0
##$NZP= 0
##$OFFSET= 15.70392
##$PC= 1
##$PHC0= -9571.49
##$PHC1= 16.40093
##$PH_mod= 1
##$PKNL= yes
##$PPARMOD= 0
##$PSCAL= 0
##$PSIGN= 0
##$REVERSE= no
##$SF= 200.130013532006
##$SI= 16384
##$SIGF1= 3
##$SIGF2= 2
##$SINO= 400
##$SIOLD= 16384
##$SREGLST= <1H.CDCl3>
##$SSB= 0
##$STSI= 0
##$STSR= 0
##$SW_p= 3612.71676300578
##$SYMM= 0
##$S_DEV= 0
##$TDeff= 0
##$TDoff= 0
##$TI= <>
##$TILT= no
##$TM1= 0
##$TM2= 0
##$TOPLEV= 0
##$USERP1= <user>
##$USERP2= <user>
##$USERP3= <user>
##$USERP4= <user>
##$USERP5= <user>
##$WDW= 1
##$XDIM= 8192
##$YMAX_p= 0
##$YMIN_p= 0
$$ End of Bruker specific parameters
$$ ---------------------------------
##NTUPLES= NMR FID
##VAR_NAME=  TIME,          FID/REAL,        FID/IMAG
##SYMBOL=    X,             R,               I
##VAR_TYPE=  INDEPENDENT,   DEPENDENT,       DEPENDENT
##VAR_FORM=  AFFN,          ASDF,            ASDF
##VAR_DIM=   8192,          8192,            8192
##UNITS=     SECONDS,       ARBITRARY UNITS, ARBITRARY UNITS
##FACTOR=    0.0002076,     1,               1
##FIRST=     0,             0,               0
##LAST=      1.7004516,     0,               0
##MIN=       0,             -1035538,        0
##MAX=       1.7004516,     717459,          0
$$ Real data points
##PAGE= N=1
##DATA TABLE= (X++(R..R)), XYDATA
0 0 0 0 0 -8 16 -16 16 -24 32 -48 56 -64 88 -105 129 -152 192 -224 265 -312 368 -432 497 -570 658 -753
26 -753 865 -977 1111 -1256 1412 -1588 1781 -1992 2226 -2476 2757 -3063 3397 -3765 4173 -4621
42 -4621 5114 -5662 6273 -6958 7733 -8610 9619 -10793 12173 -13829 15858 -18418 21747
55 21747 -26295 32906 -43447 62972 -111391 473563 623656 -190279 246226 313507 -84622
66 -84622 -61170 675916 717459 226147 239724 693619 461889 -37354 47659 373754 143519
77 143519 -77620 237956 546480 345458 228764 426108 369930 -102450 -320368 -107377
87 -107377 104149 177487 359588 494378 299909 -48839 -171332 -100249 -61190 -83211 -44467
98 -44467 45693 86811 53958 50916 99327 41841 -173260 -294445 -193081 -136447 -249339 -193530
110 -193530 122506 228702 -44776 -239549 -215955 -361989 -589827 -375339 79037 81424
120 81424 -226177 -205975 -38642 -243632 -487616 -295111 -119599 -384827 -537058 -196564
130 -196564 21731 -222695 -338803 -108488 -131451 -496521 -572114 -313403 -279141 -403543
140 -403543 -203858 91227 -51236 -402327 -457294 -367382 -436449 -436938 -199061 -74816 -237304
151 -237304 -331019 -189456 -122131 -261519 -357052 -318708 -324465 -378373 -306327 -137642 -75891
162 -75891 -140311 -178824 -162833 -214997 -349870 -404798 -290933 -131628 -58332 -33207 -16206
173 -16206 -100248 -277419 -327390 -178923 -82259 -161435 -191927 -66415 -4281 -72272 -48963
184 -48963 52585 -33290 -240534 -229634 -46081 -15494 -85490 16190 167795 100505 -41936
195 -41936 -27466 -13508 -143578 -167439 54766 219535 139444 53699 98887 87314 -16413
206 -16413 -3428 107451 86644 -21634 25089 189539 238226 172452 146302 139412 63192 3373
218 3373 57696 136399 141125 145737 224675 283720 222052 107453 60127 77534 98322 137447
230 137447 219042 266272 212521 147517 180164 234344 183336 88408 83631 135416 149571 178537
242 178537 271020 301464 196766 111469 147227 164789 85270 59845 158101 226744 208168 221298
254 221298 255342 171567 33528 37275 142663 158498 105859 127158 182324 165986 141542 176140
266 176140 163476 47178 -24572 40805 121812 127104 126334 152900 135428 75184 56931 68656
278 68656 29278 -29956 -6346 85238 136698 115174 74435 39670 673 -23826 -7570 16860
290 16860 1453 -26743 -583 67951 91000 39597 -23067 -58848 -84854 -89553 -41463 12983
302 12983 2041 -34088 -13770 24325 -11544 -89221 -117979 -109188 -107835 -75959 -3203 16526
314 16526 -49677 -94291 -67950 -59181 -107408 -135533 -119333 -111471 -98770 -37836 7602 -42462
326 -42462 -124825 -142017 -121956 -125825 -127946 -102973 -89597 -93623 -66743 -29936 -55452 -129904 -169858
339 -169858 -156780 -130197 -101274 -69153 -64096 -85688 -88185 -66992 -72111 -115896 -152600 -155601 -128951
352 -128951 -79370 -33470 -30528 -66455 -93925 -95230 -93531 -99366 -106580 -113593 -105119 -61667 -9674
365 -9674 -3063 -43624 -85482 -102662 -101601 -81951 -53623 -48238 -59832 -44256 -2671 10256 -21877
378 -21877 -61552 -86443 -92449 -63717 -8507 19020 -35 -17343 -4807 5060 -8774 -29333
390 -29333 -47202 -60035 -39666 20506 65088 53173 15865 -2965 -6883 -6925 -228 3053 -8067
403 -8067 -6066 35507 81588 83002 46541 9680 -11200 -9245 18887 47780 47734 35718 45784
416 45784 73124 82576 63549 29820 -906 -4513 29480 74763 90728 75917 58747 54420 58123
429 58123 59247 46519 20436 9470 36340 81759 106838 99749 72018 40907 26385 39335
441 39335 55188 45940 30161 42979 76322 97590 96700 77087 37640 2486 9146 47784 67813
454 67813 55488 48925 62285 71670 68784 59998 37781 2237 -8051 29140 72356 75214 53207
467 53207 42728 42404 36893 32062 28525 10908 -9430 4761 53903 84075 63706 25255 5180
480 5180 718 -113 9729 21873 14947 740 17768 56274 58780 15756 -19171 -20186 -14498 -9387
494 -9387 11411 27951 9475 -9767 13940 42976 17496 -35322 -50508 -32432 -17760 3562
506 3562 36698 33421 -15481 -40552 -12057 4819 -23972 -45291 -28792 -14531 -13968 5656 26246
519 26246 -2443 -52607 -52790 -17823 -15665 -44231 -44928 -17786 -5113 -2347 10676 2058 -50048
532 -50048 -89718 -62682 -10953 -442 -18017 -20638 -17378 -30472 -35248 -17298 -18466 -57415 -76799
545 -76799 -39047 1118 -8103 -30361 -22100 -12333 -32150 -45476 -33368 -39888 -70342 -58001 7241
558 7241 37315 -5022 -48120 -50487 -52941 -62762 -34468 7795 -9339 -59054 -47707 7227 8471
571 8471 -36315 -43638 -23040 -39898 -62460 -27807 11031 -13830 -41716 -4292 27567 -20717
583 -20717 -77594 -63155 -28700 -26903 -9362 38954 29917 -48600 -78176 -19185 16696 -18650
595 -18650 -36510 -6185 -6512 -39951 -18153 41357 27907 -39640 -44726 1866 -6520 -51495 -30588
608 -30588 28519 28438 -1030 17324 28187 -37987 -87934 -24414 58889 42807 -7998 3194 17807
621 17807 -21645 -28706 37965 60290 -14991 -58104 -739 40859 8529 3493 54237 49788 -20276
634 -20276 -30662 22149 15281 -35804 3307 96978 87702 -4137 -23580 17201 2802 -24045
646 -24045 38609 100589 35520 -50684 -9295 72219 53420 8392 39353 53617 -20321 -50118
658 -50118 39619 94692 33452 5038 71480 77481 -19790 -49478 30128 59428 13147 36518
670 36518 106798 59458 -54500 -38792 69423 77667 10354 19883 57526 4244 -41840 43668
682 43668 125963 59385 -27511 5925 45411 -11244 -33813 57145 104419 31409 -7467 47784
694 47784 44668 -46702 -51772 56943 94979 23016 -4614 33593 12940 -38371 11487 98472
706 98472 58762 -48446 -49860 21709 24361 -910 46893 83647 5894 -73967 -30686 32351
718 32351 -488 -32348 34276 81241 11119 -54934 -19943 10032 -30342 -26645 51242 55112
730 55112 -46874 -82844 -294 42899 -3411 -11709 25666 -18201 -104978 -70599 44021 53018
742 53018 -23278 -23207 20519 -25659 -94895 -50760 24554 -1972 -46041 1726 33719 -44770 -100457
755 -100457 -32082 28884 -14553 -49740 -14898 -22121 -86387 -66757 38058 56451 -35678 -80536
767 -80536 -45032 -43000 -71012 -28795 39352 14435 -57158 -52337 -12320 -39094 -79885 -40733
779 -40733 16025 -4753 -48774 -35206 -15285 -46071 -57210 -278 31615 -28925 -90029 -64456
791 -64456 -13413 -8089 -6198 22210 9765 -61565 -91499 -37242 7675 -13590 -26145 6015
803 6015 9297 -37214 -48394 -8008 -3072 -39142 -25583 26062 10651 -52302 -46362 16625 27503
816 27503 -7487 -4634 7305 -38839 -73563 -11820 62601 42429 -12037 -8030 4920 -28326
828 -28326 -36812 17578 42903 281 -16744 27123 37859 -9652 -21337 22731 34682 672
840 672 -3471 21759 11757 -14479 15167 67352 56139 -923 -20099 -1244 6126 13035 47452
853 47452 67295 32305 -6974 7029 37426 27044 5764 20022 42011 30491 15151 31705
865 31705 45188 22547 7955 35896 54172 19568 -11912 11934 48080 48010 42615 53853 37275
878 37275 -11534 -17505 35024 62102 33184 17702 40132 39586 11145 16828 46592 31718 -6167
891 -6167 9383 52059 41822 5144 15669 46405 34143 10204 23221 28544 -7044 -17705
903 -17705 33680 67786 35828 2248 10500 12092 -8853 820 37097 31182 -7956 -6944 31369
916 31369 33570 1513 -5136 9494 838 -12921 4995 22720 2520 -16532 5583 28597 9446
929 9446 -21227 -22655 -13906 -15060 -4851 19992 18999 -15043 -33308 -14082 1587 -10400 -22930
942 -22930 -18264 -15348 -18916 -9826 5198 -4126 -31239 -37348 -18493 -11721 -25811 -31103 -20767 -15462
956 -15462 -17001 -10182 -7096 -29107 -54444 -45437 -16188 -8643 -21749 -25812 -22398 -28637 -31902 -19611
970 -19611 -16977 -38852 -52526 -32287 -10187 -14574 -25755 -24389 -26032 -36608 -33317 -19592 -25573
983 -25573 -44637 -39713 -12718 -2465 -15796 -26202 -30331 -38394 -38687 -20032 -8032 -21649 -34248
996 -34248 -22650 -6426 -8165 -17938 -23741 -30300 -34366 -20958 -1147 -1168 -16324 -21008 -11553 -5977
1010 -5977 -7842 -12389 -19304 -25044 -16246 4017 13828 3804 -10474 -14579 -9319 -2202 2115 -739
1024 -739 -8300 -7862 5776 19086 18029 5765 -6509 -9476 -1938 11560 17638 11448 4904 8366
1038 8366 17782 22720 18408 7784 -2069 265 15664 29306 28929 18722 13149 14561 19915 24023
1052 24023 21038 11286 6183 15662 32225 38396 30763 19163 12522 13345 21527 28856 25415 16107
1066 16107 16531 28445 37309 35186 24934 13343 8824 15188 28795 34278 26792 18773 20307 27812
1080 27812 31312 27169 16673 7069 8406 22197 34112 32502 21889 14784 14483 18513 22024 19132
1094 19132 9706 4346 12387 26367 30829 22126 9664 2107 3403 10948 16804 13463 5135 3235
1108 3235 11701 20033 18235 6621 -5524 -9002 -1573 8889 12635 7556 -986 -3648 2255 8480
1122 8480 4438 -8709 -16957 -12822 -1572 6663 7038 -387 -11433 -15879 -8532 -1353 -6412 -17948
1136 -17948 -19306 -10172 -1714 731 -3128 -14156 -26616 -25190 -11511 -3866 -12425 -22211 -19929 -11986
1150 -11986 -7971 -7111 -11738 -24692 -34823 -26830 -9327 -4148 -14192 -21598 -19351 -16748 -16651 -16654 -19960
1165 -19960 -28975 -31112 -16980 -2765 -6998 -21229 -26674 -21913 -18953 -16890 -14126 -18052 -28231 -27014
1179 -27014 -9033 1964 -8423 -23961 -26633 -22776 -20601 -14710 -6720 -10360 -21086 -18021 -3649
1192 -3649 -3200 -18427 -25814 -17543 -10653 -9900 -4446 -952 -11948 -21790 -10348 5963 240 -18033
1206 -18033 -21601 -11354 -5124 -469 8795 7806 -10681 -21385 -7970 6550 99 -8862 -1731 7046
1220 7046 3492 1486 7767 3860 -11495 -9874 11842 19160 963 -9507 3050 13426 10303
1233 10303 11703 16944 2596 -17880 -7098 23753 29997 10905 6086 14601 8184 -2058 10286
1246 10286 24562 9657 -4473 14430 34030 17359 -3937 7940 23979 13771 6728 21785
1258 21785 21167 -4381 -4259 32788 46322 17210 -334 10333 9665 -2337 14975 43572 30065
1271 30065 -3741 2081 29408 21105 -2436 8263 29587 17012 572 17373 30691 7668
1283 7668 -6678 22019 41113 14032 -10745 2379 15053 5802 13545 40294 31951 -11504 -22688
1296 -22688 10082 24764 7111 5861 23787 15570 -10668 -3579 23663 16100 -10479 -1707 24517
1309 24517 12666 -16574 -8674 17240 11727 -1945 12366 18946 -16380 -40032 -5431 32198
1321 32198 17490 -7585 1977 4631 -24260 -27426 13620 26817 -11182 -26208 4009 9954 -21537
1334 -21537 -21485 12961 10318 -23425 -18480 8381 -9782 -42121 -14941 31235 14650 -27586 -24013
1347 -24013 -6710 -26767 -33974 10339 33928 -10950 -45992 -20244 2637 -18420 -23441 7012
1359 7012 5613 -33249 -35623 657 2141 -28347 -21239 13266 3730 -35800 -35531 -7740 -9876 -21397
1373 -21397 2670 23716 -9972 -51619 -37808 -838 1089 -11210 -848 1799 -26998 -40320
1385 -40320 -8360 15669 -4906 -23944 -8458 440 -21817 -29085 -373 13320 -7533 -14539
1397 -14539 4518 -1352 -36212 -35498 7776 26114 1637 -11221 -2314 -13851 -33887 -10079 30487
1410 30487 19698 -20134 -20562 4859 -966 -15082 7162 28262 668 -27570 -6596 15286
1422 15286 -5526 -17940 15380 35318 4538 -19924 -4279 3637 -12118 -772 36833 32773
1434 32773 -11653 -24091 4978 15185 2746 12137 28090 6627 -23063 -7138 27175 22749
1446 22749 -124 8018 23069 5884 -14885 555 21185 13506 6452 23860 28939 -1096 -21307
1459 -21307 491 25891 21409 12176 17638 11509 -11039 -9114 24343 37692 11525 -7407 4870
1472 4870 12005 425 4075 27428 27343 1858 -2855 15685 11965 -10163 -2101 28505 29068 4122
1486 4122 963 11688 -1015 -12746 13103 39148 16269 -17031 -6931 16090 9202 1120 20802
1499 20802 24452 -8774 -22586 7008 24148 2554 -4730 18274 19297 -8329 -12222 8868 6383
1512 6383 -11834 1894 28906 14540 -18695 -15130 9607 9016 -2815 7307 13677 -9949 -24498
1525 -24498 -198 22666 9081 -8958 -3161 1649 -11544 -14110 4879 10713 -5755 -9842 6401
1538 6401 7812 -13602 -20789 -2335 7304 -2783 -5566 2320 -4411 -20780 -12978 11639 11094 -13376
1552 -13376 -20902 -7749 -4889 -10857 -1093 11294 -3442 -24189 -14766 4220 -4918 -19971 -8510
1565 -8510 6354 -4184 -15450 -4422 -447 -18330 -22361 1688 10603 -11624 -23233 -8151 -1394
1578 -1394 -10847 -6437 6411 -5704 -28302 -20615 4459 3417 -12172 -9508 121 -9386 -18016 -6124
1592 -6124 2086 -11965 -19955 -3642 7554 -5125 -16265 -9057 -3862 -9119 -7141 2187 -3106 -17517
1606 -17517 -15517 2165 7359 -3113 -9404 -7648 -9412 -11258 -2757 6091 -15 -10868 -7586 2701
1620 2701 1731 -6437 -7730 -3657 -3601 -2974 3031 4992 -4056 -10073 -1828 7485 3738 -4775 -5103 -2126
1636 -2126 -1288 3162 9978 7708 -4558 -8935 336 7393 4065 36 2404 3084 2032 6225 10126
1651 10126 3785 -4911 -2483 7926 10760 5459 3169 4134 3704 5032 10572 10549 1821 -3619 2842
1666 2842 12013 12908 8599 5993 4128 2948 6755 12014 9651 1985 1475 8283 13721 12310 8010
1681 8010 4875 2655 4338 9893 13035 8120 3196 4631 10128 12992 11057 6544 1659 1383 6669
1696 6669 12696 12405 6640 3139 4688 7955 10685 8665 3366 318 3021 9116 11598 9493 4835
1711 4835 1025 1893 6555 9109 5821 563 212 4584 8134 8927 5636 58 -3379 80 6209 7184
1727 7184 2233 -1074 -30 2636 5067 5025 1260 -5333 -5427 934 5901 4130 -736 -3044 -3013 -983
1743 -983 2582 1856 -4327 -8252 -4602 1774 3290 428 -3528 -7074 -7260 -2456 914 -1732 -6996 -7815
1759 -7815 -3853 -228 432 -2434 -7640 -11106 -7730 -1469 -380 -4389 -8256 -7629 -5270 -2535 -2229 -5984
1775 -5984 -11094 -11456 -6204 -753 -1537 -5742 -9083 -9128 -6408 -3097 -3612 -8394 -11739 -8970 -3759 -918
1791 -918 -2645 -7741 -11353 -9922 -5227 -2634 -4355 -7802 -9450 -7099 -2743 -494 -3515 -9790 -11583
1806 -11583 -7319 -3062 -2060 -3788 -6600 -8187 -6212 -1142 -246 -6041 -11029 -8562 -3025 -171 32
1821 32 -2111 -5978 -8926 -4953 1434 979 -5766 -7976 -4257 -169 714 695 -752 -5714 -7234 -1661
1837 -1661 3737 522 -4893 -3756 1099 2732 2044 1662 -1501 -6306 -4223 4440 8212 1872 -3504
1852 -3504 -1648 2023 2672 3220 4297 352 -4603 -1246 8049 9400 2083 -928 3214 4938 2694
1867 2694 3106 5263 1224 -1472 6056 13240 7853 -2277 -1820 5172 5957 5080 8671 8406 -348 -2664
1883 -2664 8608 15118 7060 -705 2813 6606 3197 4042 11509 9505 516 1346 11485 10819 -960
1898 -960 -1941 7994 10087 5383 8010 11387 2849 -5474 3964 16744 11641 -681 624 7231 4427
1913 4427 2481 11345 13872 623 -6582 4991 11856 2992 -1675 7891 11043 1540 -371 7978
1927 7978 5201 -6592 -2202 14750 13866 -3038 -6159 4408 4363 -2076 5067 12893 53 -14243
1941 -14243 -3936 12160 6910 -4264 1988 7228 -4514 -10290 3147 9460 -4173 -8410 7260
1954 7260 11288 -6680 -14074 -396 4595 -4483 -2833 8245 240 -17810 -12516 8681 8919 -6261
1968 -6261 -7476 6 -7440 -15241 -1261 12373 293 -14583 -6475 4036 -6773 -16330 -4100
1981 -4100 6137 -3889 -10714 -774 917 -15351 -17846 2472 10475 -5603 -15109 -6127 -4879 -13107
1995 -13107 -5181 11296 4373 -18618 -19127 -1235 444 -10255 -4378 7154 -2619 -17953 -9759
2008 -9759 3469 -5240 -15422 -2181 10779 -2707 -17646 -8416 1519 -6460 -7158 7750 7600 -15790
2022 -15790 -22762 -1445 9969 -1241 -5105 4221 -1588 -18528 -12775 9110 8800 -7777 -5999
2035 -5999 7366 707 -14176 -7386 7934 3721 -6494 1997 8761 -6446 -17883 -1161 16633
2048 16633 7567 -5447 -1201 1015 -10246 -8705 12489 19555 343 -10933 -447 4979 -3896
2061 -3896 -2189 12504 11501 -3699 -5107 7015 4955 -7242 -1141 16053 12667 -4812 -5797 4611
2075 4611 2536 -2304 10197 20856 5863 -13724 -7491 9287 9317 3296 10356 13068 -2667 -11078
2089 -11078 3811 14983 4114 -2669 9598 13087 -2510 -7937 6226 12081 1304 1840 14563
2102 14563 8865 -11883 -9914 12054 17253 4509 2220 8287 -2068 -12856 1155 20253 12284
2115 12284 -4871 -1054 7973 -120 -7550 5778 15367 2437 -6848 4417 9508 -4913 -8900
2128 -8900 8041 16167 2104 -6324 871 872 -7933 -1314 16615 13709 -6875 -12068 325 3145
2142 3145 -2955 3166 11789 2454 -11718 -6080 7384 3681 -7073 -710 9265 1153 -10502 -4748
2156 -4748 4040 -1191 -4860 5800 10212 -5943 -17178 -5276 7084 1832 -2386 4672 1888 -13636
2170 -13636 -13704 5196 10158 -4737 -8932 1940 1279 -11084 -7187 6780 3287 -9900 -4968 6524
2184 6524 -2250 -15990 -6709 8613 3398 -7370 -2339 966 -11299 -14756 3306 12452 -2394
2197 -2394 -13198 -3781 444 -7689 -6141 5954 3867 -10799 -10343 2906 2402 -8647 -5824 4702
2211 4702 1397 -8599 -5134 940 -5081 -9877 552 9421 333 -10866 -7587 -632 -2287 -2978 3730
2226 3730 4063 -6986 -10997 -636 5971 -590 -5174 -907 655 -4311 -4030 2251 2510 -4471 -3385
2241 -3385 4526 3517 -5755 -7355 725 3608 399 1342 4411 -1637 -8901 -2707 7972 5624 -3525
2256 -3525 -2676 2074 -299 -2324 4304 7330 -1100 -6003 1556 6617 -26 -3814 2653 5839 421
2271 421 -11 5138 2289 -5080 -2360 7730 7892 -66 -1371 2391 1244 -98 4966 7553 681
2286 681 -4586 1177 6842 4520 1216 2539 3043 482 1008 4983 4231 -874 -344 4683 6337 3052
2302 3052 387 489 955 1846 4685 5948 2260 -1449 -71 3822 5731 3536 419 -528 505 2089
2318 2089 3960 4550 2224 -984 -383 3442 4213 1261 -1223 176 2078 2506 3476 3279 -237 -3087
2334 -3087 -415 4302 3886 -94 -1489 22 709 1626 3573 2252 -2512 -3652 417 3441 1531 -714
2350 -714 -917 -771 -819 837 2167 -977 -4353 -2644 1748 1927 117 -1491 -2465 -2479 -782 1516 569
2367 569 -3028 -4238 -1597 740 1074 -367 -2657 -3986 -2894 -203 1021 -871 -3476 -3356 -1593 259
2383 259 519 -1584 -4063 -4020 -1928 161 -167 -1495 -3478 -3575 -1519 436 -33 -2815 -4509 -2879 -1008
2400 -1008 584 354 -1713 -4122 -3505 -782 980 -1080 -3280 -3254 -2186 -359 704 8 -2740 -4403
2416 -4403 -2632 445 915 -1237 -2992 -2846 -1558 79 1422 -815 -3615 -3699 -733 1537 929 -913
2432 -913 -2101 -2796 -1205 1390 1278 -1351 -3335 -1849 930 2005 1339 -622 -2295 -2481 140 2333
2448 2333 1038 -1771 -2414 -475 725 2083 1387 -1066 -2687 -1291 1855 2659 1148 -1033 -1336 -117
2464 -117 2038 2769 986 -1402 -2109 -117 2732 3182 983 -855 -1219 592 2499 2401 494 -1237 -741
2481 -741 1082 3105 3096 735 -1382 -376 2135 2977 1715 470 -245 -287 1626 4252 3118 -931 -2187
2498 -2187 558 2454 2714 2021 1418 -463 -1010 2315 4360 1624 -1605 -763 2441 2840 1599 2173 895
2515 895 -1154 154 3546 3876 -35 -2366 506 2903 2386 2032 2476 -422 -2631 330 4806 3836
2531 3836 -851 -1176 1819 2164 909 1920 2214 -804 -2240 1948 4190 861 -2640 -396 2606 1733
2547 1733 998 1595 154 -3199 -1800 3998 5008 251 -2972 -761 702 -486 990 3306 618
2562 618 -3805 -1770 3642 2355 -2844 -1830 1980 904 -1547 227 1633 -2192 -4110 1650 5333
2577 5333 -133 -5693 -2897 648 -547 -763 3070 1924 -5529 -6041 1220 3752 -1614 -3471 338
2592 338 692 -3803 -2197 2506 21 -5309 -1880 4011 334 -6166 -4341 1155 742 -2059 999 2035
2608 2035 -5480 -8646 -781 5533 688 -4674 -1861 -213 -4491 -4072 2717 3010 -4781 -5591 1097 1475
2624 1475 -4555 -4410 1958 1941 -3494 -2531 1632 -2758 -7876 -2075 6816 3213 -5033 -4492 -303 -2681
2640 -2681 -3695 3024 5697 -2504 -8488 -1730 3467 -784 -3373 1927 2804 -3827 -4804 1612 2227 -3916
2656 -3916 -2651 5377 4722 -4463 -5805 218 1722 -1049 2044 6031 -262 -8545 -4242 5024 4525
2671 4525 -536 477 2523 -2545 -5308 1616 6865 1823 -3258 1060 4546 -1398 -4750 1932 5863
2686 5863 1719 -419 4005 2526 -5657 -4960 5440 9273 1386 -2580 888 -204 -3888 1329 9514
2701 9514 5940 -3915 -3763 3740 2630 -2333 2040 8170 2389 -4077 -229 4951 -507 -3926 4322
2716 4322 9742 2242 -4804 -840 2573 -844 792 8331 7181 -4189 -7428 1992 5847 1338 1241
2731 1241 5472 2098 -6015 -3163 5847 4787 -1847 335 6146 1978 -5414 -2490 3908 3012 -280
2746 -280 3571 5324 -2656 -8348 -595 7526 4715 -1349 499 726 -5000 -4800 4913 8463 102 -5110
2762 -5110 -48 2051 -3335 -2981 4655 5296 -2472 -3352 2529 264 -6939 -2924 6931 5483 -4001 -4147
2778 -4147 333 -2585 -5062 2651 8934 463 -9196 -4997 2665 46 -2819 3030 4352 -4512 -8031
2793 -8031 153 3741 -2829 -4401 4082 3955 -5176 -6925 379 1042 -4177 -644 5966 987 -9564
2808 -9564 -7190 2623 3125 -1921 6 2167 -4495 -8948 -1682 5618 761 -4780 -1558 1650 -4009
2823 -4009 -6199 231 3724 -2203 -4022 1418 1752 -6003 -7033 1694 5052 -893 -3426 -400 -2056
2838 -2056 -6783 -2090 5956 4106 -4466 -5409 131 -334 -3336 477 4746 -216 -5996 -2210 3427
2853 3427 -724 -5011 307 5044 25 -4420 -897 1319 -2813 -2520 4694 5565 -3453 -6486 -201
2868 -201 3012 -504 571 4415 1005 -5553 -3028 4382 3783 -1830 -545 3496 793 -3501 35
2883 35 3837 356 -2541 2246 5136 -346 -4361 -147 4256 2126 964 2996 1761 -3231 -2034
2898 -2034 4157 5919 1492 -1066 1041 1305 -251 1224 4492 2764 -961 367 3714 2816 -849
2913 -849 -183 3321 3431 1080 1109 1939 -111 -988 2365 5885 3073 -1163 -934 1546 1784 1471 3378
2930 3378 3204 -581 -2090 1957 4402 1519 -585 1505 2613 587 397 2530 1625 -1199 -194 3903
2946 3903 3092 -1077 -1924 1201 1403 407 1772 2807 -761 -3403 61 3612 1728 -1113 -419 156
2962 156 -493 -461 1530 1366 -1605 -1976 829 1646 -421 -1955 -738 68 -519 197 454 -1285 -2908 -1823
2980 -1823 1148 1114 -780 -2131 -2051 -1453 -946 -112 -210 -2001 -2704 -2187 -320 249 -1893 -2414 -1832 -1159 -1276
2999 -1276 -1342 -904 -1970 -2832 -1332 200 -109 -2725 -3356 -1693 -1109 -934 -585 -817 -2838 -3577 -768 674
3017 674 -1144 -3068 -2385 -1301 -1651 -1234 -127 -1301 -3446 -2395 -255 233 -2089 -2188 -1102 -1152 -1178 201
3035 201 6 -2542 -2915 -934 972 -108 -1546 -1347 -852 -1341 6 772 -816 -2334 -1483 543 906
3052 906 56 -117 -827 -1376 63 1439 848 -697 -1454 -549 775 1460 955 -354 -992 -338 1492 1644
3070 1644 691 42 -570 -49 1346 1992 960 -280 -324 763 1551 1687 1317 235 -455 683 2290 2262
3088 2262 521 97 876 1254 1703 2060 1599 119 20 1827 2613 1846 680 283 871 1351 2470 2434 997
3107 997 -466 549 2057 2068 1337 776 825 745 1646 2652 1759 96 132 1168 1937 1884 1616 747 56 562
3127 562 1938 2342 1119 -11 369 1238 1550 1416 1232 -238 -216 898 1809 1444 292 -593 -128 916
3145 916 1291 1363 65 -781 -489 798 1261 1058 -250 -884 -14 901 1167 123 -634 -914 -666 530 1248
3164 1248 577 -1217 -1647 -171 841 59 -368 -777 -1188 -1053 270 1343 -544 -2157 -1391 -8 63
3181 63 -801 -759 -610 -1795 -1336 855 312 -2002 -2750 -773 392 -796 -738 -668 -1616 -2293 -481 1302 -554
3200 -554 -2779 -2502 -466 -505 -1218 -598 -457 -2081 -2800 -218 485 -1689 -2674 -887 182 -1186 -968 -654
3218 -654 -1469 -2533 -1704 989 404 -2428 -2663 -630 -465 -1056 11 172 -1934 -3378 -1275 1078 37
3235 37 -2208 -1431 -1 -609 -1550 -157 397 -1282 -1957 590 1853 -1436 -2830 -367 488 -123 -555
3252 -555 590 -101 -3204 -1772 2156 2279 -713 -1768 268 55 -1462 -40 2321 567 -2261 -276
3268 -276 2578 603 -1902 -149 2257 644 -741 840 1528 -1396 -1659 2448 4038 335 -2108 94
3284 94 1072 -206 870 3405 1932 -1898 -1703 1945 2820 -558 109 2189 1461 -1143 103 2621 920
3301 920 -981 1439 4430 1228 -2064 -338 2018 1220 1080 2773 2845 -1414 -2705 1642 4204 1956
3317 1956 -67 1312 1449 -1440 -908 3113 3074 -409 -647 2625 2086 -1650 -1297 2619 2822 97 697
3334 697 2136 -441 -3212 335 4900 3039 -1489 -1240 564 -758 -1582 2560 4288 302 -3232 -473
3350 -473 2544 -308 -1303 2154 2966 -975 -2332 905 1075 -2144 -1266 3640 3286 -2244 -3880 90
3366 90 731 -731 1061 3524 62 -5071 -2879 1910 1621 -1458 347 1757 -1747 -4514 -620 2852
3382 2852 -177 -2910 569 2465 -2265 -4567 -356 2282 -595 -1579 1913 486 -5150 -4520 1883
3397 1883 3538 -929 -1751 159 -1448 -4366 -1425 3968 1623 -3574 -2299 1274 -965 -3920 -618
3412 -618 3208 59 -3282 -965 1161 -2586 -4256 1614 4009 -253 -3899 -1602 -222 -2747 -1441
3427 -1441 3482 2983 -3281 -4942 -119 1608 -1506 -854 2538 406 -4092 -2255 2033 1139 -2684 -587
3443 -587 3376 422 -4493 -2224 1532 209 -1447 1937 3034 -2348 -5988 -960 3394 1032 -1147
3458 -1147 1120 1220 -3644 -3467 2458 3674 -1397 -2233 1449 882 -3199 -1575 2922 2179 -1815 -484
3474 -484 2802 -400 -4571 -782 4201 2468 -1772 -568 1338 -1797 -2866 2681 5307 380 -3505
3489 -3505 -71 1729 -427 -1262 2782 3012 -1646 -1996 1908 1668 -1880 -714 3389 2517 -1498 -1278
3505 -1278 951 377 -1117 1429 4383 1370 -3152 -1525 1937 1647 -112 1819 2151 -1277 -2872 762
3521 762 3059 804 -920 1255 2083 -1021 -1878 1125 2375 -122 -131 2412 1919 -2307 -2350 1757 3096
3538 3096 583 62 1376 -291 -2489 -153 4077 2555 -1130 -859 1397 319 -1060 906 2748
3553 2748 182 -1569 622 1847 -306 -1995 979 2874 611 -1168 505 456 -1662 -555 3008
3568 3008 2361 -1192 -2221 31 910 -319 427 1801 -68 -2091 -974 1588 830 -1144 -408 893
3584 893 173 -1386 -414 752 -588 -1106 880 1501 -422 -2165 -1006 534 354 -143 291 -68 -2107
3601 -2107 -1800 515 1470 -256 -1371 -550 6 -802 -940 512 442 -1568 -1137 877 42 -1859 -1839 243
3619 243 736 -848 -628 129 -1080 -2325 -61 1982 80 -1737 -1346 -250 -378 -775 434 256 -1644
3636 -1644 -1927 221 1001 -862 -1544 -216 355 -663 -964 550 -613 -1726 -774 1187 820 -1405 -1253
3653 -1253 -225 -168 -342 415 278 -800 -1576 -200 1016 374 -886 -545 -199 -616 -237 205 179 -1009
3671 -1009 -1136 330 1150 -71 -852 -34 -104 284 352 599 -134 -892 -635 872 933 64 -449 -227 193 447
3691 447 634 1005 137 -991 32 1358 720 -274 -325 336 567 437 842 500 -331 -439 760 1232 738
3710 738 -136 -91 674 546 677 1302 300 -576 -35 1207 1219 356 165 311 397 458 901 833 -141 -410 269
3731 269 1127 847 318 305 -313 242 843 1362 313 -480 -326 534 994 692 211 -321 -69 579 841 1013
3751 1013 36 -424 67 405 773 657 -145 -630 -365 334 889 378 42 -538 -180 427 1050 183 -524 -376
3771 -376 -26 390 437 550 29 -825 -110 950 683 -354 -421 -242 -27 573 626 302 -747 -825 240 589
3791 589 -68 -240 -592 -424 -183 537 505 -133 -980 -530 385 647 -57 -203 -473 -510 -185 720 262 -683 -805
3812 -805 -545 56 43 -57 -481 -743 -836 -64 494 22 -1038 -972 -123 135 -76 -338 -878 -679 -489 278 400
3833 400 -688 -1025 -683 180 353 -104 -468 -765 -871 -499 346 315 -449 -925 -691 -53 312 -442 -503 -688
3853 -688 -830 -235 194 86 -773 -1179 31 263 -406 -497 -510 -770 -821 274 734 -429 -1363 -931 518 -33
3873 -33 -613 15 -234 -1335 -998 643 863 -346 -1079 14 566 -406 -431 319 -153 -750 1 1269 373
3892 373 -1110 -1065 387 570 -270 129 257 -795 -930 500 1327 423 -716 -227 410 16 -133 919
3910 919 639 -616 -550 1227 1184 -347 -681 614 1291 344 195 577 125 -900 467 1832 1389 -327
3928 -327 -672 462 682 412 931 1655 78 -955 132 1564 570 -316 655 1467 212 -258 688 854
3946 854 -129 -303 1750 1867 -544 -1355 570 1152 385 389 1189 330 -1564 -443 1552 1610 -135 -661 852
3965 852 347 -990 229 1755 180 -1083 285 1488 -273 -1292 -28 1441 816 -563 425 601
3981 601 -1165 -1278 1159 2030 -430 -1683 37 328 -788 -227 1901 1128 -1658 -1507 857 345 -1329
3998 -1329 -628 1196 395 -1602 -778 518 -439 -1421 243 2173 10 -2481 -1212 240 -95 -808 963
4015 963 1121 -1719 -2880 34 1449 -112 -1258 637 372 -2056 -1845 1045 1089 -1390 -870 972 599
4032 599 -2297 -1787 983 698 -1073 -235 902 -1020 -3045 -488 2128 876 -1703 -571 310 -1561
4048 -1561 -2025 1357 2125 -794 -2159 -51 873 -1339 -1728 982 1509 -1075 -1310 717 117 -2217 -640
4065 -640 2374 1941 -1393 -1921 792 -205 -1368 760 2795 236 -3054 -1154 1312 391 -1205 956
4081 956 1774 -797 -2524 201 1353 -667 -1123 1573 1652 -1278 -2056 499 1136 -645 123 2119 840
4098 840 -2484 -1812 1628 1939 -589 121 1093 -356 -2452 64 2516 971 -1133 127 1657 -442
4114 -442 -2073 471 2026 218 -887 996 1183 -1530 -1777 1998 2537 306 -1141 441 244 -1382
4130 -1382 -332 2662 2212 -1222 -1254 1175 913 -1046 714 2356 589 -1720 -222 1478 188 -1226
4146 -1226 837 2617 489 -1878 -449 1047 -521 -477 1924 1991 -1156 -1969 152 1733 226 -332
4162 -332 1472 613 -1886 -1261 1685 1396 -665 -386 1193 538 -1256 -490 1129 458 -587 323 1365
4179 1365 -448 -2025 -81 2070 1108 -444 135 298 -1317 -1416 1006 1990 48 -1298 126 636 -667
4196 -667 -981 1042 945 -487 -803 765 605 -1461 -768 1155 996 -859 -759 221 -381 -1150 313 1792
4214 1792 291 -1831 -1331 453 264 -516 480 731 -735 -1740 -75 723 -349 -1202 389 1040 -1107
4231 -1107 -1447 190 388 -936 -539 785 456 -1913 -1569 311 415 -594 -323 489 -613 -1830 -520
4248 -520 1066 354 -1175 -900 556 -678 -1279 82 676 -389 -856 173 569 -682 -1348 92 733
4265 733 -165 -591 -69 -127 -860 -880 805 773 -708 -915 -214 400 -485 -154 818 130 -882 -221 673 641
4285 641 -696 -493 717 423 -510 -265 480 -237 -343 445 1209 -36 -1103 -345 719 351 -83 700
4303 700 522 -695 -441 786 827 -23 -278 793 484 -212 23 892 487 -275 60 1006 401 -638 -147
4322 -147 1039 425 23 836 692 -351 -888 693 1174 304 -304 388 77 52 576 974 547 -369 185
4341 185 865 710 -135 -100 385 530 275 313 645 -29 -293 275 410 487 32 -44 302 148 406 575 340
4362 340 -166 -368 152 846 284 31 -164 178 265 37 90 -141 -195 -320 309 250 28 -490 -179 44 375
4383 375 90 170 135 -542 -583 113 531 -182 -420 -51 -206 206 33 510 -212 -677 -194 407 18 -152 -256
4404 -256 -350 -187 -405 14 -130 -783 -234 110 -22 -401 -227 -380 -658 -244 -233 33 -448 -857 -328 -41 117
4425 117 -81 -356 -497 -671 -32 192 -51 -389 -456 -79 116 86 -114 -381 -743 -251 85 -49 -22 -463 -409
4446 -409 -225 407 95 -252 -391 -5 36 -72 -179 184 -100 -713 -282 203 265 -673 -128 -201 -147 94 177 44
4468 44 -478 35 75 95 41 -166 65 -295 -162 64 -91 -396 -528 283 356 100 -51 -440 -80 220 174 427
4490 427 19 -410 -170 338 196 117 -22 -57 -247 -69 503 304 -227 -265 -196 158 175 165 343 -374 -154 159
4512 159 327 555 -46 -163 166 388 342 227 109 126 -173 664 637 357 -129 -312 483 472 403 19 149 235
4534 235 109 468 552 188 -451 -60 415 544 167 -165 337 -145 -135 603 718 -221 -169 -45 216 230 -194
4555 -194 532 145 -293 261 601 58 -359 -287 573 363 -272 369 347 -376 -125 643 568 57 -848 118 395
4576 395 -23 -41 242 352 -300 -203 692 415 -132 -401 98 320 -429 -383 155 -37 -414 305 593 134 -660
4597 -660 -184 246 408 -413 47 84 -376 -798 -61 825 215 -587 -192 13 11 -680 50 152 -563 -468 216
4618 216 -32 -727 -507 192 722 -247 -302 1 -291 -909 -338 948 342 -790 -702 120 -259 -717 -49 840
4638 840 57 -1193 -387 597 -375 -1132 61 516 -432 -708 -358 -307 -592 -711 857 776 -774 -1116 11
4657 11 417 -492 -126 909 39 -1528 -915 597 318 -479 -201 1100 -163 -1080 -275 764 -69 -796
4675 -796 472 762 -103 -1451 -33 757 31 -625 682 257 -1010 -980 719 1195 21 -828 454 166
4693 166 -799 -379 969 813 -509 -627 818 356 -732 -168 1177 850 -705 117 539 -120 -981 538
4711 538 1792 530 -1161 -321 588 -358 -409 981 1305 -392 -1300 533 879 -280 -404 1104 555 -961
4729 -961 -368 908 544 -740 170 1447 463 -635 -450 846 241 -162 690 966 -805 -1601 -1 1290
4747 1290 534 -635 440 677 -955 -731 964 1195 -9 -631 555 394 -608 -724 871 1071 -145
4764 -145 -236 686 13 -1362 -208 1780 1009 -669 -745 427 -331 -1076 771 1604 234 -1623 -276 704
4782 704 -328 -620 581 927 -91 -1134 215 514 -632 -707 1008 1088 -625 -1201 40 377 -308 150
4800 150 1250 492 -1328 -1014 851 462 -229 86 859 -371 -1361 -213 1051 134 -576 297 714 -134
4818 -134 -1165 -28 751 87 -445 543 290 -1097 -1266 410 1086 -26 -349 48 -277 -1245 -519 1029
4836 1029 768 -804 -850 234 -72 -833 -16 913 107 -659 -269 570 -308 -1071 239 917 332 -967 -416
4855 -416 386 -522 -468 803 1296 -730 -1398 10 386 -41 -264 626 374 -905 -804 336 613 -560
4873 -560 -339 615 43 -817 -538 399 44 -612 21 621 -311 -1418 -407 808 239 -408 -7 29 -862
4892 -862 -706 451 899 -161 -576 19 132 -420 -379 316 423 -148 -455 516 57 -1207 -473 544 754
4911 754 -223 -203 252 -323 -761 225 1046 381 -718 -322 255 182 -711 241 494 -231 -745 219 501 -123
4931 -123 -284 345 582 -137 -521 222 84 -685 17 871 649 -491 -297 389 425 -98 -6 671 -347 -764
4951 -764 50 871 75 -516 52 555 16 -307 135 666 294 -340 364 521 -216 -348 159 472 159 -165
4971 -165 236 -69 -527 -160 720 496 -121 -243 93 -58 44 224 357 362 -580 88 438 450 -365 -142 347
4992 347 46 -78 161 332 -215 -418 408 667 -149 -479 -217 145 320 -12 277 50 -486 -163 232 209
5012 209 -125 -136 21 64 -348 135 231 -128 -761 186 159 243 -405 -180 173 -231 227 1 -18 -141 -288 -134
5034 -134 325 -54 -407 18 84 186 -56 64 -426 -220 51 -169 195 -170 -16 -241 -65 -227 29 -165
5054 -165 -373 -266 -165 31 172 2 -301 -322 100 -55 -67 311 -12 -413 -118 128 52 -452 -207 -119 -21 282
5076 282 166 31 -274 -276 78 340 -253 -148 -238 -21 -120 64 242 -364 -365 -70 115 273 32 -512 -105 0
5098 0 102 150 -31 -44 -17 80 268 65 103 -399 -67 268 129 39 -187 9 -20 64 116 236 -385 -346 -314 80
5122 80 201 -94 -74 -27 -5 106 170 -39 -277 -357 -43 344 96 -34 192 -156 -270 227 272 317 -103 -167 174
5145 174 51 -166 94 -46 -220 -122 397 55 -254 -18 -26 -26 129 485 152 -300 -240 168 651 -248 -20 -16 21
5168 21 116 657 317 -104 -412 -79 393 -120 54 57 311 83 239 350 229 -140 -190 -149 99 351 -36 124
5190 124 -139 -68 485 400 238 -245 -37 149 24 -50 350 146 20 79 166 308 176 -192 -109 351 322 -20
5212 -20 -27 41 75 98 -265 201 -60 -284 -3 451 150 -116 -204 76 69 126 316 -129 -182 -215 159 245 -390 -351 16
5237 16 -9 -125 55 262 20 -501 34 295 -142 -208 98 160 -412 -199 241 369 -240 -786 -132 255 -286
5258 -286 -197 232 -237 -112 -199 199 -159 -675 -120 93 97 -280 -376 -105 -310 -40 173 290 -136 -511 -45 15
5280 15 -253 -493 347 89 -740 24 118 25 -361 -448 143 245 -296 -616 203 205 -636 127 411 159 -702 -300
5302 -300 267 143 -439 -143 348 -447 -614 -78 242 70 -650 316 365 -336 -680 372 372 -294 -97 629 452
5323 452 -412 -403 462 420 -56 74 607 289 -985 -246 892 470 -431 -166 407 29 -665 294 577 110
5343 110 -744 156 604 -385 -692 465 656 59 -280 83 287 -450 -281 717 628 -480 -754 102 177 -318
5363 -318 -15 584 330 -932 -180 489 311 -276 150 629 156 -419 -79 585 -141 -305 333 523 -195 -645
5383 -645 -95 506 239 -441 762 150 -806 -655 465 635 -88 -474 0 -158 -638 -240 566 501 -340 104
5403 104 640 -119 -620 -288 719 257 -563 -77 460 -637 -759 259 1126 49 -582 -414 481 -325 -473
5422 -473 677 500 -324 -651 372 183 -410 34 316 477 -343 -387 133 76 -619 55 753 169 -498 -596
5442 -596 282 180 -14 398 738 -290 -926 -221 642 140 -302 263 338 -516 -500 191 447 -13 -358 214
5462 214 532 -414 -763 69 423 -10 -208 425 -163 -854 -138 548 439 -444 -233 445 -261 -411 -48 838
5482 838 235 -448 -52 521 -25 -584 420 729 -270 -736 59 226 -669 -471 517 604 -315 -670 -21 96
5502 96 -466 -135 737 97 -713 -554 261 191 -232 148 793 -27 -609 -174 386 -154 -453 344 658 -281 -905
5523 -905 -269 372 35 -448 461 316 -665 -1126 271 393 -61 -170 588 222 -540 -339 724 469 -522
5542 -522 -261 238 97 -500 -46 284 -97 -367 -178 375 86 -597 9 865 -7 -169 -82 211 -252 -145
5562 -145 459 810 -313 -507 91 40 -428 -100 477 441 -433 -263 293 134 -330 211 502 161 -4 -94 451
5583 451 127 -238 457 518 125 -581 79 502 211 -73 37 237 -479 -249 131 566 -79 22 10 84 -253
5604 -253 -57 263 288 -131 -161 533 -90 -394 -497 636 57 -114 60 185 -340 -239 365 401 164 -418 -69
5625 -69 95 138 33 309 294 -145 -215 119 -156 -361 -169 235 419 -23 -148 -1 229 -37 -92 263 217 -177
5647 -177 -269 36 -3 -138 68 -28 -480 -508 -323 297 401 117 -141 64 113 -79 385 99 -533 -247 -175 84
5669 84 -163 -461 -195 169 -112 -90 -103 -50 -374 -255 15 -1 1 -140 234 -50 -196 -123 117 -464 -356 30 237
5692 237 186 -220 -10 -16 -44 78 -47 18 -299 204 145 109 -162 -200 -76 130 102 168 -86 -335 11 -151 102
5715 102 268 371 -200 67 161 217 277 -32 74 25 -35 63 212 -273 128 -238 29 71 232 201 -25 -58 -201
5738 -201 275 -209 -166 -223 -178 151 -146 -171 333 204 -24 -62 218 -300 -51 -80 -221 118 91 -52 303 -179
5760 -179 -5 499 226 -71 -269 10 -202 23 221 281 61 -158 -164 12 117 -12 92 294 155 -3 272
5781 272 -37 -155 -137 265 -20 317 -234 -147 172 -184 307 66 -119 -118 -117 231 -145 7 -32 39 183 186 82
5804 82 225 -10 94 0 170 -122 -63 -152 72 133 177 198 -138 12 -248 -317 -119 -27 67 209 -219 -530 -81
5827 -81 309 -44 90 103 8 361 -30 -63 79 -358 59 12 97 -171 -152 21 84 -1 -65 136 193 -289 -160 250
5851 250 42 -53 76 231 119 -269 -224 -216 -270 -53 9 -8 112 -67 -202 306 172 150 -36 208 -113 55 164
5874 164 324 -161 -224 186 -48 -6 -81 87 33 -180 -140 156 169 -177 -270 237 125 -249 97 -178 203 -32
5896 -32 -197 47 152 -70 -146 -126 103 -306 -28 227 -126 231 -166 320 -198 -58 -74 312 134 -239 6
5917 6 -149 -169 -257 268 219 -23 -178 6 -127 91 -53 20 -10 -411 161 362 190 -259 -62 165 246 -110 -101
5940 -101 265 134 -254 303 476 -240 -279 314 143 -37 -177 269 222 -383 25 373 223 84 105 85 215
5961 215 188 -85 458 -24 115 -39 221 -201 -402 -66 217 308 -73 -282 99 -120 -268 147 507 -69 -91
5982 -91 58 158 5 -28 460 539 -304 -296 79 40 -213 -136 403 353 -232 -12 160 -395 76 -77 261 109 -564
6005 -564 -55 278 64 37 225 210 -68 -66 120 270 -388 -266 57 7 -261 -458 126 388 -317 -260 117 259
6027 259 -390 -118 305 168 -423 -295 265 -251 -651 -203 561 79 -305 36 15 -223 -536 198 133 68 -471
6048 -471 165 -81 -275 -502 54 251 225 -535 -20 2 -388 3 739 297 -615 -376 150 -30 -256 186 335
6069 335 -116 -278 -254 236 -9 -377 -68 474 18 -472 -18 269 -10 -385 -58 276 138 -592 136 83 -415
6090 -415 45 606 170 -266 -517 182 -59 -365 -294 157 255 -704 -243 474 206 -216 -106 370 -350 -485 -113
6111 -113 555 84 -252 241 209 -409 -487 91 427 1 -339 141 105 -297 -194 484 337 -365 -95 12 392
6132 392 -733 -401 321 366 -257 -209 441 3 -353 22 696 54 -350 -208 307 58 -412 219 663 -277
6152 -277 -609 -17 240 -200 -92 121 330 -213 -577 287 594 -64 -250 431 406 -498 -534 453 177 -391 18
6173 18 278 138 -431 -260 260 216 -255 -154 135 -20 -237 333 448 -103 -239 88 208 -176 -141 232 282
6194 282 -7 -84 70 17 -629 -35 685 339 75 -21 33 -243 -280 76 655 264 -58 -294 198 190 -410 338
6216 338 314 37 -245 -106 553 -317 -400 328 342 94 -373 114 350 -240 -122 309 621 -381 -297 317 255
6237 255 17 -284 275 -240 -370 -246 211 26 -391 167 468 95 -117 -51 104 41 -107 -62 117 -326 -306
6258 -306 149 183 -58 -362 24 251 -299 -387 320 256 -168 -37 369 140 -26 -57 19 280 -381 -301 359 47
6280 47 -245 5 288 -196 -483 -121 123 -240 -164 237 250 -5 -314 -199 247 -150 -292 314 373 -255 -403
6301 -403 362 -59 -23 285 324 143 -188 -51 -166 62 -235 88 222 205 -440 -280 215 253 -11 -89 -29 -127
6323 -127 -40 122 139 22 -273 7 293 61 -64 -59 223 53 100 282 284 -76 -336 269 165 356 -69 -118 69
6346 69 -431 -153 127 170 -84 -320 -128 29 -13 24 152 76 -470 -139 247 -23 -29 -167 -100 -64 -72 -77 -14 83 -183
6371 -183 119 329 110 -138 117 264 19 -173 112 -36 -203 262 129 44 30 -169 -61 -172 -189 4 -287
6392 -287 -180 -81 34 -13 173 -54 -56 421 85 171 200 -263 -9 -62 -123 253 -122 -103 -93 -15 -155 19 97 -108
6416 -108 -147 -247 -93 57 -77 -129 -62 332 -36 107 -124 19 -78 13 349 -12 -236 19 -202 -162 -19 -28 174
6439 174 -18 131 -271 216 182 -254 -29 119 39 255 78 125 44 -119 -100 55 -162 -272 123 131 6 16 193
6462 193 185 -92 36 48 -203 -58 -120 -20 229 -179 100 -140 87 17 111 3 -35 -232 -178 215 -108 -10 -202
6485 -202 -179 -176 -81 -175 179 -90 -67 101 -15 -235 -198 -37 -61 -15 -382 -13 -35 29 -29 70 -251 -84 58 -263
6509 -263 -58 -86 81 229 -194 -124 -218 34 -145 -314 167 -3 20 -164 87 280 -13 275 329 261 -186 127
6531 127 388 -54 -198 -102 -241 77 185 -5 -393 137 -203 120 128 -95 -19 -83 -46 -32 -144 -182 70 101 -77
6554 -77 126 -125 -244 -58 182 62 -223 -118 195 -103 5 300 151 -95 -197 -86 135 3 -286 122
6574 122 -54 169 25 294 7 -335 11 62 65 39 -195 -13 59 -218 137 179 300 3 -101 -324 -177 45
6596 45 -158 167 210 17 -18 30 -14 46 -27 12 41 50 1 98 -169 178 245 296 -3 -58 17 107 -338 -58 219 57
6622 57 -112 168 328 424 57 -68 141 -53 -72 -116 324 -265 -309 99 375 52 -176 307 -104 35 -97 63
6644 63 75 29 -273 392 376 -47 -438 153 4 -35 -26 157 159 -343 -270 56 144 -297 -15 217 289 -71 -227 -184
6668 -184 176 -392 -136 43 238 -364 -103 90 122 73 54 314 -514 40 -209 399 -295 -187 204 363 23
6689 23 -215 0 153 -179 -175 270 -154 -369 -350 363 68 -294 65 22 -215 -477 -147 153 25 -97 19 55
6711 55 -149 -212 407 192 226 -279 -2 162 -217 92 202 205 123 -32 125 58 137 -139 442 -23 -246 -142 168
6734 168 98 -100 141 181 5 -154 19 77 -108 -216 117 378 -224 -515 91 310 -141 -295 129 344 -253
6755 -253 201 -41 227 -77 -419 67 -131 -99 -13 278 137 -293 -36 277 208 -233 211 259 -62 -420 282
6776 282 334 -167 -168 144 326 -183 -222 135 90 -291 -143 415 382 -151 -348 -78 216 -228 -56 579 -52 -259
6798 -259 -92 257 195 -40 -260 113 109 -363 -295 -91 -60 -187 4 437 169 -171 -226 346 -143 258 -7 129
6820 129 -98 -465 50 447 -30 -143 212 -50 45 -262 176 205 -443 -155 823 -119 -453 -236 102 -103 -28
6841 -28 -44 133 -36 -558 -25 272 114 -261 -135 42 -88 55 193 236 -288 -125 -24 306 -53 -40 209
6862 209 450 -150 -274 165 -87 -36 18 23 -103 -286 -286 369 -87 -151 -38 344 -14 18 -123 365 -120 23 263
6885 263 384 42 -369 306 267 -259 -107 -75 137 11 -167 235 -22 103 -285 -50 96 -158 -177 80 117
6906 117 -330 111 74 -159 -199 286 236 248 -324 -157 248 -77 -258 -102 206 -259 -313 159 -48 -274 -20 106
6928 106 287 -138 -203 -211 210 -334 -65 162 268 61 -89 138 -38 7 -48 189 -125 -13 49 241 -220 108
6950 108 131 80 -354 -161 152 193 -175 -217 211 25 73 -295 -81 -45 -402 -63 120 351 -272 120 240 -123
6972 -123 -44 -186 -7 -32 -148 -158 -116 -83 -208 -182 301 -248 -94 179 304 157 -156 155 71 -19 -247 -130 146
6995 146 23 -170 -331 26 -41 -256 59 -6 -34 -23 7 38 -240 -118 223 -40 35 101 -128 -12 -340 -156 -82
7018 -82 192 35 116 -267 105 82 -164 40 -292 -133 -13 79 118 -63 163 115 -248 59 333 -39 -31 -77 254
7041 254 296 -31 -192 166 272 -139 -297 103 -186 75 32 36 43 -100 -17 316 63 -2 -355 -27 57 -104 -61
7064 -61 229 -179 -59 163 54 -32 -13 36 32 -16 -114 418 -108 -53 103 -29 233 16 72 -178 -7 -57 128 -60
7088 -60 2 213 -13 -146 159 -125 -82 178 134 -22 79 107 -44 -123 -153 113 -177 -290 79 3 -331 -89 205
7111 205 261 129 244 47 -16 -55 -23 -39 189 38 -9 -63 270 203 -52 13 -38 -78 -268 -65 -211 -69 73 -231
7135 -231 -15 38 -114 55 181 42 -2 -87 -164 -3 -46 217 243 -42 115 10 137 -22 -224 -245 -142 -247
7157 -247 -73 163 18 -96 -64 16 54 192 108 -144 -63 -73 115 122 -12 6 162 -136 8 -129 -170 -87 -137 -104
7181 -104 -51 -86 119 118 104 -23 61 -194 -60 -84 143 108 412 -284 -77 194 -27 101 -203 86 -247 -134 -61
7204 -61 -120 -180 -462 142 320 8 156 -14 242 -286 143 137 315 -13 70 61 127 0 -224 120 -394 -71 -122
7227 -122 119 -40 48 -89 -39 115 7 94 207 2 139 52 -20 270 39 14 -42 -41 -1 108 -108 68 -122
7250 -122 85 -141 247 -70 109 61 -67 34 -188 -37 -156 132 141 334 234 -194 -167 -73 -22 48 -133 46
7272 46 42 -124 5 59 -86 35 -127 8 -256 90 116 122 -111 -59 16 107 -293 -115 2 100 2 268 270 -318 -3
7297 -3 -163 -57 284 -101 320 -140 217 18 -214 77 -123 193 -74 -97 -116 -252 46 -70 -119 18 99 68
7319 68 -122 66 6 -93 -125 129 214 11 -109 256 -12 -260 224 78 -141 -220 200 -98 -163 -139 -152 335 192
7342 192 -44 30 343 -24 -456 -9 43 -71 162 51 404 -138 -196 -5 217 -197 -300 83 135 -154 10
7363 10 307 70 -245 -19 180 -235 -173 -76 -69 -210 -214 124 32 -211 -340 -183 191 -116 -66 -60 201 165 -287 172
7387 172 78 -134 -26 -121 19 -216 -19 -21 38 -75 43 206 -40 -315 -20 -83 220 -190 49 71 -83 67
7409 67 112 205 -18 -408 -262 310 -161 36 -1 23 -265 -168 10 256 -160 -154 24 12 -124 300 45 -40 -541
7432 -541 -36 235 -92 -165 -285 23 40 -11 -120 289 -73 -65 99 242 -67 -310 271 228 -159 -54 -39 146
7454 146 -195 -113 101 266 -157 -67 -77 208 155 -53 229 173 -251 -63 132 114 24 47 -125 -46 -283 98 342
7477 342 25 -76 122 -44 -73 -10 183 136 -259 -101 100 -125 -141 -33 52 357 -190 -136 -92 -56 -110 -140 178
7500 178 -60 -210 14 108 114 -284 -123 142 -8 -417 15 231 31 -43 177 -84 188 87 115 145 -193 -252
7522 -252 67 88 -506 -418 189 197 35 -129 236 -66 -377 -145 385 161 36 -51 32 110 -227 -135 391 194 -74
7545 -74 -91 38 105 -141 146 -120 -57 -368 -164 -38 -165 -48 299 -78 -397 -252 -58 -76 -52 -99 300 -223
7567 -223 -27 -175 76 -22 -18 145 117 296 -118 -82 200 89 -106 2 269 -13 -296 -28 239 -54 -73 129
7589 129 19 176 -249 173 87 41 -127 356 333 53 -364 -46 160 33 263 -68 246 -182 236 71 174
7610 174 55 -22 -94 -238 -98 246 172 2 -258 -142 115 -72 -114 -339 123 79 -25 81 -41 -90 -52 12 32
7633 32 59 3 58 54 82 95 278 -68 64 -162 -107 -20 175 77 -172 -61 -338 193 245 94 38 -65 276 108
7657 108 -350 -78 257 -123 -225 33 49 -335 -313 101 429 49 123 -223 -14 -193 -160 -22 61 116 -206 274
7679 274 -25 -165 119 80 229 -135 -279 38 57 -79 -42 -86 -321 -122 312 -41 -120 35 37 158 193 -355 -222
7702 -222 -53 -7 -89 111 -209 -279 -86 75 166 -269 -53 -15 171 30 39 -12 -196 1 -31 166 113 85 3 273
7726 273 76 -182 -71 129 -122 -23 217 44 166 -251 -109 132 -99 -255 -67 207 -166 -291 163 -150
7746 -150 -23 -207 148 -79 127 -192 130 29 -104 -101 167 361 -124 -164 71 116 109 101 8 74 -87 139 106 -238
7770 -238 349 31 238 133 -137 -87 -187 76 83 -144 137 -110 143 196 351 88 -44 176 -87 -115 94 393
7792 393 -115 206 -65 77 67 69 322 164 -115 -18 -164 43 379 -216 -12 -417 -9 -20 -53 285 -289 134
7814 134 -89 55 209 -90 165 -262 -176 130 89 108 12 -14 -104 -139 87 173 -320 211 246 -17 -125 37 168
7837 168 177 49 -118 128 22 -78 -6 -74 -29 -109 -222 -83 33 -6 101 196 75 153 178 -33 161 -6 226
7860 226 -243 34 -110 16 -91 30 -211 157 -143 68 -18 57 84 143 160 -32 112 112 231 32 -146 203
7882 203 88 -59 189 125 53 -14 -31 -357 91 51 283 53 -107 40 374 -29 -177 236 -135 269 107 138
7904 138 -229 120 -111 184 -146 -111 233 49 231 32 288 211 41 -70 -236 -73 81 -192 82 -170 -87
7925 -87 18 -211 99 50 -118 -32 -51 -44 180 -99 -117 -43 32 115 55 165 -129 -57 -215 160 81 -255 359 -53
7949 -53 -281 324 -88 -89 -201 138 121 157 50 -183 -66 -9 -118 -359 120 13 132 -6 27 -28 72 9 -220
7972 -220 -142 -280 -70 -101 -84 -53 153 -121 92 -223 -179 149 -290 29 -69 76 180 215 242 16 62 101 121 45
7996 45 26 121 48 -165 80 189 113 57 -49 5 -102 138 -218 154 -182 -144 230 108 14 -211 119 -143 -225
8019 -225 120 16 -55 10 -21 181 29 74 167 80 158 -117 50 -38 -164 -61 217 85 -20 -195 121 29 275
8042 275 153 110 -49 6 -182 -76 319 63 77 79 294 -7 35 -263 110 52 251 175 69 67 150 44 -65 -162
8066 -162 -239 206 -38 -226 146 2 -32 -422 -100 95 -47 152 -79 107 -234 -5 -21 -123 -37 -139 -166 -70
8088 -70 -194 -360 89 61 -21 -188 219 99 -375 -15 285 390 48 75 -24 -405 -104 135 148 337 237 -170
8110 -170 33 -178 185 259 133 103 -331 454 48 -381 -165 82 317 392 -108 157 -91 -102 -218 45 35 -158
8132 -158 14 145 245 -222 -139 58 -114 -37 138 498 -167 -104 -73 242 144 -374 166 3 93 -183 183 41
8154 41 181 -52 198 136 -37 22 104 278 -325 -43 119 167 -226 121 234 2 -164 3 263 8 210 100
8176 100 25 75 -179 100 -79 49 -76 157 -95 46 -201 104 348 -375 -110
8191a10
$$ Imaginary data points
##PAGE= N=2
##DATA TABLE= (X++(I..I)), XYDATA
0 0 0 0 0 8 -8 0 -8 8 -16 16 -21 32 -37 40 -48 61 -77 85 -101 118 -141 161 -186 215 -247 283 -319 360 -414
29 -414 461 -521 585 -652 731 -816 904 -1009 1117 -1240 1372 -1521 1682 -1864 2061 -2288
45 -2288 2539 -2827 3154 -3534 3976 -4509 5150 -5955 6985 -8362 10302 -13249 18209 -28148
59 -28148 55739 -286058 -1035538 -455253 -54179 -349042 -328727 300897 282148 -360009 -442894
70 -442894 -13241 -190125 -683627 -533252 -93442 -226452 -460519 -166083 105389 -183310
80 -183310 -441102 -307995 -333440 -698479 -753938 -347105 -52140 -71505 -85403 -112626 -381479
91 -381479 -689557 -674785 -447162 -321511 -321701 -288193 -218396 -215586 -287771 -331936 -322711 -377769
103 -377769 -523365 -550195 -365136 -233639 -297420 -268408 -50351 -51816 -396835 -596336 -465447
114 -465447 -412974 -475408 -222946 167199 67159 -345067 -378722 -171292 -292223 -487238
124 -487238 -264417 -25514 -222716 -354242 -22725 175806 -123666 -312585 -100043 -71106
134 -71106 -367808 -368048 -9368 98365 -50307 49579 243478 31354 -332594 -302759 -60857
145 -60857 -20542 -13144 176399 249703 42015 -78628 65193 138689 -6095 -86478 12885
156 12885 81868 69580 142384 273839 268923 137101 63590 83093 68072 6888 39045 206539
168 206539 351392 346085 263468 199267 110465 -1486 26510 217359 321591 229655 177718
179 177718 285911 332735 229409 192937 256019 183580 25404 88907 312725 350773 240944
190 240944 277510 373239 262812 87624 108629 184274 129321 140406 343455 447147 282222
201 282222 129653 164905 186269 109570 127654 242902 232378 130257 171560 310512 301599
212 301599 164244 99361 105627 72731 54166 136842 223905 209827 172235 195742 197103 96834
224 96834 -14181 -16389 57875 111930 140729 176101 171024 84591 8867 34800 80339 27615
236 27615 -53514 -27985 56540 80191 74866 106532 86897 -37061 -116680 -57789 -7338 -58548
248 -58548 -68717 30937 82956 18002 -28749 -27683 -99292 -195756 -146921 -11769 6202 -68717
260 -68717 -67950 -21111 -49989 -103539 -94269 -104070 -187094 -211003 -103525 -9837 -30842 -76410 -80758
273 -80758 -108054 -167929 -178486 -146045 -152936 -175826 -128128 -39953 -23841 -91268 -156177 -180080
285 -180080 -187172 -179580 -143393 -110053 -117470 -136264 -109674 -61263 -71121 -145627 -202505 -199813 -173751
298 -173751 -142364 -88923 -49502 -77543 -127449 -119314 -90608 -126532 -188391 -181280 -125149 -91225
310 -91225 -63687 -22187 -33195 -113794 -155958 -114245 -86206 -118496 -128333 -83654 -50449 -39942
322 -39942 -8638 1660 -67202 -143040 -129216 -71022 -50654 -47872 -21700 -4515 -14262 -8161 6119
335 6119 -30044 -93375 -99627 -44439 5342 28521 39797 28842 -1533 -9921 7915 3072 -30621
348 -30621 -41820 -9402 38335 77687 91995 63997 12615 -10962 4018 21923 26657 30965
360 30965 41063 59989 92733 114945 88511 29320 -4191 7278 36163 67355 92387 92384 75564
373 75564 81273 104785 95892 48886 15272 19975 45971 86659 128506 131546 90476 60824 70182
386 70182 78464 61212 44114 44667 56375 86568 130793 142985 98472 45713 32762 46814 57980
399 57980 67694 73983 70112 74116 102924 121844 92105 38346 9363 15562 41172 74524 94712
412 94712 82503 59742 60775 75003 66091 33440 4606 -1609 19914 61942 94105 84350 47554
425 47554 21182 18044 23003 21505 10988 -1354 4649 38330 72104 69248 32994 -5463 -26579
438 -26579 -23630 74 18808 10945 -2380 11241 36240 36923 10505 -21385 -48756 -58090 -28788
451 -28788 16596 27565 2493 -13716 -5826 -3749 -18335 -33886 -48154 -60853 -48333 -2913
463 -2913 28811 10657 -29199 -44246 -39446 -40673 -44828 -44524 -47948 -51388 -28189 11093 17763 -25171
477 -25171 -70158 -77326 -60707 -47190 -35079 -24315 -30206 -41344 -28051 -3809 -17294 -65673
489 -65673 -89739 -68029 -42052 -32068 -19826 -13103 -34283 -54179 -35483 -15054 -44488 -88521
501 -88521 -80800 -38338 -13868 -5752 2375 -16177 -65347 -80234 -41748 -18448 -44424 -60258 -32563
514 -32563 -9906 -14551 -12418 -7427 -38940 -78522 -63699 -17225 -10858 -38041 -34305 -2635 5889
527 5889 -7557 -13821 -27775 -64961 -77934 -29941 25074 22497 -12639 -22667 -16032 -22782 -26895
540 -26895 -11606 -10176 -37382 -41293 2630 37487 15197 -18990 -13773 -1297 -16262 -27469 -10094
553 -10094 -3432 -18321 -2143 49561 55905 -6155 -51041 -33893 -9451 -5222 17688 47201 24143
566 24143 -22734 -8792 44072 38112 -15278 -22715 9950 8046 -7084 23949 57415 28403 -6605
579 -6605 20945 46010 -1126 -46994 -11503 43395 46451 41456 61560 40202 -30299 -41479 31263
592 31263 70036 25528 -1685 30082 39859 10494 23318 68432 46356 -21492 -19768 39100
604 39100 41710 1374 20952 76146 65257 16088 17142 30372 -12819 -37258 36841 111399
616 111399 72167 -403 6169 35101 10795 2631 56819 69474 -4675 -37851 32404 80352
628 80352 38744 13940 50705 44870 -20379 -24638 39166 47137 1983 28727 99639 68302 -34426
641 -34426 -46031 20346 29362 2985 44805 86001 16042 -62397 -8377 79248 50777 -15978
653 -15978 2941 28043 -24056 -40663 47613 93811 16261 -31819 23509 34211 -50931 -67086
665 -67086 28273 65502 6332 514 50382 5420 -91011 -57108 60736 60803 -29125 -33967 14647
678 14647 -15787 -53013 20662 83082 -16 -94219 -49887 15288 -23524 -47154 30918 64402
690 64402 -24456 -75986 -18698 -2765 -72538 -66243 40784 63855 -31376 -72282 -23106 -19230
702 -19230 -59877 -20013 47742 -3015 -105757 -86921 8317 17929 -26526 -7919 13387 -58319
714 -58319 -119927 -55358 24244 -6317 -49385 -575 32345 -43854 -105971 -54219 -1449 -31861
726 -31861 -40705 17178 12398 -81918 -101381 -4333 40234 -23443 -54800 -20172 -41072 -98724
738 -98724 -49687 60652 49799 -50867 -64177 -10937 -35410 -87633 -35255 44251 12762 -48221
750 -48221 -15573 17076 -49083 -91229 -12452 51294 -3134 -53611 -17505 -2711 -46998 -26426
762 -26426 61721 57234 -49941 -88510 -23754 7742 -13610 13822 62753 23439 -53358 -42907
774 -42907 12698 1018 -33024 6007 57519 26897 -26351 -11383 20495 1492 -9331 35645
786 35645 54605 -8345 -55531 -8094 56049 52812 28239 33032 17109 -37126 -42720 28301 74293
799 74293 40705 11249 34134 37274 -3837 -10822 34742 46043 10964 16947 59671 43646 -13911
812 -13911 -2393 64109 68036 15429 6089 25968 3091 -13759 48674 107630 63936 -8368
824 -8368 -3543 27177 12007 6974 55351 73814 23919 399 41249 53212 6402 -4802 42107
837 42107 54293 14647 5590 34857 32775 9736 31906 68767 42994 -18297 -25207 15536 35800
850 35800 35913 49999 51927 10131 -24746 -1554 34338 24334 232 12509 33761 20333 388
863 388 12777 25027 3909 -11095 13247 27621 -4916 -29141 2466 39776 27739 3326
875 3326 1846 -10068 -41423 -33058 22807 41953 168 -24617 -2544 2329 -23686 -21516 6995
888 6995 -4011 -37819 -21670 19073 5924 -35386 -27011 5429 -7784 -37321 -26531 -12574
900 -12574 -35667 -40138 6898 29134 -16833 -57317 -41197 -23839 -35634 -28140 2230 -6099 -45287
913 -45287 -42473 -4552 -5149 -42004 -49120 -26069 -25741 -38079 -22930 -6753 -26168 -45020 -24435
926 -24435 -5010 -27869 -57212 -48128 -25172 -20212 -16162 -3726 -13025 -46425 -56309 -28531 -9593
939 -9593 -23403 -36993 -28167 -18728 -21066 -17102 -9438 -20879 -43327 -41302 -15952 -7557 -21671 -26553
953 -26553 -13096 -6195 -12115 -12883 -12982 -29326 -42208 -22523 9122 11407 -9732 -17013 -9584 -10509
967 -10509 -13111 -3580 -823 -17004 -22701 1692 22555 10779 -6999 -5333 -1362 -6507 -2670 11115
981 11115 7679 -6843 1271 26771 29746 7823 -5097 -1173 1038 6105 23018 30773 15151
994 15151 3179 15913 30838 23565 9407 6569 8930 12563 26529 40665 33552 14431 10946
1007 10946 23246 28873 22426 17322 15394 16719 27405 42625 43246 25378 10448 12602 22984
1020 22984 29820 30716 26276 20677 23344 34980 41264 31715 15582 8231 13352 25503 36385 36021
1034 36021 25591 17609 21786 29389 28732 20040 9972 7499 16147 31537 37621 27952 13507 8526
1048 8526 12868 18537 19106 14158 7226 6384 17501 29740 26222 10465 -1716 -2815 3733 12278
1062 12278 15442 9676 1034 2540 12449 16204 6224 -6533 -12554 -10007 663 10816 10715 -1380
1076 -1380 -9908 -6421 438 -352 -7574 -16287 -19207 -12389 1584 7241 -2032 -16245 -21570 -17184 -11242
1091 -11242 -9901 -13930 -20268 -20769 -11108 -1457 -4638 -18126 -29803 -30413 -22832 -13320 -10274 -15858 -23180
1106 -23180 -22221 -14298 -9744 -16623 -29105 -35698 -30197 -17907 -9190 -10350 -19656 -27098 -26348 -19235 -15341
1121 -15341 -20854 -31094 -33116 -22317 -9319 -6769 -13062 -23419 -30479 -29149 -18413 -11518 -17474
1134 -17474 -26261 -23510 -11467 -5355 -9636 -17509 -26356 -30494 -22085 -6887 -2047 -12919 -21184 -15427
1148 -15427 -5952 -4590 -9067 -14971 -21798 -23133 -10066 6603 6367 -7905 -15347 -9492 -4478 -4944
1162 -4944 -6017 -7437 -11084 -7431 6467 15644 5840 -10469 -11309 -1400 4552 4660 4956 2201 -3521
1177 -3521 1027 16667 21531 5557 -9437 -5759 5493 10433 13537 17307 12782 2663 6160 18889
1191 18889 17191 1716 -1867 11689 21214 18435 17992 18028 8983 2741 14391 27844 18501 176
1205 176 1922 18482 25363 24025 24753 19528 3967 -1437 15951 30260 21065 9743 16507 25396
1219 25396 19702 13282 17280 14962 4331 8539 28070 31185 10170 695 16207 27544 19806
1232 19806 13825 15639 6598 -5573 9324 37340 35623 8473 53 11220 10149 1943 12038
1245 12038 24769 10676 -3397 13251 29974 9909 -11806 2480 21436 10393 -1601 9868
1257 9868 12608 -7736 -6034 26737 31525 -4705 -23610 -4842 4779 -3643 7096 26832 9062
1270 9062 -24989 -16762 14039 7624 -17796 -8583 13534 2065 -17508 -3356 10551 -9802 -23559
1283 -23559 2383 17796 -12194 -35818 -15613 5581 -2806 -5203 10382 -2013 -39770 -41023
1295 -41023 -423 15592 -8588 -17796 -1843 -7123 -30108 -21802 5030 -2078 -29225 -21340 4157
1308 4157 -6660 -34802 -24130 4915 -1208 -21698 -14508 -6505 -32222 -45195 -6271 27262 2218
1321 2218 -32246 -23715 -11361 -29453 -29184 8163 16572 -24482 -40343 -6668 4444 -25615 -27418
1334 -27418 5573 4384 -30542 -27716 2817 -7254 -34699 -9169 30307 6487 -41228 -33138
1346 -33138 -2394 -10171 -18116 15698 29729 -18219 -50408 -14764 16805 -3604 -16058 9428
1358 9428 9827 -25425 -25583 13901 17857 -14954 -12165 19534 9793 -28220 -22516 13688 15952 -1604
1372 -1604 10648 24014 -8954 -41063 -14366 29371 27275 2615 4263 8746 -11065 -17416 15478
1385 15478 36370 9882 -13052 3389 17296 -266 -6282 21102 32298 6442 -6231 12160
1397 12160 11673 -13223 -7152 35529 45556 9069 -10143 4115 5428 -5846 15393 47082 28613
1410 28613 -14928 -11450 21794 21410 3369 17439 33408 6243 -19647 5502 32092 13498
1422 13498 -2678 24580 38964 3826 -20502 2339 20960 8749 12903 38571 27502 -17404
1434 -17404 -22695 15790 30258 10797 9265 20811 3070 -20246 474 35176 25070 -4520
1446 -4520 -824 15826 2624 -14491 3634 25497 15217 726 10779 13462 -12309 -24159
1458 -24159 3964 29378 17005 -2355 -616 -1375 -14574 -8517 21280 26390 -5353 -23838 -6031
1471 -6031 8134 -1450 -1825 15543 11101 -15510 -19325 2305 3384 -14787 -8170 18884 14081 -16065
1485 -16065 -20559 -3545 -7239 -15931 4974 23110 -3508 -35642 -19430 10985 4317 -11272 421
1498 421 3441 -24166 -32684 720 17760 -7401 -19449 776 3517 -22844 -25852 -507 1825
1511 1825 -16532 -7909 13872 -2383 -34060 -25222 5769 5101 -12709 -8852 -1629 -19203 -28144
1524 -28144 -2215 17627 -1808 -24434 -16433 -5366 -13736 -15454 2027 6158 -11816 -17719 -2362
1537 -2362 -597 -19281 -22415 -1129 8068 -5511 -13185 -5087 -7486 -18979 -10077 11180 6394 -19322
1551 -19322 -23927 -4331 3159 -5027 -951 6978 -7189 -24420 -11427 9576 1416 -14930 -4490
1564 -4490 10597 -342 -14336 -3781 3663 -10141 -13153 9207 15675 -8287 -19089 421 10522
1577 10522 -809 -1889 8029 -1308 -18732 -7293 17945 14432 -5935 -5216 6643 571 -7746
1590 -7746 3335 12036 -424 -7350 8189 17372 2528 -9169 960 9478 4522 3391 10286
1603 10286 6417 -5592 -819 15999 17948 2993 -3939 1847 4545 4471 10745 16174 8224 -2112
1617 -2112 2572 13152 11181 1812 1745 8271 9984 8445 11626 11414 3365 -747 8626 16675 10489
1632 10489 845 2364 8998 10301 11421 14359 9718 -1451 -2154 9731 16039 9742 4058 6577
1646 6577 8710 7516 8814 10369 4733 -1716 3102 13638 13643 5331 2465 4793 6013 6290 8452 6837
1662 6837 -787 -2885 5737 13806 10612 2778 -249 449 1488 4430 7940 4488 -2368 -1488 6672
1677 6672 9197 3833 -1347 -3147 -2539 310 4790 5474 -329 -4964 -1586 3802 3951 -680 -5288 -7184
1693 -7184 -4552 1214 4907 1192 -5024 -7532 -4080 -771 86 -3385 -8027 -8365 -3613 1389 1160 -3903
1709 -3903 -8676 -9711 -6738 -2268 -1374 -5618 -10037 -8382 -3184 -658 -3376 -7710 -11743 -11448 -6341
1724 -6341 -701 -2253 -8554 -10913 -7916 -4649 -3961 -5667 -9378 -12848 -10559 -3569 -78 -4576 -10088
1739 -10088 -10890 -8508 -5690 -4203 -5609 -10700 -12120 -6506 -721 -1555 -6548 -10335 -10843 -8452 -3506
1754 -3506 -1515 -5327 -9688 -8565 -3512 -840 -2995 -6817 -10054 -10209 -4827 616 138 -5355 -8056
1769 -8056 -5768 -2257 -946 -2023 -5758 -8263 -5576 604 3881 716 -4608 -6375 -4175 -667 1685
1784 1685 144 -4088 -5014 -910 4065 4769 788 -3937 -5082 -1167 3695 4904 1830 -1356 -1298 1982
1800 1982 5286 5752 951 -3424 -2585 3396 7491 5875 2742 711 833 3533 6869 6396 976 -2239
1816 -2239 2749 8774 9724 6221 3412 554 545 5155 10161 7346 893 482 6148 10111 8592 6208
1832 6208 4268 1484 1658 7781 11603 7511 1386 3626 9286 9639 6196 4378 2924 1197 4616
1847 4616 11939 12487 4761 -798 3457 8557 8492 6054 5964 3709 694 4615 12320 11195 2416 -589
1863 -589 5225 7295 4365 3677 5665 3590 1528 7194 11785 4770 -5019 -2014 6802 7923 4294
1878 4294 5341 4569 -1809 -2366 7793 11854 1600 -6156 -680 5295 2118 1288 5931 3932 -4841
1893 -4841 -3425 5771 4530 -6316 -6160 4487 6822 -139 -1300 1805 -4228 -10068 122 10536
1907 10536 2414 -10859 -8246 1779 131 -3959 1329 2752 -8943 -13916 -1397 6267 -3101 -9397
1921 -9397 -706 3366 -6890 -10033 -1730 -1659 -11579 -7540 7393 4140 -14001 -15952 -1945 483
1935 483 -7592 -4244 1992 -8785 -19697 -7268 8908 1182 -12787 -8496 -1027 -9575 -14666 -1310
1949 -1310 4976 -8610 -13631 492 3988 -13303 -19422 -2694 4616 -6412 -8358 1345 -4654 -18796
1963 -18796 -11538 9328 7100 -11724 -13584 -2699 -5100 -11168 251 10826 -2574 -18100 -8376
1976 -8376 4642 -4063 -13548 -1175 9423 -2123 -11164 -1760 2325 -10141 -10983 8310 13038 -5411
1990 -5411 -15198 -2422 3735 -3272 1027 12471 3889 -17005 -13425 8322 10675 -2534 -482 9840
2004 9840 805 -12498 -3042 11940 4218 -6711 4728 15512 1131 -12976 -1259 12081 4797
2017 4797 -434 10368 9504 -10415 -12923 10793 21442 5460 -3100 5301 3869 -8831 -1298 19244
2031 19244 16683 -3232 -3241 11104 6722 -7050 466 16387 10978 -2364 3331 10858 -993 -9276
2045 -9276 8349 23433 9788 -6788 -1400 5962 -413 754 17930 20105 -1548 -12628 1942
2058 1942 11363 2617 2155 13131 11512 -4731 -5547 7934 8013 -3347 1533 15852 10037 -8038
2072 -8038 -7407 6699 7600 1111 7980 14213 -1399 -17306 -5940 14216 11988 272 2698 5187
2086 5187 -6925 -12202 4141 14893 2280 -7415 2981 7605 -6779 -10917 4887 10850 -2026
2099 -2026 -4802 5307 1190 -15138 -10444 12505 14612 -3849 -9526 -1267 -5420 -12557 1029 16902
2113 16902 5222 -14508 -9889 3307 -2457 -9612 1881 10085 -4035 -14065 -2178 4779 -7459
2126 -7459 -11735 4729 10310 -5952 -15463 -5000 -448 -6920 -2283 11085 4627 -16226 -18143 -1065
2140 -1065 4496 -3299 -2163 4472 -4278 -16247 -8465 6220 2030 -9783 -4969 4412 -2830 -13740
2154 -13740 -6581 4820 -163 -6786 986 4142 -10104 -17895 -2539 10552 2529 -6597 -1510 -2032
2168 -2032 -13185 -10532 7780 10412 -6739 -12098 493 2298 -8304 -5531 7715 3764 -9846
2181 -9846 -6176 6012 -723 -12149 -2654 12290 4866 -8893 -4570 1920 -6393 -8265 8337 14122
2195 14122 -3155 -14103 -2128 5718 -1471 -2424 7793 4949 -8811 -7285 7404 7112 -4775
2208 -4775 -2915 7839 4505 -6007 -2716 5066 1349 -3601 5228 12195 1438 -9846 -3468 6784
2222 6784 5039 1555 5483 5067 -4129 -5874 5395 10936 2773 -3496 1621 4827 340 17 6320
2237 6320 6145 -482 -494 7245 5811 -3064 -3495 5929 9044 3215 1825 4268 127 -4409 2308 11524
2253 11524 7381 -3125 -1946 4604 3867 867 5159 7037 -434 -4869 3788 8768 1773 -2812 3629
2268 3629 6873 880 -934 4011 2501 -3641 134 9481 7405 -2076 -3553 2159 2842 679 3836
2283 3836 5077 -1165 -5164 1027 7174 2966 -2048 -270 1168 -678 -442 3166 1756 -2577 -1687
2298 -1687 3599 3718 -922 -3827 -1974 27 722 1957 2002 -1905 -4543 -2321 2194 2648 -1045 -3861
2314 -3861 -3440 -1157 165 1004 253 -2339 -4231 -2765 790 1002 -2736 -4565 -2241 188 -252 -742
2330 -742 -1718 -4282 -5596 -1778 2052 86 -4484 -4864 -1910 -906 -805 -369 -1918 -5784 -5162 -373
2346 -373 2198 -1590 -4167 -3447 -2258 -2017 -671 -698 -3657 -5727 -2981 1304 548 -2435 -4031 -3454 -2524
2363 -2524 -822 578 -1071 -4438 -4073 -690 1546 198 -2120 -3731 -3609 -1748 1301 1009 -1369 -3545
2379 -3545 -2244 372 1173 389 -2059 -3515 -2103 574 1615 347 -1824 -2352 -1572 887 2249 543
2395 543 -2451 -2945 -109 2182 2471 737 -1321 -2241 -936 2114 2771 213 -2143 -1025 1221 2217
2411 2217 2281 534 -1578 -1863 622 3764 2832 -21 -1110 -40 1673 2728 2951 237 -1671 -797
2427 -797 2722 4055 2207 230 -766 -109 1790 3287 2628 -1 -1215 860 3637 3765 1868 -51
2443 -51 -860 286 2655 3731 1944 -709 -849 1812 3286 2915 1343 -628 -785 1122 3518 3818 1062
2460 1062 -783 -220 1843 3345 2411 390 -1361 -503 2359 3884 2854 36 -1159 -176 2063 2908
2476 2908 1918 -142 -654 457 1925 3214 1932 -892 -2024 31 2889 2599 559 -396 -914 99
2492 99 2012 3001 1139 -2244 -2259 1072 3083 1818 209 -76 -752 -1107 1425 3197 20 -3004 -1232
2509 -1232 2250 1606 -486 -617 -836 -1814 -751 2303 1637 -2250 -3780 293 2461 1265 -582 -680 -2138
2526 -2138 -3254 -52 3582 1387 -3530 -3283 611 915 -1046 -909 -672 -2277 -3034 703 2549 -1570
2542 -1570 -4412 -1656 2057 623 -1745 -1452 -1816 -3711 -1877 3231 2700 -3456 -6011 -1566 810 -753
2558 -753 -1022 429 -1362 -5243 -2625 2489 969 -4317 -3565 1024 586 -2998 -1867 77 -2490 -4036
2574 -4036 1115 3455 -2461 -7177 -3122 1893 -17 -1370 637 -311 -6124 -5246 2625 4078 -2378
2589 -2378 -4800 -7 1020 -2978 -2024 2223 279 -4423 -1540 3582 264 -6123 -3058 3225 2652
2604 2652 -1834 -112 1066 -3995 -5690 2405 7201 993 -5198 -1643 1374 -1410 -1651 3714 3503
2619 3503 -3525 -4375 2852 3793 -2746 -2581 3880 3867 -2224 -2146 2438 458 -4216 1526 8821 3937 -5695
2636 -5695 -3705 2874 2065 147 4473 5822 -2268 -6559 1410 6970 2014 -1666 2743 4250 -1941
2651 -1941 -2858 4109 4817 -1118 -512 6136 4861 -3933 -4626 3531 5399 1685 2160 4953 -134 -6391
2667 -6391 -815 8450 6738 -857 -921 2258 -509 -2556 3666 8030 2039 -3922 974 4870 -591
2682 -591 -3689 2946 6920 1809 -1968 1366 1888 -4164 -2754 7391 8796 -640 -5167 -460 1273
2697 1273 -1382 2313 8006 3014 -6943 -4886 4221 3544 -2097 859 5718 143 -6261 -2037 4121
2712 4121 174 -3400 2985 7021 -1447 -8360 -2621 3530 443 -129 5099 2472 -7460 -8412 2480
2727 2480 6846 37 -2894 1114 -1140 -7317 -3717 5478 4030 -3999 -3064 2538 -831 -7275 -3108
2742 -3108 4166 2464 -2945 -712 1310 -5245 -8606 231 8015 2266 -5520 -3917 -1280 -4373 -3861
2757 -3861 4576 6031 -3669 -8778 -2024 1909 -2895 -3393 3393 3264 -4856 -5775 497 32 -5908 -2138
2773 -2138 6285 3064 -6893 -6936 308 -7 -3427 2512 6280 -2359 -10829 -4646 5060 1869 -2729 808
2789 808 2491 -5268 -7731 1220 5592 -1996 -4229 2672 3051 -5832 -6870 2062 3560 -1949 -875
2804 -875 4382 -276 -8735 -4617 5972 5422 -1971 -1878 1441 -3194 -5927 1660 7980 1929 -5053 -1615
2820 -1615 2814 -1019 -3775 2461 5883 -493 -3871 1974 2575 -3881 -4000 4757 6987 -389 -3559
2835 -3559 95 833 -2216 1197 7774 4520 -4805 -4717 2527 3706 -189 1968 5385 710 -4715 0
2851 0 5217 1941 -2684 1889 6478 924 -4174 534 4310 364 32 5374 5419 -3172 -5186 2605
2867 2605 6455 1693 744 3748 988 -4064 -1041 6562 5125 -1573 -652 3900 1916 -2198 1067
2882 1067 4710 1822 -1512 2182 4352 -704 -3669 1747 5851 2630 -411 1184 806 -2559 -947
2897 -947 5016 5544 -590 -3100 380 1881 -149 1062 3303 1322 -2061 -1076 2644 1307 -1934 -1080
2913 -1080 2452 2080 -1068 -949 46 -738 -1426 1474 3628 -215 -4355 -2698 978 689 -66 452 166
2930 166 -3150 -3615 378 2671 -900 -3036 -1087 581 -1517 -2200 -179 -342 -2913 -2036 1426 162
2946 162 -3988 -4063 -416 661 -1414 -1421 -889 -2951 -4518 -1046 2078 -109 -3915 -2797 -821 -1387 -1972
2963 -1972 -291 -363 -3251 -3301 -376 385 -2274 -3336 -1496 -497 -1161 -1140 -1288 -2419 -3666 -1169 1003
2980 1003 153 -2508 -2983 -2236 -1220 -688 -31 -325 -2311 -2644 -1122 511 304 -1686 -2530 -1120 129
2997 129 -50 -612 -979 -1197 -1356 -194 1272 163 -1834 -1799 201 911 469 281 -274 -1325 -1222 1060
3015 1060 2359 258 -1687 -402 1276 574 825 1550 318 -1208 498 2649 2203 -496 -292 1300
3031 1300 1465 1271 1736 1408 -436 -820 2142 3205 1647 -34 439 1139 1110 2072 2634 638 -423 986
3049 986 2546 2776 1261 932 758 970 1822 2995 1879 459 248 1633 2628 2342 1611 636 454 1533
3067 1533 2462 2332 1148 339 735 1401 2398 2301 1183 -62 495 1797 2325 1621 637 295 251 1008 2345
3086 2345 1733 16 -140 908 1533 1632 1220 172 -561 -300 1304 2032 344 -584 -523 458 799 1533 695
3105 695 -489 -1553 68 1428 897 -695 -830 -721 -316 472 792 4 -1611 -1611 10 730 6 -1010
3123 -1010 -1303 -1212 -790 598 252 -1465 -2059 -1177 367 73 -632 -1047 -1848 -1514 -407 466 -555 -1810
3141 -1810 -2307 -979 -174 -138 -878 -1738 -1960 -1264 -513 -12 -1083 -2010 -1826 -1114 -22 -601 -1362 -2124 -1972
3160 -1972 -937 -323 -414 -1164 -2643 -2190 -391 190 -796 -1823 -1703 -1679 -1230 34 245 -1870 -2945 -1566
3178 -1566 376 -325 -1238 -1204 -726 -1297 -1022 321 -85 -2165 -2509 -114 1034 -431 -1005 -605 -934 -1451
3196 -1451 298 1641 -244 -2466 -1578 837 926 -509 -256 244 -998 -1352 997 1808 -694 -1939 378
3213 378 1614 161 -424 153 34 -814 76 2200 1071 -1733 -1509 1231 1903 853 448 919 -446
3230 -446 -1329 1037 2849 1373 -1091 -404 1763 921 -357 1001 1686 317 -377 1855 2453 -340 -1473
3247 -1473 998 2900 1473 539 1138 770 -790 261 3821 2865 -442 -1339 1378 1960 388 1239 3075
3264 3075 1311 -1136 315 3138 1355 -1112 541 3088 1467 -742 837 1746 -288 -506 3269
3279 3269 3828 -458 -2395 421 2132 1181 771 2653 1523 -2255 -1191 2705 3150 -340 -666 1882
3295 1882 1296 -1029 -449 2208 892 -1444 774 2894 50 -3225 -671 2537 1516 -189 1043
3310 1043 920 -2469 -3019 1606 4014 594 -2278 -309 344 -1653 -1261 2009 1873 -2221 -2488 756
3326 756 631 -2667 -2013 1965 1970 -1637 -1932 152 -1595 -3360 -60 3801 849 -4126 -3235 99 -541
3343 -541 -1353 935 2114 -2263 -4899 -1300 1638 -614 -2496 313 1007 -2113 -3531 -406 835 -2236
3359 -2236 -1646 2230 1546 -4202 -4561 120 1509 -817 -441 1465 -1758 -5554 -2677 3263 2071 -2355
3375 -2355 -1476 585 -1933 -4097 -132 3205 -568 -3386 -266 1794 -2146 -4412 670 3550 210
3390 210 -2220 341 84 -4250 -2759 3415 4454 -1410 -3329 -172 -520 -2598 274 4116 1386 -3613
3406 -3613 -2447 2092 566 -2536 326 3646 699 -3557 -892 1751 -681 -2283 2531 4515 -617
3421 -617 -4455 -914 1982 86 92 3851 2439 -3688 -4071 1809 3795 192 -141 2565 1029 -3696
3437 -3696 -1308 3521 2239 -1808 156 3405 662 -3542 -857 3460 2307 -783 1518 2558 -1986
3452 -1986 -4036 1713 5347 1968 -1763 499 1377 -2318 -1487 3838 4490 -904 -2713 1653 1954 -2207
3468 -2207 -1108 3913 2777 -1482 -951 2379 148 -3304 586 5131 2411 -2568 -1453 1658 -139
3483 -139 -1188 3229 4575 -998 -4168 -284 2707 643 -668 2564 2312 -2224 -2572 1718 2304 -1418
3499 -1418 -732 3112 1883 -2415 -2073 1340 1176 -863 1017 2906 223 -3852 -1502 2735 1886 -239
3515 -239 414 1363 -1859 -2635 1211 3450 589 -1997 -108 1293 -1165 -1978 1204 2292 -475 -1119
3531 -1119 756 589 -2764 -2212 1798 2774 -405 -1733 -30 -534 -2342 -71 2864 949 -2872 -2376
3547 -2376 628 86 -1411 317 1866 -649 -2796 -317 1611 -1092 -2428 769 2387 -702 -2690
3562 -2690 -890 108 -1397 -1185 1850 1390 -2476 -2958 -174 931 -834 -933 691 -1321 -2531 -855
3578 -855 1644 810 -1858 -1396 963 -92 -1919 -1087 39 -508 -1307 506 999 -1387 -2916 -986 1297
3595 1297 512 -716 -252 -694 -1710 -1338 915 1372 -688 -2135 -762 305 -830 -492 279 273 -1281
3612 -1281 -603 815 522 -1639 -901 908 864 -755 -781 114 -648 -1077 433 2017 6 -2023 -833
3629 -833 881 608 -352 616 631 -1062 -1186 1033 1650 -333 -1229 956 1000 38 -322 482 653 -856 186
3648 186 1533 855 -1122 -611 954 901 405 776 754 -591 -936 861 1981 661 -407 -76 349 878
3666 878 282 982 721 -122 -342 1110 1553 41 -594 258 759 1153 419 439 8 -266 461 1346 1355 -127
3686 -127 -405 129 557 495 818 863 219 -623 387 1311 896 -557 -674 592 891 390 426 330 -505 -252
3706 -252 776 1164 120 -989 -150 571 289 392 576 -167 -1138 16 1124 714 -352 -463 -119 138
3724 138 153 480 475 -594 -875 368 762 215 -586 -488 -380 -117 317 249 -412 -930 -779 427 594 -100 -429
3745 -429 -453 -547 299 396 18 -610 -793 -398 295 434 -116 -784 -992 -69 409 463 -347 -806 -823 -277 78 381
3767 381 -50 -812 -872 -96 -10 92 -31 -684 -1102 -139 447 39 -757 -988 -338 -61 -9 32 -372 -939 -684
3788 -684 145 390 -231 -1037 -615 -373 -79 201 -112 -527 -906 -480 467 266 -462 -570 -287 -440 -114 621
3808 621 -338 -1258 -795 20 266 165 -382 -396 -467 -57 250 -4 -542 -1010 -706 210 163 -84 -189 -756 -284
3829 -284 40 670 281 -568 -832 -303 189 496 -248 -546 -510 -173 272 662 94 -778 -866 18 758 699 -169
3850 -169 -382 -343 -350 253 765 316 -537 -440 453 969 204 -355 33 -70 -82 460 1314 217 -976 151 1072
3871 1072 1215 -169 358 159 -133 64 1512 1354 -72 -607 686 861 210 6 584 574 -348 420 1221
3890 1221 371 -869 -294 1375 1172 56 399 394 -283 -371 1339 1727 315 -847 92 898 612 236 853
3909 853 452 -418 -319 1039 837 -567 -615 973 1134 388 -178 441 85 -562 576 1498 453 -1252 -1010
3928 -1010 772 737 -21 306 851 -137 -1278 344 1361 809 -942 133 770 -210 -1070 -104 732 -399
3946 -399 -873 753 758 -1139 -1703 126 1503 -209 -440 360 -418 -1877 -514 1608 764 -1312 -1474 -40
3964 -40 188 -1152 -225 883 -251 -1807 -516 899 -866 -1739 -374 1369 21 -1435 -494 52 -1488
3981 -1488 -1483 1114 1343 -1292 -2242 -617 98 -598 -294 977 252 -2188 -1696 726 649 -1184 -743 758
3999 758 166 -1833 -1233 672 -105 -1534 236 1789 -467 -2717 -1023 1337 739 -600 376 732 -1843
4016 -1843 -2489 753 2304 59 -1486 180 522 -1546 -1197 1208 1302 -1182 -1054 1300 607 -2110 -992
4033 -992 1810 1458 -886 -519 835 -931 -2467 574 2923 1162 -1904 -715 658 -497 -737 1170
4049 1170 2506 -1023 -1925 284 1521 -634 -934 1489 2079 -576 -1350 817 621 -1149 91 2564
4065 2564 1489 -2023 -1755 1196 803 -285 1121 2470 -177 -2770 -467 2246 1341 -907 534 1615
4081 1615 -688 -1798 770 2032 -282 -923 1404 1586 -1366 -1989 1177 2143 -224 -211 1651 542
4097 542 -2336 -1011 2377 2575 -395 -945 882 -281 -1550 472 2996 894 -1670 -319 1355 68
4113 68 -1492 726 2184 227 -1281 564 911 -1317 -1467 1755 2492 -391 -1963 -7 614 -763
4129 -763 32 2172 1305 -1989 -1707 1072 1310 -623 165 1686 290 -2049 -553 1291 332 -1203 282
4146 282 2150 -450 -2478 -681 1055 -96 -575 1438 1140 -1536 -2468 544 1756 224 -726 534
4162 534 -110 -1901 -1078 1499 1010 -1129 -788 972 110 -1729 -705 1219 764 -960 -26 645 -1003
4179 -1003 -2343 -175 1973 348 -1398 -759 -27 -1187 -1134 773 1534 -839 -2092 -392 552 -699
4195 -699 -1011 533 479 -1392 -1318 150 382 -1206 -624 1087 623 -1046 -1252 -453 159 -787 314 1354
4213 1354 -123 -2346 -1310 934 451 -506 189 214 -800 -1604 291 1433 -229 -1094 260 915 -684
4230 -684 -1152 343 905 -639 -668 988 558 -1609 -1083 1053 1489 -316 -497 609 -296 -1050 401 1445
4248 1445 707 -1077 -414 878 -173 -380 604 1212 -272 -713 213 936 -255 -663 839 1332 187
4265 187 -331 283 310 -151 -59 1127 1037 -113 -879 570 1083 456 223 722 297 -978 -148 1019 779
4284 779 -428 109 1152 646 -263 -9 667 401 -251 718 1551 166 -1041 -29 1421 639 -75 434
4302 434 563 -520 -477 1101 1356 -400 -697 320 592 -145 49 632 186 -478 106 1030 92 -702 -343
4321 -343 1037 556 -374 188 298 -134 -677 580 824 -79 -1052 40 119 -157 -23 683 -27 -957 -286
4340 -286 302 85 -309 -327 -285 29 -231 17 -85 -296 -708 -30 467 -298 -688 -651 -187 -216 -70 216 -371
4361 -371 -649 -467 -212 334 -378 -635 -659 88 217 -147 -315 -3 -568 -633 98 41 -123 -937 -513 101 18
4382 18 -224 -78 -465 -441 -443 253 142 -324 -751 -209 -2 10 180 2 -700 -823 -49 544 -41 -808 -564 -86
4404 -86 -29 -276 64 -582 -663 -186 384 80 -208 -17 -105 -352 149 227 42 -576 -413 -256 682 161 165 -179
4426 -179 -306 -154 340 253 11 -220 -105 398 413 401 16 -112 -64 169 360 340 -125 -69 304 309 162 274 112
4449 112 -341 225 493 220 96 -101 -104 -16 438 755 362 -172 -8 333 185 467 171 -78 -176 242 449
4470 449 336 -184 -415 87 337 211 238 247 181 68 126 1009 85 -146 86 113 131 350 475 21 -220 -223 627
4493 627 452 216 -70 192 -3 64 672 363 -249 -178 257 455 353 -188 -99 -192 226 261 270 -93 -464 90
4515 90 60 519 580 -40 -187 -43 105 590 108 -101 -230 -331 491 266 186 -243 145 203 -250 138 345 -183
4537 -183 -699 293 429 450 -471 -175 143 -256 -63 577 447 -513 -744 380 363 357 -109 -116 -134 -428 -245 453
4559 453 -137 -598 -155 469 146 -514 -102 -120 -678 -84 421 485 -690 -948 -340 377 -167 -578 -305 -6
4579 -6 -509 -387 293 369 -563 -888 39 -92 -259 -578 -108 -100 -345 274 212 -181 -790 -605 155 315 -154 -379
4601 -379 -190 -288 -838 37 873 -359 -970 -134 238 -117 -434 -82 215 -612 -404 68 488 -549 -881 59
4621 59 257 -376 -526 337 12 -857 -132 843 69 -708 -783 207 462 -475 86 622 -289 -1010 -4 811
4641 811 98 -614 265 893 -183 -1023 249 609 -451 -438 759 1050 -709 -1141 267 734 280 59
4659 59 645 466 -905 -280 1181 615 -493 107 701 245 -657 206 1100 276 -636 223 835 -235 -971
4678 -971 225 1302 240 -114 355 162 -666 -590 1266 1219 -184 -1100 490 427 -346 -28 1242 666 -674
4697 -674 -763 902 631 -837 137 1107 493 -693 -370 768 -219 -367 640 1673 -163 -1415 -452 494
4715 494 178 19 759 724 -939 -963 498 1409 -8 -386 514 278 -965 -631 956 897 -376 -176 1382
4734 1382 213 -1556 -656 1173 824 -424 183 561 -618 -1393 87 1733 414 -771 -32 301 -662
4751 -662 -738 944 880 -635 -906 355 211 -993 -570 959 893 -522 -626 514 171 -990 -230 1584
4769 1584 890 -1050 -574 153 -218 -880 510 1296 -247 -1418 -656 849 64 -591 481 664 -654
4786 -654 -1141 90 438 -366 -403 671 939 -1177 -1166 279 793 -308 -93 600 -86 -1540 -818 927
4804 927 674 -306 -208 240 -512 -1151 156 901 217 -934 -324 540 -487 -1242 132 562 364 -630 297
4823 297 165 -1004 -605 509 1052 -222 -747 -140 133 -585 -68 1129 811 -992 -1054 453 236 -392
4841 -392 39 963 295 -1001 -279 530 -449 -752 669 996 309 -1632 -427 347 -57 -266 695 573 -783
4860 -783 -1297 138 846 100 -321 474 479 -587 -523 640 821 -400 -83 834 368 -803 -363 559 351
4879 351 -227 50 664 -154 -1027 -274 1064 652 -18 -38 621 -125 -734 758 956 -151 -440 101 703
4898 703 -308 -489 420 623 -55 -475 495 802 -595 -136 1129 559 -441 -599 620 -155 -513 225
4916 225 1090 277 -1081 -454 722 438 -91 510 543 -202 -463 127 947 -374 -533 614 575 -57 -456
4935 -456 248 398 -87 -50 786 -40 -796 -325 651 495 104 26 557 -123 -668 145 742 95 -605 146 456
4956 456 71 -233 25 525 -162 -555 -7 417 -317 -449 295 368 -148 -177 43 377 -689 14 372 491
4976 491 -526 -594 -64 -14 -21 -56 264 -337 -538 -248 192 3 -241 -181 165 -31 -455 -135 101 -249 -323 87
4998 87 107 -284 -657 -118 30 127 -391 -5 -105 -397 -417 180 210 -329 -337 -370 42 -376 109 -33 -247 -608 109
5021 109 483 -129 -542 -25 144 211 -285 -103 -54 -297 -188 2 61 26 -390 -91 122 -33 343 -172 -258 -106
5043 -106 32 79 -323 -199 -431 -148 235 31 15 -250 -49 -76 72 310 242 -97 -238 -93 192 23 -306
5064 -306 39 277 -335 119 133 145 -9 -60 43 -177 156 199 9 -249 -131 439 33 -139 -95 -212 430 342
5086 342 208 105 -373 -102 186 189 319 -253 11 183 -52 155 72 210 -437 108 254 123 126 182 -14 74
5108 74 78 275 202 -202 -110 -69 201 163 61 -156 -225 144 166 321 18 -98 34 -193 -22 355 227 -267 -62
5131 -62 -59 184 1 -13 -168 -46 225 458 382 131 -216 67 268 127 -40 11 54 -43 286 336 183 -99 119
5154 119 373 354 51 155 19 -96 -207 6 239 -318 -137 105 0 -53 -132 284 18 -209 79 113 -3
5175 -3 -132 243 55 265 147 -106 65 -219 -170 262 141 235 168 72 -54 -5 207 -33 -264 -184 38 176 -38
5198 -38 61 -85 82 -140 43 172 -224 16 -270 -206 118 -94 -228 -171 34 -25 -49 91 -72 -180 -594 -44
5220 -44 438 -148 -118 15 -216 -248 -271 122 43 -502 -439 80 -207 -382 -287 217 93 -463 -38 -79 -435 -516 -115
5243 -115 374 76 -367 138 121 -555 -90 297 44 -623 -414 94 3 -142 -96 42 162 -477 -105 310 80
5264 80 -201 -144 444 186 25 -84 364 -274 -191 329 448 -297 -406 -136 358 31 -16 260 138 -534 -192
5285 -192 27 294 -83 -229 177 436 -208 -234 230 155 -5 164 317 21 -538 -173 697 580 -147 47 368
5306 368 -180 -226 248 607 241 -277 -174 715 -129 -366 88 564 48 156 321 310 -481 -438 606 753 79
5327 79 -81 475 20 -509 123 776 398 -299 -264 175 -21 -354 267 476 0 -595 122 558 -157 -447 564
5348 564 558 -128 -357 228 279 -263 -61 677 696 -635 -267 -21 158 120 200 610 68 -848 -546 675 256
5369 256 -299 152 307 -194 -705 -92 514 9 -338 305 666 -755 -727 31 822 122 -102 179 314 -418
5389 -418 -474 358 648 -538 -407 89 314 -535 -195 865 472 -263 -222 218 -21 -859 2 646 164 -526
5409 -526 -55 205 -59 -596 659 926 -126 -786 -458 185 -477 -235 346 295 -674 -873 435 390 -109 -364
5429 -364 430 320 -546 -174 451 97 -383 -55 513 165 -825 -294 678 214 -189 476 335 -224 -473 148
5449 148 719 305 -630 -86 238 -383 -616 253 617 -272 -663 35 387 -555 -276 369 444 -372 -335 246 -273
5470 -273 -750 -339 828 652 -392 -227 85 -184 -426 168 879 -113 -576 -424 490 -170 -287 324 800
5489 800 -192 -788 -24 330 -290 -135 337 635 -634 -691 211 431 57 227 738 -45 -646 -502 524 231
5509 231 -302 -269 311 -163 -558 -260 622 -134 -213 196 406 297 -766 129 960 217 -210 270 308 -446 -419
5530 -419 194 676 -329 -608 382 129 -588 -245 531 721 -380 -267 395 264 -337 97 429 385 -75 -137
5550 -137 278 33 -305 180 827 400 -476 -330 158 61 101 556 433 -194 -493 232 443 103 -248 324 286
5571 286 -522 -50 222 91 -529 30 682 81 -592 -306 208 16 -348 -17 511 -92 -540 64 520 108
5591 108 -401 10 -132 -81 -131 185 525 -70 -474 178 338 86 -169 350 55 -201 -21 361 37 -599 -207
5612 -207 250 503 -159 -70 124 -71 -324 219 413 24 -363 -195 163 -74 -312 -55 42 -34 -235 -96 74
5633 74 -351 -225 -441 358 -186 -169 147 -79 -153 50 114 -104 -132 -416 238 224 38 -41 215 -29 -8 188 170
5656 170 144 -323 -89 -102 -32 -84 -220 -61 -165 -119 164 204 -297 -263 230 349 -134 -88 39 -143 -159 -45 433
5679 433 169 -285 -168 -99 8 111 -98 401 -186 -532 -55 105 -78 84 64 71 177 2 -171 79 -112
5700 -112 -243 100 154 -92 -67 -242 318 145 22 17 -127 -291 44 53 -238 -291 -231 153 214 -76 123 -74 3
5723 3 34 84 -45 -155 112 -230 70 -73 92 74 -18 -168 140 276 23 242 102 13 223 38 -134 94
5745 94 54 -76 -47 220 233 23 67 -119 139 253 -25 -70 -175 58 11 234 27 -130 -211 -186 90 -234 -184
5768 -184 219 -246 -61 101 63 -28 -272 -58 -106 137 -126 82 123 101 -279 263 198 -94 -12 -145 -116 -134 284
5791 284 -73 306 116 97 97 82 -45 -106 -92 191 250 185 79 -26 -303 14 -273 105 -194 0 -346 199 193
5814 193 23 -94 215 -65 141 290 -41 -236 -147 294 -307 41 332 -187 -293 100 -131 132 32 -457
5834 -457 231 56 2 -71 -87 122 -385 22 129 -45 -163 -109 -74 -283 487 391 -36 -98 -11 254 -42 -30 -142
5857 -142 -164 32 68 205 179 -160 -163 -57 313 149 104 -68 -479 86 -107 315 -214 -236 29 56 -183 63 49
5880 49 -354 6 203 50 90 28 50 74 -60 310 -78 53 -59 135 -3 -37 262 69 -380 -184 147 -58
5902 -58 -71 96 295 -8 88 53 -48 -99 -218 167 329 -22 -297 -70 -24 -174 36 32 222 -79 -116 -93 336
5925 336 -48 -38 298 34 -264 115 191 162 -87 -97 491 -117 -233 -35 220 -215 17 253 310 -320 -131 0
5947 0 270 -34 -44 167 259 -122 -9 471 334 -258 -108 77 111 -112 -168 408 102 -165 38 394 -240 -84
5969 -84 179 408 52 176 -145 15 -91 -4 292 305 -313 -253 244 460 63 -213 448 -52 -292 -170 198
5990 198 -35 -572 -99 461 78 -268 -81 -292 26 -247 -19 375 39 -540 -31 274 148 -167 275 344
6010 344 -113 -472 337 63 -187 -195 40 155 -233 -237 82 211 -256 -356 180 -56 -558 -91 66 404 -110
6031 -110 -29 170 193 -421 244 549 -173 -324 40 -41 -209 -40 117 371 59 -194 143 149 -36 -112 331 434
6053 434 13 -266 -166 164 70 -254 563 527 -442 -194 195 -161 -135 -50 251 -102 -168 -131 416 117 -119 141
6075 141 278 -100 -369 81 502 117 -214 575 188 -261 -664 263 368 67 -119 -324 -58 -527 -166 487
6095 487 514 -142 -258 264 34 -334 -46 467 310 -336 -391 325 -266 -246 -260 587 276 -176 84 266 -199
6116 -199 -242 299 440 -76 -382 89 342 89 -162 213 104 -123 -257 336 53 -85 -464 604 137 -351
6136 -351 -321 92 298 -453 63 385 -182 -675 -154 477 91 -22 129 367 -202 -555 160 249 -157 -35 179
6157 179 155 -409 -299 262 507 -201 -344 292 178 -153 -429 316 -21 -463 133 333 -45 -800 -119 360
6177 360 237 -295 -281 14 -266 -435 257 481 -78 -279 -233 295 -127 -367 279 187 -72 -445 207 210 -226 -178
6199 -178 348 226 -472 -489 68 36 -113 -63 210 69 -645 -90 476 206 -427 11 341 -403 -280 5 -13
6220 -13 -63 -295 85 244 -326 -416 -246 224 -112 -35 375 345 -86 -456 387 -35 -51 -78 -3 -37 -399 2 501
6243 501 -55 -404 -16 226 -15 -302 -57 122 -129 -208 326 58 -168 -342 206 351 -253 -234 -41 -40 -300
6264 -300 -218 433 49 -20 89 42 -28 -94 -465 317 114 -122 56 -33 185 47 -11 479 179 -372 253 355
6286 355 -449 -169 345 372 65 -309 -122 436 -92 181 299 90 -110 -164 385 32 -203 -232 238 -95 0
6307 0 -464 40 58 -123 -194 242 -39 -416 -117 -20 99 -183 41 49 50 -108 266 142 45 19 186 -101 13 -43
6331 -43 216 -54 81 -141 135 201 70 164 72 143 -48 -266 138 275 -7 240 150 -31 -195 -18 204 240
6353 240 -57 -299 -50 -235 44 154 238 -70 28 -150 395 70 -52 -296 221 -314 -145 226 -70 33 -18
6374 -18 13 175 -191 73 131 -30 -207 -55 222 -42 -135 41 16 219 -91 -103 47 -291 202 1 106 148
6396 148 134 190 22 229 21 14 -118 -164 218 217 -87 -7 -192 -157 181 70 28 -63 -138 -193 -50 95 -63 50
6420 50 31 14 -152 -266 -2 -16 289 243 212 -121 118 32 -47 265 187 -57 -303 -35 123 -267 174 345 64
6443 64 3 61 69 115 -44 113 121 16 137 -123 -57 -159 -153 45 350 -175 -41 257 -93 -10 -96 231 211 21 73
6468 73 -140 182 261 -47 -133 -373 160 167 -48 -71 116 74 -247 -184 45 161 -122 -184 -116 9 -28 -18 -345 -299
6492 -299 -22 288 5 -110 -25 -203 -124 -174 -99 -120 -115 112 115 -83 45 82 72 -113 91 312 -74 -29 -170 182
6516 182 -77 -135 217 -117 -46 -16 95 126 -283 -140 -19 19 286 229 252 -254 -200 260 -128 -15 -180 -66 -24
6539 -24 174 -99 1 215 119 54 130 -38 167 1 111 169 -99 82 274 30 -54 79 -55 -63 204 -36 98
6562 98 16 -308 -17 -92 -210 -162 24 284 308 235 144 -143 95 213 -202 193 -302 -146 -5 -164 243 -42
6584 -42 104 -80 -85 -90 145 53 -107 -240 121 150 -126 -262 -134 103 195 78 121 76 -325 51 82 -230 -33 -260
6608 -260 62 -39 -248 -82 -182 19 -503 184 254 -67 -63 77 14 -92 26 366 26 -345 -113 105 323
6629 323 -440 -316 73 11 -374 23 207 265 -94 28 236 17 -154 55 163 -296 -271 85 109 -264 -363 127
6651 127 -39 174 -380 -65 68 -144 109 196 297 -170 -77 249 186 -168 124 146 21 77 26 -176 -122 -274
6673 -274 59 117 92 -62 59 -42 -74 -271 191 73 -126 -459 159 -164 187 -170 154 235 52 -4 217 186
6695 186 -106 88 219 153 -68 -26 288 -369 -262 17 64 -62 -245 117 160 -71 -44 191 43 -308 -406 61
6717 61 240 -82 -163 229 105 -144 -78 284 249 -184 -160 6 144 -428 -267 197 353 11 -68 170 -94 -222
6739 -222 178 141 72 -131 12 200 -87 -259 0 202 -200 -316 120 59 -313 15 -61 272 -376 -247 95
6760 95 22 -43 20 207 516 -216 -94 433 110 -441 48 315 217 -269 -288 582 -257 -85 120 125 -25 -42 -91
6783 -91 351 126 3 349 -13 -150 -137 281 3 55 -378 -17 139 -498 -110 100 235 -52 -209 129 97
6804 97 -338 74 322 285 -324 133 43 -129 -267 -44 24 69 -355 41 128 -360 -285 221 172 -34 -170 -154 -67
6827 -67 -118 -30 491 131 -191 -163 274 59 -259 141 259 198 -234 -145 22 223 -336 -75 -13 -240 -103 -18 -4
6850 -4 -204 -158 141 536 -126 -411 -53 431 -118 149 72 49 -29 -767 243 279 -278 -383 25 135 -412 133
6872 133 94 -55 -272 3 189 -155 -402 -71 94 -14 -121 -73 231 -292 -349 325 45 -78 -123 142 62 154
6894 154 -240 93 159 -65 21 -106 161 -15 -56 162 73 -122 -496 189 16 -201 162 310 -234 -187 267 377
6916 377 -45 32 -18 376 45 -109 -137 338 -326 -130 89 236 250 -314 35 69 16 82 218 109 22 -40 -100
6939 -100 48 -31 -51 180 -27 58 73 -142 14 33 130 -123 12 109 153 122 86 -84 -5 150 201 269 -30 223
6963 223 45 -203 267 -10 -138 -64 56 -93 -31 -158 -66 107 -94 -65 235 -140 -233 -56 -9 -16 -122 74 134
6986 134 -53 -49 11 75 42 -92 -30 -58 28 -186 -74 40 -55 -101 63 17 -51 -49 85 18 289 -231 -10 66 -298
7011 -298 -334 -255 292 -59 54 19 -57 36 -188 166 39 -92 246 226 73 -31 -209 41 -64 -53 97 195 100
7034 100 -46 -107 7 -351 64 196 -51 -50 -82 -11 270 184 -236 -107 27 -159 -5 61 9 -227 101 139 -182
7057 -182 -52 126 151 20 -158 -166 90 141 -305 -8 26 4 30 81 -45 295 104 -138 470 31 -144 128 -30
7080 -30 131 104 -88 204 -136 -11 25 -32 -88 -104 40 144 -368 43 -194 -317 66 317 193 -77 -125 -23
7102 -23 48 58 96 -26 57 138 -276 -166 65 80 -277 94 19 99 -154 133 -284 -181 56 -207 241 -210 -307
7125 -307 93 141 -130 94 -2 -469 -92 186 64 -152 -103 240 65 -35 -210 28 66 83 178 38 -50 309
7147 309 172 183 -250 117 124 298 -351 218 245 -23 14 115 123 3 -38 54 101 155 207 249 -93 0 157 127 -109
7172 -109 72 -77 -59 -259 -29 79 153 132 -90 45 -349 4 -107 133 8 -121 31 -98 -91 138 -215 4
7194 4 -299 94 171 11 3 11 -174 44 67 107 -276 152 165 17 -163 90 90 -5 29 70 216 -101 183 -128 -176
7219 -176 129 75 46 349 -126 66 114 93 118 -221 -70 -101 -187 -297 -182 63 -116 -319 96 -18 298 -16
7241 -16 -173 -279 -11 -6 143 141 -51 101 -5 -118 -106 -8 -105 15 -26 -157 157 -39 -69 123 10 155 -90
7264 -90 -15 459 321 -192 410 152 277 41 31 -35 15 -163 -191 27 134 469 -84 272 -94 -230 -253 -161 -155
7287 -155 -60 28 -52 -235 113 109 -181 -43 24 224 94 30 136 -78 223 -347 102 50 -94 -172 -168 -157 -90 -99 117
7312 117 307 -69 45 -40 228 -104 -15 253 91 -23 -81 -41 87 -96 -54 317 -6 -127 -119 196 178 -81 28
7335 28 323 345 -26 -164 272 -127 -91 91 363 -10 -211 229 373 -131 -56 -114 145 -209 -126 11 -55 221
7357 221 50 89 135 -394 -300 14 254 86 -113 252 66 -235 -23 306 89 193 -53 154 5 -107 30
7378 30 145 -229 -255 26 53 -1 -96 160 269 289 -33 83 115 -7 23 127 250 -169 -134 126 243 -99 12
7401 12 172 -93 -233 -207 143 10 -88 -57 479 -49 -345 -40 218 36 -194 66 232 79 -203 21 176
7422 176 -100 -227 93 80 -305 -74 62 235 -391 -3 353 40 -319 207 5 58 -87 172 222 -36 -223
7443 -223 48 254 102 -189 -216 -10 84 -90 -203 183 -95 59 182 539 -278 -122 405 260 -95 19 64
7464 64 137 -186 -58 258 255 -394 295 111 332 135 -51 223 -59 -73 -100 -78 -328 36 199 197 -181 -79 -307
7487 -307 -20 -191 -356 -43 33 -206 -39 209 -260 -249 -13 55 -81 -207 -53 78 -37 -280 -170 190 -255
7508 -255 -14 19 182 170 -83 69 239 -110 2 233 258 207 -355 71 165 140 -357 118 44 -175 -153 244 -38
7531 -38 -210 -144 106 433 -104 -119 -129 -15 -321 -17 248 67 -101 -216 -14 -121 -4 -125 28 119 -436 83
7553 83 238 74 91 237 256 -287 -230 367 403 -316 -113 254 -248 -367 -69 -150 186 -59 89 236 -67 -168
7575 -168 -164 -5 190 278 89 -79 51 -358 43 278 -266 -8 162 58 -25 -333 -175 -105 -167 -359 -241 -204
7597 -204 106 -313 31 112 -205 13 148 -144 -393 14 134 122 -190 -246 414 44 -183 -39 103 -236 -20
7618 -20 -5 351 265 80 81 95 -35 -174 -101 -177 -81 93 352 108 -6 -14 -123 7 222 -315 -2 -136 -85 -23
7642 -23 -114 -99 106 53 287 -180 -62 264 32 11 33 67 256 -102 -100 -9 15 -80 130 39 49 19 -62 27 69 3
7668 3 -75 64 -166 181 188 209 54 -148 169 70 105 -146 236 409 298 2 20 -113 -17 -113 40 168 94 -90
7692 -90 -82 231 20 26 124 155 59 -253 -159 -80 4 -27 88 -79 -191 78 208 141 379 2 -180 123 -247 200
7716 200 65 40 101 127 58 10 -330 -456 -325 8 -95 -195 13 -179 117 263 202 141 64 23 -28 -231 -265 55
7740 55 69 287 60 -119 49 -221 -110 287 -65 -30 -82 203 -155 297 124 -100 49 -101 -21 172 -59 -208
7762 -208 255 140 -90 -355 194 52 -222 -247 179 62 54 -19 -31 45 4 -278 105 50 125 -32 -60 44 95 258
7786 258 124 -238 -128 -18 86 181 -59 -75 87 161 -36 322 126 260 -301 -40 285 73 209 -115 40
7807 40 -263 -72 -297 104 -25 -150 171 147 276 -72 18 22 -390 82 194 -22 -21 -68 62 130 109 -239 -331 334
7831 334 -42 -105 32 96 76 121 195 53 291 39 8 181 -11 -135 -102 18 26 -198 -196 -377 252 -63 -106 171
7855 171 -67 87 -26 -73 -41 40 -62 115 -77 35 -223 46 -80 -73 157 196 -20 63 -72 39 -21 181 186
7878 186 95 25 147 -414 167 304 32 -198 26 -22 122 -29 38 -67 -365 164 15 -11 141 -26 40 16
7900 16 15 86 8 -58 -133 52 -38 -98 61 -97 -23 104 -177 -200 -90 -63 -497 10 153 73 -188 102 335 155
7924 155 127 135 364 -206 82 135 170 -75 79 -234 192 -191 -27 63 -192 179 -51 -131 224 242 -161 -4 -119
7947 -119 166 -137 61 40 79 -174 -67 -75 35 19 -66 -53 -189 -240 190 -114 -364 -157 307 73 0 -71 134
7970 134 89 -245 -158 22 180 -71 183 77 -50 21 -31 -102 256 186 289 396 137 -14 148 231 -139 -181 90
7993 90 -216 -8 47 223 -51 49 -146 515 -30 -175 -223 66 276 69 42 190 -104 -346 99 22 -148 19
8015 19 -52 56 -163 -47 -108 90 51 -366 49 113 53 -84 54 114 -186 16 -11 67 -203 -106 185 -35 38 -213
8039 -213 -120 -137 83 143 -92 26 -54 -179 237 168 -298 55 -46 167 -436 6 170 -81 95 -166 238 -187
8061 -187 -292 13 151 -312 -97 106 -198 -437 80 244 -62 -128 209 -4 -28 87 38 -162 -153 -330 -131 213
8083 213 50 126 -94 163 204 -153 322 38 -184 -25 -73 -190 -189 -175 52 -157 -48 121 415 -42 -283 -179
8105 -179 150 -81 -170 241 177 -255 -61 186 -12 -181 -297 538 -175 101 11 100 233 74 46 -130 -85 -282
8127 -282 41 234 219 -164 -188 7 248 -15 251 167 32 -85 96 149 38 -330 92 224 -132 264 290 213
8149 213 -328 -19 61 261 -153 -87 -106 253 73 -94 -50 138 -135 -8 337 153 -15 233 194 118 -207 106
8171 106 314 -16 143 -107 115 12 -266 -164 68 -124 -51 -114 51 -100 -194 604 319 21 59 -114
8191a14
##END NTUPLES=NMR FID
##END=
