##TITLE=1H_LR-692-RM2
 CDcl3, 8 sc, 
 15.10.2019
##JCAMPDX= 6.0         $$ Bruker NMR JCAMP-DX V2.0
##DATA TYPE= NMR FID
##DATA CLASS= NTUPLES
##ORIGIN= UXNMR, Bruker Analytische Messtechnik GmbH
##OWNER= root
$$ XWIN-NMR		Version 3.5
$$ Tue Oct 15 14:06:17 2019 Russian Standard Time (UT+4h)  she@DPX200
##.OBSERVE FREQUENCY= 200.1315
##.OBSERVE NUCLEUS= ^1H
##.DELAY= (6, 6)
##.ACQUISITION MODE= SIMULTANEOUS
##.ACQUISITION SCHEME= undefined
##.AVERAGES= 8
##.DIGITISER RES= 18
##SPECTROMETER/DATA SYSTEM= spect
##.PULSE SEQUENCE= zg30
##.SOLVENT NAME= CDCl3
##.SHIFT REFERENCE= (INTERNAL, CDCl3, 0, 15.7039)
##AUDIT TRAIL= $$ (NUMBER, WHEN, WHO, WHERE, WHAT)
$$ ##TITLE= Audit trail, XWIN-NMR		Version 3.5
$$ ##JCAMPDX= 5.01
$$ ##ORIGIN= Bruker BioSpin GmbH
$$ ##OWNER= she
$$ F:/spectra/data/she/nmr/H-F/1/audita.txt
$$ ##AUDIT TRAIL=  $$ (NUMBER, WHEN, WHO, WHERE, WHAT)
(   1,<2019-10-15 14:05:03.31 +0400>,<she>,<DPX200>,
      <created by zg, POWCHK disabled, PULCHK disabled
       configuration hash MD5:
       00 E9 B6 7A A2 85 ED C7 34 08 36 98 17 FE 4E 26
       data hash MD5: 16K
       64 FB E1 63 BC 61 1F 02 6E 46 FB AD 0A BD ED 06>)
$$ ##END=
$$ 
$$ hash MD5
$$ 2A 56 12 0C A4 4F B0 89 CF D8 E2 D3 F2 79 AB 1B
##$RELAX= 
##$RELAX= 
##$RELAX= 
##$RELAX= 
##$RELAX= 
##$RELAX= 
$$ Bruker specific parameters
$$ --------------------------
##$DU= <F:/spectra>
##$EXPNO= 1
##$NAME= <H-F>
##$PROCNO= 1
##$TYPE= <nmr>
##$USER= <she>
##$AMP= (0..31)
100 100 100 100 100 100 100 100 100 100 100 100 100 100 100 100 100 100 
100 100 100 100 100 100 100 100 100 100 100 100 100 100 
##$AQSEQ= 0
##$AQ_mod= 1
##$AUNM= <au_zg>
##$AUTOPOS= <>
##$BF1= 200.13
##$BF2= 200.13
##$BF3= 200.13
##$BF4= 200.13
##$BF5= 200.13
##$BF6= 200.13
##$BF7= 200.13
##$BF8= 200.13
##$BYTORDA= 1
##$CFDGTYP= 0
##$CFRGTYP= 5
##$CHEMSTR= <none>
##$CNST= (0..31)
1 1 145 1 1 1 1 1 1 1 1 1 1 1 1 1 1 1 1 1 1 1 1 1 1 1 1 1 1 1 1 1 
##$CPDPRG= <>
##$CPDPRG1= <>
##$CPDPRG2= <>
##$CPDPRG3= <>
##$CPDPRG4= <mlev>
##$CPDPRG5= <mlev>
##$CPDPRG6= <mlev>
##$CPDPRG7= <mlev>
##$CPDPRG8= <mlev>
##$CPDPRGB= <>
##$CPDPRGT= <>
##$D= (0..31)
0 1.2 0 0 0 0 0 0 0 0.06 0 0.03 0 0 0 0 0.0002 0 0 0 0 0 0 0 0 0 0 0 0 
0 0 0 
##$DATE= 1571133902
##$DBL= (0..7)
120 120 120 120 120 120 120 120 
##$DBP= (0..7)
150 150 150 150 150 150 150 150 
##$DBP07= 0
##$DBPNAM0= <>
##$DBPNAM1= <>
##$DBPNAM2= <>
##$DBPNAM3= <>
##$DBPNAM4= <>
##$DBPNAM5= <>
##$DBPNAM6= <>
##$DBPNAM7= <>
##$DBPOAL= (0..7)
0.5 0.5 0.5 0.5 0.5 0.5 0.5 0.5 
##$DBPOFFS= (0..7)
0 0 0 0 0 0 0 0 
##$DE= 6
##$DECBNUC= <off>
##$DECIM= 24
##$DECNUC= <off>
##$DECSTAT= 4
##$DIGMOD= 1
##$DIGTYP= 9
##$DL= (0..7)
0 120 120 120 120 120 120 120 
##$DP= (0..7)
150 150 150 150 150 150 150 150 
##$DP07= 0
##$DPNAME0= <>
##$DPNAME1= <>
##$DPNAME2= <>
##$DPNAME3= <>
##$DPNAME4= <>
##$DPNAME5= <>
##$DPNAME6= <>
##$DPNAME7= <>
##$DPOAL= (0..7)
0.5 0.5 0.5 0.5 0.5 0.5 0.5 0.5 
##$DPOFFS= (0..7)
0 0 0 0 0 0 0 0 
##$DQDMODE= 0
##$DR= 18
##$DS= 0
##$DSLIST= <SSSSSSSSSSSSSSS>
$$ [...]
##$SUBNAM2= <"">
##$SUBNAM3= <"">
##$SUBNAM4= <"">
##$SUBNAM5= <"">
##$SUBNAM6= <"">
##$SUBNAM7= <"">
##$SUBNAM8= <"">
##$SUBNAM9= <"">
##$SW= 24.0689530833862
##$SWIBOX= (0..15)
0 0 2 0 0 0 0 0 0 0 0 0 0 0 0 0 
##$SW_h= 4816.95568400771
##$TD= 16384
##$TD0= 1
##$TE= 0
##$TE2= 300
##$TE3= 300
##$TEG= 300
##$TL= (0..7)
0 120 120 120 120 120 120 120 
##$TP= (0..7)
150 150 150 150 150 150 150 150 
##$TP07= 0
##$TPNAME0= <>
##$TPNAME1= <>
##$TPNAME2= <>
##$TPNAME3= <>
##$TPNAME4= <>
##$TPNAME5= <>
##$TPNAME6= <>
##$TPNAME7= <>
##$TPOAL= (0..7)
0.5 0.5 0.5 0.5 0.5 0.5 0.5 0.5 
##$TPOFFS= (0..7)
0 0 0 0 0 0 0 0 
##$TUNHIN= 0
##$TUNHOUT= 0
##$TUNXOUT= 0
##$USERA1= <user>
##$USERA2= <user>
##$USERA3= <user>
##$USERA4= <user>
##$USERA5= <user>
##$V9= 5
##$VALIST= <valist>
##$VCLIST= <CCCCCCCCCCCCCCC>
##$VD= 0
##$VDLIST= <DDDDDDDDDDDDDDD>
##$VPLIST= <PPPPPPPPPPPPPPP>
##$VTLIST= <TTTTTTTTTTTTTTT>
##$WBST= 1024
##$WBSW= 4
##$XGAIN= (0..3)
0 0 0 0 
##$XL= 0
##$YL= 0
##$YMAX_a= 87423
##$YMIN_a= -163392
##$ZGOPTNS= <>
##$ZL1= 120
##$ZL2= 120
##$ZL3= 120
##$ZL4= 120
##$ABSF1= 10
##$ABSF2= 0
##$ABSG= 5
##$ABSL= 3
##$ALPHA= 0
##$AQORDER= 0
##$ASSFAC= 0
##$ASSFACI= 0
##$ASSFACX= 0
##$ASSWID= 0
##$AUNMP= <proc_1d>
##$AZFE= 0.1
##$AZFW= 0.1
##$BCFW= 1
##$BC_mod= 2
##$BYTORDP= 1
##$COROFFS= 0
##$CY= 11.3945322036743
##$DATMOD= 1
##$DC= 2
##$DFILT= <>
##$DTYPP= 0
##$F1P= 20.1720416913024
##$F2P= 0.152960286110954
##$FCOR= 0.5
##$FTSIZE= 0
##$FT_mod= 4
##$GAMMA= 1
##$GB= 0.15
##$INTBC= 1
##$INTSCL= 1
##$ISEN= 128
##$LB= 0.24
##$LEV0= 0
##$LPBIN= 0
##$MAXI= 10000
##$MC2= 0
##$MEAN= 0
##$ME_mod= 0
##$MI= 1.114404
##$NCOEF= 0
##$NC_proc= 0
##$NLEV= 6
##$NOISF1= 3.799351
##$NOISF2= 2.8
##$NSP= 1
##$NTH_PI= 0
##$NZP= 0
##$OFFSET= 15.70392
##$PC= 1
##$PHC0= -9570.961
##$PHC1= 15.60093
##$PH_mod= 1
##$PKNL= yes
##$PPARMOD= 0
##$PSCAL= 0
##$PSIGN= 0
##$REVERSE= no
##$SF= 200.130013532006
##$SI= 16384
##$SIGF1= 3
##$SIGF2= 2
##$SINO= 400
##$SIOLD= 16384
##$SREGLST= <1H.CDCl3>
##$SSB= 0
##$STSI= 0
##$STSR= 0
##$SW_p= 3612.71676300578
##$SYMM= 0
##$S_DEV= 0
##$TDeff= 0
##$TDoff= 0
##$TI= <>
##$TILT= no
##$TM1= 0
##$TM2= 0
##$TOPLEV= 0
##$USERP1= <user>
##$USERP2= <user>
##$USERP3= <user>
##$USERP4= <user>
##$USERP5= <user>
##$WDW= 1
##$XDIM= 8192
##$YMAX_p= 0
##$YMIN_p= 0
$$ End of Bruker specific parameters
$$ ---------------------------------
##NTUPLES= NMR FID
##VAR_NAME=  TIME,          FID/REAL,        FID/IMAG
##SYMBOL=    X,             R,               I
##VAR_TYPE=  INDEPENDENT,   DEPENDENT,       DEPENDENT
##VAR_FORM=  AFFN,          ASDF,            ASDF
##VAR_DIM=   8192,          8192,            8192
##UNITS=     SECONDS,       ARBITRARY UNITS, ARBITRARY UNITS
##FACTOR=    0.0002076,     1,               1
##FIRST=     0,             0,               0
##LAST=      1.7004516,     0,               0
##MIN=       0,             -163392,         0
##MAX=       1.7004516,     87423,           0
$$ Real data points
##PAGE= N=1
##DATA TABLE= (X++(R..R)), XYDATA
0@%%%%%%%qJ6j6J6k4L2l4M2n6O4p2Q8j04J26j50J73j98K26k61L00l42L88m39M96
$$ 0 0 0 0 0 0 0 0 -8 8 -8 8 -16 16 -18 24 -32 32 -40 48 -56 70 -80 93 -105 121 -140 160 -182 206 -233 263
31B63n58O27p02P84q73R73j085J204j332J476j635J809k003K218k459K729l036
$$ 263 -295 332 -370 414 -459 514 -571 633 -699 777 -858 951 -1052 1166 -1293 1436 -1600
48a600L385l788M261m822N504o349P429q871J0905j4011J9406l1446J07420j7839
$$ -1600 1785 -2003 2258 -2564 2940 -3409 4020 -4851 6054 -7957 11449 -19997 87423 69584
62F9584j22320P8461m1840j1677M9820j6941o3198L4629O662o173L5991J5574
$$ 69584 -52736 25725 -16115 -27792 22028 5087 -58111 -23482 -16820 -22993 12998 28572
74B8572k4943J7217J830j6533P361M550k3545j845m184j1424R680J7157m363j396
$$ 28572 3629 20846 22676 6143 13504 18054 -5491 -7336 -11520 -22944 -13264 3893 -470 -1866
88a866K829L645Q910L947j0682p499j031n37k636k232n29J018J717L999K528K856
$$ -1866 963 4608 13518 17465 6783 -716 -1747 -2284 -4920 -7152 -7681 -6663 -4946 -947 1581 4437
104D437L469j278l281n28m117k454L549j324n626Q15K483K147O403o23m889L854
$$ 4437 7906 6628 3347 2819 -1298 -3752 -203 -1527 -7153 -6338 -3855 -1708 4695 4072 -817 3037
120C037K578m062O93q35n338J050J082k986L044L585k484R84L076k035J228K320
$$ 3037 5615 1553 2246 1411 -3927 -2877 -1795 -4781 -1737 1848 -636 348 3424 1389 2617 4937
136D937l586k367O72j873L50K298k209j796K858J652N12J648j502j638J576l70
$$ 4937 1351 -1016 -344 -2217 -1867 431 -1778 -3574 -716 936 1448 3096 1594 -44 1532 1162
152A162k009P23n74j482J81P29K19R20J024p54O39J00K10K80Nj085j581m22N81
$$ 1162 -847 -124 -698 -2180 -1999 -1270 -1051 -131 893 139 778 878 1088 1368 1373 288 -1293 -1715 -1134
171a134N73q0P8k97O22J366J65l96L61K05j129L6l55m24J26l42r41O63R22k20
$$ -1134 -561 -641 -563 -860 -238 1128 1293 897 1258 1463 334 370 15 -409 -283 -625 -1566 -903 19 -201
191b01O72Q02q06j69O63l46l1L76k094n29J321k31q7L33j87K37J384l83l65J042
$$ -201 471 1273 467 298 961 615 584 960 -1134 -1663 -342 -573 -660 -327 -514 -277 1107 724 359 1401
211A401m44j351K86p4m96K95k16p79P94N84k82J142M36j059R3M27n79L62m60j127
$$ 1401 957 -394 -108 -182 -678 -383 -599 -1378 -584 0 -282 860 1296 237 330 757 178 540 80 -1047
231a047oO99k34M07K10k13N75K26N4N9j07l56l53o83L97Q1k40r1M78o9K76N93
$$ -1047 -1053 -354 -588 -181 29 -184 391 617 671 730 623 267 -86 -769 -372 -291 -531 -622 -144 -213 63 656
253F56j03J04l84n33M99J24n41m39L73j54j12M86J6l6M33q0j6K04j39m18K00l40
$$ 656 553 657 273 -260 239 363 -178 -617 -244 -398 -510 -24 -8 -44 389 309 293 497 358 -60 140 -200
275b00o0n8L06l94K11J96P2NJ71j96J09J5n13J69L16j98N8J40o86M62K63k52J76
$$ -200 -260 -318 -12 -406 -195 1 73 78 249 53 162 177 -336 -167 149 -49 9 149 -537 -75 188 -64 112
298A12O7k52K02j55K88k59j15Q6l94L00kj9qj41N24k43K27j62L67l80O9p0k44
$$ 112 179 -73 129 -26 262 3 -112 -26 -420 -120 -122 -141 -149 -290 234 -9 218 56 423 43 112 42 -202
321b02j27N10k4m18J92r2r2M27j85J21J0J52k31K00o5j85p8k20J82J07kL1m2k8
$$ -202 -329 181 157 -261 -69 -161 -253 174 -11 110 120 272 41 241 176 -9 -87 -307 -125 -18 -20 11 -31 -59
345e9L06j51J50Q8j71k81K1j27k2o3J33q2J13K79P4k08K62l8m25NpJ03J06k76
$$ -59 247 96 246 334 163 -118 -97 -224 -246 -309 -176 -258 -145 134 208 0 262 224 -201 -196 -203 -100 6 -270
369b70j33O7K29K52q3k64K17n8K08J42p1m14j28j98L44K52k63j05J51K90L0m9
$$ -270 -403 -336 -107 145 62 -202 15 -43 165 307 236 -178 -306 -504 -160 92 -171 -276 -125 165 195 146
391A46k71J77Q9k79q2L5M13l05j38L09k09P8M69m41K24O5l18J83J68l96j8M3p0
$$ 146 -125 52 141 -138 -220 -185 228 -77 -215 94 -115 -37 432 -9 215 280 -38 145 313 -83 -101 -58 -128
414a28j7M95o17M58m3l96L4M81j42J95k80k85N75j75Mk16j17M01j80J7Lj22J84
$$ -128 -145 350 -267 191 148 -248 -214 267 125 320 40 -245 330 155 159 -57 -174 227 47 64 67 -55 129
437A29j39l5q8K77l18j53L28m3Mm33M20nN1J34p0rM6L0J20m85j10L62l7j21L81
$$ 129 -10 -45 -133 144 -174 -327 1 -42 -38 -471 -51 -56 -5 129 59 50 96 126 246 -239 -349 13 -24 -145 236
462B36m82j21N41q9P5n7j37J6r8j43K88j74L46k96J53J07k62j42L57k13N1N2Q9
$$ 236 -246 -367 174 85 160 103 -34 -18 -116 -259 29 -145 201 -95 58 165 -97 -239 118 -95 -44 8 97
485I7P9m79K57k61L6K30O4n6J29K1j19l0n3L6J07J62r1q3k11k26L32J37m45M65
$$ 97 176 -303 -46 -307 -271 -41 23 -33 96 117 -2 -32 -85 -49 58 220 129 46 -165 -391 -59 78 -367 98
509I8K6j12J28l67K62P3o6r5N1o1l4j17K18P1j24N5j22jJ81o2n1m4n2M9j29L43
$$ 98 124 12 140 -227 35 108 42 -53 -2 -63 -97 -214 4 75 -49 6 -116 -117 64 2 -49 -93 -145 -96 -225 118
535A18q1m65K88q4R6J46J59m79M40pk7l64M81k29j34K24k22J27QN9k23J69j35
$$ 118 37 -428 -140 -224 -128 18 177 -302 138 131 104 -260 221 -8 -142 82 -140 -13 -5 54 -169 0 -135
558a35J94K12m42J88j38k6J21O3k7K9J49k27J15kJ93j56k94N58k25j21J50k72
$$ -135 59 271 -171 17 -121 -147 -26 37 10 39 188 -39 76 74 267 111 -183 375 150 29 179 -93
580i3Q3L84n08K07J9j9J2l39K75M7l3Q5jl09P3K64m23M60k03Q9k1l45L39l07Q3
$$ -93 -10 374 -134 73 92 73 85 -254 21 68 35 120 119 -190 -117 147 -276 184 -19 70 49 -296 43 -264 -181
605a81J67k32J26j22L9M21m94L16m5k71K73K12k55n0J98L5k48K13l18J43pL77
$$ -181 -14 -246 -120 -242 -203 218 -276 40 -5 -276 -3 209 -46 -96 102 137 -111 102 -216 -73 -80 297
627B97m66j3M22j38l4j50J32k7j43K52p7q4K6q9K87j42jJ1j41L1J88j19k69K94
$$ 297 -169 -182 240 102 68 -82 50 23 -120 132 55 -29 -3 -92 195 53 52 63 -78 -47 141 22 -247 47
651D7k4K9k43K61k32j81N06j72j62J63K95n76M96j38l40L62M3l02L02k09J48J77
$$ 47 23 52 -191 70 -162 -343 163 -9 -171 -8 287 -289 207 69 -271 91 134 -168 134 -75 73 250
673B50P6j62l47K83k63L35j51J12l00M60n27L86l4j09J5J44l32K08j5k06J76J39
$$ 250 326 164 -183 100 -163 172 21 133 -167 293 -234 152 118 9 24 168 -164 44 29 -177 -1 138
695A38k17J08j48m3J42k67K7K15J21J05N9j25l5n7m8K02k85k3L1j29k6o2L02K3
$$ 138 -79 29 -119 -162 -20 -287 -260 -45 76 181 240 115 80 23 -25 177 -108 -131 -100 -229 -255 -317 -15 8
719HPp1K82m76J07L63j31k43j47N57l71K87l68j13K06L4K29k54j08L05L23p11
$$ 8 15 -56 226 -250 -143 220 89 -154 -301 256 -115 172 -196 -309 -103 -69 160 -94 -202 103 426 -285
741b85K24J3k27O4M09j71j09M25l75n62Q84j60k01J32K45l65n3N58n60K78n3k97
$$ -285 -61 -48 -275 -211 198 27 -82 343 -32 -594 290 130 -71 61 306 -59 -112 446 -114 164 111 -186
763a86K24l6j58J4Q5mq1J79k42J94P1j93J85l69J83R6L91l57j78J6NJ63n8L4j21
$$ -186 38 2 -156 -142 -57 -61 -142 37 -205 -11 60 -133 52 -317 -134 -38 353 -4 -182 -166 -161 2 -56 -22 -143
788a43P0K00P7m07K79j86L98j29m58K92J02k89K24p2J39k8J59k50J56j36J09r5
$$ -143 -73 127 204 -203 76 -110 288 159 -299 -7 95 -194 30 -42 97 69 228 -22 134 -2 107 12
810A2J68j22Qk14J18p6J63l6k19R5K33o9l00N0L54l93J62K97k89Q9J03k09J64
$$ 12 180 58 66 -148 -30 -106 57 21 -198 -103 130 61 -239 -189 165 -228 -66 231 -58 31 134 -75 89
833H9Lk58K26j54O4J66r0K01k39l38K15J81J44l16J35j17Jk01L0L40P4k51J59
$$ 89 92 -166 60 -94 -30 136 46 247 8 -330 -115 66 210 -106 29 -88 -87 -288 -258 82 156 -95 64
856F4j7k84L00k05M99k73K49m27K06k11J38k77L68K2r7k71M57l95L00j44n5L66
$$ 64 47 -237 63 -142 357 84 333 -94 112 -99 39 -238 130 152 55 -216 241 -154 146 2 -53 313
878C13m32K29l73M07j60k2J44j25J61l35J90J60j06P5Q0K4l21J96r1J44m87L47
$$ 313 -119 110 -263 144 -16 -38 106 -19 142 -193 -3 157 51 126 206 230 -91 105 14 158 -329 18
900A8L9k96L89j72k43J69P8k2L3j80L54j59M3J55k56k13K27n5j35M77k9L7q9q8
$$ 18 57 -239 150 -22 -265 -96 -18 -40 -7 -187 167 8 51 206 -50 -263 -36 -91 -226 251 222 259 170 82
924H2o1l72L35l3J05j94J12J56j79j03j28M49k45k46N76l42R4J06j97J01j70J96
$$ 82 21 -351 -16 -49 56 -138 -26 130 -49 -152 -280 169 -76 -322 254 -88 6 112 -85 16 -154 42
946D2R9k48J09J31j04k2J25L0j66j25j79L41k8P1k45J10L45k63j84J9J36k4J30
$$ 42 141 -107 2 133 29 7 132 162 -4 -129 -308 33 5 76 -169 -59 286 23 -161 -142 -6 -30 100
969A00j43J16J5l9qj02j51J97j03J26j64J85%K89o51J34M47K6l46J83j57r0o8
$$ 100 -43 73 88 49 41 -61 -212 -15 -118 8 -156 29 29 318 -333 -199 248 274 -72 111 -46 -136 -204
992b04L91j76k06K70J44k00K62m48L48o7r9K26l37P3O58n29n4L3R7o0p4Q7k25
$$ -204 187 11 -195 75 219 19 281 -167 181 114 15 241 -96 -23 635 106 52 85 182 122 48 135 -90
1015i0J7r0K12k81K58lM2j27l7K23l52J87j24J42m0K82l04o0L68J3k92J1J1l1
$$ -90 -73 -163 49 -232 26 23 65 -62 -99 124 -228 -41 -165 -23 -63 219 -85 -145 223 236 -56 -45 -34 -65
1039f5O5P0n7k12J60Q9k08O8L2j2k43M21k42L33l17R4J02k79M0q3M18k45J12m9
$$ -65 0 70 13 -199 -39 50 -158 -90 -58 -70 -313 108 -134 199 -118 -24 78 -201 -161 -244 174 -71 41 -8
1063hJ78n10K28N9j32R0J33k34J42j67J39J91l04k1M02k89J11k08K90l25K63q0
$$ -8 170 -340 -112 -53 -185 -95 38 -196 -54 -221 -82 109 -195 -216 186 -103 8 -200 90 -235 28 -52
1085e2J22J9J69k52k14L28j4j27K83j79Pl5k70K2L25j73Q7j67P0q4J03m5k07K93
$$ -52 70 89 258 6 -208 120 106 -21 262 83 90 55 -215 -193 132 -41 46 -121 -51 -135 -32 -77 -284 9
1109IK38m82M93j98L27l69k87K91O2m8j72J60k5J25k81j3M18j71j8L9j33O1j43
$$ 9 247 -235 258 60 387 18 -269 22 84 36 -136 24 -1 124 -157 -170 248 77 59 98 -35 26 -117
1132a17P8k2l17K06N6K69m58M20k51L54l17Q3k23J77K24l11j03K38K49j01k9o39
$$ -117 -39 -61 -378 -172 -116 153 -305 115 -136 218 -99 -16 -239 -62 162 -149 -252 -14 235 134 105 -534
1154e34O38O1j29j00J51j50j37K94q0r5P5q3K49j1j85K00l92J21K99j71K07k37
$$ -534 104 165 36 -64 87 -63 -200 94 14 -81 -6 -89 160 149 -36 164 -228 -107 192 21 228 -9
1176iJ55l03L69m69M15r8M0m3L0j68P3k16K76n5J03j21k61N39j54k4J29j20j47
$$ -9 146 -157 212 -257 158 60 100 57 87 -81 -8 -224 52 -3 100 -21 -282 257 103 79 208 88 -59
1199e9J04O7l7m62N29o8k0j4j6k7k3r3j39L00j2O0l4j35K12o1l00L52j33O4k65
$$ -59 45 112 75 -387 142 74 54 40 24 -3 -26 -119 -258 42 30 90 56 -79 133 72 -228 124 -9 55 -210
1224b10J42J87j95K6L21m34o2l8K87j51J49R5j07k4j32J05j59L98k20k62J12p8
$$ -210 -68 119 -76 -50 271 -163 -225 -263 24 -127 22 117 10 -14 -146 -41 -200 198 -22 -284 -172 -250
1246b50K67k4K56k91k83N66k95J08j92J77oJj74L8J8J49j52j95L66k88K44l44
$$ -250 17 -7 249 -42 -325 241 -54 54 -138 39 33 34 -140 -102 -84 65 -87 -282 84 -204 40 -304
1268c04K31J32k45L74k07p2J50L3q2M9K21k84l17K61n5oJ88j88J47J1j01N6k18
$$ -304 -73 59 -186 188 -19 -91 59 92 10 59 280 -4 -321 -60 -115 -121 67 -121 26 37 -64 -8 -226
1291b26Q5K11J74k24k59M25m17K87j05j6L76m40J66j85L74m49M43k96m6J54K8
$$ -226 -141 70 244 20 -239 186 -231 56 -49 -65 311 -129 37 -148 226 -223 220 -76 -122 32 60
1312F0J04j97Q2K22k12l10M11k22Q4m2j09K09o3p0L03r0M8j94j35K97j76J97q2
$$ 60 164 -33 49 271 59 -251 160 -62 22 -20 -129 80 17 -53 250 160 208 14 -121 176 0 197 115
1335A15k29J37J3O9m2o9J35j85o0L40p2l3k07L70o3l32M63m63M97l51p0Q9k93
$$ 115 -114 23 36 105 63 -6 129 -56 -116 224 152 119 -88 282 219 -113 350 -113 384 33 -37 52 -241
1358b41M97k90N7j26J8N1j45J62j21L8o3J83p1j08L84j89j54K98k88M2M1J22k65
$$ -241 256 -34 23 -103 -85 -34 -179 -17 -138 -100 -163 20 -51 -159 225 36 -118 180 -108 -66 -25 97 -168
1381a68J38L17q9j60k00O4J37O3m3N2J38n43K55r6k06J38K71J70j26k56K86q7
$$ -168 -30 287 198 38 -162 -98 39 102 59 111 249 -294 -39 -135 -341 -203 68 238 112 -144 142 55
1403E5j82K32L4m7j95K02l83J69o4M01j84p4j18j52M63j39K8k24J10j00J19R2
$$ 55 -127 105 139 92 -103 99 -284 -115 -179 222 38 -36 -154 -306 157 18 46 -178 -68 -168 -49 43
1425D3j53L43o3j77kj72L55k46L09k34m0oQ9p3M9J12l39K60M6J66n63K85K74l45
$$ 43 -110 233 170 -7 -9 -181 174 -72 237 3 -37 -43 46 -27 22 134 -205 55 101 267 -296 -11 263 -82
1449h2k9J3J04M4l53L58R4m70J76k5J8K0J90k1k95K86J52m21K13k7J03k16J36
$$ -82 -111 -98 6 50 -303 55 149 -321 -145 -170 -152 -132 58 37 -258 28 180 -241 -28 -55 48 -168 -32
1472c2k87N37j21J02m8L2l76j33N58j63n6m8J4j77J03R6R3k13J97n1L0j44L06
$$ -32 -319 218 97 199 151 183 -193 -326 232 69 13 -35 -21 -198 -95 1 94 -119 78 27 57 -87 219
1495B19m21J04P9J94l3k27M0N5j44K42n0L9j49M64m05O9p2k6j29K13q5J58k00
$$ 219 -202 -98 -19 175 142 -85 -45 10 -134 108 58 97 -52 412 7 76 4 -22 -151 62 -23 135 -65
1518f5M0Qj28L62j15j22L68k29j85L18l10N0J49J80m22m3L38k3k72N6k21K40K24
$$ -65 -25 -17 -145 217 102 -20 348 119 -66 252 -58 -8 141 321 -101 -144 194 171 -101 -45 -266 -26 198
1541A98l85J16o8K17M6l53R5m6K02l0N0j62J10RJ65j56%J4kJ70j54p7J48l66L51
$$ 198 -187 -71 -139 78 124 -229 -134 -180 22 -8 42 -120 -10 -1 164 8 8 22 20 190 36 -41 107 -259 92
1566I2l14J27J77j86J50ML8p5j67m9K74o2K3j14o2J60J97j87m73N64j80N1k84
$$ 92 -222 -95 82 -104 46 50 88 13 -154 -203 71 9 32 -82 -144 16 213 26 -447 117 -63 -12 -296
1589b96J50J02J71J29l07L20l35P5l46M35k22J07J40j80L77O8l52l7J82l34L95
$$ -296 -146 -44 127 256 -51 269 -66 9 -337 98 -124 -17 123 -57 320 388 36 -1 181 -153 242
1610B42M2n24R2L8jk29J67K1L16N8l64M66k87j28J51j12m7K92n1k93J83K8r4O7
$$ 242 284 -240 -148 -110 -111 -340 -173 -152 164 222 -142 324 37 -91 60 -52 -99 193 142 -151 32 60 -34 33
1634C3l39K44J26M5J13k31j45L78j62N1J6k87j23M2J49j66L34NP9j39J4J19k62
$$ 33 -306 -62 64 109 222 -9 -154 224 62 113 129 -158 -281 -239 -90 -256 78 83 162 23 37 156 -106
1657a06M0K51j35J74k66M8q8J15J52m17M43j73K04j96j17Q1n5p5mJ9P6j43K20
$$ -106 -66 185 50 224 -42 6 -82 33 185 -232 211 38 242 46 -71 10 -45 -120 -124 -105 -29 -172 48
1680D8P5p3J06j70J9j42jJ23J78m67K27P7Q2o6J30l72J48M65l57l9M1k59L2L67
$$ 48 123 50 156 -14 5 -137 -138 -15 163 -304 -77 0 82 16 146 -226 -78 387 30 -9 32 -227 -195 172
1704A72m28KO3K03K4K8q7J74l47n3O5K93k69L58K0j80K02k2l94J54J79j86J2k05
$$ 172 -256 -254 -191 12 36 64 -23 151 -196 -249 -184 109 -160 198 218 38 240 218 -176 -22 157 -29 -17 -222
1728b22L15p8J33j85n9M2J63q6l24N69l09k77L53q1J92k96J15K69k25j44K04k99
$$ -222 93 15 148 -37 -96 -54 109 23 -301 268 -41 -318 35 -46 146 -150 -35 234 9 -135 69 -230
1750b30N26k70N2j77J65n0l65M86J7j62K17q7l66O4K76j29J29J07l21L53n9k84
$$ -230 296 26 78 -99 66 16 -349 137 154 -8 209 122 -244 -180 96 -33 96 203 -118 235 176 -108
1772a08J58J98l21J57K3k58K9K84k84N0K38k19lN9n2pj42J86J20j49K63j54j01
$$ -108 50 248 -73 84 107 -151 -122 162 -122 -72 166 -53 -56 3 -49 -56 -198 -12 108 -41 222 68 -33
1795c3N3K73m20k0K14l07L18J57m18Q1Q6J33p6J7l16K71N1j93P2J8j04M54m7m47
$$ -33 20 293 -127 -147 67 -240 78 235 -183 -102 -16 117 41 58 -258 13 64 -129 -57 -39 -143 311 264 -183
1819a83R0J04q4l66M75m3N5j7L0j94K45j8q4N5n3R1j74J25p0J8l26L69j03J00
$$ -183 -93 11 -73 -439 36 -7 48 31 61 -133 112 94 10 65 12 103 -71 54 -16 2 -324 45 -58 42
1843D2k8r8J00J64j98K52k71r9K87l46M6qQ0J37r3J34K7j34P0M7j43LK5J20k14
$$ 42 14 -84 16 180 -18 234 -37 -136 151 -195 -149 -157 -77 60 -33 101 128 -6 64 111 -32 -29 -4 116 -98
1868i8k97N2K55N0j30K97j73O6j04K09j04j42j23M97j55k22K36k14N7j38J39q2
$$ -98 -395 -343 -88 -38 -168 129 -44 22 -82 127 23 -119 -242 255 100 -122 114 -100 -43 -181 -42 -124
1890a24K22j34m7K3K79j25j83J00K04k83N4j20Q4J24q4l2L98k99j00J06j89L73
$$ -124 98 -36 -83 -60 219 94 -89 11 215 -68 -14 -134 -50 74 -10 -42 356 57 -43 63 -126 247
1912B47j76j03P3Q9j87R3j02J87J20m54R7N20m26K0K09j88L86n66j52N20j95r1
$$ 247 71 -32 41 130 -57 36 -66 121 241 -213 -116 404 -22 -2 207 19 405 -161 -313 207 12 -79
1934g9K28j98P9k62J30m7j04K00K01J37l08K89N5m50J36j92L40k67O4K49k48J2
$$ -79 149 -49 30 -232 -102 -149 -253 -53 148 285 -23 266 321 -129 7 -185 155 -112 -48 201 -47 -35
1956c5J16j23r0J20m9L43k72m8m1k6J22n8MM6P8J38k58R7k42J07L8K53r2N2k09
$$ -35 81 -42 -132 -12 -61 282 10 -38 -79 -105 17 -41 -37 9 87 225 -33 64 -178 -71 -33 220 128 180 -29
1981b9j97K55Q7j64p1M6L30k42k89j9L80k00K20l54N01k79k71K46k3J48j33q5
$$ -29 -226 29 116 -48 -119 -73 257 15 -274 -293 87 -113 107 -247 254 -25 -296 -50 -73 75 -58 -143
2003a43K89j42J8KL1l4p7q8J54k42J61K09r0Jj65L00j89K51l00J59k2q9q7J79
$$ -143 146 4 22 24 55 21 -56 -144 10 -232 -71 138 48 49 -116 184 -5 246 -54 105 83 -6 -93 86
2027H6J08o3l20K89q1j46J22J05k13N5J04nl90K75j75NL13K2k25J80k07J89O0
$$ 86 194 131 -189 100 19 -127 -5 100 -113 -58 46 41 -349 -74 -249 -244 69 91 -134 46 -161 28 88
2050H8r0j62K54j39k63J17P4L94k07K60n20j85L14J82m5n1N7j4J56k75K5m1M9
$$ 88 -2 -164 90 -49 -312 -195 -121 273 66 326 -194 -379 -65 117 72 21 78 64 220 -55 -30 -71 -22
2073b2O7k45K14J16l01K09j16q1K8J92k09J39Q3j45j43K67o4k6N3j25K4J25J48
$$ -22 45 -200 14 130 -171 38 -78 -159 -131 61 -148 -9 74 -71 -214 53 -11 -37 16 -109 -85 40 188
2096A88j66L3j24J94J38j52mj05k77L85k9j61P1p3L56Jp8j02J9j75r0J89K4j33
$$ 188 22 55 -69 125 263 111 107 2 -275 110 81 -80 -9 -82 274 275 197 95 114 -61 -151 38 62 -71
2120g1j26J85j0K6o8K19p6j89K68l50J47Q1J34j22J32r2K44l97J9j92M14k09K29
$$ -71 -197 -12 -22 4 -64 155 79 -110 158 -192 -45 36 170 48 180 88 332 -65 -46 -238 176 -33 196
2143A96k89K42l8j88n9J59Q3m5l3j29L5J51L8p3P4l2J16r3j42J43P1k34L1o3O7
$$ 196 -93 149 111 -77 -136 23 106 61 28 -101 -66 85 123 50 124 92 208 115 -27 116 187 -47 -16 -79 -12
2168a2J32l09J32J2J18l42L84j0j52j04J12M9l32N08l2l25J48QP5j70J01p5k33
$$ -12 120 -189 -57 -45 73 -269 115 105 -47 -151 -39 10 -322 186 154 -171 -23 -15 60 -110 -9 -84 -317
2191c17M77j36J06j27l41O96p50J02M55j20j65rK45K19j78l30J12K36l13l9L88
$$ -317 160 24 130 3 -338 358 -392 -290 165 45 -120 -129 116 335 157 -173 -61 175 -138 -177 211
2212B11jk29Q2k77R4K10j14n0k11K99j58K59o2j24J06kj4lM5p3J66k67O7K50l60
$$ 211 210 -19 63 -214 -120 90 -24 -74 -285 14 -144 115 53 -71 35 33 19 16 61 -12 154 -113 -46 204 -156
2237a56N8R9mkj99N2M3J33k61M35j9k03OM7J3N9J9j89K26J08k17j83J38O8k19
$$ -156 -98 1 -3 -5 -204 -152 -109 24 -237 198 179 -24 -18 29 42 101 120 -69 157 265 48 -135 3 71 -148
2262a48P3K4L42l48K85l27K9l30M05j08J47%O7j26j71J35J83k98K1K87R7l26K99
$$ -148 -75 -51 291 -57 228 -99 -70 -400 5 -103 44 44 111 -15 -186 -51 132 -166 -145 142 239 -87 212
2285B12l54j73K33J66n2k66m1N40k88J37k9o8J17k62o6k1M16l47K4K52J10k78
$$ 212 -142 -315 -82 84 32 -234 -275 265 -23 114 85 17 134 -128 -194 -215 201 -146 -122 130 240 -38
2307c8J27k02K3j8J51k23k08O17m9k36N0rR5l96P7K65m4j46J09l26M05J43J8j71
$$ -38 89 -113 -90 -108 43 -180 -388 229 180 -56 -6 -15 80 -316 -239 26 -18 -164 -55 -381 24 167 185 14
2331A4p1k43K81J49J72k61P8q0l9R3k11J28P8K3qJ07p0j35k73O02l07k8M5J15
$$ 14 -57 -300 -19 130 302 41 119 39 0 93 -118 10 88 111 103 210 140 5 -268 334 27 -1 44 159
2355A59k97J05q6k1J4L37o7k70L02k88J24O8J37k31K21l27L9k76J12K50J3k04
$$ 159 -138 -33 -119 -140 -126 211 144 -126 176 -112 12 80 217 -14 207 -120 -81 -357 -245 5 18 -186
2377a86K33P7m7k00l0Q4J69l3k96N67k35j7P4l86Q2J54K46l80M4RJ87l6k11M84
$$ -186 47 124 77 -123 -153 -69 100 67 -229 338 103 86 160 -226 -144 10 256 -124 -80 -71 116 80 -131 353
2401C53l67R3j12K04P5p3l36K23l7k70L94L4l1k96L53j7k17K1l11L70j00K3J92
$$ 353 -14 79 -33 171 246 173 -163 60 23 -247 147 181 150 -146 207 190 -27 -6 -317 53 -47 -24 168
2424A68l32J36q5O0J78k88P8J01J8J29o4J3j25J19R1k13q1L60k95j18Q1j02O5
$$ 168 -164 -28 -113 -53 125 -163 -85 16 34 163 99 112 -13 106 197 -16 -97 263 -32 -150 -69 -171 -106
2447a06j06K30N2J0k41j97K91L16l15M2K40j10l7j27L34j73k53Q9K42j01m0j44
$$ -106 -212 18 70 80 -161 -358 -67 249 -66 -24 216 106 69 -58 276 103 -150 -61 181 80 40 -104
2469a04j17J01j02K26j08k9J7q7K77K7r4K4P9l53l4N09n08L81j82qJ65K38k54
$$ -104 -221 -120 -222 4 -104 -133 -116 -203 74 101 7 31 110 -243 -277 232 -276 105 -77 -85 80 318 64
2492F4q5m2k02N64m89lJ84R0j10k03K34J58q7p2r4j04J89k09K57J34r0l70N29
$$ 64 -21 -63 -265 299 -190 -193 -9 81 -29 -232 2 160 73 1 -93 -197 -8 -217 40 174 84 -286 243
2515B43j76m10R9R7K7o2M63m66k0K57N8J15k90k1P1lJ94j36j5l09N62k66k08M93
$$ 243 67 -343 -244 -147 -120 -182 281 -185 -205 52 110 225 -65 -86 -15 -18 176 40 25 -284 278 12 -196 297
2539B97k66J9j53Q6kL8p1k51M20l08Q7L46r2l02M5nJ31M4L8j00r5J97mJ37l31
$$ 297 31 50 -103 -17 -19 19 -52 -303 117 -191 -104 242 150 -152 -107 -112 19 63 101 1 -94 103 99 236 -95
2564i5L98j60K40m78O0n6O4j3J04q5k31N1K94q6K19j09Q7j64N3k70L53l68J07
$$ -95 303 143 383 -95 -35 -91 -27 -40 64 -21 -252 -201 93 7 226 117 204 40 93 -177 176 -192 -85
2587h5k1J01q0J60j44j57K80j8J45j80%LN4nR7j41k7L8JJ26o6j81j75N84j41l13
$$ -85 -106 -5 -85 75 -69 -226 54 36 181 1 1 4 58 53 150 9 -18 20 21 147 81 -100 -275 309 168 -145
2613a45J13k8J37O7n0K71n54P2K31m3P5j04J1M1Q6q6j53j8J59r8N6j24k56J77
$$ -145 -32 -60 77 144 94 365 -189 -117 114 71 146 42 53 94 180 94 -59 -77 82 -16 40 -84 -340 -163
2637a63L31j86J71K0j84k39L70rl40M0N9p8K29l27K47J60k09K35p5J93m58K89
$$ -163 168 -18 153 173 -11 -250 120 111 -229 -189 -130 -208 21 -306 -59 101 -108 127 52 245 -213 76
2659G6J08p8l75M2K44q0K63j19l65K63J88k57K21j44j6K33j32L4j90N83n17j27
$$ 76 184 106 -269 -227 17 -63 200 81 -284 -21 167 -90 131 -13 -29 204 72 106 -84 499 -18 -145
2681a45o9K38q3m4K02j89Km0J93k48K36j44n3L43l8k41M26j49l74N0P0R1K18k10
$$ -145 -214 24 -59 -103 99 -90 -88 -128 65 -183 53 -91 -144 199 161 -80 346 197 -177 -127 -57 34 252 42
2705D2j08J50R6K4k65K59j15r7Onq8R2j49L52j64r4J77k68J61J01j32N6J90l92
$$ 42 -66 84 180 204 -61 198 83 -14 -8 -13 -101 -9 -158 194 30 -64 113 -155 6 107 -25 31 221 -171
2729a71K39J3k19k7K76k57Np1L5J4K09k1j95L50l50L67k08J80j06l3j09j24L39
$$ -171 68 81 -138 -165 111 -146 -141 -212 -177 -163 46 25 -170 180 -170 197 -11 169 63 30 -79 -203 136
2752A36k77K75j19rJ17l27K41M6rk33J08j16J09q1J37k88M02q2jM4l76L64O6K
$$ 136 -141 134 15 6 123 -204 37 83 74 -159 -51 -167 -58 -139 -2 -290 112 30 29 73 -303 61 127 129
2776A29k43J20j66N5j0L37j37k35L3J02k06K75k75K68k45J53J21n5k10L67R1j05
$$ 129 -114 6 -160 -105 -115 222 85 -150 -117 -15 -221 54 -221 47 -198 -45 76 21 -189 178 269 164
2798A64p5o2J93k10O0j80J22K01j07J41k58q2O6R4j78j00L03k81L40j72l7k53
$$ 164 89 27 220 10 70 -110 12 213 106 247 -11 -93 -27 67 -111 -211 92 -189 151 -21 -58 -311
2820c11N08n21M16j88j64m5M15j51J15k96K70N3j74K02l84L79m76N05l59l8K64
$$ -311 197 -324 92 -96 -260 -305 110 -41 74 -222 48 101 -73 129 -255 124 -352 153 -206 -244 20
2841B0o5M7j60J95p8j78K0k01O25l54O2J65j16K77k37o0J1N7J0l29K96j84j28
$$ 20 -45 2 -158 37 -41 -219 -199 -400 225 -129 -67 98 -18 259 22 -38 -27 30 40 -289 7 -177 -305
2864c05M75j92j44K26q9P0P1j98jJ26J4L6l0j09k09J73r3M06m82K76j60K04j64
$$ -305 170 -22 -166 60 -29 41 112 -86 -87 39 53 89 59 -50 -259 -86 -179 227 -255 21 -139 65 -99
2887i9Q6j98K15K14n05M12j13k3p4n4J96j7j29nK81J4l78N3K12q2j05q9L96j48
$$ -99 -13 -211 4 218 -287 125 12 -11 -85 -139 57 40 -89 -94 187 201 -177 -124 88 6 -99 -188 208 60
2911F0M6m9l97P5K50L32l91J64j26J1p4Q2j4OJ29JK9j66j25P8l2j9N7L2L26k50
$$ 60 106 57 -340 -265 -15 317 -74 90 -36 -25 -99 -17 -31 -25 104 105 134 -32 -157 -79 -111 -130 -73 -41 285 35
2937C5O3J8k53O6K78Pm57M4K46RJ43q3j95K07j55l7L0K75k05j60K37j2j72j6K13
$$ 35 98 116 -137 -71 207 214 -243 -199 47 56 199 116 -79 128 -27 -64 -34 241 36 -124 113 101 -71 -87 126
2962A26k90K08k64N4J2K07nl4j35N0J57k80M1L66M1k58K53k59j05M03Rj28p0m9
$$ 126 -164 44 -220 -166 -154 53 48 14 -121 -71 86 -194 -153 213 254 -4 249 -10 -115 288 297 169 99 50
2986E0j29o8r3L07k3J09M4l44K53o%j58o7L06m26J48M44l17J59j36j57j16J99
$$ 50 -79 -147 -240 67 44 153 197 -147 106 100 100 -58 -125 181 -245 -97 347 30 189 53 -104 -220 -21
3009b1Nk09L23m19J99Q4l1m15O07J48m24L83O8k70M4Q7j16M3j85l5K10k7M2o2
$$ -21 -16 -225 98 -321 -122 -38 -69 -484 123 271 -153 230 298 28 72 159 43 86 -99 -134 76 49 91 29
3033B9M8j64J97O0l3J4p3L3j35M1j58J36J2L02m13J73j52J27Lj02J36j04m9jJ52
$$ 29 77 -87 110 170 137 151 78 111 -24 17 -141 -5 7 309 -104 69 -83 44 47 -55 81 -23 -72 -73 79
3058G9Q7N5l36j28N12l78K38j58P3K62m09P0j14L29p0j70P3l10L40j08q1R6j9
$$ 79 166 221 -115 -243 269 -109 129 -29 44 306 -103 -33 -147 182 112 -58 15 -295 45 -63 -144 -48 -67
3081f7n4j71K58j59J31L95m18j8J71O1m71L87j32J18j25Q5J07l64K31l7J84n14
$$ -67 -121 -292 -34 -193 -62 333 -85 -103 68 129 -342 45 -87 31 -94 -9 98 -266 -35 -72 112 -402
3103d02P14j86J23M2j79j18j80J52L3j08P1m7K13l0j09j42J64L02j66Q9k83j93
$$ -402 312 126 249 291 112 -6 -186 -34 -1 -109 -38 -85 128 98 -11 -153 11 313 147 236 -47 -240
3125b40J81n2K53q6k23L48j00J04k97j69L23J57j95J5J91l07q1j0J78J4j66R5
$$ -240 -59 -111 142 56 -167 181 81 185 -112 -281 42 199 4 19 210 -97 -178 -188 -10 4 -162 -67
3147f7K4n7K53J26n60L36m7q1K08j27k80M15J13k85L40n29J13J56m01J43n0J49
$$ -67 -43 -100 153 279 -281 55 8 -73 135 8 -272 143 256 -29 311 -218 -105 51 -350 -207 -257 -108
3169a08N7J8J21k93K28k6J15m21M03j32J93J18k54n2M47m97p8J04K42O0m43J76
$$ -108 -51 -33 88 -205 23 -3 112 -309 94 -38 155 273 19 -33 414 -83 -161 -57 185 245 -198 -22
3191b2J76l42K38o6l09K29o0J65k4n2J20j34J15J63l4j29k27L11k09J62J1j73
$$ -22 154 -188 50 -16 -325 -96 -156 9 -15 -67 53 -81 34 197 163 34 -193 118 -91 71 82 -91
3213i1q2j1J79j00J46K01m60L30k31L25k07J89j72K76r0n85K81j01KM44m87k4
$$ -91 -173 -184 -5 -105 41 242 -218 112 -119 206 -1 188 16 292 202 -383 -102 -203 -201 243 -244 -268
3235b68K7L87j9k30l1L62m54J36J2K24J78m10K70p3j03k87K35O3K1J73J50m02
$$ -268 -241 146 127 -103 -134 228 -226 -90 -78 146 324 -86 184 111 8 -279 -44 19 40 213 363 -39
3257c9L8Q0J39P9l47%J06l54M62k35j68K95k5o7j56J71O9p8j56M37m21L43j69
$$ -39 -1 79 218 297 -50 -50 56 -298 164 -71 -239 56 31 -36 -192 -21 48 -30 -186 251 -170 173 4
3280Dj3L07j47j14L7o5j9K63j76M9j28l9J53k35J89K18j32j85J19j6O0j64MJ45
$$ 4 -9 298 151 37 74 9 -10 253 77 126 -2 -41 112 -123 66 284 152 -33 86 70 130 -34 -30 115
3304A15j44K66l52J03J30n5nm1j0qp7p3K05P3k01q3j89K37m7J24O8R3K23l87J34
$$ 115 -29 237 -115 -12 118 63 58 17 7 -1 -78 -151 54 127 -74 -157 -346 -109 -156 -32 36 129 352 -35 99
3329I9KM5R7k79J83j80p9L4K39J14l84J22j21J55Q0p5l31K15lJ93N8l41K52k51
$$ 99 101 146 243 -36 147 -33 -112 -78 161 275 -109 13 -108 47 127 52 -279 -64 -67 126 184 -157 95 -156
3353a56J83j1j39p6K64R0r1m4j04O0j28L57j1k44k2k1r3K35r6pK09j95Q5J38j33
$$ -156 27 16 -123 -199 65 155 64 20 -84 -24 -152 205 194 -50 -72 -93 -186 49 -47 -54 155 -40 45 183 50
3378E0P9k70K9r2J07m9J35j99J56J63J24P1l17m6L64k88J27l64J93n3J58m6l66
$$ 50 129 -141 -112 -204 -97 -146 -11 -210 -54 109 233 304 -13 -59 305 17 144 -220 -27 -80 78 32 -334
3401c34L36j76K58N3j22m7J56l11J79o6M8L0pq2J54rN9k07L1j3K59j67J3j96J86
$$ -334 2 -174 84 137 15 -32 124 -187 -8 -74 -26 4 -3 -85 69 60 119 -88 -57 -70 189 22 35 -161 25
3426B5q8k20O27o97M57j58j11J59L20k43j72J89P1Q0k52M8m8K50l7j67J5O1k82
$$ 25 -63 -283 344 -353 104 -54 -165 -6 314 71 -101 88 159 239 -13 35 -13 237 200 33 48 109 -173
3449a73J03Q0jJ22p9K4J25j12j3J3l2k24K43j55J25J09J49m31j76M55m74J87k3
$$ -173 -70 10 9 131 52 76 201 89 76 89 57 -167 76 -79 46 155 304 -127 -303 152 -322 -135 -158
3472a58K93m39M30K1j64j91M18j07j18J80O0k47J86j73r3K82l93J08J44j50K88
$$ -158 135 -304 126 147 -17 -208 210 103 -15 165 225 -22 164 -9 -102 180 -213 -105 39 -111 177
3493A77l1l19K36k04J17J57j29j3O6p8J3K5k07K3K67j60J34j82R4L11m86L41j83
$$ 177 146 -173 63 -141 -24 133 4 -9 57 -21 -8 17 -190 -167 100 -60 74 -108 -14 297 -189 152 -31
3516c1QJ30n10M34R6J3j85j53P7J00K39j10p3J0l7l9m4j12J27J66k19J23J52r2
$$ -31 -23 107 -403 31 127 140 -45 -198 -121 -21 218 108 35 45 8 -31 -75 -187 -60 106 -113 10 162 70
3540G0N1j30J23m04K01P0j43Q0j78J94R4j50K00m93L22J51J59j59O5r1R1q8J1
$$ 70 121 -9 114 -290 -89 -19 -162 -82 -260 -66 28 -122 78 -415 -93 58 217 58 123 32 123 35 46
3563D6j60J51m1j37K17k75J7L83J63m49K52R4m26K88K41k98k54J60L06k70M8j89
$$ 46 -114 37 -4 -141 76 -199 -182 201 364 -85 167 261 -165 123 364 66 -188 -28 278 8 56 -133
3585a33K76k03R8j35K33o7j29P6K4p7k3j80N6L8K00L0n0J77n06L06K02k47J02
$$ -133 143 -60 38 -97 136 69 -60 16 40 -37 -60 -240 -184 -146 54 84 34 211 -295 11 213 -34 68
3608F8l05J77J67o0J53k44OO0l05L96J75k49J7p2k72L58j33M22m05j95R7J77j01
$$ 68 -237 -60 107 47 200 -44 -38 22 -283 113 288 39 56 -16 -288 70 -63 359 -46 -241 -144 33 -68
3631f8k2K37M0o03L18J5J91j0j88J28j07j88J84N4j81K73l30K33J64k70J92J27
$$ -68 -90 147 187 -416 -98 -83 108 98 -90 38 -69 -257 -73 -19 -200 73 -257 -24 140 -130 62 189
3653A89l52p8J60n5k2J61j69L29j37kM5j02K91j97N0k68K50j20K40k22j05J75
$$ 189 -163 -241 -81 -136 -158 3 -166 163 26 24 69 -33 258 61 111 -157 93 -27 213 -9 -114 61
3675F1j49J56o9p8Mq9K4L27q1l72M54n4l19L74j82J74j57M2j19J05r7K84l1j15
$$ 61 -88 68 -1 -79 -75 -164 -140 187 106 -266 188 134 -185 189 7 181 24 66 -53 52 -45 239 208 93
3699I3p2n8j91J97JJ36l0P2k9kn3m36M77m02N8K47J33JJ42l20J7p9N2j01L4J82
$$ 93 21 -37 -228 -31 -30 106 76 148 119 117 64 -372 105 -297 -239 8 141 142 284 -36 -19 -98 -46 -147 -113 69
3725F9j95k09J16N9K35J48m4k48N6J14q6k04K36O7J5K9j3j60pL8Q5K33n69N76
$$ 69 -126 -335 -219 -160 75 223 179 -69 -13 101 15 -189 47 114 129 158 145 -15 -22 16 101 334 -235 341
3749C41m55pm0k18K66J79j68k27N68k81p8L66m37J88O4N3j05nq2P3k22K19N4j96
$$ 341 -114 -121 -161 -379 -113 66 -102 -329 239 -42 -120 246 -191 -3 61 114 9 4 -78 -5 -227 -8 46 -150
3773a50L01n4K04j89l20K23L55j01k8r6l81L96j59j65L07j11o8j33J46J87N7k45
$$ -150 151 97 301 112 -208 15 370 269 241 145 -236 160 1 -164 143 32 -36 -169 -23 164 221 -24
3795b4L00j25J2j86n0J36j14r3M06k28k50L80m53K18Q9M9j76k14J27J41n1K13
$$ -24 276 151 163 -23 -73 63 -51 -144 262 34 -216 164 -289 -71 18 67 -109 -323 -196 -55 -106 107
3817A07J13l97J95k3m04J41K76L45k09P8k74J36j54Q5N7M7l8N2o2j27j68M19l61
$$ 107 220 -177 18 -5 -409 -268 8 353 144 222 -52 84 -70 15 72 119 81 133 71 -56 -224 195 -166
3840a66N36l18N4l0m8k5M2l0n3P5r0L02l30L41k45J54j5j29k7Q2M0j41j22L07
$$ -166 370 52 106 76 28 3 45 15 -38 37 -53 249 -81 260 15 169 154 25 -2 80 120 -21 -143 164
3864A64Ok81lj09K64j61N9N4K26o1k15l9L33l26Q4j9J49k07K5J43j16J44j72L98
$$ 164 170 -111 -114 -223 41 -120 -61 -7 219 158 -57 -96 237 -89 -5 -24 125 -82 -57 86 -30 114 -58 340
3888C40m70J17j24K9PR4n1k28K90J07J1k01l8N4M9J87l03L05k57L41k75k73K59
$$ 340 -130 -13 -137 -108 -101 -7 -58 -286 4 111 122 -79 -117 -63 -14 173 -130 175 -82 259 -16 -289 -30
3911c0J90l06K49k17Q7K18k92K24m06J94Q3Q0j4L25o67K85J27J01l75K14J65l46
$$ -30 160 -146 103 -114 -27 191 -101 123 -283 -89 -6 74 60 385 -282 3 130 231 -144 70 235 -111
3933a11J09k54J57K28j32j2j3L3O4k10K44k00J7M4J58K8lM7j12q8j30K21K5Q4
$$ -111 -2 -256 -99 129 -3 -15 -28 5 69 -141 103 -97 -80 -36 122 150 147 194 82 -6 -136 85 110 194
3957A94j81N0L9j00J41j76o8P1J46k64L54j57r5J75k30j7K27p1Q2p8K2k38k1J72
$$ 194 13 63 102 2 143 -33 -101 -30 116 -148 206 49 -46 129 -101 -118 109 38 120 42 64 -174 -195 -23
3981b3J13j70K35r9j71J85k33K09N5K35j64m0k38L85m19K47m91M50j99J93M9N1
$$ -23 90 -80 155 56 -115 70 -163 46 101 336 172 132 -106 279 -140 107 -384 66 -133 60 109 160
4003A60k99mL28l24K42o0j76K92l06l5P7K01J0k05J19J39m39L9Q9J5M7L6L2K5
$$ 160 -139 -143 185 -139 103 43 -133 159 -147 -182 -105 96 106 -99 20 159 -280 -241 -152 -137 -90 -54 -22 3
4027Ck6p2JK9J7R8J4O0J22k68l9j5O5k46J49K99l19K61q8j0K3J23L3o3k91L0K79
$$ 3 -23 -95 -94 -65 -48 50 64 124 246 -22 -61 -76 -11 -257 -108 191 -128 133 45 35 58 181 214 151 -140 -110 169
4054A69l54J16m1K86p5J93k72m2K34k88M13l07J8o5k59M0K76j67l27K44R1O7L59
$$ 169 -185 -69 -110 176 101 294 22 -20 214 -74 339 32 50 -15 -274 -234 42 -125 -452 -208 -117 -50 309
4077C09m64K62n4k46J41J24J00j23l30R8N68l81J14j68o7M26n16J42M01n39N05
$$ 309 -155 107 53 -193 -52 72 172 49 -281 -183 385 4 118 -50 -117 309 -207 -65 336 -203 302
4098C02m72J50k93N61j85j58j23K81k19J47L3Q8l92M6L01j44K18M5m67M21M0o1
$$ 302 -170 -20 -313 248 63 -95 -218 63 -156 -9 24 112 -280 -234 67 -77 141 186 -281 140 180 119
4120A19j52r4O3r6J46n7J53j97N6K8J12K6j5L1k79K29j26J06R4o8k03L75j32k21
$$ 119 -33 -127 -64 -160 -14 -71 82 -115 -59 -31 81 107 92 123 -156 73 -53 53 147 79 -124 251 119 -102
4144a02r3J71Q6P4pj73J35J31m20Q9K41j82j8j3l0L6K25k86J15K02J1l50M05l92
$$ -102 -195 -24 62 136 129 -44 91 222 -198 -109 132 -50 -68 -81 -111 -75 150 -136 -21 181 192 -158 247 -145
4168a45J61J34j9k38J61l37K77O9%l61K31K27l85K47j8J96l72m3N29k86K08p2
$$ -145 16 150 131 -107 54 -283 -6 63 63 -298 -67 160 -225 22 4 200 -172 -215 314 28 236 164
4190A64j73Kj35K63j23K57m05L23p1k1j83K26p4K0R0r8K64p52O20k84O3nL82O7
$$ 164 -9 -7 -142 121 -2 255 -150 173 102 81 -102 124 50 70 160 62 326 -426 194 -90 -27 -32 350 417
4214D17o15K64L5m4l64M57l56J94KO0k40K54Q5r2J35k29j59J01N7j2P9p5L9J24
$$ 417 -198 66 101 57 -307 150 -206 -12 -10 50 -190 64 149 57 192 -37 -196 -95 -38 -50 29 -46 -7 117
4238A17L0j4k05j30L51l40K12j8j32K23j48J85l71J7L15o0k4nm2o1J86j56J20
$$ 117 147 133 -72 -202 149 -191 21 3 -129 94 -54 131 -240 -223 92 32 8 3 -39 -100 86 -70 50
4261E0J6j03pK18j01k63M09m8%k03n4Nk73K21K03KL08l83OL13n37Q9J75j24r6
$$ 50 66 -37 -44 174 73 -190 219 171 171 -32 -86 -81 -354 -133 70 72 380 -3 3 316 -221 -132 43 -81 -177
4286a77L34N2k96K29j59j47M89l53J5k56K56n2J32j64L4nj60L87j54J95j12k9
$$ -177 157 209 -87 142 -17 -164 325 -28 -13 -269 -13 -65 67 -97 -63 -68 -228 159 5 200 88 59
4308E9k1L8l9m4m0m5R4k7p9q7J81J82k44K40ol31Q4J13j03l9k8L00J72n47J40
$$ 59 38 76 37 -7 -47 -92 2 -25 -104 -191 -10 172 -72 168 162 -169 -85 28 -75 -114 -142 158 330 -217 -77
4333g7L55j26K01n97L10P4o2k72O7l6M16k95O3K5J19o5l0j00pK11k88L9K03J41
$$ -77 278 152 353 -244 66 140 78 -194 -127 -163 253 -42 21 46 165 100 70 -30 -37 174 -114 -75 128 269
4357B69j13k50j35M22r7n3J54j99j32K20j3j12K8n6J28J31j60P3k09L8K51j31
$$ 269 156 -94 -229 193 96 43 197 -2 -134 86 73 -39 -11 -67 61 192 32 105 -104 -66 185 54
4379E4k7q4j10J03K29n84M79P5j14K5N2k70L67n26K2K59L5N9L1l1Pr%m1R6l01
$$ 54 27 -57 -167 -64 165 -419 60 135 21 46 98 -172 195 -331 -309 -50 -15 44 75 44 51 42 42 1 97 -204
4405b04R5J51K4Op2J5K27j35j73L55l52J00j27o3M22m48J47Mk6J72j96M0R6J33
$$ -204 -109 42 66 72 0 15 242 107 -66 289 -63 37 -90 -153 269 -179 -32 -28 -54 118 -78 -38 58 191
4429A91l04J11m9m8K00k18J9J87p6l58J5J64J75N2k36M00j42J34K2l74K54j03
$$ 191 -113 -2 -51 -99 101 -117 -98 89 13 -345 -330 -166 9 61 -175 225 83 217 239 -135 119 16
4451A6mj76N1L58l06j51K28m0O1K1j31L1j83O42l76r9j46K58j07J51k8k65Q3J0
$$ 16 12 -164 -113 245 -61 -212 16 -24 37 58 -73 -42 -225 417 41 -58 -204 54 -53 98 70 -195 -112 -102
4475a02R9Q7j31p7j2j37J30K8J58j53O6K34l84J76m0n6K62j25J85k09K2J42j97
$$ -102 -3 84 -47 -124 -136 -273 -143 -115 43 -110 -44 190 -194 -18 -58 -114 148 23 208 -1 21 163 -34
4498c4j40K48p5k9R6L51m20J68j05J7J8l28J53K61m31K79r7L4OJ03m4J89l59J08
$$ -34 -174 74 -1 -30 66 417 -3 165 60 77 95 -233 -80 181 -250 29 -68 -34 -28 75 31 220 -139 -31
4522c1J89l4J5n1j31J66j4j01j26L58k05l2J94j06j2J71l00j34J29k24K88O2j91
$$ -31 158 124 139 88 -43 123 109 8 -118 240 35 3 197 91 79 250 -50 -184 -55 -279 9 71 -120
4545a20P3m4j4k9N0j12J98K64j54l0O9j39p4N2j80L33L1k43r1o3L37j5j15L4r1
$$ -120 -47 -91 -105 -134 -84 -196 2 266 112 82 151 12 -62 -10 -190 143 174 -69 -160 -223 114 99 -16 18 -73
4570g3K02j00R2o1r7J26K30l59J3j71K32pK61j74k96N12q8m71J74M6K57k27oJ4
$$ -73 129 29 121 60 -37 89 319 -40 -27 -198 34 27 288 114 -182 330 242 -229 -55 -9 248 21 15 29
4594B9J09j13j3MR2j00N8n8l61M93N0J73o94N71j80k10K15j71l0L29l81J15L62
$$ 29 138 25 12 16 108 8 66 8 -353 140 190 363 -331 240 60 -150 65 -106 -136 193 -188 -73 289
4617B89l54l4J07KL8Qr6n8K26m34N07j32l10K93P1K0r1l30K16K22K9l57j26M13
$$ 289 -65 -99 8 10 48 56 -40 -98 128 -306 201 69 -241 52 123 143 52 -278 -62 160 189 -168 -294 119
4641A19j26M0K67m71K47k15J06J87j55J08J84L7k09l79M56k48L16l96poJ06P7
$$ 119 -7 33 300 -171 76 -139 -33 154 -1 107 291 328 119 -260 196 -52 264 -132 -139 -145 -39 38
4663C8k45N83n22J40M9l6k35K22jP7n7m1k16L10o9lR7M2m9m6n8l7J72q8K35j92
$$ 38 -207 376 -146 -6 43 7 -228 -6 -7 70 13 -28 -244 66 -3 -6 91 133 84 38 -20 -57 115 27 262 70
4689G0n7k4K96m36J40J85J30l73n9J84j52K2k01M19l42O5J67k13J59n7J22l01
$$ 70 13 -11 285 -151 -11 174 304 -69 -128 56 -96 -74 -275 144 -198 -133 34 -179 -20 -77 45 -256
4711b56K89J8K71l52p8J21K16k83J50n0l28K15O6J8K99k34k27N1j46M09k60RP9
$$ -256 33 51 322 -30 -108 13 229 -54 96 46 -282 -67 -1 17 316 82 -145 -94 -240 169 -91 -82 -3
4734cP3p3m7K1j99K37q0OK41l31K13J06j57K48l33j50L50j78J23k35J88k10J56
$$ -3 70 -3 -50 -29 -228 9 -71 -65 176 -155 58 164 7 255 -78 -228 122 -56 67 -168 20 -190 -34
4757c4P2k11K65K8j83J45q4J61k40J77r4J7MJ78k88J26j64j65L22K0P2Nk40J09
$$ -34 38 -173 92 120 -63 82 -2 159 -81 96 2 19 23 201 -87 39 -125 -290 32 52 124 129 -111 -2
4781bR3N4k48J7L29l00k05K32j29J92nj32qm59O04n9Q6m6k47Q9K21J26m23J42
$$ -2 91 145 -103 -86 243 -57 -262 -30 -159 33 28 -104 -112 -571 33 -26 60 14 -233 -144 77 203 -220 -78
4805g8p4K4o2k25M70k49N7J04M24l66N7k60J60L15l23L7l8J28q0M2j3j63K28j27
$$ -78 -152 -128 -190 -415 55 -194 -137 -33 391 25 82 -178 -18 297 -26 11 -27 101 21 63 50 -113 115 -12
4829a2J61J83k49j04K00o7m5j08K77m33p7O08l05J04k72L12N5k38j33L13p2j45
$$ -12 149 332 83 -21 179 112 67 -41 236 -197 -274 334 29 133 -139 173 228 -10 -143 170 98 -47
4851d7j42J45J2N4j57Q5k1L05j97n2k2j29P2k13N70j97l6r2j13K84l5o3Oj03K2
$$ -47 -189 -44 -32 22 -135 -50 -71 234 37 -15 -37 -166 -94 -307 263 66 30 -62 -175 109 74 11 17 -86 -64
4876f4K11j88J28M3j81J33j73R4j17J27kk2Q7J32j65J66l81M59J3l52j62K15l39
$$ -64 147 -41 87 130 -51 82 -91 3 -114 13 11 -11 76 208 43 209 -172 287 300 -52 -214 1 -338
4899c38K42J05j68L24j06J36m4l7n7j34L3L0K93k69j76R3J38j38L8J37m16L85
$$ -338 -96 9 -159 165 59 195 151 114 57 -77 -44 -14 279 10 -166 -73 65 -73 -35 102 -314 71
4921G1M4j87J55k4J39m65L64k56J54j74L16kk78m1K40j5k14J88J52k52j40J39
$$ 71 115 -72 83 59 198 -267 97 -159 -5 -179 137 135 -143 -184 56 41 -173 15 167 -85 -225 -86
4943h6L85l0k76M8j87N1l26M64j03K58J0r2K05k71j0j32rK26j25j54L49m40L46
$$ -86 299 269 -7 41 -146 -95 -421 43 -60 198 208 116 321 50 40 -92 -101 125 0 -154 195 -245 101
4966A01nk13K25p7L06l58K65k24k21o1K45j30J99j63K63l8p0k44L17k05L79l70
$$ 101 96 -117 108 31 337 -21 244 20 -201 -262 -17 -147 52 -111 152 114 44 -200 117 -88 291 -79
4988g9K62l61K51N6k08J36J18l67J42L56l86R1n6K35j44L5P6j95Lj09K8M15k08
$$ -79 183 -178 73 129 -79 57 175 -192 -50 306 -80 11 -45 190 46 81 157 -38 -35 -144 -116 299 91
5011I1m1K12l63K0o5J34J9m5K29j96q1L23k85N8j31l0K66r2k98K72j1J3J58k00
$$ 91 50 262 -101 -81 -146 -12 7 -38 191 -5 -86 237 -48 10 -121 -151 115 23 -275 -3 -14 -1 157 -43
5035d3J99l53K37k66K57L1n1j98P0Q2j99N73j00J7o61N38r4j30K09l96L81m20
$$ -43 156 -197 40 -226 31 62 11 -187 -117 -35 -234 339 239 256 -405 133 39 -91 118 -278 103 -317
5057c17M86mp5l48K35L3K58l6k01K04k86N1j59L2J05o0j85L47k81L59Ll86N23
$$ -317 169 165 90 -258 -23 10 268 232 31 235 -51 0 -159 -127 -22 -82 -267 80 -201 158 161 -225 298
5080B98l93O7l7q5J1Q6K59j65l9J03N7q9j16J44k04K89k69K37r3%j54J06p3J14
$$ 298 -95 -28 -65 -150 -139 -53 206 41 2 105 162 73 -43 101 -103 186 -83 154 61 61 -93 13 -60 54
5104E4l8p4J5PK51l62M34l88J78rM6j53N3j39K22r0k36K82K08j9j89M3k8M0j68
$$ 54 16 -58 -43 -36 215 -147 287 -101 77 68 114 -39 14 -125 97 7 -229 53 261 242 53 96 68 108 -60
5129f0Mr5J39J03N0j4N2o4l07M58k06J33l60K78k81J56N6q2K78l21M13k18J46
$$ -60 -56 -151 -12 91 141 127 179 115 -192 266 60 193 -167 111 -170 -14 42 -40 238 -83 330 112 258
5152B58m77L90j12j38J04K50l36O8J69k39k6M68k05k46k4N0j14J77J5jk87K13
$$ 258 -219 171 59 -79 25 275 -61 7 176 -63 -89 379 174 -72 -96 -46 -160 17 32 31 -256 -43
5174d3R0l8k95K76O9r7m9N6L73l93k9K33l39K09M8K37l72j9MJ98k7j35q6J49K00
$$ -43 47 9 -286 -10 59 -38 -87 -31 342 -51 -80 153 -186 23 71 308 -64 -83 -79 119 92 -43 -129 20 220
5199B20k67l6K47l71R7K03l05L17k69o9K18r6O5J36o4N2P9r6j61L39m21K30%n9
$$ 220 -47 -83 164 -207 -110 93 -212 105 -164 -233 -15 -111 -46 90 26 78 157 61 -100 239 -182 48 48 -11
5223a1q9K02j92j11J50mo3LL09j73q3M36n15J27P8n8R3n33K28L84l23J08k19K41
$$ -11 -100 102 -90 -201 -51 -55 -118 -115 194 21 -62 374 -141 -14 64 6 99 -434 -206 178 -145 -37 -256 -15
5247a5K46j49J9l02R0K37m5j24j56r3L25j01n3o9L84k25J5K1k8j06K5J29N6K81
$$ -15 231 82 101 -201 -111 126 81 -43 -199 -292 33 -68 -121 -190 194 -31 -16 5 -23 -129 -104 25 81 362
5271C62l57J54l6Q6j69j43K6J60k1k1K4R9k31K88m27K59l21J03M81n40j37J82
$$ 362 5 159 123 209 40 -103 -77 83 62 41 65 164 -67 221 -206 53 -268 -165 316 -224 -361 -179
5293a79K20J70n71O24N0l80j14J93m0j84N24k63k33J37L4j86K05j6j88L08j06
$$ -179 41 211 -360 264 314 -66 -180 13 -27 -211 313 50 -183 -46 -12 -198 7 -9 -197 111 5
5314EJ91j91M4j39l9r1J03l5O2L9j99QQ1J49n0p8K99k79j10J42K28l16J50Jo3
$$ 5 196 5 49 -90 -129 -220 -117 -152 -90 -51 -250 -242 -161 -12 -62 -140 159 -120 -230 -88 140 -176 -26 -25 -88
5339h8K36pj1m5j4q3L9J16m71L40J35q5K69l59nR7M8j10j05L33k23J11k58J70
$$ -88 148 141 130 85 71 -12 27 143 -328 12 147 62 331 -28 -33 64 112 2 -103 230 7 118 -140 30
5363C0l40L28j39K44P4j72j10PQ2j35K00o8r8P6O5r5K86j05j86j8J55J5Q4m22
$$ 30 -310 18 -121 123 197 25 -85 -78 4 -131 69 1 -97 -21 44 -51 235 130 -56 -74 81 96 180 -242
5387b42R2L06j36q0k81K29m3n9J16P8P7m51N41l28M49k87n4j35Q1K85k01K52k81
$$ -242 -150 156 20 -60 -341 -112 -155 -214 -98 -20 57 -394 147 -181 268 -19 -73 -208 -127 158 -43 209 -72
5410g2j1L10j97K7R4j21j98L16j5p2r3Q7n0k33K43k98K22J29j92M7K26l18K12
$$ -72 -83 227 30 57 151 30 -168 148 133 61 -32 55 5 -228 15 -283 -61 68 -124 -77 149 -169 43
5433D3pjj21K49j80K0l33M93p1k8j57J63j01l0J06K09k71K00k33rj1qL05l64Q
$$ 43 36 35 -86 163 -17 3 -330 163 92 64 -93 70 -31 -61 45 254 -17 183 -50 -59 -70 -78 227 -137 -129
5458a29J13K74k01K57k34l8l24M11l16R5O1j71K72l6K44k46P9k19R8n9mK77j34
$$ -129 -16 258 57 314 80 42 -282 129 -187 -92 -31 -202 70 34 278 32 111 -108 -10 -69 -73 204 70
5481G0j13J20J22K6q5k05l2K69k00R1J32j76l62L32J06m4k9J83k77j13K62k16
$$ 70 -43 77 199 225 140 -65 -97 172 -28 63 195 19 -343 -11 95 51 22 205 -72 -185 77 -139
5503a39j87N57l24L56o49N27K19l29j03k2J94n2J21j24k4r6P6M4K07n00M69j03
$$ -139 -326 231 -93 263 -386 141 360 31 -72 -94 100 48 169 45 21 -75 1 45 252 -248 221 118
5525A18j94J95r9m27M86j11j4OK60lO5m54L2K00J21l78Q7q3L57k03j22N78l82
$$ 118 -76 119 20 -407 79 -32 -46 -40 220 217 282 -172 -140 60 181 -197 -110 -193 164 -39 -161 417 35
5548C5LK85k48n8M4j88M83m16k13L82j59J41j01J6n3k60K57J50l6M0k4o3j0QJ04
$$ 35 38 323 75 17 61 -127 356 -60 -273 109 -50 91 -10 6 -47 -307 -50 100 64 104 80 17 7 15 119
5573A19j78j5j84N42m11L7j84K72p6k3K07M9j85k16J58J52P0m9J21j56Q3j03J07
$$ 119 -59 -74 -258 284 -127 -90 -274 -2 -78 -101 106 155 -30 -246 -88 64 134 85 206 50 133 30 137
5596A37R3l48n8o6K75P7K6k97p8L91J5j60m8j06K18J2l5j8k82K02j4L78l41N3
$$ 137 230 -118 -176 -242 33 110 136 -161 -239 152 167 7 -41 -147 71 83 48 30 -252 -50 -64 314 -27 26
5620B6j15J37j40k2j55N31k56j19J27J76j99J62q1R6j07Q1j01p7K22l88j65M53
$$ 26 -89 48 -92 -114 -269 262 6 -113 14 190 -9 153 72 168 61 142 41 -36 186 -202 -367 86
5642H6j77o3J22J68O2j29l1j66pK63O0o7OJ9q6Q6k45J05n2K90l71p0L28l08K22
$$ 86 -91 -154 -32 136 198 69 38 -128 -135 128 188 121 127 146 60 146 -99 6 -46 244 -127 -197 131 -177 45
5667D5P7p8J85j54p6K18R9l22n8J48M3k4j70R8j87R9J39M27q10J45K73O1r3k28
$$ 45 122 44 229 75 -1 217 316 -6 -64 84 127 103 -67 31 -156 -57 82 509 -301 -156 117 178 85 -143
5691a43R6Q6p6L8J67j78L68l60Q1n2j35K96n9r1k26K85j39R3L16k77j29j07K87
$$ -143 -47 39 -37 1 168 -10 358 -2 79 27 -108 188 129 38 -188 97 -42 51 367 90 -39 -146 141
5714A41j45j13q2M41k85J16j7n3J09J31O2k29j76L23j79J2k81K13J1K91o20M40
$$ 141 -4 -117 -199 242 -43 73 56 3 112 243 305 76 -100 223 44 56 -225 -12 -1 290 -330 110
5736A10m6O3j27p5L05n43M85j3l1l48L58r0j56K14J01j35q5l9p6P1L18l02q2K61
$$ 110 64 127 0 -75 230 -313 172 159 128 -220 138 48 -108 106 207 72 -13 -52 -128 -57 261 -41 -123 138
5760A38N1m51L06J76k07k4k38K50L7J21j25q1Q7j53J16j53L43N1k27o6N2n2L3
$$ 138 189 -262 44 220 13 -11 -249 1 38 159 34 -47 40 -113 3 -150 193 244 17 -49 3 -49 -16
5783a6J03j15K06k23j8J51j9j44J01k86O7J16o1K43P8k88J85j12j46J60L5J41
$$ -16 87 -28 178 -45 -63 88 69 -75 26 -260 -193 -77 -138 105 183 -105 80 -32 -178 -18 17 158
5805A58j24L16l72L5J64l67L61l13K11j31j9o0K83q9j66K45l1j89j06J24j2M8
$$ 158 34 350 -22 13 177 -190 171 -142 69 -62 -81 -141 142 53 -113 132 101 -88 -194 -70 -82 -34
5827c4k98L32J86k28O5J05k75J48K9k21K38k57J27k34J43J31o7K35k83R4P7k66
$$ -34 -332 0 186 -42 23 128 -147 1 30 -191 47 -210 -83 -317 -174 -43 -110 125 -158 -64 13 -253
5849b53J04r2J40K29j85l31M22r1Q1j7J40r0l67J42M81J5o38K85k6L90m15q8J72
$$ -253 -149 -241 -101 128 -57 -388 34 -57 24 7 147 57 -310 -168 313 328 -310 -25 -51 339 -76 -164 8
5872HK18j90M4k5n7M6j45J31k52K64m03L01J12N1k17K24l17J73m2p0J48j26k3
$$ 8 226 36 80 55 -2 44 -101 30 -222 42 -361 -60 52 103 -114 110 -207 -34 -76 -146 2 -124 -147
5895a47L09j73o7K40k79L04n1j04Jj92L3J98m38M42l85L06J74l28K19l3j70J75
$$ -147 162 -11 -78 162 -117 187 136 32 33 -159 -126 72 -366 76 -309 -3 171 -157 62 29 -141 34
5917C4l50K56J21p4N5Q5k51R6k35M13k38J85k81J74J3l8Q5k7r1j17J97l22N88
$$ 34 -316 -60 61 -13 42 127 -124 -28 -263 150 -88 97 -184 -10 3 -35 50 23 -68 -185 12 -310 278
5940B78k80%J10pm12j1K66R8M4j75l25L19N9m0L27l59K59m45J34j45M12l5k33
$$ 278 -2 -2 108 101 -311 -322 -56 42 86 -89 -414 -95 -36 -76 251 -108 151 -294 -160 -305 107 72 -161
5963a61K88j33J06o9j23K61j54N3k28k27L12j57K12Q8L3J14r3j59o4K96M6l06
$$ -161 127 -6 100 31 -92 169 15 68 -160 -387 -75 -232 -20 68 101 215 122 -37 -101 195 241 -65
5985f5M7n1j35K55k02M08j35k19R3J31k22M1l5J41k40L35j72K80j64l6J16l29
$$ -65 -18 -69 -204 51 -151 257 122 -97 -4 127 -95 -54 -89 52 -188 147 -25 255 91 55 171 -158
6007a58J05p5K35k33K26R8j49j92J59J94k36L69j76o0p2j60K25l29N25m57Q6O9
$$ -158 -53 -128 107 -126 100 198 49 -143 16 210 -26 343 167 107 35 -125 100 -229 296 -161 -75 -6
6029fk3j5O5n9K52l72J17K83j58n4l5J44O6l33J26j37J69j87R2l1r0M89k87l01
$$ -6 -29 -44 21 -38 214 -158 -41 242 84 30 -5 139 205 -128 -2 -139 30 -157 -65 -96 -186 303 16 -285
6053b85J69q2L43k05J82j62n8O3q6J46j3K68l25N7J35k79K53j01k0q0J16K85n06
$$ -285 -116 -198 145 -60 122 -40 -98 -35 -121 25 12 280 -45 12 147 -132 121 20 0 -80 36 321 -185
6076a85J05j25J00L6J58J7J0L0m22L34q7K1J15k71K40j34K40o0k52n3L12j54j79
$$ -185 -80 -205 -105 -69 89 106 116 146 -276 58 -29 -8 107 -164 76 -58 182 122 -130 -183 129 -25 -204
6099b04M9J27P6R0M4j29J4n04M73k0lj5p4l2KR2K5J7n7j01OJ89k1J20j87k43M03
$$ -204 -155 -28 48 138 182 53 67 -437 36 16 13 -2 -76 -108 -106 -14 11 28 -29 -130 -124 65 44 164 -23 -266 137
6126A37k34L27m56K77k16J35K64k43Q2r0L6l8jl50P42j39m36J16J91K8N5O6l16
$$ 137 -97 230 -226 51 -165 -30 234 -9 73 -17 19 -19 -20 -370 372 233 -203 -87 104 132 187 253 -63
6149f3K16k82K6L12l40N9K99l35K05j65J24j42r9K81O5j49k01K6N5K02j82J17
$$ -63 153 -129 -103 209 -131 -72 227 -108 97 -68 56 -86 -185 96 161 12 -189 -163 -108 94 -88 29
6171B9j26K57k02j1P6j04M57l23k20K14j49P1J4L33n57J79j52K59k9K68o6k21
$$ 29 -97 160 -42 -53 23 -81 376 53 -167 47 -102 -31 -17 316 -241 -62 -214 45 16 284 218 -3
6193cl85K59K41K9j92m7K9j23K71p0p1J85l75K85l78O6K96m7J58n8K2j88L06j11
$$ -3 -388 -129 112 141 -51 -98 -69 -192 79 9 -62 123 -252 33 -345 -279 17 -30 128 70 92 -96 210 99
6217I9M5j80J58k82r1n4J82j96M02l43L34J03l66K55j56M19l68K19o1k62J10p2
$$ 99 144 -36 122 -160 -251 -305 -123 -319 83 -260 74 177 -189 66 -90 329 -39 180 119 -143 -33 -105
6239a05K23j01M8J35j62o1oj0K91m05o3J09J25j52j09R8J45N7j03n8K19J5r1J0
$$ -105 118 17 65 200 38 -23 -29 -39 252 -153 -216 -107 18 -134 -243 -145 0 57 -46 -104 115 130 39 49
6263D9o1q4O1P6j00o5K58p4q7p4j13J92J1K32j10j54j46N7J09Q7k82L83m04J48
$$ 49 -12 -96 -35 41 -59 -124 134 60 -27 -101 -214 -22 -11 221 111 -43 -189 -132 -23 64 -218 165 -239 -91
6287i1j40L39k14j51J84l2k1k3K19Nk75K48j99P6j79L89J46o78L76j52J37J96
$$ -91 -231 108 -106 -257 -73 -105 -126 -149 70 75 -200 48 -151 -75 -254 135 281 -397 -21 -173 -36 160
6309A60j19j89K38k54J75j65O1J77n4k07N00l13J3pj59K51J82n7m8k73K69K25
$$ 160 41 -148 90 -164 11 -154 -93 84 30 -177 323 10 23 16 -143 108 290 233 185 -88 181 406
6331D06k33l38J93K22k6j66o2n8J00O9j45k05n9M47l22Q0Q9j3m3j86K58%p3p0
$$ 406 173 -165 28 250 224 58 -4 -62 38 107 -38 -243 -302 145 -177 -97 -8 -21 -64 -250 8 8 -65 -135
6355a35K13R5Mj35k49K30m86M29J03j08K0n5J60k45K26k7j54L35k26J65k08j33
$$ -135 78 173 177 42 -207 23 -463 -34 69 -39 -19 -74 86 -159 67 40 -114 221 -5 160 -48 -181
6377a81J23k31J62p4m8k8J86J81J04R4k4l27q5R3M16l82J43K2N8m92J75n5J0J8
$$ -181 -58 -289 -127 -201 -249 -277 -91 90 194 288 264 -63 -148 -55 361 -21 122 144 202 -290 -115 -170 -160 -142
6401a42K03K9L4K4l84P6K32r7j3Q4o8j47J84j95J80P3J16m32K16J83J51l49J41
$$ -142 61 90 124 148 -236 -160 72 -25 -38 46 -22 -169 15 -180 0 73 189 -243 -27 156 307 -42 99
6424I9J66k05L9Ok26M09k21M1o1j13J34k84J4L33j40J32n0q7M5q2K09l21J31r4
$$ 99 265 60 99 105 -121 288 67 108 47 -66 68 -216 -202 131 -9 123 73 -14 31 -51 158 -163 -32 -126
6448a26n5K48l4N4p1J32Mm3k5n5j52L12k67J64l14M03j22j04P2j8J7j58K29L3
$$ -126 -181 67 33 87 16 148 152 109 84 29 -123 189 -78 86 -228 175 53 -51 21 3 20 -138 91 124
6472A24l71L53Q5n67M22j52J30j26j5K16k03k6M26k01l3k38R5K45K20n36J3K72
$$ 124 -247 106 191 -376 46 -106 24 -102 -117 99 -104 -130 296 95 62 -176 -81 164 384 -152 -139 133
6494A33l49J48Q3k05M50o5p8K6k46R4j71N82l20J75Q0l72K51j48j12k06J90j40
$$ 133 -216 -68 15 -190 260 195 117 143 -103 -9 -180 402 82 257 337 -35 216 68 -44 -250 -60 -200
6516b00K30q7J70J7k14K7Q1l3J48r1m44M13p3P2J07k45J19J3jk96K25NJ10R4k27
$$ -200 30 -57 113 130 -84 -57 24 -9 139 48 -396 17 -56 16 123 -122 -3 10 9 -287 -62 -57 53 147 -80
6541h0l2K01k63L75k40O5l5j44K78j85Q6j61K08P5k84K64q0j5K85k28l4K1n8o2
$$ -80 -112 89 -174 201 -39 26 -9 -153 125 -60 26 -135 73 148 -136 128 48 33 318 90 56 77 19 -43
6565d3J53Q4K0l03J08j49L11k06On2R2JP5J2l60J62J8j45L44j60OK2K03k52j67
$$ -43 110 194 214 -89 19 -130 181 -25 -19 -71 21 22 97 109 -251 -89 -71 -216 128 -32 -26 -4 199 -53 -220
6590b20K30k34K0J13J10L5n2jJ56J40j56P6n2o5j84k8MJ27q9J14j39K1L28j22
$$ -220 10 -224 -204 -91 19 54 2 1 157 297 141 217 165 100 -84 -112 -108 19 -70 44 -95 -74 254 132
6614A32j13%j12pL69l76K97O2l73N05n09L18k50L29l26R5Q9J27l22O3P8r8L4m57
$$ 132 19 19 -93 -100 269 -107 190 252 -121 384 -125 193 -57 272 -54 41 130 257 -65 -2 76 -22 12 -445
6638d45L07O5l15M71k36K44O6j58m7J49j83O6K59m86L54k6j5l65L06k61L53k03
$$ -445 -138 -73 -388 83 -153 91 157 -1 -48 101 -82 -16 243 -243 111 85 70 -295 11 -250 103 -100
6660a00J34q8M32m17Q5k21L4L67k32k60K0J64j73K89k23J92Q2N8K17l19k8K72
$$ -100 34 -54 378 -39 46 -175 -141 226 -6 -266 -246 -82 -255 34 -189 3 85 143 360 41 13 285
6682B85M5k70j44J68k62L55q0J07j24n4J2j22J29n3K16N0l97K20q6R1K91l65k00
$$ 285 330 60 -84 84 -178 177 97 204 80 26 38 -84 45 -8 208 258 -139 81 -5 86 377 12 -188
6705a88P8O1m5K13k1l3l76M79L6l37k1J13q8L91k28J64l90K63l43J11J14m4K12
$$ -188 -110 -49 -94 119 98 65 -311 168 204 -133 -154 -41 -129 262 34 198 -192 71 -272 -161 -47 -91 121
6728A21j17Q4q0P7j70L3J68qj78j53K09J10l86O51m23k13K24K9J45j66M9O6l0
$$ 121 4 88 8 85 -85 -52 116 108 -70 -223 -14 96 -290 361 -62 -275 -51 -22 123 -43 6 72 42
6751D2J39l18P5J79m22K60K6L7k42L11k19J78K5K7q9m5P0kJ53n61J61M23j12M3
$$ 42 181 -137 -62 117 -305 -45 -19 18 -224 87 -132 46 71 98 9 -36 34 32 185 -376 -215 208 96 139
6775A39j6l6P5j85M7J57o8l7K9p1j16J78k57O8K53m00L94L8P9k27k1M0J56jl1
$$ 139 123 87 162 -23 24 181 113 76 105 34 -82 96 -161 -93 160 -240 154 192 271 44 23 63 219 218 187
6800A87j38O2j04j83K68j16K6K15m99K40j12J15K59j04j10p1Q9l7o7J38l39K39
$$ 187 49 111 7 -176 92 -24 2 217 -282 -42 -154 -39 220 116 6 -65 24 -13 -80 58 -281 -42
6822d2PK3j12L16R4o15O38l47J94l26j45R9M36n36M17N6l5k75M28l80k2J98j66
$$ -42 -35 -12 -124 192 286 -329 309 -38 156 -170 -315 -216 220 -316 101 157 122 -153 275 -105 -127 71 -95
6845i5K06J29j93J63k41N8K4N4j57p7L02k49L33r9k54J30k40L98j30J61j90j07
$$ -95 111 240 47 210 -31 27 51 105 -52 -129 173 -76 257 158 -96 34 -206 192 62 223 33 -74
6867g4P3q2L76j62l04J31Q7O0n2L66r3n15j6K64K9l51K5J69j40L74Jj46L2r9Q8
$$ -74 -1 -83 293 131 -173 -42 45 105 53 419 326 -189 -205 59 88 -263 -238 -69 -209 165 166 20 52 -47 41
6892D1O7q3k78M24l21K07J25m9o1r3K16m7l43J98k0j47L71j00Mm0J61j83l72M91
$$ 41 108 25 -253 171 -150 57 182 133 72 -21 195 148 -195 3 -17 -164 207 107 111 71 232 49 -323 168
6916A68k46J32k66j75N23l20K90r2K61l02J3P6l55M55j66J72m80M10l9j37N8K84
$$ 168 -78 54 -212 -387 136 -184 106 14 275 -27 -14 62 -293 162 -4 168 -312 98 59 -78 -20 264
6938B64k84J49j35q8R4q5J29j17L30l11K11j77J30p2P2j63J32o9L8J65K8j02p2
$$ 264 -20 129 -6 -94 0 -85 44 -73 257 -54 157 -20 110 38 110 -53 79 10 48 213 241 139 67
6961F7j33j52l4L10k75K88N1MR5j67j04Q9K08j26q1k51K66l14M73k28J96k23k21
$$ 67 -66 -218 -252 58 -217 71 122 126 221 54 -50 39 247 121 40 -211 55 -259 214 -14 182 -41 -262
6984b62K31J41l22L88k31p6K3J20L07m44K24k8J93l99l9J15K79k36K6j63J72L3
$$ -262 -31 110 -212 176 -55 -131 -108 12 319 -125 99 71 264 -135 -174 -59 220 -16 10 -153 19 52
7006E2J3L28l31NK09m46q0L95o9k40L23l14K04l50J17R2NJ28j16M0K3k8j45K92
$$ 52 65 393 62 67 276 -170 -250 145 76 -164 159 -155 49 -301 -184 -92 -87 41 -75 -35 -12 -40 -185 107
7030A07j52K7l4K23m9Nj96JM6p5j75J23K26j25J66j49K9P3k11K31j95k20K95k15
$$ 107 -45 -18 -52 171 122 127 -69 -68 -22 -97 -272 -149 77 -48 118 -31 -2 71 -140 91 -104 -324 -29 -244
7054b44K83j0l28K36J62J75k80j45J32m6K6k9J61J75l39j34Q7Rj03K90R1m55K06
$$ -244 39 29 -299 -63 99 274 -6 -151 -19 -65 -39 -68 93 268 -71 -205 -118 -109 -212 78 169 -286 -80
7077h0K40k29%J53j33J79J69m73o3M54j46o5N3j08l4L89k28k77J77K91l2j80K47
$$ -80 160 -69 -69 84 -49 130 299 -174 -237 217 71 6 59 -49 -83 306 78 -199 -22 269 237 57 304
7100C04m42J79l4N9N0J2o3k1J08m94L96j69M9J43L4l54N15j61q2R6jj32R6l9P0
$$ 304 -138 41 7 66 116 128 65 44 152 -342 54 -115 -66 77 111 -243 272 111 29 125 124 -8 88 49 119
7125A19k54J71R3j18O8j09o0K35Rj66l10L83k9j32J89L1m87K14J47J06n78L79
$$ 119 -135 36 129 11 79 -30 -90 145 154 -12 -322 61 32 -100 89 120 -367 -153 -6 100 -478 -99
7147i9rJ62j09QO5L0J87k2m11p5M90k29j81L29j54L7rk4k7j70o5K14P9j86K20
$$ -99 -108 54 -55 -47 18 48 235 213 -198 -273 217 -12 -193 136 -18 19 10 -14 -41 -211 -276 -62 17 -169 51
7172E1l80K73J00k09K01N9k42K23k08Q8l5o1j32K53k20L2L25Kk21nj4R5J2o8k60
$$ 51 -329 -56 44 -165 36 95 -147 76 -132 -44 -79 -140 -272 -19 -239 -207 118 120 -101 -106 -120 -25 -13 -81 -341
7197c41N53k16j68L13l20K12LJ79J45m03J33k6m6J91l08J95R1m45K61J9j7Q4L
$$ -341 212 -4 -172 141 -179 33 36 215 360 -43 90 64 18 209 -99 96 187 -258 3 22 5 89 92
7220I2J7l93L74J31m68M01k37J85J55l35j9J5n8o6J51J10j36J22Q8k76J89k25
$$ 92 109 -284 90 221 -247 154 -83 102 257 -78 -97 -82 -140 -206 -55 55 -81 41 129 -147 42 -183
7242a83L75r5R7l03r1J38L05j37k43r1J84L5l5K93m47K73N4j80L07k43jJ11j85
$$ -183 192 97 194 -109 -200 -62 243 106 -137 -228 -44 -9 -44 249 -198 75 129 -51 256 13 12 123 -62
7265f2J25N5J37r0j89j23K21k53L35j98K5k81K15L59l45q5J81K14l16j08M2K02
$$ -62 63 118 255 165 -24 -147 74 -179 156 -42 -17 -298 -83 276 -69 -154 27 241 -75 -183 -141 61
7287F1r4q7j5j15M15J66n97J32L21j70k05K57k19M9L3O6K90k95Q9j59l08N85k42
$$ 61 -33 -120 -135 -250 165 331 -266 -134 187 17 -188 69 -150 -101 -68 -2 288 -7 82 -77 -385 200 -42
7310d2o4O1J22p9P7o7j82K8M4L64j98J56l10K12k76L8O9J4J13j31L1L8J3l53K84
$$ -42 -106 -45 77 -2 75 8 -174 -146 -102 262 64 220 -90 122 -154 -116 -47 -33 80 -51 -20 18 31 -322 -38
7335c8r4M00k68L6R5q1m44L43j4J59j7n7j76P4L23j75l1j04P3L7p6j46M13m66
$$ -38 -132 268 0 36 131 50 -394 -51 -65 94 77 20 -156 -82 241 66 35 -69 4 41 -35 -181 232 -234
7359b34J66Rq7L03l46J46l1l41M48J29l27N6m17K91K67J23k01N3J04k36M29o77
$$ -234 -68 -59 -146 157 -189 -43 -74 -415 33 162 -165 -109 -526 -235 32 155 -46 7 111 -125 304 -373
7381c73N17k37m6P2K39k4J00l20J66K2j37K58ok83Q8j61P7k49M98J34l68j06K67
$$ -373 144 -93 -139 -67 172 148 248 -72 94 116 -21 237 231 -52 36 -125 -48 -297 201 335 -33 -139 128
7404A28k82R2K19J20m33L57l06J98K35j06j80k14l4m5Q1KL20R3k71q4M9J12K71
$$ 128 -154 -62 157 277 -156 201 -105 93 328 222 42 -172 -206 -251 -170 -168 152 245 -26 -110 -61 51 322
7427C22j84N9j63l36J42L24j91k38K19J81m38K60J72j26n8o1J06K2J33r4j38Q9
$$ 322 138 197 34 -302 -160 164 -27 -265 -46 135 -303 -43 129 3 -55 -116 -10 12 145 51 -87 2
7449BK43p2j07J39m14M43m07Q8J94%J10k43k27M12j78J81m85K50L00j21r5Q8k45
$$ 2 245 173 66 205 -209 234 -173 -85 109 109 219 -24 -251 161 -17 164 -321 -71 229 108 13 101 -144
7472a44M42k32j95L3J9K98m21M2L7l6j9P6J24J39k44M1K02j12o5r5j4o5K43j08
$$ -144 298 66 -129 -96 -77 221 -200 -158 -121 -157 -176 -100 24 163 -81 -40 162 50 -15 -110 -124 -189 54 -54
7496e4l16M40J5p5k64K35R9k83l6J67P5J6n8o1j52L19o1N2r1O7o2k8lK2J59l26
$$ -54 -370 70 85 10 -254 -19 80 -203 -239 -72 3 19 -39 -100 -252 67 6 58 -33 34 -28 -56 -59 -37 122 -204
7522b04M0J4N34l63J37n8j45J9L4J78k88J13Q2J12m44J34L9o8J31N9k8J52j13
$$ -204 -164 -150 384 21 158 100 -45 -26 8 186 -102 11 93 205 -239 -105 -66 -134 -3 56 28 180 67
7545F7o2J55k56J10j14K87k74J48oQL15k82l08J21J44O8k47J95l11J36N5j01L26
$$ 67 5 160 -96 14 -100 187 -87 61 55 63 378 96 -212 -91 53 121 -126 69 -242 -106 -51 -152 174
7568A74L4j87p7J18J63j11m9K82j72k05l3k08L94k06j92O75k35j57J13N4j16J59
$$ 174 208 21 -56 62 225 114 65 347 175 -30 -63 -271 123 -83 -275 400 165 8 121 175 59 218
7590B18J0m33K03M9P1k41K80j69m8J38k56N4J79j75R9M01l99K11k34J86m62M02
$$ 218 228 -205 -2 47 118 -123 157 -12 -60 78 -178 -124 55 -120 -21 380 -19 192 -42 144 -318 84
7612H4q4Q4O5j59j29J82j03J61J9m20L85J48j42K31j17j44K68l84J69j35k21K10
$$ 84 0 84 149 -10 -139 43 -60 101 120 -300 85 233 91 322 205 61 329 -55 114 -21 -242 -32
7634c2j62K78r5K1J40j34q0m4N9J89j27j99J01J52j56J87J50m37Q1j36R3m5k5
$$ -32 -194 84 -11 10 150 16 -64 -108 -49 140 13 -186 -85 67 -89 98 248 -189 -108 -244 -151 -196 -221
7657b21K71k85k4K32o2J85q0q7J68k19J34j8j33J49J03o6n5L9K97k83j54K1m7
$$ -221 50 -235 -259 -27 -89 96 16 -71 97 -122 12 -6 -139 10 113 47 -8 31 328 45 -109 -88 -135
7680a35L22j39J8qJ08m5j07o6n0n2J99j93M26k26l15J54r6J49l05M11k6oM9K94
$$ -135 187 48 66 58 166 121 14 -52 -102 -154 45 -148 278 52 -263 -109 -205 -56 -361 50 24 18 67 361
7704C61m90o4N21k93j6j87K80R2l58M3J13r5M37l80L2k2q3n4K3O4K67K7l53o1
$$ 361 -129 -193 328 35 19 -168 112 204 -154 -111 2 -93 344 -36 -4 -26 -109 -163 -140 -76 191 218 -135 -196
7728a96J97lQ7J5O1n6k2j14j55mK00J10k12J12r0R4Q6k66J17J67k26J24J43O8
$$ -196 1 -2 85 100 161 105 83 -31 -186 -190 10 120 -92 20 -70 24 110 -156 -39 128 -98 26 169 237
7752B37m02M14J4k3j55ORk18J63k1K60k80j20J29q6K77J3l05O7j84K01L31k40
$$ 237 -165 249 263 240 85 91 100 -118 45 24 284 4 -116 13 -73 204 217 -88 -21 -205 -4 327 87
7775H7j43K00n3q7N8l6J59j54M6j58K13l36J02j00K91j68kL5J35J45k07J19j4
$$ 87 -56 144 91 4 62 26 185 31 77 -81 132 -204 -102 -202 89 -79 -81 -46 89 234 27 146 132
7798A32J24n0l67R5j56J39J4m2J20l8o1j27K09L91n99M16j77j80J23l12M54Q6
$$ 132 256 206 -161 -66 -222 -83 -69 -111 9 -29 -90 -217 -8 383 -216 200 23 -157 -34 -346 108 194
7820A94j79K4M4j60j2N6K1k75L63K6J79j63k95L49m6M6q3oo8L64l90K26j4o50
$$ 194 15 39 83 -77 -89 -33 -12 -287 76 102 281 118 -177 172 126 172 89 83 15 379 -11 215 201 -449
7844d49L14K96l60L4k2J65L0QJ45J8m75K75J18l32K18K7Q0j92j30K78l6R2K82
$$ -449 -135 161 -199 -165 -187 -22 8 16 161 179 -296 -21 97 -235 -17 10 90 -102 -232 46 10 102 384
7867C84m51J2j78N1J90j65K26M6k84L70k92o2L1j68L16J34Mk37J58j69P1J16l02
$$ 384 -67 -55 -233 -182 8 -157 69 115 -169 201 -91 -153 -122 -290 26 160 164 -73 85 -84 -13 103 -199
7890a99J93j27J99q6n4K8J3k21K11J72q6q4N1J9l7K79l71k7K83j05L11m30k79
$$ -199 -6 -133 66 -20 -74 -46 -33 -254 -43 129 43 -41 10 29 -8 271 -100 -127 156 51 362 -68 -347
7913c47J07L07r7M1m2rJ52j50K30k47L1K06m73M23Pn38O60l15L2knJ55q1KJ25
$$ -347 -240 67 -30 11 -31 -40 112 -38 192 -55 -24 182 -291 132 139 -399 261 -54 -22 -24 -29 126 45 47 172
7938A72o6k89K28r1Qm6N6R9k38K76J95m08RK01J82l23k34MN59j32j59J12j74L61
$$ 172 106 -183 45 -46 -38 -84 -28 71 -167 109 304 -104 -95 106 288 -35 -269 -265 294 162 3 115 -59 302
7962C02l70O6J93m59L56M7j26R6L0k81J51l13K11q0K79N4N0k71R0R2k32J23j44
$$ 302 -68 -2 191 -268 88 135 9 105 135 -146 5 -308 -97 -177 102 156 206 -65 25 117 -115 8 -136
7985a36Q5MK63k97k24K20L10j29k59jMM85j10k91k71J87O0J47P0j20J27j65j50
$$ -136 -51 -47 216 -81 -305 -85 225 96 -163 -164 -160 325 215 -76 -347 -160 -100 47 117 -3 124 -41 -191
8008a91L63j99k4O3k01J48j18J89K35l82k9L66j63k0J63k64l53P26l14O6l4J11
$$ -191 172 -27 -51 12 -189 -41 -159 30 265 -117 -146 220 57 37 200 -64 -417 309 -5 61 27 138
8030A38k42N9K79l79K09N8q4k69K18P7l03L83k26M1p6j70L59j06L31m12l6J55
$$ 138 -104 -45 234 -145 64 122 38 -231 -13 64 -239 144 -82 -41 -117 -287 72 -34 297 -115 -151 4
8052DN9J04j26j77MO4K4J31j12p2J37j56k02J93L8l13M85J9O1l39K18j45K19k7
$$ 4 63 167 41 -136 -132 -68 -44 87 -25 -97 40 -116 -318 -125 -87 -400 85 104 165 -174 44 -101 118 91
8076I1k89l7L56j07j68K31mN6j83M3L54n07K45o5j84O9j72L23K13p4j56k08o1
$$ 91 -198 -235 121 14 -154 77 73 129 -54 -11 343 -164 81 16 -168 -99 -271 52 265 191 35 -173 -234
8099b34K48j25m4K86k06J71P5j16J29J7l94L64j24R7l05J28K90k55P2o0r0K12
$$ -234 14 -111 -155 131 -75 96 171 55 184 201 -193 171 47 144 -161 -33 257 2 74 14 -76 136
8121A36Nl27K9J67M0j1j41M8J61l05K98l73L71k88K50j30j94K38j8N8k00K16O5
$$ 136 141 -186 -157 10 50 39 -102 -54 107 -198 100 -273 98 -190 60 -70 -264 -26 -44 14 -186 30 95
8144I5R1k21m1K33l50J3L98j42j15J37k41k6L65l2J2k24L57m50p3L25O3k21l06
$$ 95 186 -35 -76 157 -193 -180 218 76 -39 98 -143 -169 196 164 176 -48 309 -141 -214 111 174 -47 -353
8167c53M67Kl18L86n0j16l4J13k01L3M4J19R9k15J91l51K06o1J28n3m2o7K0K16
$$ -353 114 116 -202 184 134 18 -16 97 -104 -71 -27 92 191 -24 167 -184 22 -39 89 36 -6 -73 -53 163
8191A63
$$ Imaginary data points
##PAGE= N=2
##DATA TABLE= (X++(I..I)), XYDATA
0@%%%%%%%%%%%Qj6J6j6J6k1K9l2L6m4M9n7O7p5Q7j01J14j28J45j63J82k04K29
$$ 0 0 0 0 0 0 0 0 0 0 0 0 8 -8 8 -8 8 -13 16 -16 20 -24 25 -32 35 -40 47 -54 60 -68 77 -86 96 -108 121
34A21k55K81l11L46l86M30m76N26n81O42p13P92q80R81j096J233j395J589j831
$$ 121 -134 147 -164 182 -204 226 -250 276 -305 337 -376 416 -464 517 -579 654 -741 848 -983
53i83K138k543L103l932N278p820J4207n6627j16213J11305K7062l2550N3065
$$ -983 1155 -1388 1715 -2217 3061 -4759 9448 -47179 -163392 -52087 -25025 -57575 -4510
66d510M390o0280L8674M1198j4245K1244J4393l7140M8R458k2284j21R537j9868
$$ -4510 -120 -60400 -21726 19472 5227 26471 40864 3724 3772 13230 -9054 -9175 362 -19506
80a9506k860J1726j935J1107J9354o611p430M061J309K265j951j3263q373L476
$$ -19506 -22366 -10640 -12575 -1468 17886 11275 3845 7906 9215 11480 9529 -3734 -12107 -8631
94h631L000M7P48K583L076K981K732O20n57o67l606m995j066j063j846M383J187
$$ -8631 -5631 -5584 -4836 -2253 823 3804 6536 7156 6599 5932 2326 -2669 -3735 -4798 -6644 -2261 -1074
111a074m210K259N447J649K480j109o652J063L515n029j545J051l340Q07M541
$$ -1074 -5284 -3025 2422 4071 6551 5442 -1210 -147 3368 -1661 -3206 -2155 -5495 -4688 -147
126a47j018J403M595l158j154L081k064j615J731k994k742J823L16J69L209j526
$$ -147 -1165 238 4833 1675 521 3602 1538 -77 1654 -1340 -4082 -2259 -1943 -1774 1435 -91
142i1j686L657J560j119q6j687j804R31J73j398J02L13o08R62J005Q71L96M25
$$ -91 -1777 1880 3440 2321 2235 548 -1256 -325 -152 -1550 -1448 -1135 -1743 -781 224 1095 1491 1916
160A916j085l50N04n86m63k12q95j416Q40J301P78q0j33oO33R52k86j339J32o7
$$ 1916 831 481 985 399 -64 -276 -1171 -2587 -1747 -446 332 252 119 113 746 1698 1412 73 205 138
180A38j262K12K82l41M60L15m12N86J525p19J37N58j104p56O12p9p39L12r22o15
$$ 138 -1124 -912 -630 -971 -511 -196 -608 -22 1503 784 921 1479 375 -381 231 152 -587 -275 -1197 -1812
200a812J928M31n50L85M46k85P49m61o51J74k77j040k08N31l55J142j82o61R47
$$ -1812 116 547 -3 382 828 543 1292 831 180 354 77 -963 -1171 -640 -995 147 -35 -696 251
219B51P38k78L17J29j270o88Q76m07N7l50k59l07J376m9P1L62K2j31k0J06m13
$$ 251 989 711 1028 1157 -113 -801 75 -332 -275 -625 -884 -1191 185 136 207 569 591 460 440 546 133
240A33l07k83m54O2L78K99J42J42K35j43l3Q60m95m66j75m02J22J32P6n57O29
$$ 133 -174 -457 -911 -849 -471 -172 -30 112 347 204 171 1031 536 70 -105 -507 -385 -253 -177 -734 -105
261a05K16p6M2K76K1m0j53q3j41q3k87J18n4j88M60n9K49r5M70l03J71k33k5k40
$$ -105 111 35 77 353 374 334 181 98 -43 -126 -413 -295 -349 -537 -77 -136 113 18 488 185 356 123 98 -142
285a42J17l08P6K39m29L49R9n0Q0J35Pj66L4j2j84L41l98J80k67J36K2l2j9L30
$$ -142 -25 -333 -257 -18 -447 -98 1 -49 31 166 173 7 41 29 -155 186 -212 -32 -299 -163 -141 -173 -192 138
309A38j24P0j41J82J12J5q7J9m24j85L80p2K93l55KN0j23L55J00k52k6O8k8n9
$$ 138 14 84 -57 125 237 252 165 184 -240 -425 -45 -117 176 -179 -177 -127 -250 105 205 -47 -73 -5 -33 -92
333i2k21J89j7J4l59M83J87j23J02K48l77j68M29l14J79l38j31Q2k7L38j86P5
$$ -92 -313 -124 -141 -127 -486 -3 184 61 163 411 34 -134 295 -19 160 -178 -309 -227 -254 84 -102 -27
355b7k29M36k61N29l62O3m1k63K8J53m0j98J03o2R5K77k22m6q0L60J56n08L55
$$ -27 -256 180 -81 448 86 149 108 -155 -127 26 -14 -212 -109 -171 -76 201 -21 -67 -147 213 369 -139 216
378B16l97R5j7l64L52K52m8k01j8K96P3J63l04j37l27M10q3N2l64M31o3p4J47
$$ 216 -181 -86 -103 -467 -115 137 89 -112 -130 166 239 402 98 -39 -366 44 -39 13 -351 80 17 -57 90
401I0j05J05M4J00j29l9m88O46l03N8m1l07O30j12R0m4nk30j44L40j44j01M1k27
$$ 90 -15 90 134 234 105 66 -422 224 -79 -21 -62 -369 261 149 239 195 190 -40 -184 156 12 -89 -48 -275
425b75K60k7L8J3%K3r7L46j02j33k1j31J36k22Q1J15l0lj91L32m2j51j03J44J94
$$ -275 -15 -42 -4 9 9 32 -65 281 179 46 25 -106 30 -192 -111 4 -26 -29 -220 112 70 -81 -184 -40 154
450A54K14Q5n63O0j56J05K16j61q8j38L00J50R3q8O3n09J57r3K06j85K27j95k6
$$ 154 368 453 -110 -50 -206 -101 115 -46 -134 -272 28 178 271 183 246 -263 -106 -199 7 -178 49 -146 -172
473a72o1K45J33O0j97p1J01k05K22j90M3k52R1N68l13J93L3l3j31p5q0L32k49
$$ -172 -233 12 145 205 8 -63 38 -167 55 -135 -92 -344 -253 315 2 195 228 195 64 -11 -91 241 -8
496hm4K4O1L7J56j01K7m0j26j08J13k4Q8L36m19J95j70rJ47n0r0k22L08J17k74
$$ -8 -52 -28 33 70 226 125 152 112 -14 -122 -9 -33 55 391 -28 167 -3 -12 135 85 -5 -227 81 198 -76
521g6J40l12J21N1R6J39m18J87j0L09l21j15L85j26k59K38J32k35K87m8l07K3
$$ -76 64 -248 -127 -76 20 159 -259 -72 -82 227 -94 -209 176 50 -209 29 161 -74 213 165 -142 -119
543a19K41n00K09J31l24J86J26Ojm4J93j61M99m53m43O33j17q7r0j30J19J94M10
$$ -119 122 -378 -169 -38 -362 -176 -50 -44 -45 -89 104 -57 442 -11 -454 179 62 -25 -115 -245 -126 68 478
566D78n17j1n9j21M35j68L2j14J26j0M8j44J06j6j31L42j40J04q5k00J52p9QJ17
$$ 478 -39 -50 -109 -230 205 37 69 -45 81 71 119 -25 81 65 -66 276 136 240 155 -45 107 28 36 153
590A53q7m51L25K24k82j58M4K45o2QK38k30o3J75j76R6N1N5L9OQnl24j25L91r7
$$ 153 66 -385 -60 164 -118 -276 -232 13 -49 -41 197 -33 -96 79 -97 -1 50 105 144 150 158 153 -171 -296 95 -2
616bOj67j83J99K71j31r4N3L31m89N1j03L56k9o8J57k89J91j3J43l80R2k2K35
$$ -2 4 -163 -346 -147 124 -7 -101 -48 283 -206 -155 -258 98 69 1 158 -131 60 47 190 -190 -98 -120 115
640A15L1j9j97j82M14J4q0l00m1p9K77K00k81lk6O9R8j65p1O55o18O3M2k0J0j33
$$ 115 146 127 -70 -252 162 176 96 -204 -245 -324 -47 153 -128 -131 -157 -88 10 -155 -226 429 -189 -126 -84 -104 -94 -227
666b27M44l82L03K87n86L40k9j79n0P5K11j82K15m0l00K9o1L05k15K21j62k41
$$ -227 217 -165 138 425 -161 179 150 -29 -79 -4 207 25 240 200 -100 -71 -132 173 -42 179 17 -224
688b24oK42j43J18Qj43L95l60J64Q5m52K26j34r0K99m7k86M5L41l2O2n8j47K2
$$ -224 -230 12 -131 -13 -5 -148 247 -113 51 136 -316 -90 -224 -314 -15 -62 -348 -303 38 6 68 10 -137 -115
712a15O7J01k5l2m1m5j79L28k13J22P2M3J07l45K34j45K10j91p0J48J02k99L63
$$ -115 -48 53 28 -4 -45 -90 -269 59 -154 -32 40 83 190 -155 79 -66 144 -47 -117 31 133 -166 197
735A97j33j7J00k47M0L56j13j55j40L0Q1Q3j9l8k35K79j77r0J54Lk43L78q7J41
$$ 197 64 47 147 -100 -60 296 183 28 -112 -82 -1 82 63 25 -210 69 -108 -198 -44 -41 -284 94 7 148
759A48k6o08M31J93K31k34k96K16r4M5m0M5j5l9j97K30j05l0P8J4j59J02L9J88
$$ 148 122 -486 -55 138 369 135 -161 55 -39 6 -34 11 -4 -43 -240 -10 -115 -145 -67 -53 -212 -110 -71 117
783A17J45m21M57k54l8M5P5N9o7J86j37j16k29M1K93q6J25j24o5mj54K90Mk24
$$ 117 262 -159 298 44 6 51 126 185 118 304 167 51 -178 -137 156 70 195 71 6 2 -152 138 142 -82
807h2K65k09P3k01J77O1k33K37L4k22R3K57k9r9j91J90j52j39j74K63J08L6k17
$$ -82 183 -26 47 -154 23 84 -149 88 122 -100 -7 250 221 122 -69 121 -31 -170 -344 -81 27 63 -154
830a54K15j70J63l44L33k21J17k88N20M6n87P32n31K68n9kj68K21J33j92J56j00
$$ -154 61 -109 54 -290 43 -178 -61 -349 171 217 -370 362 -169 99 40 38 -130 91 224 32 188 88
852H8J20k22j11K71Pm91L85K17n45J61K65j87o3Q8j08N0J59j65n6O8m8J76j66
$$ 88 208 -14 -125 146 153 -338 47 264 -281 -120 145 -42 -105 -17 -125 -75 84 -81 -137 -69 -117 59 -107
875a07Q6P9j68L6O8k31K87k83L62m00M04J13k65K27n2k49O7%K8J51k0j71K5P9
$$ -107 -21 58 -110 -74 -6 -237 50 -233 129 -271 133 246 -19 208 156 -93 -26 -26 2 153 133 -38 -13 66
899F6O0k92K96j28K1J87O5k14m5l12J97K04l84J85M6K46j95J55Oj41p9l0l54K35
$$ 66 126 -166 130 2 23 210 275 61 16 -296 -99 105 -279 -94 -48 198 3 158 164 23 -56 -86 -440 -205
923b05j26K37J05k05K61n1j60K55p7k0j60K96m7k18L44nn98K76M7q9L90l40K27
$$ -205 -331 -94 11 -194 67 16 -144 111 34 14 -146 150 103 -115 229 224 -374 -98 -51 -140 250 -90 137
946A37l64K21Q7k96M0J53J90n84M42L03n86L89k30l1M3q4j58M05k6j18R1L90m05
$$ 137 -227 -6 81 -215 -175 -22 168 -416 26 329 -257 132 -98 -129 -86 -170 -328 77 51 -67 24 414 9
969Ip0K71k75o4J56j16L4J03o4O0l25N29j20j46J73k66j7m4L47q2O0k42k63L06
$$ 9 -61 210 -65 -129 27 -89 -55 48 -16 44 -281 248 128 -18 155 -111 -128 -172 175 93 153 -89 -352 -46
993d6Q8q6q6K78m02L25j7K95m66K2j45K27O2L25k50J21k80Q6J7q5j80J32K73k24
$$ -46 42 -44 -130 148 -254 71 54 349 -117 -95 -240 -13 49 374 124 245 -35 51 68 -17 -197 -65 208 -16
1017a6L08k26j71O5M1l00Q0K03J01k5k48K55k90N9L19l56K76K1j98J79k00j19
$$ -16 292 66 -105 -40 1 -299 -219 -16 85 60 -188 67 -223 -164 155 -201 75 96 -102 77 -123 -242
1039b42L02k87K61J21j42J30j79J06O7j97L05m7j76n5j14K14j5L3k38L14j25j27
$$ -242 60 -227 34 155 13 143 -36 70 137 -60 245 198 22 -33 -147 67 52 85 -153 161 36 -91
1061i1j10O0J47o0M29m38j0L52l19O4j7n22O61k27J82j33J15r4j48R2K52m58M8
$$ -91 -201 -141 6 -54 375 -63 -73 279 -40 24 7 -515 146 -81 101 -32 83 -11 -159 -67 185 -273 -225
1084b25L09j83K06q7p8P0K76m37Q5j51K34l2J69k41j94L75k2K2p1o7M2O1Q0l52
$$ -225 84 -99 107 20 -58 12 288 -149 -64 -215 19 -13 156 -85 -279 96 74 96 25 -42 0 61 141 -211
1108b11Q6Pk9R7r7K58j26l8J00J49k32Q0R2L2m5l11M58m07m0K28j28JO5j4l28
$$ -211 -125 -118 -147 -50 -147 111 -15 -53 47 196 -36 44 136 168 123 -188 270 -137 -177 51 -77 -76 -11 -25 -353
1133c53L99Q1k56K74p5J34l72J24N8J49j14M9l61L97o5q8K77m74M59l73K15N9
$$ -353 46 127 -129 145 70 204 -168 -44 14 163 49 98 -263 134 69 -19 258 -216 243 -130 85 144
1155A44k44j31l2R7J71q5K01L4j24K27k61J23n0O3j14l63K25m6J84l7J87l50L4
$$ 144 -100 -231 -263 -166 5 -80 121 155 31 258 -3 120 70 133 19 -344 -119 -165 19 -18 169 -181 -147
1178a47J03L95j92J30m26K00k90j5L13j02J32j15m9O5q6L44p8j82L1rk6J35j59
$$ -147 -44 351 159 289 -137 63 -227 -242 71 -31 101 -14 -63 2 -84 260 182 0 31 22 -4 131 -28
1201b8r6K97j15j22j61K07K3J47n7j27L25l63J03k9j26K47N2k27p6O0J47J40k37
$$ -28 -124 173 58 -64 -225 -18 5 152 95 -32 293 -70 33 4 -122 125 177 -50 -126 -66 81 221 -16
1224a6L7k38J28K54k92L24k54Q8J49l59l7J99j40J75j47Q9Pk55J98o0j13L0K24
$$ -16 21 -217 -89 165 -127 197 -57 31 180 -179 -216 -17 -157 18 -129 -40 -33 -288 -90 -150 -263 -233 -9
1247ik33L40o5j13J67k25J53J99o7m02J52Q2k39J57JJ44J03j25K2O8j81j2M9K10
$$ -9 -242 98 33 -80 87 -138 15 214 147 -255 -103 -21 -260 -103 -102 42 145 20 42 110 -71 -83 -34 176
1271A76j84n8l70L77K64j01O7k6j23k18K68j19M20k68j13J91p9O9k21q8K32j69
$$ 176 -8 -66 -436 -59 205 104 171 145 22 -196 72 -47 373 105 -8 183 104 173 -48 -136 96 -73
1293g3o7J29j68RN43l05k70K18Jk21L55j14j21J62P3k7k95M1j56M2J97J6j0k18
$$ -73 -140 -11 -179 -170 373 68 -202 16 17 -204 151 37 -84 78 151 124 -171 -130 -286 -244 -47 -31 -41 -259
1317b59L08l20L01k9k27N2K82Rj99O0j62K31k22P1J18o4K84m96J99rN5L0Jp2J97
$$ -259 49 -271 30 1 -226 -174 108 117 -82 -22 -184 47 -175 -104 14 -50 234 -262 -63 -72 -17 13 14 -58 139
1342A39q0k31L48M04o96j12K62n4P1L0L9j41k46J71J00J42J24l47K41l6l33K72
$$ 139 59 -172 176 580 -116 -228 34 -20 51 81 120 -21 -267 -96 4 146 270 -77 164 128 -205 67
1364F7k23N3K89J2l60K4K25L0l29J52J17J82l81L3j0J11j36K26j21n3J00m7L4
$$ 67 -156 -103 186 198 -162 -138 87 117 -212 -60 57 239 -142 -109 -119 -8 -144 82 -39 -92 8 -39 -5
1387en0j15K73k30K62k22k09L91O9r1k02J13p3L4qo2Rp9R1P6l3L00j55P7n3l6
$$ -5 -55 -170 103 -127 135 -87 -296 95 164 73 -129 -16 -89 -55 -63 -125 -116 -195 -104 -28 -61 239 84 161 108 72
1413G2m0k5j13K58j84J29k26J6J39j90L24k77K2N4J95p8N8j90o7J44QK02j48j23
$$ 72 32 7 -106 152 -32 97 -129 -113 26 -164 160 -117 -95 -41 154 76 134 -56 -123 21 29 231 83 -40
1437d0J15J16k01j26Q9L1M8j21K67q9p0J23l13J50l04L56o7j90K24J53j71QR7
$$ -40 75 191 -10 -136 -47 -16 32 -89 178 89 19 142 -171 -21 -325 31 -36 -226 -2 151 -20 -12 85
1460H5r1l38L78l81N11Q4k57o9L8Q3j94K99k16J10j28K12n02L71r6N7J67j79J06
$$ 85 -6 -344 34 -347 164 248 -9 -78 -40 43 -151 148 -68 42 -86 126 -376 -5 -101 -44 123 -56 50
1483E0k95M56j94L01j08k1l33K47J52l49q1K73N4l45K60j16J93j22O4p6L9k53
$$ 50 -245 211 17 318 210 189 -144 103 255 -94 -175 98 152 -193 67 -49 144 22 86 10 49 -204
1505b04M63l95R8J2J14k53J31n9N8Q2n8R2k45L7j51K07J37k23o7J84j29K79J4
$$ -204 259 -136 -38 -26 88 -165 -34 -93 -35 47 -11 81 -164 -127 -278 -71 66 -157 -224 -40 -169 110 124
1528A24k94J05k8Q0m7L53j04j50j53N7K90k95r5J53j25L9j1j34J63M1L0J79j72
$$ 124 -170 -65 -93 -13 -60 293 189 39 -114 -57 233 -62 -157 -4 -129 -90 -101 -235 -72 -31 -1 178 6
1551Fk93J32k16N33p7q7j5L6j46L60j80%K4j91K34k2q7j6P0k75o9L69r4O9J7J16
$$ 6 -287 -155 -371 162 85 -2 -17 19 -127 233 53 53 77 -114 120 98 11 -5 65 -210 -279 90 -4 65 82 198
1577A98l04M3L46l18J80j83J29r5j52J02Q4K1M2j32j64L13k85L22r8K5j08p3M8
$$ 198 -106 -63 283 -35 145 -38 91 -4 -156 -54 30 51 93 -39 -203 110 -175 147 49 74 -34 -107 -59
1600e9K76k2l62Q7Mj7J32j58K23j12J64m15K77K5o6M2K96n7m85Q2K65j52L7k99
$$ -59 217 195 -167 -80 -76 -93 39 -119 104 -8 156 -259 18 43 -23 19 315 258 -227 -145 120 -32 5 -294
1624b94J67M36k13j84o4K73j73L06j70N5J03j59O8j86J39m1o1j53J53o0j76K25
$$ -294 -127 309 96 -88 -152 121 -52 254 84 139 242 83 151 -35 104 63 2 -151 2 -58 -234 -9
1646iq3J50k79L90k13O1K42m06J95k47J44Q3K02j40R2m85L71l19N30k72j23L45
$$ -9 -92 58 -221 169 -44 17 259 -147 48 -199 -55 28 230 90 182 -303 68 -251 279 7 -116 229
1668B29l66M72k73J53j26k38M7J13j38O8J84l27K86J73j08k48n6J77J06No0Q2
$$ 229 -137 335 62 215 89 -149 -102 11 -127 -59 125 -202 84 257 149 -99 -155 22 128 133 73 155
1690A55l16r7M69j88mj45J64J99l30N6j84J40j11K48j11M01l35J45k21J02k90
$$ 155 -161 -258 211 23 19 -126 38 237 -93 -37 -221 -81 -192 56 -55 346 11 156 -65 37 -253
1711b53L91l62N58m50LO02l03k03k51L42j67q6K4j80N73l67M28o07O3L86m1j77
$$ -253 138 -224 334 -116 -113 489 186 -17 -268 74 -93 -179 -155 -335 238 -129 299 -308 -245 141 100 -77
1733g7J53k89R7m8K6KK8K33n2J48p0j48j58K49r8K0j06m9j09L52K24j29q4r1k33
$$ -77 76 -213 -116 -164 -138 -136 -108 125 73 221 151 3 -155 94 -4 16 -90 -139 -248 104 328 199 115 24 -209
1758b09L87r9J20m9R6n2j92m33K54K18L8k61J51qm0J23j24m3K51j03p7j49N34
$$ -209 178 79 199 150 246 194 2 -431 -177 41 79 -182 -31 -39 -79 44 -80 -123 128 25 -52 -201 333
1781C33n56L58j44k99N93j70mn0J30j21l02N00l63L37k50N1k4l47J05K13J71j7
$$ 333 -223 135 -9 -308 285 115 111 61 191 70 -232 268 -95 242 -8 43 19 -328 -223 -10 161 144
1803A44k72J78N9l60J27P9j13J20k4P0l9j64J46Q2M5o9L9L04k83L2m09N38l44
$$ 144 -128 50 109 -251 -124 -45 -158 -38 -62 8 -31 -195 -49 33 78 9 48 352 69 101 -308 230 -114
1826a14J01l5j71K34L00j09M8j46j51L0k0n3K60J9k15K35o8r9k84L69j14K29m2
$$ -114 -13 -48 -219 15 315 206 254 108 -43 -13 -33 -86 174 193 -22 213 145 46 -238 131 17 246 204
1849B04k11j40J21j57L88m62J73L54m32K22l7j47K1J04p7K14k89K73n9l54J65
$$ 204 -7 -147 -26 -183 205 -257 -84 270 -162 60 23 -124 -103 1 -76 138 -151 122 63 -291 -126
1870a26K91j07o6J30p8n3%L60k52p4r5O9q3q8K72l72M58j16Q3n57L88r0Q1J43
$$ -126 165 58 -8 122 44 -9 -9 351 99 25 -70 -1 -84 -172 100 -272 186 70 153 -404 -16 -106 -25 118
1894A18n32L69J44J6j21P4J55k61O1J53j95L0L3k2j10L04j57N3l2j51J35j85M0
$$ 118 -414 -45 99 115 -6 68 223 -38 23 176 -19 11 44 22 -88 216 59 112 80 -71 64 -121 -81
1917h1n9N2PR9l64K49K32k28R9k97M53k83J65j29K51j68r5k1Q8K5l39M23j09l38
$$ -81 -140 -88 -81 18 -346 -97 135 -93 6 -291 162 -121 44 -85 166 -2 -97 -118 -30 -5 -344 79 -30 -368
1941c68O35j49k91k7L6K55k4K22l47l46N40Q9k05J19l16Q2n3Q7J64k59J59J91
$$ -368 267 118 -173 -200 -164 91 67 289 -58 -404 136 225 20 139 -177 -95 -148 -61 103 -156 3 194
1963A94k00k33J66J49j28M4RJ09j01k07J49J47m0J32j03j73R4K09k22l22K08p9
$$ 194 -6 -239 -73 76 -52 -8 1 110 9 -198 -49 98 58 190 87 -86 8 217 -5 -327 -119 -198
1985a98Q6J48j33J95k80K68k91m0o8L61j31k95M96m22K34O4R3K5k0r8M2j00j96
$$ -198 -112 36 -97 98 -182 86 -205 -245 -313 48 -83 -378 118 -304 -70 -6 87 112 92 -6 36 -64 -260
2008b60K84l7N0L2j06K23k74j0L17k73m9L33j94J25k11j69L66k43J82J6k05J60
$$ -260 24 -13 37 69 -37 186 -88 -98 219 -54 -103 230 36 161 -50 -219 147 -96 86 102 -103 57
2030E7j12J82K00m08p2K74k69K46l34M29o34J76K46j94J65k11J19K02o3M7J28
$$ 57 -55 127 327 -81 -153 121 -148 98 -236 193 -441 -265 -19 -213 -48 -259 -140 62 -1 46 174
2051A74k62o6L77j87j30L9L54k35j08k35o8K28k1J69n2J67j37J0lQ1k02j02L7
$$ 174 -88 -154 223 36 -94 -55 299 64 -44 -279 -347 -119 -140 29 -23 144 7 17 14 95 -107 -209 -172
2074a72JJ51Q4j08K72k07Pn7j46K89j44j15K04j06K19p5o4j23nJ03J03kk28P2
$$ -172 -171 -20 64 -44 228 21 28 -29 -175 114 -30 -145 59 -47 172 97 33 -90 -95 8 111 109 -119 -47
2098d7J35j54j93J20L28k31k5o9M3J81j44r6L19j70L2k37J79l7K40k85M43k53
$$ -47 88 -66 -259 -139 189 -42 -67 -136 -93 88 -56 -152 167 -3 29 -208 -29 -66 174 -111 332 79
2120G9m47L43r9J81k69O47m53M3o8R9l13J33J38r5n3O7K17l05M46k08j25O3k79
$$ 79 -368 -25 -124 57 -212 435 -18 25 -43 56 -257 -124 14 -81 -134 -67 150 -155 291 83 -42 21 -258
2143b58L26l4L26l96K05j35j24J61J00p2R2j93k70K66j0j70j62L86p6%K62j59
$$ -258 68 34 360 -36 169 34 -90 71 171 99 191 -2 -272 -6 -16 -186 -348 38 -38 -38 224 65
2165F5p9n4J39J8r6k68N54m09l2J03L8j51J72o8j64M39j94j70J71j85N4L6K59
$$ 65 -14 -68 71 89 -7 -275 279 -130 -162 -59 -21 -172 0 -68 -232 207 13 -157 14 -171 -117 -81 178
2188A78n71N64k85l7M7K89j40J66k09p0k86M65k1l63N10j61k30J84L8p5J85n49
$$ 178 -393 171 -114 -151 -104 185 45 211 2 -68 -354 111 90 -273 237 76 -154 30 68 -7 178 -371
2210c71J96L14j47p8j2K9j29q1M6J26k61N07j35J97l22Kj6mK86r6k72K67j54q
$$ -371 -175 139 -8 -86 -98 -69 -198 -279 -233 -107 -368 139 4 201 -121 -119 -135 -139 147 51 -221 46 -108 -116
2234a16R1Km5J64j4k44L04k12k4Q4J82m57K56k33L17L9p4J22p1j17j29K4L93k13
$$ -116 -25 -23 -68 96 82 -162 142 -70 -94 -10 172 -285 -29 -262 55 94 20 142 71 -46 -175 -151 242 29
2258B9r0N92l52l12M3k1J19r8M4j6p4L38k13J52r4n9m7o1m2nJ46j2J94J43l12
$$ 29 -61 531 179 -133 -90 -111 8 -90 -46 -62 -136 202 -11 141 47 -12 -59 -120 -162 -167 -21 -33 161 304 -8
2283hj19K24J03k57p6O3j17K45j63J63k65K97q1o2J27o3N6j50k49K97q1K49k60
$$ -8 -127 97 200 -57 -133 -70 -187 58 -105 58 -207 90 9 -53 74 11 67 -83 -332 -35 -116 133 -127
2306a27J37k06K5R9JM93k38J02m40J14J50k62M3O0J67k25L72k59L87m68J24K35
$$ -127 10 -196 -171 -72 -71 422 184 286 -154 -40 110 -152 -109 -49 118 -107 265 6 393 -75 49 284
2328B84l44LK14L5j44o3k65J79K12j41k3m9N10l12K90p21P35n04j43M9K11j46
$$ 284 -60 -57 157 192 48 -15 -280 -101 111 -30 -53 -102 408 96 386 -335 400 -104 -247 -198 13 -133
2350a33O1j4J39k1k51M24k28K1k2o8J16J28J37k33j76K65j73j49K91Q7k38j2J60
$$ -133 -72 -86 53 32 -219 205 -23 -2 -24 -92 24 152 289 56 -120 145 -28 -177 114 201 -37 -49 111
2373A11k58J63l92K80J17k08j69J95L5L00k24J9M3m2r3K11P9L4k8O8j29Rk51o2
$$ 111 -147 16 -376 -96 21 -187 -356 -161 -126 174 -50 -31 12 -30 -123 88 167 201 173 241 112 121 -130 -192
2397a92J3K32n3J65k78K35l49K01m4J96P9j76N1Q0q2j34J87o1N8ml46J95rJ80
$$ -192 -179 53 0 165 -113 122 -227 -26 -70 126 205 29 80 160 78 -56 131 70 128 124 -222 -27 -36 144
2421A44n0o2qpp7qq1R8j24J54K51J10o08L64J50n00K45l5J26k25K04j67K43L4
$$ 144 94 32 24 17 -60 -68 -149 -51 -175 -21 230 340 -268 96 246 -254 -9 -44 82 -143 61 -106 137 171
2445A71r5K73o73J32o0M14j42L6j75n8m7K07k3Mk92L92j21j71J04P4j43K79j79
$$ 171 76 349 -324 -192 -252 162 20 56 -119 -177 -224 -17 -40 -36 -328 64 -57 -228 -124 -50 -193 86 -93
2468i3K22j91j9L40O8j90j22l22P5K58J01q1J71m18K04K40j34M5k5j89r9J60l2
$$ -93 129 -62 -81 259 327 137 15 -307 -232 26 127 46 217 -201 3 243 109 154 129 -60 -159 1 -31
2491c1J18l98L55rK65k4n51L01p7P7J17l18m1qN14j59j74J03N2j84j06L73j72
$$ -31 87 -311 44 35 300 276 -275 26 -51 26 143 -175 -216 -224 290 131 -43 60 112 -72 -178 195 23
2514B3p5r3j03J60R6k1l4k7K1l11L61j33O1P7j12K51J5j13m4N4j31K73k99J8O9
$$ 23 -52 -145 -248 -88 8 -13 -47 -74 -53 -364 -3 -136 -75 2 -110 141 156 43 -1 53 -78 195 -104 -86 -17
2539a7J19MK50k79l08L88R3k65O8o3j74M78o9l46K20k01L35k49L29k89j82M34
$$ -17 102 106 356 77 -231 157 250 -15 53 -10 -184 294 225 -121 99 -102 233 -16 313 24 -158 276
2561B76l03K48j36O7qL5l84J4J23K67m13J90m5J10J29j64k11P8J14m6p6M2R4N4
$$ 276 -27 221 85 152 144 179 -205 -191 -68 199 -214 -24 -69 41 170 6 -205 -127 -13 -59 -135 -93 1 55
2585E5j14j71R8J83j68K32J1m5R0l31L67k03j89J55m9l62L61j74N0Q7J54j55J84
$$ 55 -59 -230 -132 51 -117 115 126 81 171 -160 207 4 -185 -30 -79 -441 -80 -254 -204 -117 37 -118 66
2608F6p0J4J95k75M2J04k10K67j65J03P7j75j39l18P57j74J80l57l0J61j08K6
$$ 66 -4 10 205 -70 -28 76 -134 133 -32 71 148 -27 -166 -484 273 99 279 -78 -108 53 -55 -29
2630b9J53j78k4M1l6J4J54j11p3K17Oj20m7J04q3R6q4Q4l9k19O3j33J20n5q4K99
$$ -29 124 -54 -78 -37 -73 -59 95 -16 -89 128 134 14 -33 71 -12 84 0 84 45 -174 -111 -244 -124 -179 -263 36
2656C6j06L11k53j61K89J78l34PO7K27k13J07k13k6K05p1l77L74%J31r7l5k31
$$ 36 -70 241 -12 -173 116 294 -40 -33 34 261 48 155 -58 -84 121 50 -327 47 47 178 81 46 -185
2679a85k42M59J09k93K4n6L18k67K47m7n8j33o0K82j73O7K8l08N44n49K39R5J21
$$ -185 -427 32 141 -152 -128 -184 134 -133 114 67 9 -124 -184 98 -75 -8 20 -288 256 -293 -54 41 162
2702A62l57J01m5J86J45k46J39j19R6k87K06n7j72K73k9K13J79m88K03j07QL6
$$ 162 -195 -94 -139 47 192 -54 85 -34 62 -225 -19 -76 -248 25 -4 209 388 -100 103 -4 4 40
2724D0P7m45M2K80l10M94j77O8k05J01k7r8J70k04M11l17M6J00l3j18L3K1j58
$$ 40 117 -328 -286 -6 -316 178 1 69 -136 -35 -62 -160 10 -194 217 -100 -54 46 13 -105 -72 -51 -209
2747b09M22k62R1k78K24K2k29J94n5J53j41J26n5k11N21l14J69o7J89m58L21m88
$$ -209 213 -49 42 -236 -12 10 -219 -25 -80 73 -68 58 3 -208 313 -1 168 101 290 -168 153 -335
2769c35K27K57l4m06J18L58J07k02j34q1L07k45K28n6j0l11L58j19k15J2j48L54
$$ -335 -108 149 115 -291 -173 185 292 90 -44 -125 182 -63 165 109 99 -212 146 27 -188 -176 -324 30
2791C0n8K27k27q8j84L47j1m2k07K30l18M74J16j33L4R0k86K71j40l33K07K87
$$ 30 -28 199 -28 -116 -300 47 36 -6 -213 17 -301 173 289 156 190 280 -6 265 125 -208 -1 286
2813B86k19j9k43J18J35J07j08P5k51J32J53l39MQ6J64M2l39J05K11l9j9p0N9
$$ 286 67 48 -195 -77 58 165 57 132 -119 13 166 -173 -169 -83 81 123 -216 -111 100 61 42 -28 31
2836C1K8PJ3J1l63M38j71K5Nj9J45K5k62J40j16Kj68P2L2M37j78j80J56L7j53
$$ 31 59 66 79 90 -273 165 -6 19 24 5 150 175 -87 53 -63 -61 -229 -157 -125 312 134 -46 110 147 -6
2861fN1j53J91j87O5J01j2pj84R8J54n3Q7l10l15N57n5R5j64n7Q7o6P2R3J50l6
$$ -6 45 -108 83 -104 -39 62 50 43 -141 -43 111 58 145 -165 -480 77 22 117 -47 -104 -17 -83 -11 82 232 196
2887A96n3J10k23L04p7j51J07n04L83j39Q7j93j64M72k19N0p8L22j99J22j7j20
$$ 196 143 253 30 334 257 106 213 -291 92 -47 40 -153 -317 155 -64 -14 -92 230 31 153 136 16
2909A6J6K20m75K59Kpn7n1M0p4j08J5k2L99k61L37lO2k15l3K89m33K19j56k32
$$ 16 32 252 -223 36 38 31 -26 -77 -37 -111 -219 -204 -226 173 -88 249 246 308 93 60 349 -84 135 -21 -253
2934b53K2M69l88j62N43k12k6l74O56k22J07KJ36m65J84j80M49j65j84j7K7J48
$$ -253 -231 238 -150 -312 231 19 -7 -381 275 53 160 162 298 -167 17 -163 286 121 -63 -80 -53 95
2956I5m8Rm07N38l31J62m14N91j13o4J3r4O3J05n5lk78J13K21k88J26k15L34K11
$$ 95 47 56 -351 187 -144 18 -396 195 82 18 31 -63 0 105 50 47 -231 -118 103 -185 -59 -274 60 271
2980B71k00k45L41j74O2J32l51P8k52J79J55n8K21mj5l97K31k58L0L74j44n9J82
$$ 271 71 -174 167 -7 55 187 -164 -86 -338 -159 -4 -62 159 155 140 -257 -26 -284 -254 120 -24 -83 99
3003I9N7j79J38m27O49p01M95J63k34p7j7J78m93K60l7N1J44J10j95J67l76K07
$$ 99 156 -23 115 -312 337 -364 131 294 60 -17 -34 144 -349 -89 -126 -75 69 179 -16 151 -225 -18
3025a8J55k88J4J91k13J31M2J28j66r9K83j76K69q8p1M5q0P8l65O33n17J23j6
$$ -18 137 -151 -137 54 -159 -28 14 142 -24 -123 160 -16 253 165 94 139 59 137 -228 405 -112 11 -5
3048ek27K46j01j88L18p8L41n79J31L45q0m43P6N23n79L90j24kj52J27j72O7J75
$$ -5 -232 14 -87 -275 43 -35 306 -273 -142 203 123 -320 -244 279 -300 90 -34 -36 -188 -61 -233 -166 9
3071Ij50J58j23J63k67J37J26m6o8P0J73m16N68j96l5K76j88l7m6n7k76K32J57
$$ 9 -141 17 -106 57 -210 -73 53 7 -61 9 182 -234 334 138 103 379 191 154 108 51 -225 7 164
3094A64o1j68P3M3J00l11PK15R4r6j11m4kJ99J69l65q4NK40P4k10J1K43m16K07
$$ 164 103 -65 8 51 151 -160 -153 62 156 60 -51 -95 -97 102 271 -94 -178 -173 67 141 -69 -58 185 -231 -24
3119b4L7j63Q8K14k04K4Q9J39k89J52j0KK6M9n14J23L35l2J64j40k58K02q8j24
$$ -24 13 -150 -62 152 -52 -28 61 200 -89 63 53 55 81 130 -384 -261 74 42 206 66 -192 10 -78 -202
3143b02K00P5o9P6j65J50P6L6j66k67OM94k49l47J07m9L57j13P9K9j14K06j39
$$ -202 -2 73 4 80 -85 65 141 177 11 -256 -250 244 -5 -352 -245 -294 63 -50 29 58 -56 150 11
3166A1M4J9l6l50O99l9j19r7o8j5K25l05N6j83j50L19K3J60n05P1M98m51K70k8
$$ 11 55 74 38 -312 387 348 229 132 64 49 274 -31 25 -158 -308 11 34 194 -311 -240 258 -193 77 49
3190D9J09L5j45K0j55J50j98J63k3J31j36m8K88o5j79Q6j5m07L05n7j65L24n1
$$ 49 158 193 48 68 -87 63 -135 28 5 136 0 -48 240 175 -4 82 67 -340 -35 -92 -257 67 16
3213A6j51o1N98k95j21j13J29J67o6k4qp1j72K07QmJ90l78K60l6p3m5K36k57K77
$$ 16 -135 -196 402 107 -14 -127 2 169 103 79 71 0 -172 35 43 39 229 -149 111 75 2 -43 193 -64 213
3238B13m65J98p5j0K30j79M48n37L65k93j38J22K20j65R4j19L24l11M79n06K61
$$ 213 -252 -54 -129 -139 91 -88 360 -177 188 -105 -243 -121 99 -66 28 -91 233 -78 401 -105 156
3259A56l11j91M01o8J90O7j45m6j8O8J17l32J21j28k9J43K40m35K94j1j36K7J15
$$ 156 -155 -346 55 -13 177 244 99 53 35 103 220 -112 9 -119 -148 -5 235 -200 94 83 -53 -26 89
3282H9k48K43k11M17N5o48K44j40M9N6k0Q9j09J52j55Q2O2N8R5p1j54J14j04k5
$$ 89 -159 84 -127 290 345 -303 -59 -199 -150 -94 -114 -25 -134 18 -137 -55 7 65 160 89 -65 49 -55 -80
3306h0M8l8J91m4j5J53k68J6k3J15q9J23j5k02J42Q8k22J51o6k54K64J02L1k85
$$ -80 -32 -70 121 77 62 215 -53 -37 -60 55 -34 89 74 -128 14 102 -120 31 -35 -289 -25 77 108 -177
3330a77J82j47J21J32k17J59j55K53m37J88k07K30M06k07k81J85O9j54J94n1r1
$$ -177 5 -142 -21 111 -106 53 -102 151 -286 -98 -305 -75 331 124 -157 28 97 -57 137 86 -5
3351eK68k15j19j35R6K36j68J5J52J30k61l8n6q2J23J24J8J58l21L66k12k0%j40
$$ -5 263 48 -71 -206 -110 126 -42 -27 125 255 -6 -44 -100 -182 -59 65 83 241 -80 286 74 54 54 -86
3375h6M2M6K0J65k16K72l46J48K42o0l48J97j10j13J61k88N00m05J38p9K70j15
$$ -86 -44 2 22 187 -29 243 -103 45 287 227 -121 76 -34 -147 14 -274 226 -179 -41 -120 150 35
3397C5k17J57P1J01k15J68n5j08J33j61J41n62O50k80Q7n7Q2K15m8l37K98k59
$$ 35 -182 -25 46 147 -68 100 45 -63 70 -91 50 -512 138 -142 -55 -112 -30 185 137 -200 98 -161
3419a61K37j92J81l00M16l11k1J29oo8KK93k84K04j93J98l12K1QJ48oQ7j16l2
$$ -161 76 -116 65 -235 181 -130 -151 -22 -28 -96 -94 199 -85 119 -74 124 -188 -167 -159 -11 -17 70 -46 -78
3443g8J45m44L39Q3j14J48J27l77J27R7j01J19l08R0K16l62J22L69P1k11L0J22
$$ -78 67 -377 -38 45 -69 79 206 -171 -44 53 -48 71 -237 -147 69 -293 -171 198 269 58 88 210
3465B10k78q0K31j2L2l37L98k10r8Q0K63l0j47q1j2J11j98l8J61K23l06J96p4
$$ 210 -68 -148 83 71 103 -234 164 -46 -144 -64 199 169 22 -59 -71 40 -158 -196 -35 188 -118 78 4
3488DJ18j14p1k07L39m6n7O6J79K0l17N1K28l26J19J62j89O6m6J93L4k3n5k87
$$ 4 122 8 -63 -270 69 23 -34 32 211 231 -86 -35 193 -133 -14 148 -41 25 -21 172 206 183 128 -159
3512a59L0K11r6O1K03k02j45o1K26j6o8k30K40j32L71m8J08k95J8j98K40j51J99
$$ -159 -129 82 -14 47 250 48 -97 -158 68 52 -16 -246 -6 -138 233 185 293 -2 16 -182 58 -93 106
3535A06j46q6K45j47Q1L2P6k02p5P3J03k59J71q8L06j52P9J05k54j39Q1J49L2
$$ 106 -40 -126 119 -28 53 85 161 -41 -116 -43 60 -199 -28 -116 190 38 117 222 -32 -171 -90 59 91
3558I1mJ73l39J53j80K52Ql9j73J08o2j64J12J01kMj89L04k95K36m6l5K04k55
$$ 91 87 260 -79 74 -106 146 154 115 -58 50 -12 -176 -64 37 35 39 -150 154 -141 95 49 14 218 -37
3582c7K32l4j95K85k96j3K42j02K31m77oQ8K17j92J64j69K99j00j37n4M30m13
$$ -37 195 161 -34 251 -45 -58 184 82 313 -164 -170 -82 135 -57 107 -62 237 137 0 -54 376 -37
3604c7K6K18j50J08l7J3l47L56k57L58J11j86k43n8p2J67K79j51k2k57K03j42
$$ -37 -11 207 57 165 128 141 -206 150 -107 251 362 176 -67 -125 -197 -30 249 98 76 -181 22 -120
3626a20K6J28k03K21o1j8j4j89N37m29m9K73o8k8k1J43l1j56k12K07J53k44J43
$$ -120 -94 34 -169 52 -9 -27 -41 -230 307 -122 -171 102 34 6 -15 128 97 -59 -271 -64 89 -155 -12
3649a2j47Q7l0j68L01K24k31J99j47k7k8j37K1O6k31M46k22J22K57j89k21J19
$$ -12 -159 -72 -102 -270 31 255 24 223 76 49 21 -116 -95 -29 -260 186 -36 86 343 154 -67 52
3671E2Jj02J71Pj81J94q9r3J03j13m0J13j70L5J80m7k57r2K84LP0k55J63K6m5
$$ 52 53 -49 122 129 -52 142 53 -40 63 -50 -90 23 -147 -112 68 21 -236 -328 -44 -41 29 -226 -63 -37 -82
3696h2j19J22n1m6L62l71l2J18J48j29q6K28m5j32O7K07m7k27N0J83k4q6K9MJ11
$$ -82 -201 -79 -130 -176 186 -185 -217 -99 49 -80 -166 62 17 -115 -48 159 112 -115 -65 118 94 8 37 41 152
3721A52n94J90L45k78K87j42J84k68J89j7j34R4M2J9j9pj97L81J16n09J21PL3
$$ 152 -442 -252 93 -185 102 -40 144 -124 65 48 -86 8 50 69 50 43 -154 227 343 -166 -45 -38 -5
3744eK6l19j1M59l20K16k22J56J87n3l55K02J19j34n8J30K33k23j11j30J86o3
$$ -5 21 -298 -309 150 -170 46 -176 -20 167 114 -241 -39 80 -54 -112 18 251 28 -83 -213 -27 -90
3766i0L6K95k26p0J7j34L27p3j06m2k7pp7K02L13k67j83L17l26M9R6Q6lL18o34
$$ -90 -54 241 15 -55 -38 -172 155 82 -24 -66 -93 -100 -177 25 338 71 -112 205 -121 -72 24 110 107 425 -209
3791b09J21K11j40mj23K06j78j28L47J05j34M4O8j85J5N9J31l71L54j23k29O30
$$ -209 -88 123 -17 -21 -144 62 -116 -244 103 208 74 118 186 1 16 75 206 -165 189 66 -163 467
3813D67m64o1j10R9K32l30K55j92J78l30J39J11L14j76J1l48L3J32n1J99K9l47
$$ 467 3 -58 -168 -69 163 -167 88 -104 74 -256 -117 -6 308 132 143 -205 -172 -40 -91 108 137 -210
3835b10J69L03k2l34L70k03l3K2j49J3J1RM13n45J44K30k00l0L5l11J20M6N2j35
$$ -210 -41 262 240 -94 276 73 40 62 -87 -74 -63 -54 359 -186 -42 188 -12 -42 -7 -318 -198 -152 -100 -235
3859b35J39m8K14p9op7M8pj09R3q0J1M0J68j68R5J1K2qJ8j92L45o2j05K65k49
$$ -235 -96 -144 70 -9 -15 -92 -44 -51 -160 -67 -147 -136 -96 72 -96 -1 10 32 24 42 -150 195 133 28 293 44
3885D4K91l52J1K17l25J61K0k23J30j96J96nJ99M3j56j09J64q4J55k03R4K3j85
$$ 44 335 -17 -6 211 -114 47 67 -156 -26 -222 -26 -31 168 211 55 -54 110 26 181 -22 72 95 -90
3908i0J61j18J06lM2m3j64k9Q6K2MJ01k56L67j08J31j60L9l41L11j65K21j65O9
$$ -90 71 -47 59 56 98 55 -109 -138 -52 -30 -26 75 -181 186 78 209 49 88 -253 58 -107 114 -51 18
3932A8L0J30j0l25J17N6M1Q4j59R6r7R6L3l07N4J13O4K01l7k79K80k21N2P6j94
$$ 18 48 178 168 -157 -40 16 57 141 -18 78 -19 77 110 -197 -143 -30 34 235 198 -81 199 -22 30 106 -88
3957h8O1j57K00j40M5Mj41Ql4L20j80M58k60p7k20R9R6J88k88j06J77J44j15K29
$$ -88 -27 -184 16 -124 -79 -75 -216 -208 -242 78 -102 356 96 19 -201 -102 -6 182 -106 -212 -35 109 -6 223
3981B23l1l61n5L27J16j88O2j27N4k1L5k3PJ59K09l63J25j20O3%j94j5J24k41
$$ 223 192 -169 -224 103 219 31 93 -34 20 -1 34 11 18 177 386 23 148 28 91 91 -103 -118 6 -235
4005b35M05r4k04J06J62j33K67m49M4J26J23l70N26j95l13K34o4K73kj93K1Qq9
$$ -235 170 76 -128 -22 140 7 274 -175 -131 -5 118 -252 274 79 -234 0 -64 209 207 14 35 43 -46
4028d6J14r5k13K10Q6J5J86o0N0k13p0K55l44K1M9LK04j59j28J31J2J46n0l03
$$ -46 68 -27 -240 -30 56 71 257 197 247 34 -36 219 -125 -104 -55 -52 152 -7 -135 -4 8 154 104 -199
4052a99L61j45m60M19K51k53K56l3j20K2jk55J86K22k05j44P7p2P9M7j19J63o8
$$ -199 162 17 -443 -24 227 -26 230 197 77 99 98 -157 29 251 46 -98 -21 -93 -14 33 -86 77 9
4075IK9J51j30j54K01k70L60k63l7K55l50J51nj01J9J50K0lk30Q6L17m5k19j01
$$ 9 38 189 59 -95 106 -164 196 -67 -104 151 -199 -48 -53 -154 -135 15 35 32 -198 -112 205 160 -59 -160
4099a60M72k25m5J12rm63K64J94k53P5K94j75j5mJ63m43J61q2K1J16K63p5j45
$$ -160 312 87 42 154 145 -318 -54 140 -113 -38 256 81 66 62 225 -218 -57 -139 -118 -2 261 186 41
4122D1j7L00m66K35k09j05J59m8L53k72j07j2K90k1l5k62K40k00K55l5J40k73
$$ 41 24 324 -142 93 -116 -221 -62 -110 243 -29 -136 -148 142 121 86 -176 64 -136 119 84 224 -49
4144d9J50j86j72L81n6J1Rj82K02NK0R1m26M92K0k8j55L2k47L6K26j59q9M4J29
$$ -49 101 -85 -257 124 68 79 88 -94 108 113 133 224 -202 290 310 282 127 159 -88 -52 174 15 -74 -30 99
4169I9j72P1R4j40J29K57k46K3k02J17P2k48k5J71J9J21k13K54J62k77P0k44J51
$$ 99 -73 -2 92 -48 81 338 92 115 -87 30 102 -146 -171 0 19 140 -73 181 343 66 136 -108 43
4192D3q9J29k42J94l18oL75j7K5O2M3j77j9R0J69j43J42j48j62j61M78k42j66
$$ 43 -46 83 -159 35 -283 -289 86 69 94 156 199 22 3 93 262 119 261 113 -49 -210 268 26 -140
4215a40J23r7L24p0M2Qj38L2J88O8k83k12L29j83j3p2K71p4K66m42k36J97K21
$$ -140 -17 -114 210 140 182 190 52 84 272 340 57 -155 174 -9 -22 -94 177 103 369 -73 -309 -112 109
4238A09j42K74o0k13l4L1M2q9L33j71o1l9J10k08K64k16Q0l06M60j76l16K95R2
$$ 109 -33 241 181 -32 -66 -35 7 -82 251 80 19 -20 90 -118 146 -70 10 -296 164 -12 -328 -33 59
4261E9k7j06J24j13P0L3m3o3J49n9k61M80o77N65k0m30L33j45l09M01K93j02k16
$$ 59 32 -74 50 -63 7 40 -3 -66 83 24 -237 243 -434 131 111 -319 14 -131 -440 -39 254 152 -64
4284f4q2J42l36K57Q5N5o1J58o8n01K94k9L91m05M49l29J12J18j63m9J73J23j22
$$ -64 -146 -4 -340 -83 2 57 -4 154 86 -415 -121 -150 241 -164 285 -44 68 186 23 -26 147 270 148
4307A48k85KK60k08p7L02k1j95J63m63M80j36j02J45R6l6o5M4k6j86M3P7r0L03
$$ 148 -137 -135 125 -83 -160 142 121 -74 89 -374 106 -30 -132 13 109 73 8 52 26 -160 -117 -40 -130 173
4331A73k01O2k3j54N7J71j8j16qj27J82p4l1j05O27n25J51j44j65K38K80n51K69
$$ 173 -28 34 11 -143 -86 85 67 -49 -57 -184 -2 -76 -107 -212 415 -110 41 -103 -268 -30 250 -301 -32
4354c2qm3r2J82L55l94k15K07j33k1L75k01L1L2N5j00l27O02k59o5J75l01J41
$$ -32 -40 -83 -175 7 362 -32 -247 -40 -173 -194 181 -20 11 43 98 -2 -329 273 14 -51 124 -177 -36
4377c6j64J40J12r1j68L80j58p5j11J06O%L06l02K6K18k13K5J4L46o61N22n55
$$ -36 -200 -60 52 -39 -207 173 15 -60 -171 -65 -59 -59 247 -55 -29 189 -24 1 15 361 -300 222 -333
4400c33K18J33l2K01j65k21K48j84K99p6j85j4o8L90j78j05J47j05j59K77J55
$$ -333 -115 18 -14 187 22 -199 49 -135 164 88 -97 -111 -179 211 33 -72 75 -30 -189 88 243
4421B43j86%Q1j36J24n9k58R0M97n56O9l9M2K78k30J41k14k2M46k51j43j65M25
$$ 243 57 57 138 2 126 67 -191 -101 396 -160 -91 -130 -88 190 -40 101 -113 -135 311 60 -83 -248 177
4444A77j52k3k53K04m7R9q5r4J74o7j72J16J63j1q5K18m1k70J25M27k89k50R5
$$ 177 25 2 -251 -47 -94 5 -80 -174 0 -67 -239 -123 40 29 -56 162 121 -149 -24 403 114 -136 -41
4467d1R2k53J17jL13j40J04k03J08j22K66q2j68K52j19P8j32J80j68j67Pj31Q8
$$ -41 51 -202 -85 -86 227 87 191 -12 96 -26 240 158 -10 242 123 201 69 249 81 -86 -79 -210 -122
4490a22K07o7l14M98j58k22n0L03k24j5J45k1N1j54N6P8j35K69jl32L84j92K6
$$ -122 85 18 -296 202 44 -178 -228 75 -149 -164 -19 -40 11 -143 -87 -9 -144 125 124 -208 176 -16 10
4513A0r1K98j55k17J81m60N10j13P3l3j18jJ38P6k20k40N00j64O9j5P0j9k35K49
$$ 10 -81 217 62 -155 26 -434 76 -37 36 3 -115 -116 22 98 -122 -362 138 -26 43 28 98 79 -156 93
4537I3j02R1k63J66j63K80k52M28k30m67J35M47k76k8K58l34Q0OPR5J4J01j67
$$ 93 -9 82 -181 -15 -178 102 -150 278 48 -419 -284 163 -113 -141 117 -217 -137 -131 -124 -29 -15 86 -81
4560h1J98j54r1Pn4N01l09j74K13N3j25R9j88J63j05o8L50k5k70R4p5N8J22l21
$$ -81 117 -37 -128 -121 -175 326 17 -157 56 109 -16 83 -105 58 -47 -115 235 210 -60 34 -41 17 139 -182
4584a82j4L49m72L30m64L70k3O3K40k22P8p0q1o4L68k24K16k87K09Lk19Q0J29
$$ -182 -196 153 -319 11 -453 -83 -106 -43 197 -25 53 -17 -98 -162 206 -18 198 -89 120 123 -96 -16 113
4607A13j32J41J39j41l35L23k10L7K26k75K28k44q9J42J63M1k04j07M10l9j88
$$ 113 -19 122 261 120 -215 108 -102 -65 161 -114 114 -130 -219 -77 86 127 -77 -184 226 187 -1
$$ [...]
8191I
##END NTUPLES=NMR FID
##END=
