##TITLE=1H_LR-692-RM1
 CDCl3, 8 sc, 
 14.10.2019
##JCAMPDX= 6.0         $$ Bruker NMR JCAMP-DX V2.0
##DATA TYPE= NMR FID
##DATA CLASS= NTUPLES
##ORIGIN= UXNMR, Bruker Analytische Messtechnik GmbH
##OWNER= root
$$ XWIN-NMR		Version 3.5
$$ Mon Oct 14 13:58:05 2019 Russian Standard Time (UT+4h)  she@DPX200
##.OBSERVE FREQUENCY= 200.1315
##.OBSERVE NUCLEUS= ^1H
##.DELAY= (6, 6)
##.ACQUISITION MODE= SIMULTANEOUS
##.ACQUISITION SCHEME= undefined
##.AVERAGES= 8
##.DIGITISER RES= 18
##SPECTROMETER/DATA SYSTEM= spect
##.PULSE SEQUENCE= zg30
##.SOLVENT NAME= Acetone
##.SHIFT REFERENCE= (INTERNAL, Acetone, 0, 15.7039)
##AUDIT TRAIL= $$ (NUMBER, WHEN, WHO, WHERE, WHAT)
$$ ##TITLE= Audit trail, XWIN-NMR		Version 3.5
$$ ##JCAMPDX= 5.01
$$ ##ORIGIN= Bruker BioSpin GmbH
$$ ##OWNER= she
$$ F:/spectra/data/she/nmr/H-F/1/audita.txt
$$ ##AUDIT TRAIL=  $$ (NUMBER, WHEN, WHO, WHERE, WHAT)
(   1,<2019-10-14 13:56:25.12 +0400>,<she>,<DPX200>,
      <created by zg, POWCHK disabled, PULCHK disabled
       configuration hash MD5:
       00 E9 B6 7A A2 85 ED C7 34 08 36 98 17 FE 4E 26
       data hash MD5: 16K
       DD 96 7C 3F BF 01 02 98 57 BC C9 84 46 4E 69 CE>)
$$ ##END=
$$ 
$$ hash MD5
$$ 6A A6 92 C6 25 FD C4 67 25 33 20 4E 70 F3 D7 63
##$RELAX= 
##$RELAX= 
##$RELAX= 
##$RELAX= 
##$RELAX= 
##$RELAX= 
$$ Bruker specific parameters
$$ --------------------------
##$DU= <F:/spectra>
##$EXPNO= 1
##$NAME= <H-F>
##$PROCNO= 1
##$TYPE= <nmr>
##$USER= <she>
##$AMP= (0..31)
100 100 100 100 100 100 100 100 100 100 100 100 100 100 100 100 100 100 
100 100 100 100 100 100 100 100 100 100 100 100 100 100 
##$AQSEQ= 0
##$AQ_mod= 1
##$AUNM= <au_zg>
##$AUTOPOS= <>
##$BF1= 200.13
##$BF2= 200.13
##$BF3= 200.13
##$BF4= 200.13
##$BF5= 200.13
##$BF6= 200.13
##$BF7= 200.13
##$BF8= 200.13
##$BYTORDA= 1
##$CFDGTYP= 0
##$CFRGTYP= 5
##$CHEMSTR= <none>
##$CNST= (0..31)
1 1 145 1 1 1 1 1 1 1 1 1 1 1 1 1 1 1 1 1 1 1 1 1 1 1 1 1 1 1 1 1 
##$CPDPRG= <>
##$CPDPRG1= <>
##$CPDPRG2= <>
##$CPDPRG3= <>
##$CPDPRG4= <mlev>
##$CPDPRG5= <mlev>
##$CPDPRG6= <mlev>
##$CPDPRG7= <mlev>
##$CPDPRG8= <mlev>
##$CPDPRGB= <>
##$CPDPRGT= <>
##$D= (0..31)
0 1.2 0 0 0 0 0 0 0 0.06 0 0.03 0 0 0 0 0.0002 0 0 0 0 0 0 0 0 0 0 0 0 
0 0 0 
##$DATE= 1571046984
##$DBL= (0..7)
120 120 120 120 120 120 120 120 
##$DBP= (0..7)
150 150 150 150 150 150 150 150 
##$DBP07= 0
##$DBPNAM0= <>
##$DBPNAM1= <>
##$DBPNAM2= <>
##$DBPNAM3= <>
##$DBPNAM4= <>
##$DBPNAM5= <>
##$DBPNAM6= <>
##$DBPNAM7= <>
##$DBPOAL= (0..7)
0.5 0.5 0.5 0.5 0.5 0.5 0.5 0.5 
##$DBPOFFS= (0..7)
0 0 0 0 0 0 0 0 
##$DE= 6
##$DECBNUC= <off>
##$DECIM= 24
##$DECNUC= <off>
##$DECSTAT= 4
##$DIGMOD= 1
##$DIGTYP= 9
##$DL= (0..7)
0 120 120 120 120 120 120 120 
##$DP= (0..7)
150 150 150 150 150 150 150 150 
##$DP07= 0
##$DPNAME0= <>
##$DPNAME1= <>
##$DPNAME2= <>
##$DPNAME3= <>
##$DPNAME4= <>
##$DPNAME5= <>
##$DPNAME6= <>
##$DPNAME7= <>
##$DPOAL= (0..7)
0.5 0.5 0.5 0.5 0.5 0.5 0.5 0.5 
##$DPOFFS= (0..7)
0 0 0 0 0 0 0 0 
##$DQDMODE= 0
##$DR= 18
##$DS= 0
##$DSLIST= <SSSSSSSSSSSSSSS>
$$ [...]
##$SUBNAM2= <"">
##$SUBNAM3= <"">
##$SUBNAM4= <"">
##$SUBNAM5= <"">
##$SUBNAM6= <"">
##$SUBNAM7= <"">
##$SUBNAM8= <"">
##$SUBNAM9= <"">
##$SW= 24.0689530833862
##$SWIBOX= (0..15)
0 0 2 0 0 0 0 0 0 0 0 0 0 0 0 0 
##$SW_h= 4816.95568400771
##$TD= 16384
##$TD0= 1
##$TE= 0
##$TE2= 300
##$TE3= 300
##$TEG= 300
##$TL= (0..7)
0 120 120 120 120 120 120 120 
##$TP= (0..7)
150 150 150 150 150 150 150 150 
##$TP07= 0
##$TPNAME0= <>
##$TPNAME1= <>
##$TPNAME2= <>
##$TPNAME3= <>
##$TPNAME4= <>
##$TPNAME5= <>
##$TPNAME6= <>
##$TPNAME7= <>
##$TPOAL= (0..7)
0.5 0.5 0.5 0.5 0.5 0.5 0.5 0.5 
##$TPOFFS= (0..7)
0 0 0 0 0 0 0 0 
##$TUNHIN= 0
##$TUNHOUT= 0
##$TUNXOUT= 0
##$USERA1= <user>
##$USERA2= <user>
##$USERA3= <user>
##$USERA4= <user>
##$USERA5= <user>
##$V9= 5
##$VALIST= <valist>
##$VCLIST= <CCCCCCCCCCCCCCC>
##$VD= 0
##$VDLIST= <DDDDDDDDDDDDDDD>
##$VPLIST= <PPPPPPPPPPPPPPP>
##$VTLIST= <TTTTTTTTTTTTTTT>
##$WBST= 1024
##$WBSW= 4
##$XGAIN= (0..3)
0 0 0 0 
##$XL= 0
##$YL= 0
##$YMAX_a= 338118
##$YMIN_a= -500815
##$ZGOPTNS= <>
##$ZL1= 120
##$ZL2= 120
##$ZL3= 120
##$ZL4= 120
##$ABSF1= 10
##$ABSF2= 0
##$ABSG= 5
##$ABSL= 3
##$ALPHA= 0
##$AQORDER= 0
##$ASSFAC= 0
##$ASSFACI= 0
##$ASSFACX= 0
##$ASSWID= 0
##$AUNMP= <proc_1d>
##$AZFE= 0.1
##$AZFW= 0.1
##$BCFW= 1
##$BC_mod= 2
##$BYTORDP= 1
##$COROFFS= 0
##$CY= 11.3945322036743
##$DATMOD= 1
##$DC= 2
##$DFILT= <>
##$DTYPP= 0
##$F1P= 20.1720416913024
##$F2P= 0.152960286110954
##$FCOR= 0.5
##$FTSIZE= 0
##$FT_mod= 4
##$GAMMA= 1
##$GB= 0.15
##$INTBC= 1
##$INTSCL= 1
##$ISEN= 128
##$LB= 0.24
##$LEV0= 0
##$LPBIN= 0
##$MAXI= 10000
##$MC2= 0
##$MEAN= 0
##$ME_mod= 0
##$MI= 1.114404
##$NCOEF= 0
##$NC_proc= 0
##$NLEV= 6
##$NOISF1= 3.799351
##$NOISF2= 2.8
##$NSP= 1
##$NTH_PI= 0
##$NZP= 0
##$OFFSET= 15.70392
##$PC= 1
##$PHC0= -9572.192
##$PHC1= 18.40093
##$PH_mod= 1
##$PKNL= yes
##$PPARMOD= 0
##$PSCAL= 0
##$PSIGN= 0
##$REVERSE= no
##$SF= 200.130013532006
##$SI= 16384
##$SIGF1= 3
##$SIGF2= 2
##$SINO= 400
##$SIOLD= 16384
##$SREGLST= <1H.CDCl3>
##$SSB= 0
##$STSI= 0
##$STSR= 0
##$SW_p= 3612.71676300578
##$SYMM= 0
##$S_DEV= 0
##$TDeff= 0
##$TDoff= 0
##$TI= <>
##$TILT= no
##$TM1= 0
##$TM2= 0
##$TOPLEV= 0
##$USERP1= <user>
##$USERP2= <user>
##$USERP3= <user>
##$USERP4= <user>
##$USERP5= <user>
##$WDW= 1
##$XDIM= 8192
##$YMAX_p= 0
##$YMIN_p= 0
$$ End of Bruker specific parameters
$$ ---------------------------------
##NTUPLES= NMR FID
##VAR_NAME=  TIME,          FID/REAL,        FID/IMAG
##SYMBOL=    X,             R,               I
##VAR_TYPE=  INDEPENDENT,   DEPENDENT,       DEPENDENT
##VAR_FORM=  AFFN,          ASDF,            ASDF
##VAR_DIM=   8192,          8192,            8192
##UNITS=     SECONDS,       ARBITRARY UNITS, ARBITRARY UNITS
##FACTOR=    0.0002076,     1,               1
##FIRST=     0,             0,               0
##LAST=      1.7004516,     0,               0
##MIN=       0,             -500815,         0
##MAX=       1.7004516,     338118,          0
$$ Real data points
##PAGE= N=1
##DATA TABLE= (X++(R..R)), XYDATA
0@%%%qJ6j6J6k3L1m0M9n7Q0j04J21j45J77k10K50k97L47m05M73n47O28p21Q26
27D41r40J065j206J361j533J721j925K153k402K674k972L298l658M054m490M970
43B611n502O094o757P502q345R307j0419J1723j3272J5152j7492K0494k4508L0191
57A6779l8929N4243q8908L05736L5422m09268K16456O0404j69369j7577L34581
68B99570L8548k42385m8519K16127m4970k14175M204J68110n6009j18595Q1170
79H3076J32922p0254o9310Q3246L4762j63988j23835N9639J03835L0296L7501
90A37890L8614o0371j37297n6360N7575O5863K050j3505J4293Q740l3453k3135
102I04K7803J2430n8002l9767M0326J3515p4902j4884J16214O7023p8459o0700
$$ y = [0, 0, 0, 0, -8, 8, -8, 8, -15, 16, -24, 25, -32, 48, -56, 65, -80, 97, -113, 137, -160, 187, -218, 255, -292, 336, -385, 441, -499, 566, -640, 721, -812, 909, -1016, 1137, -1265, 1409, -1563, 1735, -1923, 2131, -2359, 2611, -2891, 3203, -3554, 3948, -4397, 4910, -5509, 6214, -7058, 8094, -9398, 11096, -13412, 16779, -22150, 32093, -56815, 248921, 284343, -124925, 91531, 151935, -17434, -35011, 299570, 338118, 95733, 47214, 263341, 218371, 4196, 8400, 176510, 120501, 1906, 83076, 215998, 145744, 76434, 159680, 194442, 30454, -93381, -33742, 70093, 100389, 137890, 176504, 116133, -21164, -77524, -19949, 45914, 47964, 34459, 48752, 57492, 24039, 904, 28707, 41137, -16865, -56632, -16306, -2791, -77693, -92577, 23637, 90660, 12201, -48499]
114d8499K2538n1863j07928O2659J85065R537j46995j9391Q5450m6636r5214P5654
126g5623R7479j02586j14786R8576J10866q2592p2072J00993N1877j25814p2350
137a86032Q5438K7559p8971L7849J51488M773j53526o5766N3103K295l4126O1793
149i4123Q0510m5020q2537L1353P3116k0399o2172K171K3469k5115j5844N3593
161h0998N2224j9725l1793K1034J1912o2600o4919K8712P8055L0888j254J9835
173a8629o758p8847n1979O0994P5404k7435m9341L5699M4915l2210j8550N6176
185a0561Q946r0197l6415P9400L8172n5160J768Q8100J4971p4496j6382L4548
197a7306m0496n5717P2626J10559j9852p5971J0837K8010m5199j8283O9203J8095
$$ y = [-48499, -25961, -77824, -185752, -123093, 61972, 71509, -75486, -94877, -9427, -56063, -151277, -75623, 21856, -80730, -195516, -96940, 13926, -68666, -140738, -39745, 12132, -113682, -186032, -100594, -73035, -152006, -114157, 37331, 42104, -111422, -177188, -124085, -121790, -155916, -94123, -13613, -58633, -141170, -109817, -36701, -57100, -119272, -117101, -93632, -118747, -134591, -80998, -28774, -48499, -80292, -59258, -47346, -109946, -174865, -146153, -68098, -37210, -38464, -18629, -25387, -104234, -156213, -95219, -19815, -47250, -96591, -60892, -15977, -48187, -66737, -10561, -1615, -91812, -128227, -48827, -10655, -65815, -64047, 24053, 39024, -35472, -51854, -17306, -57802, -113519, -40893, 69666, 49814, -26157, -15320, 12690, -32509, -50792, 18411, 36506]
209C6506p8725j6048Q8938L4210n4703p270M3391k8047o1604L0664O4052k5762
221B5602m1736N5041O5150m0894o7871O227J8571k4900O270O7479K5653n5469
233C9123l5642L7251L3271k1664k7486M491N839q358J0054L8680K0738k8654l7421
246C0222O083K4563j5057l6182J0230M6848J4417j3464P254M759m3396l8692L4225
259C1810N2187j3472l7586J2077K7460q156q257J6328j2504m9051r032M5007K4243
272G1054j4566j302J0457j4095j3929J2432k847l5764o437M2383K7325j3688q092
285E2931r33k7881k4113K5163L0395k3926l4125K0579L7719k128j7357P27j1004
298B6047l3965o054L6843K3152j9543j7836J3562J6334r581k2722j3767n027n23
$$ y = [36506, -42219, -58267, 30671, 64881, 10178, 2908, 46299, 18252, -43352, -12688, 51364, 25602, -16134, 38907, 104057, 63163, -4708, 1519, 20090, -4810, 1460, 68939, 94592, 39123, 3481, 40732, 74003, 52339, 24853, 29344, 35183, 26825, 36879, 75559, 96297, 67643, 30222, 36305, 60868, 45811, 9629, 19859, 66707, 81124, 67660, 74914, 79673, 36277, -2415, 31810, 83997, 70525, 32939, 45016, 72476, 64320, 56063, 72391, 59887, 10836, 1804, 46811, 71054, 56488, 55186, 65643, 51548, 37619, 50051, 47204, 11440, 5003, 47386, 74711, 61023, 52931, 51998, 24117, 4, 25167, 55562, 31636, -2489, 18090, 55809, 53681, 36324, 37051, 26047, -7918, -13972, 22871, 46023, 26480, 8644, 22206, 38540, 28959, 6237, -7530, -12557, -13080]
311a3080J0855K4875J5515j6551l0612m067K0560L041k3973j3352J1450J1661
323c678N655J3963P671k6129l6358N99K5568L620j5311q18J3680N234K753N868
337B317j1010l0800j5218J7642K2791N365n319o258m935K889Q570m286k1871j6197
351e6320Q063J9599J6349P293p666j9684j1602R403J1263p036j4418K95J2875
364c1586J4298J0446k277k0685k1836j23J6326J0346j289l745m72N687J1216M839
378h855j3198k2990q472J4105K0058R491k128p089o976J09P254J161j2334j3812
392d3676L854K1273K0266L478j3018j5544m848M430O337L514k957n902L757J8837
406a99J5389q509k4439j4124M979J1809R833O506m4o564r78J1760R280j2793k3670
$$ y = [-13080, -2225, 22650, 38165, 21614, -8998, -13065, 7495, 10536, -13437, -26789, -15339, -3678, 1977, 15940, 23611, -2518, -38876, -38277, -12709, -9089, -24400, -25218, -11538, -6304, -3551, 2317, -8693, -39493, -54711, -37069, -14278, -8913, -14232, -20490, -25425, -22536, -13966, -18252, -40123, -56320, -48257, -28658, -12309, -5016, -12682, -32366, -43968, -34565, -23302, -30338, -44756, -44461, -31586, -17288, -6842, -9119, -29804, -51640, -51763, -35437, -25091, -26380, -30125, -30597, -24910, -13694, -8855, -22053, -45043, -53515, -39410, -19352, -9861, -11989, -19078, -26054, -25945, -18691, -17530, -29864, -43676, -39822, -18549, 1717, 5195, -7823, -23367, -28215, -23785, -17448, -13934, -16891, -22793, -19036, -199, 15190, 6681, -17758, -31882, -26903, -15094, -5261, 1245, 1201, -5363, -6341, 5419, 14699, 1906, -21764]
421b1764o636J6068K0386Q253k016n850p750m372M604N884n221j5234j816K1807
435F343K3606p9j6424j2140l181p80N107R009O40r636n70J7577J5214q092k2518
450D076j3710K144J2044J0973N141j788m374k291M827O160m298j8226j3388J1540
464a170K6104R209j1950r174m39l880l760Q455N456j4926j3537J8256K9555Q78
478C9077k4009j3297K505j211j510J1822J0827r963j2770J1586K0239p306k8126
491b136j1174J2974J1423J552N346N501j0022j4085Q141J8422q273k9127o570
504a8028K1116J6227R34L054q40k0374j7796J2636J7248q666j4034R920J6764
517A8161l38l672J893j2394k2003M679K5902L985j9433k130J6445K082n554P942
$$ y = [-21764, -28400, -12332, 8054, 16307, 14291, 8441, 691, -3681, 923, 6807, 1586, -13648, -15464, 6343, 29949, 29870, 13446, 1306, -1875, -2655, 2452, 11461, 12101, 2465, 1895, 19472, 34686, 26594, 4076, -9634, -7490, 4554, 15527, 20668, 18880, 14506, 12215, 17042, 23202, 18904, 678, -12710, -1170, 24934, 34143, 22193, 13019, 12580, 8700, 4940, 13395, 18851, 3925, -9612, 8644, 38199, 39077, 15068, 1771, 4276, 3065, 1555, 13377, 24204, 14241, 1471, 13057, 33296, 25990, -2136, -13310, -336, 11087, 12639, 17985, 23486, 13464, -621, 7520, 25942, 17669, -11458, -18028, 3088, 19315, 20249, 23303, 22463, 2089, -15707, -3071, 14177, 5511, -8523, 1397, 18161, 17823, 14151, 16044, 3650, -18353, -13674, 12228, 16213, -3220, -5350, 11095, 13177, 7623, 15565]
531A5565k595l1959j7936K9468L1567o716j3519P617l35k0827l094K0432k270
544E398k6169K087L4947J0072k4951j1116J2833j646j4172O585J4133j4083k1674
557b7756J7961L7818K335k9213j5713P12o552j932K3785K2275j5246k4790Q776
570g540K0181j0616k2996N062J6205o337p631J7934J0741k3270j4275K7324J9087
583B3869k9847l0926J3685K0705m648P332L0656p276n2598j8288L9042J9984k4438
596a2748k742K9075l516l2620P535L3326j4363l9026J3752L9266j3225l6592J3588
609a8290L4251q946j8141J9319N634m5674k5363M3668M2741j3211j9050R331p710
622a441l1376L666L9407N326l2963l611K8714J575k4467L264K3462p816k3693
$$ y = [15565, 12970, -18989, -36925, -7457, 24110, 17394, 3875, 11492, 11157, -9670, -12764, 7668, 5398, -20771, -18684, 16263, 26335, 1384, -9732, 3101, 1455, -12717, -6132, 8001, -6082, -27756, -9795, 28023, 30358, 1145, -14568, -13856, -20408, -22340, 1445, 23720, 8474, -16316, -7540, 12641, 2025, -20971, -15909, 296, -6041, -13672, 4262, 15003, -8267, -22542, 4782, 23869, -5978, -36904, -23219, -2514, -7162, 170, 30826, 23550, -29048, -47336, -8294, 11690, -12748, -15490, 13585, 10069, -22551, -15016, 18310, 3947, -35079, -21327, 17939, 4714, -31878, -18290, 15961, 7015, -11126, 8193, 13827, -31847, -57210, -13542, 29199, 15988, -3062, 6269, -1441, -32817, -29151, 10256, 15582, -17381, -20992, 7722, 9297, -15170, -11906, 11556, 3740, -19953]
635a9953Q885J7430j8864k1744K9129M3322r646l9374q775O965j5087j923M4880
648A5245L1553l6624m3594J8561L0127j9993j8938L0972J7200m0022j9280M4252
660I459K1083m2419j2633M9491J0128n8970k2921M5080J6430k7232J8196M7886
672E3578k7924p4625R17O0315Q351k9663J5664K5591l4568l6774L5584M0671k8376
685H741l2758K3578J9881l0455j6023L4709K1079k2145p772K0312j1836m4712
697c7401j397M9059K6942j6110j1613J215k1386k5164K2642M4317k045l7226p581
710a5748K1781N6j5772J4851K5690j7597l6142Q608K6852j3662k2065L2154M1330
723E0336k3397m7540K424J8835j8282l971N2640K7583n3634m6436L1419L3136
$$ y = [-19953, -11068, 6362, -12502, -34246, -5117, 38205, 28559, -10815, -19590, -12625, -27712, -29635, 15245, 46798, 10174, -33420, -14859, 15268, -4725, -23663, 7309, 24509, -15513, -34793, 9459, 30542, -11877, -24510, 24981, 35109, -23861, -46782, -1702, 14728, -12504, 5692, 53578, 25654, -48971, -48054, 12261, 20612, -9051, 6613, 32204, -2364, -39138, -3554, 37117, 8741, -24017, -439, 19442, -11013, -27036, 7673, 28752, 6607, -1165, 19147, 7311, -37401, -38798, 10261, 37203, 21093, 9480, 10695, -10691, -35855, -13213, 31104, 29059, -8167, -15748, 6033, 6089, -9683, 5168, 30858, 13261, -22881, -14273, 12579, -1083, -23148, 9006, 50336, 26939, -20601, -18177, 658, -17624, -21595, 31045, 58628, 4994, -41442, -10023, 23113]
735B3113k2601r830L6039j47n4367p597N6275J5929m2177l583M0011j0761n2088
748c1784K750M5713Q5k4938K5068L1620m0158n5022K0306M9422k481j9980J8030
761A8631O252m2419j8601M7853L3153l3106k9154J9829J0001k7520j081M1081
773B4919J1314l5467j0890K5460n513l8571M297M9351J4930k9672j1423J1704
785A0439j6815k5378K7034M6536j0901m6499l624K7840j589j3571K0572J9177
797C3221l1334l4063K1953L0776j5876j7357K7907J9203l1795k6044J8930R256
809D777k2308O604M4516L307n0271j8702L2493J0947j9396R619K4851k4123m0735
822c8421J9584M6792p165l3231R049J8533k5756k3400K8460K6471k2433j4559
$$ y = [23113, 512, -9318, 26721, 26574, -27793, -35390, 20885, 36814, -5363, -8946, 31065, 20304, -31784, -29034, 16679, 16764, -8174, 16894, 48514, 8356, -46666, -26360, 23062, 20581, 601, 18631, 24883, -17536, -36137, 11716, 44869, 11763, -17391, 2438, 12439, -15081, -16162, 24919, 36233, 766, -10124, 15336, 9823, -28748, -24451, 24900, 39830, 10158, -1265, 10439, -6376, -31754, -4720, 41816, 30915, -15584, -19208, 8632, 7043, -6528, 14044, 33221, 1887, -32176, -10223, 20553, 4677, -12680, 15227, 34430, 2635, -23409, -4479, 4777, -17531, -10927, 33589, 36896, -13375, -32077, 416, 11363, -8033, 1586, 26437, 2314, -38421, -18837, 27955, 20790, -12441, -3392, 15141, -10615, -34015, -5555, 20916, -1517, -16076]
834a6076K8741J1140l8358k3386K6715K2109j1935l222J6182q551l1523J188L5849
847H873J2460k5575j6635Q593M051o720Q384J9322l232k4150p277J6161M136j5849
861a7458j759K1115R115j4517q943O010o136j3317J2845K7471m349k9553m732
874b4208J9092K846p160J1149N896k4323j8061K4052K2973j3551j2977J5190M118
887E036k1914m003K1462j619k2265J0499L1663n823l2146j263K0004l772j0488
900a4629J6785J2384k4348j9400K3223K5678j1683j9131N097M406j2831L56K1677
913G584P443j8631o948J5036O305j5109r541R103Q329k005K100P305m801j5378
927i208j359J8115Q347j3208j1442N174O478P28O033P880q975j7522L37J6612
$$ y = [-16076, 12665, 23805, -14553, -37939, -11224, 10885, -1050, -4272, 11910, 3359, -28164, -26976, 8873, 21333, -4242, -20877, -12284, -8233, -14953, -6569, 12753, 9521, -14629, -21906, -5745, -1609, -17458, -19217, 1898, 11013, -3504, -12447, -6437, -12573, -25890, -13045, 14426, 10077, -19476, -24208, -5116, -2270, -9430, 1719, 7615, -16708, -34769, -10717, 12256, -1295, -14272, 918, 5036, -16878, -20881, 581, -1038, -23303, -12804, 18859, 13036, -19110, -20373, -369, -4141, -14629, 2156, 14540, -9808, -29208, -5985, 19693, 8010, -11121, -6024, -1618, -14449, -14093, 7584, 15027, -3604, -10552, 4484, 10789, -4320, -13861, -4758, 3571, 1566, 3666, 10971, 6170, -9208, -10567, 7548, 15895, 2687, -8755, -3581, 2897, 3625, 9658, 17538, 8563, -8959, -8622, 7990]
941G990L891j0252n46Q227p64m377N629K525j3706q743J4482J4819o556j0351
955B268K802K544m810M171J0097o084j7503P38J7521P302p045l663K46o665l169
970a250R479O926q667p723P462R910j847o205l172l639k353O637Q965j843q633
985D047k305N637M777m00m365p117m707M582J0098N562l992p644l326K224M215
1000G286O17m815n295R60O494O883J673n905r796m414P062O977k254n755n84L040
1016B174K403L825K141q647j2283O65J2067O072n306l510J459k49j154M154J63
1031C974r608p896O755J2528J863n457m409k118j332K979L376l319o619p35P133
1046b885P259J361n647q697m552M931O580J77m164j449J039K553M000J323p160
$$ y = [7990, 11881, 1629, 1083, 9310, 8546, 4169, 9798, 12323, -1383, -10126, 4356, 19175, 12619, 2268, 5070, 7614, 2804, 6975, 17072, 10988, -6515, -5777, 11744, 19046, 12001, 8338, 8584, 1919, -1250, 8229, 15155, 6488, -1235, 6227, 16137, 14290, 8085, 4913, 1274, -1079, 5558, 14523, 12680, 4047, 1742, 7379, 12156, 11756, 7391, 274, -4433, 149, 10247, 15809, 11817, 4173, 847, 3071, 7286, 7903, 3088, -2207, -1247, 5247, 12130, 13803, 7898, -1898, -6312, 750, 7727, 5473, -282, -866, 2174, 4577, 8402, 10543, 1896, -10387, -9722, 2345, 8417, 3111, -399, 1060, 811, -343, 3811, 3974, -5634, -13530, -6775, 5753, 7616, 2159, -2250, -4368, -5700, -2721, 655, -2664, -9283, -10018, -2885, 4374, 5735, 88, -8609, -13161, -8230, -1650, -1473, -5637, -7086, -6047, -3494, 506, 1829, -5331]
1061e331j0577j71J0275O701k274m212j051m56R56K834l73p228n933M374J0056
1076b410N484l653o887m323R74M218J613k176l345j233L713P271M310n532j1246
1091a3222l830O335O495L24k366o37p20J635N246J791p701r805Q38R473O604p1
1107C89l187k967j747K182L609no787m716L792R315N449j556n761o168l81M165
1123d374M433j027m394m86M806N159K327l171p120n987K668Q503M274l651l817
1138a857J415M383J618m12k948o881l767O740J2110J872p298m464J676J276J32
1153C595J660j339n136j118R518Q931l406r542l056K486J669J240J667j173m314
1168A682J570J0281M840q320j0616j948M565L581M436L562l084p198K69Q071K294
$$ y = [-5331, -15908, -16079, -5804, 897, -1377, -5589, -6640, -7096, -6140, -3306, -3679, -10907, -16840, -12466, -2410, 3074, -579, -7466, -11789, -10815, -6597, -4984, -7160, -10505, -11738, -8025, -754, 3556, -1976, -13222, -17052, -10717, -4222, -3898, -6264, -6901, -7621, -5986, -740, 1051, -6650, -16455, -15617, -6144, 460, 389, -2798, -5765, -7512, -5330, -1721, -1726, -8513, -13229, -9437, -122, 5327, 3771, -1990, -8158, -8539, -4374, 59, -968, -5362, -5848, -1042, 4117, 6444, 3273, -3847, -9834, -7166, 1337, 5611, 1960, -1857, -442, 3941, 5559, 5147, 2199, -4682, -8449, -1709, 10401, 12273, 4975, 511, 2187, 3463, 3595, 5255, 3916, -1220, -2338, 7180, 16111, 12705, 3163, 107, 2593, 4262, 5502, 7169, 5996, 1682, 3252, 13533, 18373, 10053, -563, -2511, 2054, 5635, 10071, 13633, 10549, 3351, 3620, 11691, 13985]
1183A3985r296o142L683N096R60K471L158m626q131L294Q481k753j1950j926R637
1198E941N814l50J859m38j1455r517Q402J3367l161j0389J530P228j789k778M698
1213H962k82j1985m211J1432P529q217o060P604N207n073k926J552o450r682P088
1228e512J8310K386j3133o705L267r61k510O773N675j0358r374R009J2253m684
1242D436r798K420M335o697m408Q389L282r760j373J6149O095j6803j3881O633
1256a0981O910l151M094J3415n150k1068k355J9692N718j5520m249J1164j631
1269c112j2226P372J7453o602j8614N983J5538r783j8766Q251J8636k708q161
1282f739R926K428k2294j1401K1805J7869j1955j1891P977K073j1740L959J8701
$$ y = [13985, 4689, -1453, 2230, 7326, 8286, 10757, 13915, 9289, 1158, 4452, 12933, 10180, -1770, -3696, 5941, 11755, 11405, 13264, 12826, 1371, -8146, 256, 13623, 10462, 73, 1603, 8831, 7042, 4264, 8962, 8680, -3305, -7516, 3916, 11445, 3228, -2832, 4772, 9979, 4906, 1980, 3532, -2918, -12600, -5512, 12798, 15184, 2051, -4654, -1387, -2348, -4858, 1915, 7590, -2768, -12142, -3133, 9120, 4436, -5362, -2942, 1393, -5304, -9712, -1323, 1959, -7801, -9174, 6975, 13070, -3733, -17614, -10981, -4071, -7222, -3128, 10287, 5137, -15931, -18286, 1406, 7124, -8396, -12645, -1481, -3112, -15338, -7966, 9487, 2885, -15729, -9746, 5792, -3991, -22757, -14506, 4130, 1422, -6739, 3187, 5615, -16679, -28080, -6275, 11594, -361, -12252, -4275, -2202, -13942, -9983, 8718]
1295H718j932k2091l141J6753K104j1334M384J4109m134j3385L204O623j0754
1308a0876j0121J5964K0369o171j7049j256M691n403j58J6667O528j8586j4820
1321b0221J2907J5458n788o681Q607J394j6499o081J7133Q937j3344k044J8498
1334A2276K487k3669j0098J6558P007q382O331J6728j1834k7906M770K8349K484
1347A5101j7981J391R765j2967j2358J9865K1370j4322j9773J0002J1042j6099
1359d964j0315J9638J4426j3331o778J3563k470k4365k396K8291J1731j7468q484
1372b922Q503l772j1766J1467K2876p086k6566k551J7657J255r027R608J3921
1385B1597j1345j9007N772J2896r119j0057J7265J8046j3306j9559L933R103p534
$$ y = [8718, 6786, -15305, -18446, -1693, 411, -10923, -6539, 7570, 3436, -9949, -6745, -122, -10876, -20997, -5033, 15336, 9165, -7884, -9140, -4449, -9852, -10010, 6657, 13185, -5401, -20221, -7314, 8144, 2356, -4325, 4282, 5676, -10823, -16904, 229, 9166, -4178, -6222, 12276, 14763, -8906, -19004, -2446, 4561, -3821, 2510, 19238, 7404, -20502, -15732, 12617, 15101, -2880, -1489, 8276, -4691, -17049, 2816, 24186, 9864, -9909, 93, 11135, -4964, -15279, 4359, 18785, 5454, -1324, 12239, 9769, -14596, -16992, 11299, 23030, 5562, -2922, 5581, 1809, -9957, 1510, 24386, 17300, -9266, -11817, 5840, 7095, -1932, 7676, 21597, 10252, -8755, -2983, 9913, 794, -9263, 8002, 26048, 12742, -6817, -2884, 6219, -1315]
1398a315j45J9287M730k5714j4819J8887J6012q266m234R810n511k2716J293K5167
1412A2466N280j6904l13J5803o219k2088K850J9515j548j1210J0562J2108j8834
1425A468k1040J4433K3487n571j4251N078K863j7454m364K6510J4875k0847j6486
1438a1299J1229N485j4640L77K0760M166j9294l635J4666l552j9838L602K3914
1451A1941K809j7847l996Q305n572q930J4382J7692j1333k3646K00J5980J154
1464A139m663R118N775j5929j4533J0933J3272p739p475J1713Q821j3779j1568
1477a4915Q453O502q852J19J6697M18k2455p308J8302J0121r524j849P596r137
1491e832j7655R118K3972j098j7911J235J1252r200j2768J0961J4066r482r922
$$ y = [-1315, -1460, 17827, 22557, -3157, -17976, 911, 16923, 8657, 4423, 14233, 8722, -13994, -12701, 12466, 17746, 842, 529, 16332, 10113, -11975, -9125, 10390, 8842, -2368, 8194, 20302, 1468, -19572, -5139, 18348, 12777, -1474, 3604, 6467, -10987, -15351, 11159, 26034, 5187, -11299, -70, 5415, -9225, -8848, 11912, 16078, -3216, -6851, 7815, 4263, -15575, -11973, 11941, 14750, -3097, -7093, 1212, -4360, -13290, 1092, 18784, 7451, -16195, -15995, -15, 1139, -3524, 5594, 11369, -4560, -19093, -8160, 5112, -2627, -10102, 1611, 10432, -3347, -14915, -6462, 40, -8812, -8693, 8004, 8422, -14033, -21341, -3039, 7082, -2442, -4291, 3305, -5832, -23487, -14369, 9603, 8505, -9406, -8171, 3081, -6119, -18887, -7926, 6140, -3342, -13264]
1504a3264J2988R024j7908j2148J5757J3100j0006o982Q883j520j5344L596K3096
1517I272L495j9229q356R086J674o316O563J2642n337j4667K407J1799l207j1360
1531a1534M340J1828j785q309K079M845o305m450J0566R748r851j3597L795J0079
1545A449O82j525O124r12j3171n979J3037Q869p386n255P595K238q285j564Q541
1560D458j007r330L281J2509j879j3184p54J0818J929n356K305L135r231p304
1574i610J0455J3114m203j0175M83L291m017j163Q384K414q142l311Q955L818
1588A0293p698n237N139L661l372M89L988l252o699L188J0443O45r768m211L137
1603G46J555j1N070L705o642p596L243P760j280o046M02L879j080j115L571R60
$$ y = [-13264, -276, 8748, -9160, -21308, -5551, 7549, -2457, -9439, -556, -2076, -17420, -13824, 9272, 12767, -6462, -14818, -5732, -4058, -10374, -3811, 8831, 3494, -11173, -8766, 3033, -174, -11534, -7194, 4634, 2849, -5460, -3381, 1464, -4841, -9291, 1275, 11023, 1172, -12425, -8630, 1449, 2131, 606, 6730, 5818, -7353, -13332, -295, 8574, 1188, -4067, 3528, 5766, -2519, -4083, 4458, 3451, -5879, -2598, 9911, 8032, -5152, -5906, 4912, 6841, 1485, 3790, 6925, -2306, -9610, 845, 13959, 9756, -419, 64, 3355, -662, -1825, 6559, 8973, 831, -2480, 6475, 10293, 2595, -2642, 2497, 6158, 2786, 3275, 7263, 4011, -2688, 500, 10943, 11588, 1820, -2391, 746, 2301, 2290, 7360, 11065, 4423, -3173, 70, 7830, 6550, 504, 906, 4785, 3705, 2590, 6161, 7121]
1619G121o546l728O787N412m770o060J727M360q1K83K804k575q478j138Q477N000
1635H595m417m078J838R21j879J365K948l811n821L002P461L62n283j815J615
1650A003n33L64K190K69n983j679N805N344k084m386j690q80p52L669L483k594
1666A546m980J011M802J203k496k364j595j512K250M463J064m122l296K299K998
1681A271k93j566k636j689P52L923L138p94m360k855R68L467J319k371l123K98
1697d551K549K411R70j326l784l460K431M267P78l068j914J197J323J910O28k624
1713b263m262p99L742M198n80k956j622j1J863K204p01l422k120J466L544K480
1729G61o53k890l229L97L094K040j463k873o08J904L187J029j700l404k692J828
$$ y = [7121, 575, -3153, 3634, 9046, 4276, -1784, -57, 4303, 4222, 4505, 7309, 4734, -3744, -4882, 3595, 8595, 4178, 100, 1938, 2859, 980, 2345, 5293, 1482, -4339, -1337, 6124, 6486, 1203, -612, 1003, 470, 834, 3024, 3293, -2690, -4369, 1436, 6780, 4696, 310, -1380, -2260, -3012, 657, 4140, 1546, -3434, -2423, 2379, 3582, 1086, -1278, -2873, -4385, -2135, 2328, 3392, -730, -4026, -1727, 1271, 978, -588, -3224, -4913, -4161, -238, 2900, 2106, -2254, -5109, -4141, -674, 645, -1726, -4849, -4551, -2002, 409, 1379, 53, -3731, -7191, -4760, -493, 285, -2783, -4697, -3500, -2177, -267, 361, -2263, -6525, -7324, -3582, 616, 36, -2920, -4542, -4553, -2690, -486, -1187, -4609, -6729, -5263, -1719, 761, 108, -2782, -6011, -5614, -2520, -480, -1943, -4816, -5424, -3520, -333, 696, -1004, -4408, -7100, -5272]
1745e272M051J496j736k152l63J539K602K58k735l336n08L496L349R02j841k729
1761b979j035K103K420n56k815j448R20L046K888M51l886k784J91L016J804j067
1777B69j570j089J156K586K557j364m434k451K420L518R59n52j523j478P46K881
1793B631J615k815m061J03L023K994L18o66k073j829R20L349O23l584k837J939
1809c50L861J649n74k417k122j371K149L996p7l488k208K231L441m4j070j580
1825B026k793o17L403L760r26m189m24K671J563j731o20j175k207R03N212K975
1841G831m309n052J235K782K50o8P91j931l411K191N817O92n616k987K902O70
1857A787j126J199J889k197k895L511M684l007p011k64M769J318o83J194L86m846
$$ y = [-5272, -1221, 275, -1461, -3613, -3976, -2437, 165, 423, -2312, -5648, -6156, -2660, 689, 1591, -250, -2979, -4014, -1911, 509, -47, -2862, -4310, -3390, -344, 2544, 2995, -891, -3675, -3484, -468, 1336, 269, -1301, -2390, -1234, 1352, 3909, 2545, -1889, -4340, -1920, 1598, 2557, 2005, 482, -996, -250, 2631, 4246, 1431, -2630, -2527, 496, 3490, 3808, 3142, 1069, -760, 160, 3509, 4132, 548, -2289, -350, 3511, 5160, 4586, 2169, 47, -1324, 825, 4821, 4744, 1256, -952, 1279, 4720, 4676, 3606, 2026, -767, -1384, 2019, 5779, 4853, 664, 240, 2911, 4474, 2743, 2123, 948, -1259, -356, 4856, 7831, 3522, -1530, -295, 2487, 2737, 2669, 3460, 1529, -1882, 309, 6126, 6818, 1202, -1785, 1117, 1787, 661, 1860, 3749, 1552, -1343, 2168, 6852, 3845, -3166, -3430, 1339, 2657, 1974, 3168, 3554, -1292]
1873a292k605N878M737m707n873J770L327k61J06L097m67n944j106N662J497n611
1889a792k412N244L083k641m29J398l805m659M017Q024j296p569j341M264N87
1904F73r61L034J442o257n273N316O542k678m442L149K375l739k486L578Q65n313
1920d175L60Q032J806q006m708M655L231j842Q79L418l455q232K027J0051K552
1935F593p888k417L507j218m436L876O897l213o621L186O414m998q276L717Q553
1950C676k011m250L540J575q614l886J1313P920q672q467M385L419m911J514R996
1965F527j15j3190k687J0241J684q525J310R965j764q856J323O665n204p676Q380
1980a922J1272o293j2022K371P780k925k773Q841L118j3156q089J0361R578n521
$$ y = [-1292, -3897, 1981, 6718, 2011, -3862, -2092, 1235, 974, 1080, 4177, 3710, -2234, -3340, 2322, 3819, -1792, -4204, 1040, 4123, 1482, 1053, 2451, -1354, -6013, -1996, 6028, 4732, -2837, -4178, 86, 673, -288, 2746, 4188, -2069, -7342, -2026, 4516, 1838, -2604, 545, 2920, -819, -3305, 273, 1138, -4175, -3815, 4217, 6023, -1983, -6691, -2036, 1195, -647, 232, 3650, 195, -8037, -6010, 4041, 6593, -1295, -3712, -205, -1423, -5859, -1983, 4914, 1701, -4920, -1734, 4680, -318, -8594, -4877, 3676, 1665, -2585, 955, 2530, -6084, -9970, 1343, 9263, 591, -7876, -3491, -72, -4983, -3469, 6527, 6412, -6778, -9465, 776, 2460, -6065, -4755, 5210, 3446, -5410, -4087, 2578, -2626, -10302, -1922, 9350, 3057, -8965, -6594, 1186, -1739, -4512, 4329, 7447, -5709, -13798, -3437, 6141, 620]
1994F20m079O135N33j0327k212J1088K253q653L37J0117j104j2738j128J0190
2008A032J880n737K895O040p892j1396P038J4438j021j0462Q82L582o930m289
2022i940J1854R033q994q950O165N280q604m260J0273N972q054l391P135r10j1289
2037h680J111J5278L552j2602n341O775l62n727P499J1718o492j5479O00J1405
2051C255m34o076N601P527p620r906O043P445n746n500R559P502j0398r206N714
2066b240O563l890k69R104o79j4867n107J2920Q056n630k859M528l528j0296K367
2081e827J3299J595j0262j28Q130l384j0209K825J0979j346p043L358N803q969
2095a179r328R408J3257m117j0682K138L336p744k068J4461P064j2913r552P720
$$ y = [620, -3459, 2676, 3209, -7118, -9330, 1758, 4011, -4642, -4305, 5812, 4708, -8030, -9158, 1032, 2912, -2825, 70, 6110, -1782, -13178, -6140, 8298, 7277, -3185, -2303, 1279, -5651, -9940, 1914, 10947, 1953, -6997, -832, 4448, -4156, -8416, 1857, 7829, -225, -3616, 3519, 2609, -8680, -7569, 7709, 11261, -1341, -6682, 93, -269, -5996, 1503, 13221, 6729, -8750, -8150, 3255, 2821, -3255, 2346, 9873, 2253, -7653, -1610, 5835, 89, -5411, 4148, 11650, 1252, -7954, -2240, 4323, 433, 164, 9268, 8589, -6278, -11385, 1535, 9591, 3961, 1102, 5630, 2102, -8194, -5827, 7472, 9067, -1195, -1323, 6807, 3423, -6786, -3961, 7018, 5672, -1371, 1987, 7790, -1179, -10507, -1099, 12158, 8041, -2641, -503, 2833, -4911, -6979, 7482, 14546, 1633, -7919, -199]
2109a99M890q239l71J1616J614j1958k402J0308j408j1399L853J3821j392j3017
2123d283l94P576k960m960R384Q558j0381j3361M764J0331j830l264O543J964
2137G687j1199n732R462O241o848l316P482K525q650l730P223K660n689Q62P648
2152F626l322j1491l40J1645M310o129j382L218n389p550O359J1873k440r924
2166c936J171N917l656o165N901O814n752o022O649M218q340n034R366O334o561
2181I04n372M117j79o689K991J1759P07j1620m315O341J712m016K843O301l845
2196A639q184K651P089k324o443L432N985l450n142J984L808l155k190O354L595
2211E649p537o924M009O188p93j139L112j103p371j596P790L613n638k814M353
$$ y = [-199, 4691, -3548, -3919, 7697, 9311, -2647, -5049, 5259, 3851, -7548, -3695, 10126, 8734, -4283, -4677, 2899, -61, -5021, 4363, 12921, 2540, -10821, -6057, 4274, 2444, -820, 5723, 7687, -3512, -9244, 218, 6459, -389, -3705, 3777, 6302, -2348, -6078, 1145, 3805, -1884, -1022, 6626, 3304, -8187, -8527, 3118, 7428, 1299, -83, 3135, -2254, -9804, -3445, 8428, 5988, -3936, -2765, 3152, -504, -6669, -768, 6046, 294, -5728, 921, 5139, -3201, -8235, 1131, 7465, 904, -4468, -351, -530, -7219, -4228, 7531, 8238, -3382, -7697, -1356, 356, -3660, -817, 5484, 1639, -6545, -3894, 3195, 871, -5572, -2140, 3845, 395, -4747, -2763, 1045, -2110, -4300, 2054, 5649, -1888, -8812, -4803, 1385, 592, -547, 2565, 1462, -5909, -7505, 285, 3898, -1740, -4554, -201]
2226b01J470m783l8M436k67n086J101O172j703p462J094P552L98m022K87J588
2242E36n067k941O292P156l572o860J395L533k659j165M293J372n544j575N750
2257I44K506n125k171M514J236l574m38K947j622l453L273O158j165o649j210
2272c829L501j01p75L240J656m230l248L851L772j930l806R09K114j098l24K316
2288B018O06l381m85L521J711l673k785J565K625L37M63J125k335l552L16M504
2304B580J480k792j780J283J407n22Q45J033k501k932J697M140n29k940LJ991
2320B463k04m73Q11q10k716j136M299K920j653l084J92N83l14Q75J332j527k874
2337a316Q50L624J065k259j052n58m69O96J685k4j712j290J915K113k31j935j589
$$ y = [-201, 1269, -3514, -3552, 884, 617, -4469, -3368, 2804, 1101, -6361, -5267, 2285, 2683, -1339, -1052, 536, -4531, -7472, -1180, 5976, 2404, -4456, -3061, 472, -2187, -3352, 941, 2313, -3231, -4806, 944, 3450, -1675, -3846, 668, 1904, -1670, -2108, 839, -783, -4236, -963, 5195, 4030, -2619, -3829, -328, -429, -1204, 2036, 3692, -538, -3786, 65, 3837, 1907, -1899, -990, 1124, 26, -298, 2018, 2624, -757, -1242, 2279, 3990, 317, -2468, -903, 1722, 2059, 2522, 3647, 1312, -2240, -1924, 2580, 4060, 1268, -512, 771, 2178, 1656, 2501, 3534, 1033, -1899, -202, 3938, 3409, 469, 472, 2463, 2259, 1786, 2597, 1787, -929, -2065, 2234, 5154, 3501, 417, 609, 1192, 878, 1753, 3085, 1558, -1316, -466, 3158, 4223, 1964, 912, 354, -115, 581, 2266, 2242, 530, -760, 1155, 3268, 3037, 1102, -487]
2354d87o26O24K033J031n43j979q69J410J482j71k043j525N23J236J354P23j101
2371A072j600r90J513J506q09k095n69J457R45J001Kj815k265J69K670J100j272
2388B0j519m0O00J155J165j025k275j377J105K409M71p90j291n61N91J285P85
2405G08j639j750k52J919J342N97j468j569m31J190J531k89j334j629J040J613
2421d21J196k93j927j662L31J719R96j15j282q67O17J723Q43j055j798j315R89
2438b321J894O88N2j721q92O54J681K96j725j339K53J157J696R26j264k080o00
2455b645J510J268o5r73o85k81J271J669L92j903k292J17K294R41j10j137m27
2472a056J53R29J197j66k524j208J208J975Q87o89p90j159J85J254J406p21k631
$$ y = [-487, -1113, -489, 1544, 2575, 2032, 53, -816, 594, 2076, 1905, -138, -1663, -1140, 96, 1450, 2173, 1072, -528, -1518, -5, 1501, 692, -1403, -1972, -515, 430, 1431, 1433, -382, -2647, -2478, 192, 1292, 20, -1499, -1539, -939, 216, 1381, 356, -1919, -3296, -2191, 218, 689, -101, -1392, -1953, -1362, -77, 708, -931, -2681, -2933, -1014, 328, 925, -543, -2112, -2543, -1353, 178, -111, -1445, -3074, -2034, -421, 775, 482, -1445, -3107, -2776, -1057, -61, -176, -1458, -2325, -1708, 15, 858, -197, -1995, -3310, -2321, -427, 261, 313, -1408, -2300, -1646, 35, 331, -1394, -2733, -2480, -1323, 373, 1299, 35, -2045, -2645, -1135, 133, 68, -905, -1590, -1871, -600, 1069, 1461, -442, -2734, -2617, -323, 618, 508, -629, -1056, -903, 26, 1223, 1057, -1467, -2675, -1467, 508, 1395, 706, -84, -1243, -1058, 196, 1602, 881, -1750]
2489a750m48K344J267L20p46r34j216j5J695J328j051k246Q45J890J045j351l96
2506E81q01j139Q87K539N15j793k179J508J855J97r75m15p92j232J367K887L83
2523C393k941j285J738J073r95l93P92r89r47K444K280j818l307K62K822N43j401
2540A271O7M34k221j33L675J838l236l414J205K392r56K7J911l29l075K96L457
2557C209l1l825n98L296J022k116m7J009j420k343K705L966k325m330l11L674
2573A535M85j430K000K84l755k422L380L735k571l061K155K040k210j649K525
2588A041M27l295r2M918O0m809j851L754J744j722j25J412k564l898K699N995
2604C694n13m680r31K449j243k236K533L545k837l384L272K759l836l378L083
$$ y = [-1750, -2198, 146, 1413, 1733, 987, 53, -1163, -1178, 517, 1845, 794, -1452, -607, 1283, 2328, 977, 581, -220, -1359, -472, 2067, 2582, 789, -1390, 118, 1973, 2170, 1195, 780, -12, -1244, 123, 3010, 3393, 452, -833, 905, 1978, 983, 590, 1382, 393, -554, 1890, 4170, 2352, -955, -693, 2129, 2672, 1271, 1338, 1772, -449, -582, 3093, 4931, 1695, -1719, -514, 1878, 922, 949, 2860, 2531, -544, -248, 3209, 3178, -647, -1245, 2051, 3073, 957, 910, 1919, 499, -1844, 861, 4827, 2502, -1828, -2139, 1535, 2020, 590, 2590, 2874, -881, -3303, 77, 3812, 1241, -1820, 335, 2375, 165, -1484, 1041, 1468, -1827, -1919, 2999, 3059, -1750, -3601, 153, 1897, 175, 50, 1462, -1102, -5000, -2301, 3694, 3181, -1499, -2430, 19, -1224, -3460, -927, 2618, -219, -3603, -331, 2428, -1408, -4786, -1703]
2619a703L789k132k212J931K90l847m00O253K574n710m065K715J412j986J602
2634a489M823j667o328l45N585J44m186N68M567j187m281J234L500k524l139M405
2650c20M422m308o065K181M601n33j700L665N75o701l522O630M904l099l449K957
2666B38R23n182l76O118Q18n352K4N544p43o581q2O820P35m227J087K791m301
2683a746n291N256P827j930o682M72L012l169j796O484M269o443m744M222L057
2698B798m405k087N840K862n645k037M494j1n506J451Q393K75q227k848M696J023
2714A066l245M141N464m435q754J947P576j091l967K844L738n141m659M447N075
2729E006m336l539O101K766o851m454N381L912l278m91N146j739q802p48Q584
$$ y = [-1703, 2086, -46, -2258, -327, -37, -3884, -4284, 1969, 4543, -1167, -5232, -2517, -1105, -3091, -1489, 3334, 1667, -4661, -5006, 579, 723, -3463, -2895, 1672, 485, -3796, -2562, 938, -1586, -4725, -320, 4102, -206, -6271, -4090, 511, -22, -1722, 1943, 2518, -4183, -7705, -1075, 3829, 730, -2719, 238, 1161, -4021, -4397, 1721, 2539, -2813, -2789, 2755, 2012, -4569, -4651, 2169, 2904, -1323, -236, 2555, -1746, -7037, -1781, 6046, 4116, -2566, -2094, 918, -2251, -4047, 2437, 6706, 263, -4481, -259, 2798, -1607, -3694, 2146, 5008, -637, -2674, 1820, 1809, -3697, -2246, 6147, 6422, -1805, -4653, 43, 1066, -2179, 1962, 7426, 2991, -5763, -3816, 3760, 2669, -1298, 1546, 5284, 143, -4516, -69, 5006, 670, -2869, 3232, 5998, -853, -5307, 74, 3986, 708, 217, 5363, 3624, -5178, -5926, 2658]
2744B658L422m762j280L015k624m980K870P439j490o327J200M247k486m681L148
2759f31N878k500m112K599J630m829l132O369N980l780n523J258J197l114O09
2774b101O963J697p220m065M786K685l575q6N144m18o183m90N098k17m738K112
2790f08O114j777p064k86M502m2k480M405L633n810o843L043O623j377l075K870
2806A828J510n702k811O241L718m814k554M222R27n089j613N440J668l927J10
2821h46M004k117o932R58P890J634m974p68K207k974l488M297N972k867n995J822
2837b177L753k188k556L786L128m523l011L653J970m719j344N669K756m847k849
2852c499K740k6l314K072N958n21o851j722N202P27k324R13K924k561m689K480
$$ y = [2658, 6080, 1318, 38, 3053, 429, -4551, -1681, 5758, 4268, -2059, -859, 3388, 902, -3779, -631, 5247, 2747, -1365, 1234, 2864, -1965, -5097, 1272, 7252, 3472, -2051, -793, 404, -2710, -2101, 4862, 6559, -661, -4726, 60, 2745, -830, -916, 4228, 3810, -2373, -2863, 2235, 2018, -2720, -608, 5506, 3729, -3335, -3621, 881, 839, -1641, 2764, 6397, 587, -6256, -3213, 3410, 2033, -1042, 1828, 3338, -2364, -5175, 1066, 4784, -30, -2584, 1638, 2565, -2524, -4137, 1303, 2971, -956, -846, 3158, 1041, -5891, -4933, 2957, 4591, -383, -1151, 1056, -1918, -5406, -1109, 4863, 1996, -3999, -2177, 1576, -612, -3168, 618, 3746, -777, -3788, -135, 1835, -2884, -4228, 1441, 4197, -650, -3499, -759, -785, -4099, -2027, 3931, 3410, -3441, -5163, 39, 766, -1558, -645, 2279, -282, -4971, -2491]
2868b491M649j642l677K110L567k762l619J847K619k168q13L873J594n183l207
2883e303L462L407j477j194K217j118l915M97N096O83l722j125K578J18k565J126
2899a235K740q91k570J431K335k018l149J485L370J21j821J71L27k283q09L765
2915I69K403k625l024J139J896m24p17J767Q8k450q43K738J308k646o35K159J155
2932B258j759j167J078L5j789J137L601j196l162o78K308Q86j200M16J120k241
2948c53j652K110L028j377k370P32J772j609n54J241L60j282l46K383L60k768
2964c25q39J341J152k53RN54r73j820R04K635l13j986r92J255L47k27R02M97j519
2983C49j137J113J904j045j843M25J070K44l26L96k72j755k50J944J242j288j667
$$ y = [-2491, 2158, 516, -3161, -1051, 2516, -246, -3865, -2018, 601, -1567, -2380, 1493, 3087, -2096, -5303, -1841, 1566, 89, -1105, 1112, -6, -3921, -3424, 1672, 2355, -1367, -2492, 86, 204, -2361, -1235, 1505, 614, -1956, -525, 1810, -208, -3357, -1872, 1498, 1619, -202, -31, 296, -1987, -2796, 969, 3372, 747, -2277, -1138, 758, 334, -383, 1384, 1472, -978, -1821, 917, 2225, -421, -1056, 1103, 2258, 499, -668, 410, 445, -1344, -207, 3394, 2198, -964, -1642, 666, 1552, 352, 768, 1888, -353, -2005, 105, 3133, 1756, -614, 118, 1890, 281, -273, 968, 1328, 46, -300, 2083, 2443, -325, -1164, 177, 1329, 1076, 1085, 1639, 666, -1154, -250, 2385, 2072, 86, -906, 349, 696, 469, 1371, 1868, 349, -788, 325, 2229, 1184, -659, -234, 836, 1080, 754, 1150, 878, -877, -1127, 817, 2059, 771, -896]
3000h96N18J110k3P0P89j228j459m2K049O76j736m28N60O96l79M24j28r73r51
3019a351J092J558n38r77l08K63J80M44R66j191j241j82J538J025q27j022j75
3036g46J90K11Q68R4q61o96J76J207K56o49j144M2M16Q82M57m33o41k95L23Q52
3056E09L53p62j183K8P20P28J01k76q00m30N44R37L7o64q42m8R27N54p1k23j287
3077a148j64Q13R02J05j071m01M01L25J061p98m15q31J5J145Q19l73j193k28J20
3096i16P85K56j74q75n86Q87Q23L33o84o60l76N19N07M90l81j266K09N72Q48O0
3116C71n68p22k82N47Q94k2m54o50J14M73J142n82r62o26O23L98O21M8n08r19
3136a064K66N02Q38k69j209L02M8P15O66l20j276oL82J005j38m13o76J52K04K11
$$ y = [-896, -378, 732, 709, 779, 1568, 340, -1119, -1161, 888, 1564, -172, -600, -40, 656, 277, 701, 573, -400, -1351, -259, 1299, 761, -216, -524, -261, -81, 363, 1329, 138, -1103, -1285, 253, 1278, 451, -571, -746, -556, -345, 523, 617, -244, -940, -764, 443, 699, 50, -1094, -1052, -636, 246, 703, 270, -371, -666, -343, 509, 862, 100, -1083, -1055, -335, 393, 494, 218, -582, -1012, -468, 469, 506, -158, -1000, -1048, -121, 433, 362, 139, -1148, -1312, -499, 403, 508, -563, -964, -563, -238, 823, 25, -390, -1221, -1206, -61, 758, 385, -808, -1036, -916, -131, 125, -49, -924, -1510, -623, 200, 533, -151, -811, -1187, -668, -161, 329, -52, -1318, -1109, -537, 311, 371, -197, -919, -1201, -654, 240, 218, -236, -886, -772, -299, 843, 261, -701, -1327, -704, -306, 315, 363, -145, -1064, -798, -296, 542, 273, -936, -634, -586, 129, 795, 475, -801, -807, -425, 580, 442, 29, -647, -495, -291, -80]
3156h0J184p54r88k61J049R14o16l43j63j75L5J137M38j324r30M67J075M05p45
3175C25j60j43k00N17Q82n2j260p15Q90J207l1r08j45l69p08R78J291q6j358m98
3195e43J080O97o73n64R05n56o15P22J180p58j626M33J874n5r84k33M45j281J70
3214c82J435J181j722j674J068J131l67q27J068j08j390K75J723j06j719n01J670
3231G55O82j520j81P15l42j335J833J651j622k409M66J882K99o59L35K50j431
3248f31j190K435J066j432j219N67J554j236o59P26N96j446J2K097l07k354o93
3265b114K575R05j154m44Q02j279j637J524K797l75k809k14J813n02j041J347
3281A94J132j650j309J342J637j813j583J759K157j945j308J182L91k110O98L121
$$ y = [-80, 1104, 350, -638, -899, 150, 1064, 448, 105, -58, -233, -198, 939, 1377, 53, -877, -410, 665, 1070, 325, 165, 22, -178, 339, 1221, 1169, -91, -806, 84, 1291, 1260, 352, 207, -162, -870, 108, 1399, 1313, -45, -543, 537, 1234, 561, -3, 902, 346, -269, 453, 1633, 875, -751, -318, 1556, 1501, 517, 284, 729, -552, -382, 1053, 2234, 512, -1162, -94, 1037, 670, -157, 911, 803, -587, -312, 1411, 1305, -414, -915, 755, 1437, -83, -264, 451, 109, -1226, 607, 2258, 636, -1773, -1307, 575, 874, 215, 550, 800, -631, -1821, 614, 1680, 248, -971, -404, 1150, -86, -745, -19, 577, -869, -857, 1240, 933, -1421, -2114, 461, 1366, 212, -232, 570, -709, -2346, -822, 1975, 1600, -1209, -1423, 390, -112, -1153, 194, 1326, -324, -1633, -291, 1346, -467, -2050, -291, 1866, -79, -1387, -205, 186, -1924, -1226, 1895]
3297A895M37l052j983J959J121j152O28J993j316k806N68L111n85k213O44K223
3313A472j126k276J039K045j176j400K411J657k757l172J831K743q58q10J742
3328A365k66l190j152L693K085k452j623K130k0k254J62L144r0k966K13K615p28
3345F66l144P06L352J14k323L43J232k229j777K828L594j595l632M91J786j268
3361h56q87L171J275k819k434K150K004k525r45L020R48l232r67K493J37k322
3377a789Q69L762k88m587q63K964O26j476J498K420k511l988J425L985o78k177
3393h08J107J752k425k275K609K597k328j614K125J720l497k275L524K225j953
3408D84m43J991r79l847J6M615J490k957j323K319j119k453J817L529j002l611
$$ y = [1895, 2332, -720, -2703, -744, 377, -775, -147, 1846, 530, -2276, -1708, 1403, 818, -1395, -751, 1472, 346, -1930, -891, 1154, -22, -1422, 989, 2646, -111, -3283, -1452, 1291, 433, -377, 1365, 1099, -2091, -3243, 450, 2535, 83, -1540, 590, 570, -1684, -1522, 1622, 1532, -1434, -1221, 1394, 666, -2478, -1772, 1580, 1694, -629, -286, 946, -1283, -3060, -232, 3362, 1767, -1865, -1374, 412, -856, -1743, 1428, 2703, -116, -2550, -400, 1604, -921, -1866, 1154, 2102, -1130, -2097, 396, 533, -1789, -920, 2842, 2554, -2033, -2896, 68, 694, -782, 716, 3136, 625, -3363, -1938, 2047, 1369, -808, 299, 2051, -374, -2649, -40, 2557, 229, -1385, 740, 2460, -1037, -3312, 212, 2437, 484, 41, 2032, 1053, -2794, -2778, 1837, 3327, 370, -953, 1366, 247, -2206, -389, 3140, 2138, -1473]
3424a473M21K683j195k563J947L128j432k857J544Q02j961j412L515L022k851
3439A318l264J415J375j898N50L081L84l907j647K969J422j896j85K523o50l370
3455a780K96K993m70k387J547K810j668l500M00K737k80j128J857J725l500l192
3471c540K711K973q86j843J412K02k578q25L267J702k859j090K149K90k723m47
3487b085K893J035k336O5J757r54l215J051L582K48k483o55J192o00j862K398
3503C1K569j746l154P76K166j151q19J718J393k159j624J801J168k057r90L055
3519I77J241k545j643J511O02j403M02K735p15l551k39K767Q95j592L00J309j235
3536a84k061J247K576j128j887R82J730j235k051J073J939r73r28J546P38k615
$$ y = [-1473, -1052, 1631, 436, -2127, -180, 2948, 1516, -1341, 203, 1005, -956, -2368, 1147, 4169, 1318, -1946, -531, 844, -1054, -504, 2577, 2961, -946, -2593, 376, 1798, -98, -283, 2240, 1590, -1780, -1484, 1509, 1039, -1348, 199, 3009, 1341, -2159, -1759, 978, 698, -430, 1427, 3152, -348, -3540, -829, 2144, 1258, -585, 827, 1029, -1549, -2374, 893, 2595, -264, -1354, 795, 1085, -1638, -2085, 808, 1843, -493, -428, 1329, 375, -2840, -1789, 1793, 2041, -442, -1097, 95, -505, -2367, 31, 2600, 854, -2300, -1524, 642, -509, -1328, 390, 1783, -376, -2000, -199, 969, -1088, -2078, 977, 2218, -327, -1970, -459, 143, -1260, -858, 1877, 1162, -2389, -2628, 139, 1034, -558, -258, 1051, -184, -2245, -998, 1578, 450, -1437, -455, 1275, 40, -2011, -938, 1001, 28, -900, 646, 1384, -1231]
3552a231j446K530J653j206q50Q07l25j796M33K685K85k394p15J597M27j619L72
3569g93J960q47j488N16J575q37k034J659J620m50j434L18L42p66n67J942J149
3586A865k015j383R06J457q01k20J151k00j753Q9J255N31j468j71J200M07j182
3603c32n6O94k93o48L93J390n49j614K19J420J16q49M86K74j255n00J201J429
3621A526j058p62O4P05l87m13M45M2o54J50J126L13j259o43P61P42k32j65J87
3640D88l87p15L08J521k25r03n65O35J4p8Q6N57n01l60N6J009m34r02o6J010o2
3661D86l13J80j87m21k50J011N83r04r55N11Q27k03J72J77o38o17K12J063j25
3680F09o77p8L79N1O1K96j91q55P4O46M69oj239L05K13L99l2P0n76k82o2Q43K85
$$ y = [-1231, -2677, -147, 1506, 300, -550, 257, -68, -1864, -1431, 1254, 1539, -855, -1570, 27, 454, -1165, -793, 1167, 320, -1168, -652, 923, 86, -1948, -289, 1331, 881, -553, -235, 107, -659, -1226, 716, 1865, -150, -1533, -627, 830, 29, -191, 960, 760, -993, -904, 351, 882, -586, -757, 443, 850, -332, -388, 306, 13, -635, -242, 1148, 599, -1015, -796, 624, 740, -109, 377, 651, -604, -1104, 97, 1526, 468, -294, -230, 475, 88, -325, 120, 162, -492, -342, 784, 1097, -162, -805, -44, 698, 466, 301, 488, 101, -614, -306, 1215, 990, 87, -478, 157, 171, 93, 179, 736, 235, -125, -69, 940, 506, -396, -462, 548, 486, 173, 353, 166, -255, -505, 506, 1089, 185, -770, -259, 568, 365, 537, 714, 76, -541, -329, 734, 609, -68, -146, 233, 284, 345, 641, 450, -405, -331, 315, 784, 778, -461, -156, 57, 456, 424, 494, -82, -364, -426, 417, 702]
3703G02m99m41j79M84o0J41j41pm68M52L87M54m85p71N44j06rM19k78o28j54O57
3725A4P61m40l86l81J28J53M30n2k9m68m08N68L59j16l18l94J74K79O4J87m32
3746c07j58LP07ok33o16j64K23O02j35p1l22m1K92L5K98k20p08K95K03L73r2p0
3769a12k63l24J80N13J34m47P4n19L99J37J52k87j58m3M76L68l75k22j78K25L7
3790b33K56J40l32m07K54M37J95k02m18j71M65j3K45k5k19n32P50K1Q5l18j06
3811a28l75L04L78M69o10k88j45M51M23k04n79J29j18M51J48J23l92o49J79O32
3831A99L65l96j23j88K37j59O98j19m43k60n5M67L43k79j63N3k00L32L50k85o22
3852b48L2M30L53l0l43n5k38j75O25J34l96k44k67N77N72p14K6Q9J9j17L28J64
$$ y = [702, 203, -238, -417, 67, 7, 148, 7, 0, -468, -16, 371, 825, 340, -431, 113, 7, -2, 417, 139, -489, -643, 14, 775, 335, -51, -432, -304, -151, 279, 227, 198, -270, -678, -110, 249, 133, -185, -579, -405, -126, -62, 125, -307, -465, -462, 245, 239, 6, -610, -774, -551, 51, -84, -155, -477, -518, -226, -191, 107, -113, -821, -526, -323, 50, -42, -112, -375, -699, -519, -6, 128, -319, -245, -764, -365, -228, -76, -363, -521, -564, -88, 280, -95, -317, -495, -270, -233, 23, 163, -169, -576, -322, 115, 310, 108, -310, -481, -16, -29, 216, 191, -28, -560, 190, 211, 296, -22, -128, -503, -199, 179, 648, 38, -250, -395, 56, 479, 275, -304, -175, -293, 158, 306, 429, 37, -612, -433, 199, 564, 168, 45, -143, 94, -65, 633, 514, 71, -189, -244, 223, 566, 287, 124, 177, -23, 309, 659, 374, -248, -216, 214, 567, 537, 194, 139, -99, -274, 351, 485, 89, -155, -422, 155, 727, 13, 39, 128, 147, 30, 358, 522]
3874E22k74r33M96Q16J69o12j65j09n7J11O53L34j173m68M34N76L40o22J23O9
3894B30n08J07P75k90m97k35Q03m0n39M9J51n3l05P62L83l65j336K55J200J70
3914G17p01J41K07q76m69J282N02r12p95Q78N65p10k32O71J24q40M10L89J24j425
3934i50p5J421J73n49k66J60lo78N89R36M9j215k11R01j02o43L94J035j167n50
3954g51R74O67j097n68P89R20r13n57K64N16j098M97J320J23j415j136J560K61
3972C56k43m91J039k82j558K68J744k35j014K49P48n12j184N68J045l06j178J151
3990A65P47j070j479J108J101k22o45N51L10j678k00J598R40j465p21Q79N43j100
4008f38l81J337L17j512J05J128K35j810K11J840k45r38j61P83n51j102J369J660
$$ y = [522, 248, -685, -189, 627, 796, 184, 19, -90, -147, -36, 617, 951, -222, -690, -256, 320, 660, 38, 161, 230, -278, -171, 604, 314, -183, -418, 385, 345, -194, -145, 6, -47, -352, 410, 793, 428, -908, -653, 547, 717, 16, 157, 364, -512, -981, 301, 803, -109, -904, -26, 539, -171, -403, 268, 392, -448, -38, 351, 475, -950, -1025, 396, 569, 20, -246, -86, -89, -767, -178, 758, 807, -408, -619, 282, 180, -463, -69, 966, -201, -751, 223, 890, -207, -775, 14, 934, 21, -536, -272, 244, -854, -357, 963, 1086, -329, -1465, 95, 356, 113, -378, 661, 379, -1179, -911, 833, 598, -416, -167, 581, 69, -1115, -547, 498, 192, -986, 165, 912, -158, -1637, -529, 572, 350, -295, 256, 566, -1112, -1312, 286, 1226, -239, -960, -81, 462, -638, -1019, 318, 635, -877, -772, 356, 591, -1219, -1008, 832, 587, -351, -512, 271, -280, -1382, -13, 1647]
4026A647j035j893L76J272l91l35J059N23j507j452J727Q45p39r00J538K90j500
4043d75o81J351J35r51M29J264O2k130l22K048J3o58K93P40q50j772O85K101k57
4062A025j435K94J089j237n65Q71J110r58p51R19P22j564j055J620J119q14o15
4079b25R64n89j232j36K656N51j768r97J047l2j098P33J828p90j860O9J906q22
4097B05j073P98J789r36j395N25R94j048r58J564J220j224j681Q19Q13p94J01
4114b81J477J58k122p30J602Q98j272P4J076k44j445K0J542M5j266L82J221q33
4132C02j466J10J734J16r64M80Q09j709j181J328J903q66r77N27L27j360l33J688
4150D68Q29j322r00J266j39j021p9J399L21j187j68R61k46j355P9K118j74j411
$$ y = [1647, 612, -1281, -905, 367, -24, -359, 700, 1223, -284, -1736, -9, 836, 97, -803, 735, 1025, -475, -1156, 195, 330, -621, -192, 1072, 1134, -996, -1318, 730, 743, 85, 378, 1118, 268, -1504, -819, 1282, 1025, -410, -116, 973, -264, -829, 42, 1152, 194, -557, 362, 1084, -480, -1535, 85, 1204, 390, -225, 739, 150, -1082, -1218, 1438, 1989, 221, -776, 271, 239, -859, -126, 1702, 912, -948, -879, 1027, 205, -868, -70, 1719, 783, -612, -87, 907, -141, -1099, 465, 1685, 461, -1220, -401, 412, -382, -281, 1196, 1354, -768, -1498, 104, 1002, -270, -196, 880, 636, -809, -789, 753, 798, -468, -86, 1135, 302, -1164, -1054, 680, 796, -168, 312, 1121, -588, -1769, -441, 1462, 596, -381, 146, 473, -887, -1220, 468, 1297, -25, -925, 341, 202, -819, -898, 501, 822, -365, -533, 428, 182, -1173, -1094, 1024, 850, -561]
4168e61j17M46j0p35J322J114r63j500K47J160m79o25P52Q67j260o85J086K70
4186C29q61k47J231M65j250p78J006L24k87k83J078k1j601l03J533J54r41K32
4204b20N27j50j309O87J180m13j067M33J057n99j234P54R68o24m05O50K55j186
4222f96l65J305Q82j000n89O69K00p24k9O49O97j099o36Q96rq40N28Q09l52q75
4242e79M44L10j54o65N2J291l99o05Q9K78n8n28J025M28r10r30L29J000j95m09
4262a86N43n6q64J87M69M34n20m61M63L52n73k31N96j28l66K28P01o15q50M00
4282d77N91L63o95L84M9n54k53M67R19n50o74K83K29j0k77M35K86n65K01L74j1
4303E15o40k12K59N88l52n5k6k02l77M87O83k91m04j89K42L6O1J37j1j47m44L87
$$ y = [-561, -678, -232, -242, -977, 345, 1459, 496, -1004, -757, 403, -76, -701, 51, 918, -342, -1027, 59, 329, -532, -779, 452, 917, -333, -1111, -105, 219, -68, -351, 727, 706, -895, -1198, 335, 489, -452, -220, 307, 157, -1152, -465, 715, 302, -765, -332, 725, 126, -1108, -354, 614, -10, -415, 235, 490, -696, -1061, 244, 1126, 126, -463, 206, 406, -318, -347, 302, 999, -100, -736, 160, 151, -689, -161, 648, 296, -579, -135, 175, 21, -644, -592, 699, 300, -305, -216, 62, 4, -524, 501, 929, 19, -911, -582, 418, 223, -186, 357, 301, -563, -376, 93, 527, 7, -454, 9, 361, -212, -443, 153, 25, -341, -113, 588, -27, -877, -477, 114, 477, -218, 166, 215, -339, -592, -125, 794, 244, -430, -147, 82, 72, -205, 230, 516, -49, 152, 526, 515, -125, -337, -78, 510, 158, 103, 77, -125, -502, -15, 668, 377, -27, -216, 26, 62, 123, 260, 249, 102, -342, 45]
4325D5M39n98j79L71lo5L9j14J66j19r6L79J60k36m10j41O70k70K74k53K5m39
4347c55K40N01J41p24k6L35R1k0m70L92j0Q2l02N93l60k2l2J18K57k69j56L28
4369C32o12k5J11L76J3l59m4J19J92J9j23P1k18J50QP1k34qM1J74j42K8O9k22
4393b13o0J52K80o7m02k8J71O8RK10j82j53N5J39j76R3J19j67K29j56K3J74k30
4416a12k61J1O33k50R2m46O6L73jq0q8J60k76J74K76n37L8J30j30R1M32k94l34
4439c33L16n25L20L23K43m67q7j93L02J59n2q4l0P2j19O08l95k28m0J39K24O7
4461B20k98O0j37L39L65l80q9L8j09q5J37n4J05k32j8J29J75L2l80lK59l01K35
4484HMJ46k55K3J84o4j07j07Q9j42K54M7k70K26j69N3K20M5j63n10K53J96N8O6
$$ y = [45, 484, -114, -293, 78, 75, 10, 49, -65, 101, -18, -114, 265, 425, 189, -221, -362, 308, 38, 312, 59, 84, -355, -115, 386, 527, -197, -223, 112, 203, 183, -287, 105, 95, 177, -125, 468, 108, 86, 54, 172, 429, 160, 4, 332, -280, -305, -194, 182, 195, -164, -208, -89, 103, 122, -1, 70, -148, 2, 10, 81, -153, -161, -120, 54, -88, -60, 9, -213, -273, -121, 159, 92, -310, -338, -167, -99, -90, 120, -62, -215, -160, -21, -197, -104, 15, -152, 77, -79, -56, 118, -112, -373, -362, 271, 21, 113, -333, -267, 106, 105, 25, -63, 97, -179, -5, 271, -266, -228, -98, -228, -137, 295, 1, -333, -17, -542, -222, 101, 344, -123, -210, -403, -101, 58, 6, -78, -108, -36, -155, 453, 58, -170, -210, -71, 153, 220, -78, -18, -155, 184, 549, 169, 80, 118, 9, -76, 61, 7, 112, -120, -138, -9, 166, 198, -182, -185, 74, -227, 8, 12, 158, -97, -74, 110, 46, -61, -168, -79, -221, 33, 80, -190, 36, -133, -80, 140, 185, 22, -488, -235, -39, 19, 85]
4508H5M2j59l16K95RL60r1k20k11M17j49L29k33j16m98K19O00k51j2k41K89l18
4530a70J10K89k22j32K2K22K30l26j09jN3p2J97L8J41n32L93K72j32m56K54o8
4552Aj34P6J19N25p95J96l3k1J66j3j07kJ7j3L86l11l61J96J73L17o12j03M57
4575A24nJ10n3J60k19l38l14R95J5m32R1n4p9q3K38K12k45j54K34J48l07m02L95
4598C7M26m74k52M51J75m74l29M68L80l07o8j42M36p54L94L35L19p66k15K88J09
4619C7l3l0O65n62o06M42J05j02k39L80L47k37o08M94K76o86J08N19J14m85m96
4640e97O26L24j76m95O38J13r43j8Q29n9l91l50Q53k03o24J74P73l86j15o5M02
4661C10m63p56Q55N40k90m18L34l7m81l35Q64M13n47k09J57K0q8j91N87L0m68
$$ y = [85, 127, -32, -348, -53, -44, 316, 225, 5, -206, 211, 62, 391, 158, 42, -456, -237, 363, 112, 100, -141, 148, -170, -60, 229, 7, -125, -103, 119, 349, 23, -86, -87, -34, -106, 91, 129, 270, -262, 131, 403, 271, -185, 69, 1, -133, -57, 62, 587, -208, -12, -45, -66, 100, 87, -20, -22, -5, -18, 368, 57, -304, -108, 65, 382, -230, -333, 124, 119, 229, 176, 336, 117, -221, -535, 460, 475, 43, 134, 80, 1, -82, 156, 368, 123, -31, 203, 351, 44, -358, 37, 463, -11, -263, 188, 363, -111, -440, 28, 408, 101, 33, -109, 327, -427, -33, 302, 621, -145, -360, -72, 37, 4, -26, 639, 77, -529, -87, 18, -84, -323, 57, 404, 167, -441, 53, 329, -357, -249, 270, 384, -101, -597, 29, 353, 177, -318, 320, 433, -510, -528, 301, 242, -149, -499, 354, 151, -473, -299, 474, 88, -27, -92, 310, -153, -909, -54, 486, 196, -222, 112, 75, -406, -741, 123, 536, -11, -220, -63, -43, -131, -322, 265, 295, -173]
4682a73l19M88J63o93J06P54j66l37M7Q1J42o29L90O29k41o64R5L06L5k99M91
4703B06M88o92p85P36N96m62n19O29J32m12m07N04L57l54k03N80K76q23l39P07
4723B15K36l22l88M48P0r43L62O97K53j056K06O35n30m99K16R19k52q07O16M62
4743E38o58k94K62O87l35j70j40L90o37J34N58L90p86n11N77O3k21j03P53k2q90
4764d15J30Q62l07o90K74M45J35j091L72O46l64m02O34L31j76j109M16Q64l53
4783B02n74P94Q9o91j37J82O26k42o01O44Mp18K21K52M11o71j33P58J57r60l46
4804g33R21m0n31K99M08n50n35N89L93J43o13N58j01l28l48M30N84n75j79L49
4824A41N92j043K61L46M59n75m20M64R0n29j45P76J21o90k11M42j05k24K43M15
$$ y = [-173, -492, -4, 159, -534, -428, 326, 160, -177, -130, -49, 93, -536, -146, 483, 242, -422, -327, -21, 14, -285, 206, 694, 2, -783, -47, 549, 87, -432, 197, 329, -83, -490, 14, 371, 17, -186, 394, 670, -153, -492, 215, 451, 129, -259, 189, 259, -684, -322, 375, 628, -428, -222, 413, -117, -616, -400, 519, 267, -540, 76, 538, -120, -414, -152, 535, 200, 30, -110, 280, -357, -223, 335, 725, -61, -572, 5, 68, -153, -256, 497, 475, -415, -285, 577, 270, -420, -146, 299, 434, -657, -285, 361, -3, -405, 229, 560, 384, -725, -309, 555, 202, -372, 422, 511, -180, -317, -135, 491, 249, -352, 292, 296, -422, -201, 51, 462, -209, -342, 416, 573, -387, -733, 188, 148, -383, -84, 324, -226, -761, -172, 221, 364, -249, 309, 208, -120, -468, -38, 546, -29, -208, 141, 733, -310, -49, 297, 756, 181, -239, 225, 315, -214, -359, 417, 538, -152, -363, 79, -26, -250, -7, 408]
4844D08k00o92R5N50NP1m24N67j97m30J79N47o07k97M24L93m51o14N51L34k92
4865h0j60P11k79m43l69P89K37j10m99L05J62n42J49L20r3n16K47P23o97k90N7
4886c78O15M5j60J62m15k0n00L79O64j20n00pK24k28oL67K6k59j95K05K13l81
4908b69l4M34r0m75N00k03J7j78k05N94P1l98M79j48k85LN9L05k98k73J30K31
4930c3P9O5j55K11j93l97M20K34k62k68M32J77n36K91p1O5m67L91K35P2m37k8
4952a75M1M73o31K20K61j62l08J38k6K25k32j28L64K31p6N6l2j32j8J03j66Qj72
4975a38l16O36O3m14J21K9j46R3J45J30j09l40K33J70j22ML34l91K35m34M50k00
4997C3jj7j35M62m23K47n4l72J56L72k17R1j65j96L41J83k29j14L2j92J71J30
$$ y = [408, 208, -484, -389, 161, 166, 237, -187, 380, 183, -247, -68, 479, -128, -425, -1, 392, -59, -673, -122, 212, -80, -240, 471, 192, -251, -620, 169, 406, 296, -203, 102, 264, -278, -129, 191, 98, -418, -171, 552, -145, -435, -378, 237, 282, 122, 284, -131, -151, -651, -272, 392, 272, -228, -235, -11, -239, -245, 122, 148, -111, -306, -101, 112, -269, -303, 131, 41, -434, 66, -137, -120, -298, -503, 91, 162, -236, 243, 95, -190, -187, -128, 177, -121, -394, -264, -33, 46, 111, -44, 167, -26, -423, -3, 231, -31, -299, 133, 310, -226, 65, -6, 59, -408, -17, 218, 290, -147, -175, -134, 339, -292, -72, 189, 27, -281, -143, -169, 56, -176, -304, 60, 291, 215, 271, 239, 107, 89, 192, 26, 34, -138, -454, 182, 245, -169, -48, -19, -165, -72, 73, 203, 94, -246, -13, 157, 35, 39, 373, -18, 217, -217, 233, 33, 32, 15, -120, 342, -81, 166, 112, -260, -104, 268, 51, 142, -23, -219, 122, 305, 76, -38, -6, -198, -27, 103]
5019A03k04K40l40L19j29P9P2J58m08l30N14K29k01l22j7M17p9k62J84j3J97n26
5041c19K97ro4Q7N3R5k44Q1K20l34J00j29K69r6K27l65K45k12K8K82k14j7j66
5064a85M6J49K79j74lN0j30K13R1%k62J0k31j33J65K48j95OK55l81j1J09K15J02
5088B33m59L33M3k50K37j4k7O7M7q2Lj9R3k35J00o3k73k21L03J28O1M7l61J66
5112a43j24K92j14j20K98P1k37J65n2k12L38j61P2O1j39Q1J11Ol45O3j66K66J15
5135A26j4J87l33J59Oj71P9j57J97P6l9k83J32K00J5qj97Q3L6j47R2Oo0k1j56
5160a92J60R8k67J96J61k34j90L50Q0m37K93J85j37k70K27j73R7L8l13L03k29
5181b54K62L21j22j51l26J46J50n1l1P0k15K30J57p5j26J85n28L47o8J67k6j02
$$ y = [103, -101, 139, -201, 118, -11, 68, 140, 298, -110, -440, 74, 303, 102, -220, -237, 180, 101, -161, 23, 10, 207, -319, -22, -31, -95, -8, 45, 140, -104, -23, 197, -137, -37, -166, 103, 7, 234, -131, 114, -98, -70, 212, -2, -19, -185, -139, 10, 289, 115, 112, 162, 32, 245, 336, 336, 74, 84, -147, -280, -115, 133, -62, -56, 199, -182, -193, -84, 131, 233, -226, 107, 150, -100, 137, 123, 96, 163, 210, 128, 131, 112, 205, -30, 70, 7, -266, -487, -184, -56, 5, 52, -309, -143, -267, 25, -89, -209, 89, 160, -77, 88, 36, -176, 162, 1, 73, 134, -5, 76, 187, 193, -152, -89, -255, 11, 126, 112, 299, -34, 125, 131, -40, 39, -118, 79, 155, 116, -167, -35, 165, 180, 172, -25, 58, 94, -53, 39, 45, -15, -36, -192, -32, 66, -201, -5, 156, -78, -268, 82, 162, -275, 18, 203, 66, -204, 23, -150, -53, -15, -328, -25, -254, 8, 329, 207, 56, -270, -124, 26, -25, -56, 14, -201, 29, 186, 111, -15, 170, -358, -11, -79, 88, 62, -40]
5203d0Q1j95m1L59q5rj52j24j27K78K78j06j61J79j96K20l8k31J04L73l84nJ12
5226I0j43O1j67L65m03J25kJ88j85J8k8J02K6q4J15k62L05k43M1J83l04L8J98
5249C4p5k22J84J84K92l13q8j44Qj70K18K96k80Oj51L19J92k90K10k01J84n30
5271c37N64l59J66k87L98J57l05P6n2K9m5j99J67j61l4j4o6J93p0J41K18J63m55
5294a12j6J33O5k22M5L28k4l48J88J09Kl75M1K89N7k49l47N69K34m51k42L15k60
5317b71K55p8M88m68mj14K85q7k80O57m97J01l28L81M09l18o54O98k54j21K42
5338D2L4k56Jk3K18L53n32J99j0M6j19Q6J05Nl33j08O05n15lK52L64m30J0P3J5
5363G9K4k05K93m4l05k00K75L38k99J9K60q7l52J98M10m99n2J50L15k19j20j12
$$ y = [-40, 41, -154, -195, 164, 79, 70, -82, -206, -333, -55, 223, 117, -44, 135, -61, 159, 121, -110, -6, 367, -17, -22, 90, -53, 8, -159, 206, -197, -72, -74, 114, -71, -53, -81, 21, 47, -37, 78, -184, 121, -122, -81, 102, -202, -164, 34, -41, -263, -79, 105, 397, 84, -4, -148, -140, -310, -92, 204, -76, -70, -221, 98, 290, 0, 210, 9, 193, -337, 227, -132, 34, -253, 145, 302, -3, 73, 21, 50, 5, -194, -27, -188, -222, -236, -302, -109, -179, -38, 180, 343, -112, -128, 5, 70, -152, -107, 221, 197, -151, 37, 146, 148, -227, -186, 103, 160, -89, -436, 133, 367, -84, -326, -11, -271, -16, -94, 394, -74, -78, -192, 93, 6, -274, 383, -114, -13, -341, 40, 449, 131, -523, 175, -79, -200, 42, 76, -180, -179, -202, 16, 369, -163, 36, 26, 72, -47, 39, 144, 149, -184, -292, 313, -202, -205, 47, 411, -19, -9, 64, 79, 103, -102, 191, 147, -158, -358, -83, 255, -44, -25, 235, 148, -204, -6, 404, -95, -147, 3, 318, 99, -21, -133]
5385a33K61l2p00Q98k70o4m84K15L14%M7k59M27k56l70O98j21k26j28K20J28k16
5407e1l27K53N78n10j24M22N9m86J7K49K17k24j88K01k01Pr5N06j41l17K89p4
5429F0j05n0l1K04P0l29J11J17N6%J46O9l64O8J13k67j38J30K94J7k54lJ95P4
5453A83l58j36O56l27k23r9K28L71k81k27M44j54m13K60P0j77p8K95L35j23m10
5474a64P3L46L3m48J23L22l12m65N23L88l74N0N9l6l30J94K68j6m07J30N13p67
5496b97J75N6L26N1j62p8J95K6m49K45K20m30K4J70L9m5m6j18J79J95o69P87L3
5519D27n98J51L62l79Q5j68K78P7l40o5J38Q5j81O4N0j14j9M08J51r7o40K77N59
5542E11m84M38m40j2K7l00K62L35k88k36J46K27k86K5r3K53k3j71N39m17k07P4
$$ y = [-133, 128, 96, -604, 294, 24, -40, -524, -309, 5, 5, 52, -207, 220, -36, -406, 292, 171, -55, -183, 37, 165, -51, -378, -125, 453, -57, -181, 241, 300, -186, -169, 80, 297, 73, -115, 86, -115, -108, -203, 303, 162, -155, 134, 60, -45, -95, -126, 78, 148, -181, -70, 47, 103, 103, 249, 318, -46, 22, 135, -132, -270, -140, 154, 171, -83, -86, 109, 183, -175, -311, 345, 18, -205, -304, -76, 295, 14, -213, 231, 77, -336, -76, -6, -183, -261, 34, 369, 246, -164, -91, 255, 288, -160, -37, 285, -27, -492, 31, 419, 45, 95, 154, 118, -212, -18, 250, 234, -173, -43, 470, -297, -122, -66, 260, 311, 149, 71, 266, 292, -157, 88, 308, -122, -98, 72, 111, 66, 20, -98, 81, 276, -393, 394, 427, -171, -20, 342, -37, 48, -120, 158, 235, -105, -170, -32, 53, -128, -64, -14, -128, -147, 261, 412, 315, -325, -48, 511, 27, 465, 25, 13, 40, -260, 2, 337, 49, -187, -41, 186, -100, -75, -168, 85, 62, -109, 430, 13, -194, -120]
5564a20K27M18p19K10j88J68j66P7L10j20j01k41Mj49J18K14J72J68k57r2K38
5585A71j48j37J13J90k94o8J26j12oK56J73n86M00j71J06K40j69o8J47Q3m71o3
5607b88J20L00q9o3J67j03l19L6L01J96l32L28Ll60k05K17P0L15n05R0J47l17
5629b91M0L2P29o49q0K45J3n3k73J44K79k58l67N46J42m30l3K88j64k05L18j65
5651a92L34l8j27J23m7k05J41Q0k90L55j70Q5j54P5j20M53l35j83K76k26K96k90
5673a59J07J00M0q1LJ31l0j85J38n21K44J2m6J70k82K98l8K4p3j02K83j82K90
5696A41l64L46k44K23R9R9m39m8J71M3k19pK96j05Nk84L55N5j11J20k84O8j16
5719b00k1J19L41m34L72j08K2j31J16J61k39J97k85j00k4J32k13N86m18l0o6M82
$$ y = [-120, 107, 525, -194, 16, -172, -4, -170, -93, 217, 97, -4, -245, -241, -390, -272, -58, 114, 282, 25, -67, 171, 23, -114, -1, 189, -105, -173, -47, -159, -165, 91, 264, -322, 78, -93, 13, 253, 84, 16, 163, 246, -225, -288, -168, 132, 43, -20, 147, 44, -275, -239, 62, 258, -74, 254, 257, -103, -308, -91, -21, 294, -211, -121, 26, -291, -251, -219, 510, -139, -219, 26, 39, -14, -287, -143, 136, -122, -489, 57, 199, -231, -264, 24, -140, -345, -27, -192, 142, 104, -23, 100, 53, -152, -11, 69, -221, 134, -36, 49, -105, -30, -150, 303, -32, -215, 61, -165, 131, -159, -52, 48, 88, 7, 10, 141, 111, -74, 64, -457, -213, -201, -247, -77, -359, -61, -99, -75, -148, -250, 33, -149, 141, -223, 123, -121, 102, 201, 300, -139, -187, -16, 27, -192, -199, 97, -8, -3, -287, 68, 123, 12, 132, -152, -84, -200, -221, -102, 239, -195, 177, 69, 91, -40, 76, 237, -2, 195, -90, -190, -214, -82, -295, 291, -127, -157, -223, 259]
5741B59k10k59J82n8J67j61J03K80o59M58J99l03R4j09kj48Q6o7K61K92l53kq0
5764c0j29O00l93K55l13o9K5J73n2Q4j68M8RJ33j15j50N2j12K88k48J85k10K41
5787A04n5j58J70q4L23K7k67j8P0j1o2l21J80L9J08o0nj4J30Q7k68J39q8J56j09
5812A3j72L44j11k51N2J34J10l00K19j30n4P9l31M38L40k68k31J79k5J33m8m0
5834H0r9k9o0k8m6M46m87J32L52l28K44k37kj43J11J48j15k81J83l1j90N23k77
5857a34O9K17Q2l66N7J24o8J41l88L17n9n9j5l2M1K23l9R2k04o4J82j3j16k5k19
5882b56K1L93j72o1J5J7K52k16P8l7j1p3J64k40L97n09O8L42q7m0j73J58P0p8
5906B2k43K79J84n69L52O5k58M03m70M71l66P3K58k66R3oj47K80k59J40K26l85
$$ y = [259, 49, -210, -28, -86, 81, -80, 23, 303, -356, 102, 301, -2, 92, -17, -19, -167, -81, -148, 113, 405, 52, 50, -30, -159, 441, 48, 303, -10, -79, -54, 119, 67, 151, -17, 31, 40, 173, 58, -92, -40, -152, 136, -112, 73, -137, 104, 49, -109, 61, -23, 300, 327, 60, 42, 112, 101, 39, -282, -102, -63, 45, -15, -20, -34, 96, 183, -85, 54, -34, 122, 13, -159, 185, 74, -177, -125, 9, 119, -181, 38, -92, -146, -67, -398, 40, 380, 112, -119, 60, 35, 168, 120, 80, -19, -48, -108, -136, -182, 264, -223, -91, 261, -67, 177, -60, -62, -205, -94, 54, -61, -342, -159, -190, -380, 143, -134, -65, 152, 234, -132, -75, 49, -19, 122, -266, 51, -8, -67, -82, -114, -73, 150, 111, 203, -1, -65, 117, 104, -12, -37, -256, -235, 158, -14, -75, -60, -43, 209, -7, 71, 34, 23, -50, 114, -126, 271, -238, -170, 172, 85, 45, -128, 30, 100, 22, -221, 58, 242, -327, 25, 90, -168, 235, -235, 236, -130, -57, 201, -65, 28, 22, -125, 155, -104, 36, 262, -123]
5928a23J9k13M7N03l56lJ46k38J41J48m2J16j74m8J17L19m62k36J85L43j47o7
5950b5K8J06j99J05L10j08l96J85Q8o9k14kK12l9Qo4L2K00n66J85L86k24n9R9
5974b1J48j74j36L82K19o16L0M33k25M02o51L43J51m59o8K08M8n2J72K9j12p3
5996b2p3P8k08K75j40M70l51l32J25K89k84kK36L90n47l25N88r7l47m9N44k7j79
6019A2m57M49J54l23J17R1L7m10M34O1k97R2P5j5j62K82j83K40j01j80J00%J42
6042A58n15L79j70J01l26N69m7j67j93M34%j64l93L28K14k85J27K7K6k11j44K96
6064D4J00l39j00O13k71n59K31N57j21m65K35K80m72k59M97K91N9p48M54Q9j36
6085b0l26J44N39m72Mk05M36n20J24N55l9m69rM06j00L7j18N70P2o97L42o6k64
$$ y = [-123, -104, -317, -270, 233, -123, -126, 20, -218, -77, 71, 29, 145, -29, -77, 40, 359, -103, -339, -154, 189, 42, -25, 3, 109, -90, 15, 325, 217, -179, 6, 94, 25, -189, -191, 21, -18, -10, -74, -42, 158, -408, -223, 163, -61, -120, -21, 127, -47, -183, 199, 418, -198, -168, 265, 40, 442, -209, 134, 285, -174, -242, -34, 14, -38, 134, 163, 51, -22, -95, -17, -225, 50, -90, 380, 29, -303, -178, 111, -173, -175, 61, 451, -96, -421, 167, 70, -277, -326, 218, 191, 12, -445, 4, 158, -165, -48, 43, 80, -330, 104, 165, -132, -40, 35, 20, -142, 140, -43, 197, 96, -84, 16, 16, 158, -357, 22, -148, -47, -373, 196, 149, -18, -211, 223, 223, 59, -334, -6, 208, -77, 50, 77, 103, -108, -252, 44, 144, -195, -295, 318, 47, -512, -281, 276, 155, -310, -75, 205, -267, -526, -29, 262, 321, -427, 27, 116, -20, -346, -202, 337, -135, -131, -336, 100, -420, -296, 259, 220, -249, -258, 148, 48, 85, -33, 537, 609, -88, 254, 188, -76]
6108g6l34M76K64k12m69L00J38j18j11J1N62k40l37K3L14o3m4O3K88m05j9j6J97
6131A92l40O8J10J58k34l49N68J6l17m3L28j62j62k98P79m4m80K15M55m33m12
6152c85J11M48k78r3K19J87k92q1K62M36n45j33p9M35m10PL0M84l69q9K02J94
6174B61n78J11M94r8l09j13L52J8k68J63J52j2p79L76N61k46l04L90J50n69M7
6195b01K04K95l71j7J11K47l51k03L43K45n59J36K07L60p76J54L97k3n5k62L92
6216B73p2m56j2O32p4k74j88L30j68k38L7M19l56j31M51K96l91l70L68k8K7j65
6238i0Q2j22K10j58M03j88k67j38L74p4j31j75K52K7J3n7M51n36l2J43N7J92m69
6261b33n3L13j59J03K8K40n2n07N10j36O1K5j9l74N7LJ0L59l12j53M51j23J8p2
$$ y = [-76, -410, 66, 330, 118, -351, -51, 87, -31, -142, -131, 431, 191, -146, -123, 191, 128, 84, 147, 435, 30, 11, -5, 192, -148, -80, 30, 188, -46, -395, 173, 189, -128, -171, 157, -5, -167, -465, 314, 270, -210, 5, 460, 27, -385, -274, 174, -104, -197, 22, 209, -83, -164, 98, 534, -11, -144, -223, 212, -198, -191, -161, 323, -46, -135, 67, 261, -317, -206, 288, 190, -119, -232, 120, 138, -130, 33, 185, 173, -606, -230, 331, 85, -219, 171, 321, -248, -201, 3, 298, -73, -90, 21, 268, -83, -286, 57, 302, -257, -121, 86, 446, -330, -176, 221, 198, 143, -119, 273, 201, -255, -267, 365, 291, 17, -171, 159, -9, -247, -210, 209, -147, -278, 173, 469, 78, -292, 76, 48, 75, -90, -8, -130, 80, -78, 325, 137, -130, -268, 106, 32, -99, -274, -22, 5, 18, -39, 412, -124, -156, -13, 44, 236, -233, -286, 27, -132, -29, -1, 239, 187, -320, 190, 54, 115, 140, 121, -253, -196, -193, -183, 176, -136, -289, 162, 39, 57, -15]
6285a5j04K10o1K10k13N6j83j13L77O3m35K47R7l41j3P7L37R7n78K22L00m4k59
6308f6n1L57j9l15K12j08q6K55k67j62J58J13j21p1P5J90oql68nk36O70j51l10
6332c20M63j57o4O8qk08J11J00M98k42m88K75j85J72k42J86K13p4k95K38J61l26
6354a24M2R4J82k86L1N8r1O4k56J97L1J43j05K35l28K2K00K08n9m97L87Qp6j87
6378a07q4M86l76K35q1k28L14j86J06k47J77J19l49K46j19NO1J41lj95J3O0K44
6401B32l32k1K53l75L31J35l16j39K68K09j47K7j43n3L13j41K0K80n5j70k43j34
6423b01J24J3Jm4K73l11k6J7J37j01J49l12L63J13K6l48L63l28P0K26j11l82J43
6446a46L63j57J05jn1l0l08O4L98l72K82r9j88L56l4K18o17J13N8j00R0l7j7j7
$$ y = [-15, -119, 91, 30, 240, 27, 83, -100, -213, 164, 227, -208, 39, 136, -205, -218, -141, 196, 293, -285, -63, 237, 193, -66, -117, 240, 221, -94, 118, 10, -76, 179, -88, -250, -92, 21, -100, -171, -96, 94, 88, 80, -288, -293, -529, 141, -10, -320, 143, -14, -78, -10, -18, -226, -115, -15, 483, 241, -247, 28, -157, 15, -227, -41, 172, 98, -197, 41, 202, -124, -82, 12, 194, -92, -61, -3, -94, -30, -286, -89, -58, 85, -20, 215, -113, -91, 109, 317, 258, -239, 148, 156, 80, -107, -191, 295, -81, 154, 73, -155, 159, -27, 79, -168, 9, 128, -221, 25, -94, -89, -28, 113, 110, -85, -72, -12, 232, -100, -121, 132, -243, 88, 223, -93, -232, 36, 245, 98, 125, -18, -71, 242, 101, 121, 401, 346, 176, -67, -201, -77, -64, -63, -107, 166, -145, -171, -154, -17, -118, 31, -281, 82, 195, 221, -127, 236, -92, -22, 204, 93, -289, -146, 217, 60, 165, 164, 113, 83, -225, -161, 237, -135, 147, 48, -140, 216, 182, 400, -217, -104, -46, -146, -56, -93, -110, -127]
6470a27L63l78J86Q2k15L23n27J71J87R7l13L05L0J77n29K33j07j81L89k16K5
6491b5O2k40K99J05K4k28k22J51n1O3J53M9k60J06l42O66l78L27k19J15j3r6p5
6514b9K04j68k12K35M9j3L51o79L36k08J36M2j24k02K20K64j20J51J70m77l9O0
6536e3r3j18K24R9n7K83l72k44M05k78j25L40K23j14q1n1j20j2J20k67K90n1J16
6559F4Oj27o4MqK8J27j26j93k7L91Q9M4n28L83J43l61K30l44M02m45R1L07M6l03
6584a71q9M4J58m8M1p0K81o0l9l3nk47N36k51Ll76K36J22M4m57K62J95R3j06j01
6609c8J97j28j39r1L86j14l00J98J96K8k29m44M62r3P4J91k04o8J28J6K00m22
6631a94o5L38k43J47Q9J31j3j22o0j2K80m13PQ9j90J65J74K34m99qL47j0k42k67
$$ y = [-127, 236, -142, 44, 126, -89, 234, -293, -122, 65, 162, -151, 154, 184, 361, -168, 65, -42, -223, 166, -50, -25, 37, -203, 96, 201, 225, -3, -225, -74, -125, -62, 91, 140, -120, -14, -356, 310, -68, 259, 40, 155, 142, 46, -29, 175, 7, -205, 30, 79, 66, 417, -262, 74, -134, 2, 44, -80, -282, -62, 202, 82, 233, 403, -74, -113, -53, -146, -264, -40, 59, 2, 285, -87, -331, 74, -204, -329, 11, 234, 120, 39, -12, -132, -144, -24, -291, -1, -52, 64, 70, -57, -121, -117, -125, -97, 30, -96, -289, -316, 75, 164, 208, -320, 63, 206, -155, 75, -269, 133, -312, -221, 86, 132, -171, -260, -216, -58, -106, -65, -135, 146, 86, 47, 14, 9, -238, 298, 47, 50, -326, -90, 32, 76, -381, -119, 76, 169, 63, -38, 159, 31, -108, -199, 187, 73, -227, -29, 167, 195, -34, -478, -16, -109, -35, 156, -48, -116, 12, 28, 228, -194, -259, 79, -164, -17, 72, 203, 190, 68, 8, -4, 276, -137, -130, -41, -231, -66, 108, 342, -157, -165, 182, 172, -70, -337]
6655c37O91l18j45m7l4M66m17M84J3k44j47r8M69k66o4j42L70k39j91N45q6k0
6677B43n13J58J60j03JJ7M17l68o14N20K74n42L3M20J14k80kJ36q4k21J83L55
6699C04N4m14j01N96o81m1R5K60p3j93P0J2L60n11L97M01p09j37L55J84l25r5
6721a92M27l08j6j95M32J01Ol71M80j93l71o0K95L02m89j26K28M36q94L83M89
6742C64n2l33j99R4J56l38L40L25k38n14K39N48n13n9M22Q1k1m67j4M91p54L40
6764a02J90N94p73j61K76J32n01K17L32L7m97J93k4R1j25J85L53q1m93kj7J00
6786g6l5J43N34q79mR4M70l01k3J50K11m84j79M19L00k16l85M10Ll19O8J56q9
6809c2J26l56M47R0m21r1J44J07j7j58M39m04m00L20K10J10k07N2J39j75j26K5
$$ y = [-337, 354, 36, -109, -156, -190, 276, -141, 343, 356, 112, -35, -133, 336, 70, 6, -136, 234, -5, -196, 349, 263, 243, -270, -112, 48, -55, -54, -37, 380, 12, -602, -82, 192, -350, -317, 103, 217, -63, -65, 71, -13, -234, -51, 304, 358, -56, -157, 439, -242, -283, -188, 72, -1, -194, -124, -112, 248, -263, 134, 535, -174, -311, 44, 228, -97, -192, 235, -73, -89, -284, 148, 249, 255, -116, 364, 171, -200, -260, 35, 337, -152, -278, -50, 386, -508, -125, 364, 312, -21, -220, -126, 30, -308, 32, 357, 119, -395, -156, 392, -121, -180, 242, 323, 302, -165, -179, 312, -442, -102, 88, 682, -91, -252, 24, 156, -345, -128, 204, 241, -256, -63, -87, 4, -121, 64, 417, 336, -157, -159, -176, -76, -111, 32, 566, -313, -317, -223, 247, -54, -77, 73, 284, -200, -379, 40, 340, 124, -261, 149, 152, -167, -99, 57, -32, 94, -262, 185, 275, -146, -237, -93, 14, -3, -161, 278, -126, -526, -206, 4, 114, -93, -41, 98, -77, -203, -178]
6831a78P89j57q65M48l7j4n44M94M51m46m47L56J54l95O3K47L01l54J40K4J00
6852A30m83J44N75l84l24n4L75j3l74K42K87M0n37J43K98l2k70L10J31M5l19K02
6874A32j02j67o9L67q1k89l0J68N52o05j9L06J99m79p8N34k64m61L8M73J89o24
6896c10L96K36l18k40K91l0K2m39N02R1J0m13n0N01n08L08K21j23l14O5K06k0
6918H4k98J68j04J47M67p97N69P3m55Q7J22j4j23j02J75J72n18L54O0nl53K79
6940a2O8K11n36Q8K72k28k9J06k07L66k13P8N9j62m6L49j51k74J01J73K15l47
6962a19o9M89l04m1l00K29K56j14J71p9k3j95J56Lo8p3J42P6j76j68K11M6J5n00
6986d35M63L76m47j94K74P5k22j4J63K92m50K31j16J40k95L95n7k21qk79L57J18
$$ y = [-178, 611, 454, -411, 37, 0, -14, -558, -64, 387, -59, -506, -150, 4, -391, -328, -81, 220, -134, 6, 30, 130, -353, -209, 366, -18, -342, -396, -21, -34, -408, -166, 121, 161, -376, -233, 65, 33, -237, 73, 204, 249, -70, 132, 30, -137, -206, 161, 80, -209, -239, -71, 481, -124, -143, 163, 362, -117, -195, 339, 75, -386, -348, 125, 314, -310, 86, 322, 4, -236, 55, 25, 47, -392, 110, 201, 211, -202, -252, 249, -259, 49, 270, 147, -167, -102, 104, 84, -214, -46, -150, -3, 464, -333, 236, 309, -146, -59, 63, 49, -74, -176, -1, 171, -347, 7, 67, 62, -291, -12, 56, 267, -269, -181, 91, -137, -166, -60, -267, 99, -114, -36, 23, -139, -185, 164, 13, -261, -160, 13, 228, -119, -188, 301, -3, -44, -344, -115, 141, 27, 198, 119, 96, -99, 57, 60, -8, -81, 61, 137, -39, -207, 4, 50, 65, -435, 28, 404, -43, -237, 37, 112, -110, -124, 39, 331, -119, 112, -4, 136, -159, 236, 179, -42, -50, -329, 28, 146]
7008A46j24j42O1J73m07L72j08K00k05R6p1k85Q0j57O26m48j36N07k05M0j52K54
7030A15Q8j58l14L13L7j04R2L1n9j7j77J06P4P6l02M08j78n8K09l6j05l35L73
7053G9k34K29oj03N6k18p7K38J51J49k3k49J57J9j85PK11N8J3l90K96r6j95L03
7077A90j20M7l27L76k57n1R1Mj06J09m8K62j00p6J11j42k00J25J52k17j6r7L98
7100A08L0k1j33J48r5j31J30L8m08J07p7M51P3k71K00O1k00J54l10J78J33n07
7122c42K65k8K55k49J16M4K4l19K15j09N9j3p5K67k95j56J79j02K45Pp7M15k47
7145G9j4M84m50J78k61m8L0R1k14K03O9l18L7J84J57l24l5K08J50n31K82N1J53
7168A61k67k7J18K8l52N33k02L31l74M9J00k31J90k8Q7l53M42l03j74j17L95j07
$$ y = [146, 22, -120, -59, 114, -293, 79, -29, 171, -34, 62, -9, -294, -214, -371, 255, -193, -329, 178, -27, 13, -139, 115, 203, 45, -269, 44, 81, -23, 69, 100, 41, 24, -153, -47, 27, 103, -199, 209, 31, -27, 182, 146, 41, -294, 79, -155, 74, 68, -35, 21, -197, -274, -36, 115, 264, 241, -8, 149, 168, -17, -10, 201, 259, 272, -118, 178, 82, -113, 190, 70, 117, -210, 166, -91, -142, -51, -47, -153, -44, -92, 170, 70, -6, 105, -37, -237, -112, 40, -177, -193, -290, 108, 138, 117, -16, 132, 37, -94, 36, 74, -334, -227, -304, 147, 220, -51, 149, 210, 10, 164, -146, 32, 165, -342, -77, -105, 150, -99, 17, 61, 85, -234, -19, -128, -69, -82, -157, 110, -185, -341, -162, -264, -19, -12, -89, 326, 79, 65, 549, 99, 277, 16, -32, -2, 89, -125, 78, 147, -171, -134, 50, 207, -117, -152, 56, 206, -325, -43, 8, 161, -106, -133, -15, 13, -339, 194, -8, 323, -51, -2, 98, -133, 57, 29, 116, -237, 205, -98, -272, -389, 6, -101]
7190a01J67J6Q2j06Q0j27j20r0K77n1j14mj90J80J30J02J1j17k5J13o4R6j92L6
7214a1J28l01M7P2J07J25k13j01j70K93qm6J4J19j06j48PL38j30j39lJ36K58n38
7238b70K57R1j04J07k09J75o9J8k03j51K54p1j51M14N6k92K36k68L81j39j38P3
7260cJ90p2l3j54Q9k2k95K27J86k87K28K28k17k88Q8L40J39n42J95J42k99j27
7282b87K99N3N1k86L12j38N2Q9k01M6p0J3K07j16r4k7K45k69j84L96J17j28l74
7305b94K26J56j43l52N40K1K35o33K93K99k53q2J44p4j09L6j45L50k96J55l18
7326b44J23r3k45N97N5l31o7L62j86K38m14J54K44n35L57k7L60n38j8N88l96M2
7348B6j14r3K05k36L77k3l28R7K99k8j55j76j9M33l72r7J09M98m61o6M08l0m45
$$ y = [-101, 66, 82, 164, 58, 138, 11, -109, -199, 78, 27, -87, -91, -281, -101, 29, 131, 142, 25, 0, 113, 49, 145, -47, -11, 117, -184, -137, -65, 42, 167, -46, -147, -317, -24, -32, -78, -64, 55, -51, -199, -192, 146, 16, -123, -126, 10, 268, -270, -13, 78, -26, 81, -128, 47, -22, -4, -207, -358, -104, -175, -326, 88, 144, -148, 88, -180, 201, 62, -76, -3, 187, 115, 82, -72, 17, -5, -300, -73, 113, -174, 54, 282, 65, -223, -135, 205, 344, -198, -3, 139, -160, -287, 12, 65, 116, -170, 142, 4, 56, 145, -56, -10, -80, -67, 140, 24, -70, -97, 148, -121, -305, 91, 208, 80, -294, -68, 88, -55, -407, 133, 154, 389, -244, 49, 348, 95, 13, 157, 83, -26, 10, -135, 215, -81, 74, -244, -121, -214, -459, 138, 193, -138, -205, 157, -29, 209, -205, -51, 193, -342, 15, -12, 348, -190, -208, 380, -16, 26, -88, -181, 24, -212, 165, 142, -186, -89, 210, 182, 27, -149, -168, 265, -107, -204, -95, 403, -58, -124, 284, 254, -191]
7371a91N84m72J39l33K67Q9J42o19O2N94J1j00k95K73p6l33M0L66K6k46K0M22
7393C70j65l50J37L65l94j63nK39J5k96K07L59k91k44N22K7q03J65P59j19l60
7414b5j23K80J10o81L30J04M60o44K17K35j54n15J99O22m57l09L31K20k1m28K15
7435c4K80j89l56K78P2O5o5J14J1k94k75L60K03j34P4L45m57n6j68M54r9n3j66
7458i0K21K40p54J63L26p4k06K70K74n06k43L25J82o7k25M3K65q5n14M70J34l75
7480b26r0L94K42n03k0O08k08m79J69J47Ol08P6N90k78l47J98j3J26l46L89q8
7502C9P2n88J86K78k3k41J64M19l73j41K92J0j56q3L74ok02l43L79L00m80K2L25
7525B24k21M7j19K12K83n71K98Q7j42m73J3Q87j71n90Q7K86N6k95o6L47j55k51
$$ y = [-191, 393, -79, 60, -273, -6, 83, 225, -394, -332, 262, 273, 173, -122, 151, 75, -258, -218, 148, 174, -72, -52, 370, 205, -145, -8, 357, -37, -200, -205, 34, 49, -247, -40, 319, 28, -216, 306, 333, -470, -305, 454, 335, -25, -148, 132, 242, -439, -109, -5, 455, -189, 28, 263, 109, -406, -207, 415, -42, -351, -20, 200, 179, -249, -34, 246, 57, -299, -21, 51, 116, 51, 165, 176, -118, -393, -33, 170, 36, 110, 455, -2, -58, -226, 228, 129, 76, -90, 131, 371, -383, -220, 106, 32, -174, 96, 370, -136, -379, -54, 128, 61, -164, -121, 144, 59, -455, 15, 149, -226, -316, 78, 320, -183, -203, 405, 197, -282, -113, 34, 40, -268, -192, 398, 120, -227, -29, -42, 84, -262, 127, 39, 111, -477, -291, -13, -36, -277, -113, 306, -67, -208, 84, 94, -62, -145, 229, 223, 21, -322, 57, 357, -123, -101, 224, 3, 50, -69, 143, 426, -145, 153, 240, 98, -375, -362, 525, 354, -236, -149, 137, 193, -102, -168, 179, 24, -227]
7547b27K93K63o01K63J87J17k89j51l0L83n66L2M71p3k98M3J88j88N9J17J25M4
7569A62l2n72P00j78q6j43O59k05p32J45L26j82K8L7M2R6k04q2L67l83K39o8L70
7592C04m82J81J00ml3l03M11N3l27j11L62o1k56K09J16j08j22j64L61J76l45M6
7614Cl1J80K3j62J24k2n04L82M08n11k74L93J86k98j54K86J50j36k60L07O1m29
7636b78K59j15K48k17j24L89J51l93Q5O3j42r3K63L49o51J72L4J92O5m48Q1M6
7658f4K29j42N1l13m5p5O77r6k32q4K2M33j67j79J35J23j58j76j24K66k07k22
7680c48K38J48K2j53K25q1k33L8J87J94o24K98K36r4N7n1m0j00L5l1rjl29K19
7704a97J79Lk35M78k19j8k75K78J36j17l05J24J60%R1J14l37L24m9nj35l3J01
$$ y = [-227, 66, 329, -272, -9, 178, 295, 6, -145, -175, 208, -358, -326, 145, 72, -226, -183, 5, -183, -124, -7, 118, 162, 130, -442, 258, 80, -6, -149, 510, 305, -427, -282, 44, -138, -110, -73, -31, 65, -139, -221, 146, -237, 2, -66, 304, -178, 3, 103, 99, 66, -237, 174, 227, -100, -211, 151, 90, -166, 43, 159, 51, -71, -235, 126, 302, -43, 3, -28, 152, 175, 13, 137, 115, -389, -7, 401, -110, -384, 9, 195, -103, -257, 29, 179, 43, -217, 90, 151, -278, -19, -134, 114, -103, -227, 162, 313, -80, 5, 68, -74, -167, 96, 445, -206, -34, 0, 192, 257, -191, -110, -64, 165, 23, 74, -239, -284, -359, 318, 222, -10, -94, -72, 361, 194, 15, 150, 273, 115, -61, -185, 81, -126, -348, -110, 38, 60, -93, 132, 51, -182, -144, 43, 237, -387, -89, 147, 53, 110, 59, 19, -81, -46, -77, -86, -87, -416, -197, -18, -15, -250, 228, 9, -9, -284, -6, 130, 13, -292, -168, -8, -8, 83, 197, -140, 184, 135, 130, -5, -38, 63]
7727F3J26o1k47K0n0J64j32O7K50R9n38K9M27k27K33j34O4l79J76j41K07J00k41
7750a25Q5j7J75j69oP6j25j98K67J14j63n0J86j7J63k91k7Q6M3r1K60l1p6K46
7774C15k06j20K56l34N5L85o90N53k48K75l92J8J36K9j11p5K88N5k84J29j18L92
7796C08k50l41J29k2M26k39o8J19j95J45Q8J4J37l0m3l73K08J64L1k26j93J69
7818d2K74k54m0N12n14j63L7K30N0k64J95j8l71M84j07k55K82K4l7K14l26k64
7840c53L88k03q2J95j6j15Q5L7r7K10j47K58n6j70ML3q7R5n0R8k35J15J97j43
7864c9j44J56j13L7K60j37j18J31M6l12J10J64k89J08L7L14l63Q4p7L8KJ22P3
7887I0P0j09j58P8k4P7l60M19m5P6j74J72j00j02R4j02J76j39J92p7L4n2j00J08
$$ y = [63, 189, 128, -119, -99, -149, 15, -117, -50, 200, 299, -239, -210, 217, -10, 223, 89, 153, -226, -50, -191, 16, 116, -125, -40, -57, 118, -51, -57, 19, -106, -304, -37, 77, -86, -136, 50, 33, 196, -95, -122, -36, 7, -84, 176, 145, 69, 315, 109, -11, 245, -89, -34, 351, -339, 214, -34, 241, -151, -133, 3, 32, -79, -154, 134, 189, -95, 34, -84, 308, 58, -283, -154, -176, 250, 11, -57, 62, -133, 12, 100, 114, 251, 221, 178, -195, 13, 177, 208, -18, -211, -42, 232, -22, -62, 450, -64, -227, -190, 40, 90, -174, 21, 3, -368, 116, 9, -246, 36, 60, 23, 237, -89, -353, 35, -168, -250, -55, -71, -186, -101, -64, -161, 49, -98, 160, 104, -66, -62, -29, -116, -21, -71, 27, -208, -93, 104, -39, -183, -27, -140, -103, 157, 20, -98, 33, 79, -233, -123, 41, -248, -140, -103, 211, -152, -68, -145, -107, -105, 17, 90, 160, 51, -107, -29, -53, 24, -336, 83, 38, 114, -60, 112, 12, -90, 4, -98, 78, -61, 131, 54, 88, 36, -64, 44]
7911D4K7k50J92O4Kk27J30K65l52j29L83L0j58J01J8J3j36j83L3L91j85j65Q4
7934hQ3j2m06M81j7l15r2L73Q8k11p2l1K23r2l17M65L1n15M71Mj02j72K08J08
7958A73k06J35k7Kk10J23J41l7l62j64M96j54l2J4n2Q4K1k27L93l18m6L52j7o9
7982A3m4J90l55J77Q3p1L09j80l28j19N54k04k2j04J31K9j19L23m69J88k20p1
8004c09M58o3j51J00pj61J78L27k46q6j75K29j5j23J40k8K67l96%K76j12j86k19
8027c02N12j40l00K05K82k03l18Q5L13j56o7L4K87m6o21L13J46q1o0K22j27Qm28
8050d42M81n0j87K56J57o3m18K77L65k08j87K70L3j90q2J37q4K8l17O30j8k93
8072I5n72P26l4pj57Lj11k06r6M41%J05N5k74K40m10J82K45j7l63J04j6j82j77
$$ y = [44, 71, -179, 13, 77, 79, -148, -18, 247, -105, -234, 149, 179, 21, 122, 140, 153, 17, -166, -133, 258, 73, -92, -8, 75, 63, -343, 138, 121, -194, -286, 87, 175, -36, -108, -139, 84, -8, -325, 140, 171, -344, 127, 131, 29, -143, 65, 173, -33, 102, 75, 77, -133, -10, 131, 94, -268, -432, 64, -90, -122, -108, -160, -76, -55, -282, 111, -207, -253, 99, 82, 13, -31, 159, -196, -19, 64, -7, 302, 122, -206, -325, 229, 25, 3, -101, 30, 59, -60, 263, -206, -18, -238, -309, 149, 86, -65, 35, 28, -133, 45, 372, 126, 40, -135, 94, 79, -44, 96, 68, 335, -61, -61, 215, 103, -83, -302, 210, 70, -230, -25, 257, 54, -264, -179, 134, -22, -89, -55, 232, 186, -435, -122, 24, -57, -117, 105, -22, -14, -442, 39, -11, -198, 58, 215, 152, -266, 11, 376, 168, -19, 251, 284, 94, 12, 149, 65, 93, -224, 406, 388, 95, -477, 249, 215, 208, 51, 54, -57, -263, -359, 82, 82, 187, 242, -32, 208, -202, -20, 225, 208, -155, -51, -67, -249, -426]
8096d26M54J5j62k38K97Q7m3K3k71Q01l33m03P2K50k22M0J20N5J56n70L89J83
8118B74k59OJ12M5k19M8j28J03k2l86Q96l59K9m11L11rj61j14O11m97j61K5P97
8141E31m56k49K16J65L1o51M29L80k45m50R9J31l5n8P1N42o25j2K5J67L9n4j38
8164a47L26n36K86J17j00J43l02N38n26J79m9L10k77p9M9L96m67j5K51K54k38
8185A13j07M48k55o5m26K88
$$ y = [-426, 28, 43, -119, -357, -60, 27, -16, 7, -264, 537, 204, -199, -127, 123, -99, -59, 61, 116, 272, -298, 91, 274, 15, 21, 133, 178, -41, 7, -121, -18, -40, -426, 470, 111, 140, -271, 40, 31, -130, -244, 367, -130, -291, -266, 531, 75, -174, 42, 207, 238, -413, 16, 396, 151, -299, -200, -69, -104, -162, -91, 451, -174, -186, -161, 6, 45, -9, -147, 179, -357, -71, 46, -54, 89, -213, 325, -201, -22, -71, 239, -38, -117, -68, 328, -139, -154, 97, 351, 113, 6, 454, 199, 134, -292, -4]
8191d
$$ Imaginary data points
##PAGE= N=2
##DATA TABLE= (X++(I..I)), XYDATA
0@%%%%%%qJ6j6J6j6K4l2L7m5N6p0P8q9J10j31J50j73K02k34K66l02L42l88M38
30B31m91N53o20O94p75Q61r59J065j181J310j449J604j777J968k181K422k691
47a416K997l353L766m253M839n562O478p678R329j1755J5675k3043M1538j68014
61a40452l60363K92008K16877j30321k1288K79005J2325l00238p1036K18049j4298
72a9732k14941K3423K01957k5083j32739P0249J26559q5670j11822N8385L5147
83g4267j35841p3370J30584J40039J086l4798j8345p7218j06983L506J12081Q1860
95e1666j3747l5595M37L126l1149k1707K4801J3717m5122k5569N2950L4891m5961
108a40594k251J03109L9990j09078q1212L8834O349m9239P9142J62477k4357j75902
$$ y = [0, 0, 0, 0, 0, 0, 0, -8, 8, -8, 8, -8, 16, -16, 21, -24, 32, -38, 40, -49, 61, -70, 80, -93, 109, -125, 141, -161, 181, -207, 231, -260, 293, -327, 367, -408, 453, -506, 559, -622, 688, -761, 843, -934, 1034, -1147, 1275, -1416, 1581, -1772, 1994, -2259, 2580, -2982, 3496, -4182, 5147, -6608, 9067, -13976, 27562, -140452, -500815, -208807, 8070, -122251, -143539, 135466, 147791, -152447, -223483, -5434, -19732, -234673, -211250, -9293, -34376, -167115, -96866, 29693, -55977, -167799, -109414, -74267, -210108, -283478, -152894, -12855, -11769, -46567, -64912, -142130, -249113, -245607, -133526, -51666, -65413, -101008, -100571, -97445, -128594, -150301, -125500, -111783, -156905, -182474, -129524, -94633, -140594, -142845, -39736, 254, -108824, -190036, -151202, -144853, -194092, -114950, 47527, 23170, -152732]
120a52732k6679J09806j2333q4862O5995R9227q6659j01381J09371J21742q4553
131d3058r1333Q8560N6919j18105o1949J12753O3234o6084J6674J15553k7641
142D5523j67738m4636J06920M8563k5623M2692O1315n6327q4712L8032P9628k4992
154A8645o7873J1754M6144n817q653M8060L7604l8521m7345J2424J6119m1907
166a9366l0802O0054Q7661J1566m0634j5798j4987n5094j9153Q0817P5168l7708
178H1724o0600L0395M6626l4318l3647L9833R215p4561j8391R3259M6988n9525
190F6998j5639O9849k49r0194k3782N2042o736l3673O9254Q9044m9102j03787
202B4025M811M6963k7359j9959O0691J9805p2439j4304Q8155K6588p5401k7887
$$ y = [-152732, -179411, -69605, -81938, -166800, -100805, -1578, -88237, -189618, -80247, 41495, -43058, -134391, -45831, 11088, -107017, -168966, -56213, 7021, -59063, -42389, 73164, 45523, -122215, -166851, -59931, -11368, -36991, 5701, 67016, 10689, -74023, -35991, 43637, 18645, -49228, -37474, 8670, 2853, -5800, 42260, 79864, 41343, -6002, 6422, 22541, -19366, -50168, 9886, 97547, 109113, 68479, 52681, 37694, -17400, -36553, 44264, 119432, 81724, 21124, 51519, 98145, 63827, 30180, 70013, 79228, 4667, -13724, 79535, 126523, 66998, 51359, 121208, 120959, 30765, 6983, 59025, 52289, 18616, 87870, 176914, 127812, 24025, 28836, 75799, 48440, 28481, 89172, 108977, 36538, 22234, 110389, 136977, 61576, 33689]
214C3689M2243j4673n2246L3592O7686k4476n0698L9405M8615n6775p5593J8857
226I626M4757q017J197M9262O778o7654l5990M3955L3192l1602l2920J0823J7527
239D0934k750N509K3141L53m0842l6205J2927K9411r286k7669J6641M4218K944
252E9326l4340j2169N97k9890k1535M3266M9409k3401m7273R327K9862j2551k2043
265a1415P543p066l4038N045N2792K0429l0287j6805O162j1831j5668J0618M556
278a9965k2528K528M3611J8574l1793k5637j212j3830j1876K9186K9903k3611
290b6650l0473K3915L6735j2912l2491n091j611j7808O187M0900J7665k7960k2228
303e1822J3798J4282j5181k3246l585J0662J1968J4165J6075R82k4968k7179M338
$$ y = [33689, 75932, 61259, 9013, 42605, 110291, 85815, 35117, 74522, 123137, 66362, -9231, 9626, 54383, 46366, 47563, 96825, 103603, 35949, -41, 43914, 77106, 45504, 12584, 23407, 40934, 38184, 43693, 66834, 67187, 26345, -9860, 3067, 32478, 23192, -4477, 12164, 56382, 59326, 24986, 12817, 13414, -16476, -38011, 5255, 54664, 31263, -16010, -6683, 23179, 10628, -11415, -3872, -10938, -44976, -39931, 12861, 33290, 3003, -13802, -7640, -19471, -35139, -24521, -19965, -42493, -39965, 3646, 22220, -9573, -35210, -36422, -50252, -62128, -32942, -3039, -26650, -57123, -33208, 3527, -9385, -41876, -46967, -48578, -66386, -60199, -19299, -1634, -29594, -51822, -38024, -23742, -38923, -62169, -65754, -55092, -43124, -28959, -12884, -11902, -36870, -64049, -59711]
316e9711K5595L681k1896o725K0388J6866o96L17k851k5505k4182J4957L4866
329b4896N889j8301l64J5875L518o300k119j0347j9961O33K9792K3991m041j4899
343b1530p693j204M049O764l850j5192k706J9767K3501O861p622j5254j7003k829
357c3941J6366J4235n805j0164O426J6170Q968k690j2206j9385j0406J3218K4590
370E376J0241n925o308O43M763M642k973j4968j4762N176K4289J9602M26j1548
384A8674j1269m984K493O339O04r349m155J2577K2311J0565j0134k1234j2907
397d69J970J0581Q273J749l203k881N914J3470M244j7511k4002m293J6542J7225
411B7609N797j292m877p225j200Q223K625j4931j8077M193K3761J7681l038j3156
$$ y = [-59711, -34116, -30435, -52331, -59056, -38668, -21802, -22498, -22181, -25032, -50537, -74719, -59762, -24896, -19007, -37308, -37672, -21797, -18279, -24579, -26698, -37045, -57006, -56373, -26581, -2590, -6631, -21530, -29223, -30427, -26378, -19614, -23464, -38656, -41362, -21595, 1906, 8767, 1145, -14109, -31112, -33941, -17575, -3340, -9145, -19309, -12883, 3287, 12255, 9565, -2641, -22026, -32432, -19214, 5376, 15617, 9692, 3384, 4027, 8790, 13432, 10459, -4509, -19271, -14095, 10194, 29796, 30222, 18674, 7405, 2421, 4914, 11253, 11857, 2508, -1647, 10930, 33241, 43806, 33672, 12438, -469, 1501, 12082, 20355, 22104, 18901, 16020, 21934, 35404, 39648, 22137, -1865, -6158, 10384, 27609, 33406, 32114, 27237, 20012, 18812, 27035, 29660, 14729, -3348, 845, 24606, 42287, 39249, 26093]
425B6093j0386n523p1O231N329m904r497L465K1103J3339j3148k4593q991N846
439D293O736O009O346j991j0218m35J3268O312j6278k1864m162J5056J6962O724
453B6758l104q706p384k281L376K184o085j2014l243J8230K2119j378k1592j3675
467f795K981J699j177O966N445j0252p759J8610K1205j1430l1674j0937J2159
480a0959P726J173Q713P438j1471j2649R687J4222j2780k6336k661K3065J5180
493A0348k825k560J19j0346j0867P543J4854r600k4715K022K9085J5306r505q891
507c2n233j5371r767J7822J9705q716j4731J0801J6156n411j2003k672p188j1980
521b8620J0075K6804J261k2645l102J7624K221j1581K41j668k0925m779L5377
$$ y = [26093, 15707, 10184, 10113, 16344, 21673, 16769, 7272, 10737, 31840, 45179, 32031, 7438, -1553, 4293, 11029, 17038, 23384, 21393, 11175, 10740, 24008, 30320, 14042, -7822, -11984, 3072, 20034, 26758, 23654, 14948, 7564, 5283, 8659, 10843, 4758, -7256, -10499, 7731, 29850, 28472, 6880, -6795, -3814, -2115, -3292, 3674, 9119, -1133, -8892, 9718, 30923, 19493, -12181, -23118, -10959, -3233, -2060, 6653, 14091, 2620, -10029, -342, 13880, 1100, -25236, -27897, -4832, 10348, 7523, 4963, 5082, -5264, -16131, -8588, 6266, -3334, -28049, -26027, 3058, 18364, 8859, -32, -5265, -20636, -30403, -12581, 7124, -1592, -16323, -5522, 10634, 5223, -6780, -9452, -16640, -28620, -18545, 8259, 9520, -13125, -16227, 1397, 3618, -7963, -7722, -9390, -30315, -35094, 283]
534B83K8217j7575k5019L739L761j5079p20K1492K023k1584L713L1525L376l1917
548a3765j3462J7852N222j2664N056J5438r603j6475J8308L0319j0445l8045j2866
561c5130J4609P948L445J9201J2934k2018k6374R727K1647r876k1503R505K1256
574E371l502j0070J1835Q105k1784j3648K4236J6118k9989k5414K3656L1034m918
587A1030n933J4544j3356m5743n981M9502K3771k9002j0672K5738j664l1577M630
600a4713L2457j1356l6646J4893M0569j2633l7732J4793L6765j0650k7408J0185
612a476Q447l2658j2155N0252L8452k8338l4716O060K746j9248Q509L8805J400
625B6080l5888n653L0638K663k6826P85K3503n587k3624P544K0712j1717j7052
$$ y = [283, 28500, 10925, -14094, -10355, -6594, -21673, -22393, -901, 1122, -20462, -16749, 14776, 18152, -13765, -27227, -9375, -4153, -16817, -11761, 3677, -5926, -22401, -4093, 26226, 15781, -22264, -35130, -20521, -12573, -9128, 10073, 23007, 989, -25385, -15658, 5989, -3887, -25390, -15885, 5371, 1869, -8201, 3634, 11739, -10045, -23693, 543, 16661, -13328, -38742, -15086, 15948, 11030, 5097, 19641, 6285, -39458, -45439, 4063, 27834, -1168, -11840, 13898, 12234, -19343, -14713, 17744, 6388, -30258, -15365, 25204, 12571, -25161, -10368, 26397, 15747, -11661, -1476, 6971, -25687, -37842, 12410, 50862, 22524, -12192, -6132, -3386, -22634, -14125, 24680, 26080, -9808, -15461, 15177, 17840, -8986, -8201, 15302, 9715, -13909, -6365, 14347, 2630, -14422]
638a4422K6473L2427k2715m6673l119K3355K464K005L3043J5281m5259m2332K6228
651a3244L8256j6669k2918K5692J7869l6163j7483M2841K0826m3471j8558M4183
663B1161R717n6049j6174N6257K4332l2792L2L2425k9312o4791J5825P2800R330
676D2761m3546K034K4298k7951l0879L6476L9458l2099l9061K4758K6863k5675
688b563j6127L5070J9555k9699j7556J7151m905l1887J0098N2434J7407l4675
700A4303k4308L054o907j0262K6339L7430j2470m3791n517K9723N900j6966Q469
713D997J8998j8683l2965J2450L3305q252k1584K4064K9907l1585m9175J1029
725b7494L5373n084o801L6998J2576n8592m0525M2874M3296k3446k0878K7993
$$ y = [-14422, 12051, 44478, 21763, -24910, -28029, -4674, -2210, -205, 32838, 48119, 2860, -39472, -13244, 25012, 8343, -14575, 11117, 28986, -7177, -24660, 18181, 39007, -4464, -23022, 21161, 30878, -25171, -41345, 14912, 39244, 6452, 6484, 38909, 9597, -55194, -39369, 33431, 42761, -785, 1249, 25547, -2404, -33283, 3193, 42651, 10552, -28509, -3751, 23112, -2563, -18690, 16380, 35935, 6236, -11320, 5831, 926, -30961, -20863, 31571, 48978, 14303, -10005, -6951, -13858, -24120, 2219, 39649, 27179, -16612, -22129, 7594, 13494, -3472, 4997, 23995, 5312, -27653, -15203, 18102, 9850, -11734, 12330, 42237, 10652, -38523, -27494, 7879, 2795, -4006, 32992, 45568, -13024, -53549, -10675, 32621, 9175, -11703, 16290]
737A6290J586m5843k547N7535J3136m9975j1563L8017n605m5797R370N2485J589
750B8678l4257R642K2832l6679m4663L3460N7652p471l4983O460R514l1413j1454
763c2682M7617K7010m1534l4208K4660K0551k0760k618L5187N038m1332j4551
775b7622K8277K583k9851Q949M7437O320m2880j7903J7710l532j5277K5320L7205
788C6736k0558m9624K352L7974M043j8819R657J3157k8463k7338K7883L4794j6089
801E705k3291K1158J6064l2764k5379K5509K0356j7572P87L3019m466n0935j1946
814d3755M2475J7866k3558j537J9154j9345l2741K4709M6155j2863m1396N312
826a9524K4051j7470j9188K9838K6034k4634k1458K3652J0670l5605j6251L5159
$$ y = [16290, 17876, -27967, -30514, 27021, 40157, -9818, -21381, 16636, 11031, -34766, -25396, 27089, 28678, -5579, 4063, 26895, -9784, -54447, -20987, 36665, 29194, -5789, 671, 10185, -21228, -32682, 14935, 41945, 411, -33797, -9137, 11414, -9346, -11964, 23223, 28261, -13071, -27622, 655, 3238, -26613, -17664, 29773, 36093, -6787, -24690, -6980, -10512, -25789, -469, 36736, 16178, -33446, -31094, 6880, 10923, -7896, 1761, 14918, -13545, -40883, -13000, 21794, 5705, -17586, 3572, 19636, -13128, -38507, -12998, 7358, -10214, -9427, 23592, 19126, -31809, -43755, -1280, 16586, -6972, -8509, 10645, -8700, -41441, -16732, 29423, 16560, -24836, -19524, 4527, -12943, -32131, -2293, 23741, -893, -22351, 1301, 11971, -23634, -39885, -4726]
838d726K6535j8005j3802J1092m617k4537P205L5753O339l1830j6365J6626J2159
851A827n136M157J1917p987k4152k547K1197P283j3679j221J9329N017j9607j1560
865a5162R049K417p337J2090K1736r677k9966q30K4921O091j2790K946N040j8837
879a0309j1019K7284K2554j7028j9902J2784P416j9171m219K2993K690k0145P540
892A468K6549q972l3887J348K7244k8j4233J0618J0462k1383j5397K6032K3437
905C3258j8116k3978O812J1152p503Q4J8490L783k1114q388J6254O324j5391p604
919e937J2852J0400m542l587L619n171j1902K813J7455M882j5857j0893R050J0163
933A3345j086m48K007r176j3808N322J8812K731j3203l056Q727k29p349K437K009
$$ y = [-4726, 21809, 3804, -9998, 1094, -3523, -28060, -20855, 14898, 21237, -10593, -26958, -10332, 1827, -3309, 848, 12765, 4778, -19374, -21921, -724, 6559, -7120, -8341, 10988, 16005, -3602, -15162, -6113, -3696, -11033, 1057, 22793, 13116, -16850, -17680, 7241, 13332, 542, 3488, 8528, -10309, -21328, 5956, 28510, 11482, -8420, 4364, 11780, -7391, -11610, 11383, 14073, -6072, 1468, 28017, 19045, -14842, -13494, 13750, 13722, -511, 10107, 20569, -814, -16211, 9821, 33258, 15142, -8836, -2024, 9128, 1625, 1709, 20199, 23982, 2868, -5520, 10734, 17058, 1667, -5937, 6915, 17315, 12773, 9186, 12805, 7634, -4268, -1455, 16000, 20882, 5025, -5868, 3182, 13345, 12259, 11811, 13818, 4642, -9166, -3844, 14968, 17699, 4496, 1440, 10167, 9938, 2589, 5026, 7035]
948G035r603m892J5818J2792j1426j3674L150O243l677J246O479o200j4093M797
962f005J8926L729j3162p154J529k280q11Q986N245r282p145Q499Q737n475r608
977e271k359Q22J528O347O292m911r603o32P441L594m058o118l898J97P427Q920
993E718M01q284q174o58M898M330j239n070k281L689O647L236l792p402p709J130
1009a4560R257O305l722p170J087M868J120J60j211p515p862N471J4478L651q781
1024d424n985K413J424j429K100j42o675l487J0120J1553k337j0520m324M16J501
1039i796L114K955k780m763K319Q220M033l793p821o932O70Q196P344j888n047
1054e969o80K752K080J298j533p590n995M898J2748M651n991o432J32J704P49
$$ y = [7035, -2568, -7460, 8358, 21150, 9724, -3950, -800, 5443, 1766, 3012, 9491, 3291, -10802, -6005, 12921, 16650, 3488, -3666, -2137, -4417, -5228, 3758, 9003, -279, -7424, 1075, 9812, 4337, -5271, -7630, -6808, -5280, 1067, 7359, 2448, -7155, -7787, -346, 3248, -810, -6928, -10826, -10629, -3202, 5718, 6119, -2165, -10339, -10997, -6099, -1769, -3008, -8078, -10359, -6670, -23, 3213, -579, -7981, -15690, -14560, -5303, 1002, -2720, -9890, -8803, -3935, -2815, -2655, -3866, -11381, -19243, -13772, 706, 4357, -4424, -10409, -7996, -6572, -8001, -5901, -6043, -12718, -16205, -6085, 5468, 3131, -7389, -11713, -11297, -9796, -6682, -3727, -6507, -11270, -8951, -731, 3302, -491, -8312, -15244, -14574, -6378, 966, -922, -5969, -6649, -3897, -1817, -519, -2052, -9642, -15637, -10739, 2009, 6660, 669, -5763, -5631, -3927, -3178]
1069c178J989j005n320k315P453R703J498q036p471j374M516M792J263l020k174
1084b679J414M151N015k90p820q418J310R570O411k262l965j164J110J200K979
1099F562j37p360n806N521J1513L679m688n731k689M55L240L017j135m945j666
1114a70O281Q211O34o323p112k965L100N972L783k945l611K71N022K859k272n720
1130E015n464r92O417Q612J645o263m905K136L931p77k885l134l594J164Q688
1145I594R015k515j1185n038L816K816n13k83m31l145J321Q351M984p738j0860
1160a811j285N780K750j5M73n20l518J857P491J74j1201r199L123Q453M314Q54
1176G720o3n141o152J027P603or316m491O565O881m84j287J35m820o302L504Q289
$$ y = [-3178, -1189, -2194, -7514, -9829, -2376, 7327, 8825, 789, -6682, -8056, -3540, 1252, 2515, -505, -2679, -1265, 2886, 7901, 7611, -209, -8627, -7317, 2253, 8664, 6402, 2437, 1273, 2383, 3583, 6562, 6425, -935, -6741, -1220, 10293, 13972, 9284, 3553, 864, 1319, 4559, 7576, 6441, 1496, -170, 6111, 14322, 14956, 8633, 1521, -1444, 1656, 7628, 11411, 8466, 4855, 5126, 10148, 13007, 10735, 5015, -449, -1441, 4976, 13588, 15233, 8970, 4065, 6201, 10132, 9355, 6470, 3336, -258, 906, 9594, 18609, 16094, 4909, -129, 3687, 6503, 5990, 5707, 5276, 2131, 3452, 11803, 16787, 9049, -1811, -3096, 2684, 5434, 5419, 5892, 5372, 1854, 3711, 11202, 11376, 175, -9024, -5901, 2552, 6866, 7720, 7657, 2516, -3636, -2609, 4994, 4988, -4328, -8819, -2254, 4627, 4143, 2856, 2991, -1829, -8131, -4627, 3662]
1193C662l480j0474O16J2039M641n060l731j895p819m267J1088J2126n495j2339
1207a0388J878Q370j690n313K800J93q509j076J2406O359j0201o967P641M896
1221C99o641n079K713j396m336Q662J4754l054j7371o338P639L025j833N374M085
1236F03q923p045R622J1317o902j2161K731O372l984l331Q078M966q411j843J2327
1251C416K463j8003j0964J2067J2840k665o27P508n852j8103J359K1420M420j7728
1265h449n202J3001K145j0433N606J4963p682j8665N341J6749p510j6652J0720
1278f068K0243m559j3884M619L240j6140n945K3958J6446j6988j6006R150P018
1291E084q791J525J5374l469k1283q29K0189L972j3104J736J2075m894j4521K578
$$ y = [3662, 182, -10292, -9676, 2363, 7004, 1944, -1787, -3682, -11501, -15768, -4680, 7446, 1951, -10388, -8510, -140, -1830, -7143, -4343, -4150, -12659, -13735, -1329, 5030, -5171, -12138, -4497, 399, -6242, -11321, -8608, -10004, -14340, -5678, 9076, 6022, -11349, -17687, -10048, -7023, -8856, -3482, 603, -8320, -15365, -5743, 5574, -1328, -13489, -10758, -4386, -8370, -11701, -3623, 1343, -7068, -8911, 3416, 5879, -12124, -23088, -11021, 1819, -846, -1473, 6035, 183, -17920, -16561, 4859, 9279, -8449, -13651, -650, 1495, -8938, -3332, 11631, 3949, -14716, -9375, 7374, -136, -16788, -6068, 14175, 9616, -4268, 351, 3591, -12549, -18494, 5464, 21910, 4922, -11084, -1934, 5084, -3707, -2182, 13192, 9723, -11560, -12389, 7800, 11772, -1332, 404, 12479, 7585, -6936, -4358]
1305d358J0166o125o363J5089J5703j2305k0804P01J1071l6o79J1638K721j8795
1319b376j1233J6226J6313q109j2000N573L212j2298l016J8067Q588j4679n677
1332a409J4887M94k2821o042K1425J1028j1147m78J1013j1616k2776R089K9809
1345B1456o68k3292k140J2792o447r668J7883J7139j8772k2153J0859J5507j2545
1358d9r477J9655J3134j6893j2084J1423O45j8902J943K8139P881k4066j2085
1371a0736J1791K604q649R162J6925j0754k6914J625K3416L972j2308L948J0334
1384A4416j2500j8106Q540J6770o312j0053J3499J3442j7014k0782Q444J5204
1396E548m399l444J3311R94k4337j0467K3573J7206j3161j1657P538k302j6252
$$ y = [-4358, 5808, -317, -6680, 8409, 24112, 11807, -8997, -8296, 2775, 2739, 2060, 13698, 16419, -2376, -13609, 2617, 18930, 10821, -1179, 4394, 7606, -4692, -7708, 10359, 18947, 4268, -1409, 13478, 13972, -8849, -14891, 6534, 17562, 6415, 5937, 16950, 5334, -17442, -8353, 21456, 20788, -2504, -4644, 8148, 1701, -7967, 9916, 27055, 8283, -13870, -3011, 12496, -49, -9526, 10129, 23263, 6370, -5714, 5709, 6354, -12548, -10605, 17534, 25415, 1349, -10736, 1055, 3659, -4990, 4172, 21097, 10343, -16571, -14946, 8470, 12442, 134, 4082, 14416, 1916, -16190, -7650, 9120, 2808, -7245, 6254, 19696, 2682, -18100, -9656, 5548, 1149, -2295, 11016, 12010, -12327, -22794, 779, 17985, 4824, -6833, 705, -1597, -17849]
1409a7849N043K5425L096k1560m261J4538m353j8977N717K2169j362j4741N120
1422a995R776j6313j6592J7968K3817r513k0670M072P864j0844j721K3556R328
1435A8733k5704j7572J4778J1761j1076j312J8863J620k1592n368J6115L86j7029
1448a7397M772K3277n46k1833n079J2951p4o892J0163J3456j4655k2467O062K1482
1462C220K520r464L438L570j3909j0966J4464J5254p531j0553R508P354j3579
1475f674j0495J1172J0232p532k614J2204r30k0418l246K1583J0071j3387p205
1488g239P423m711j1621J0948K2269m550k2388l25J3912m588j1118J1048J4602
1501A3662j0235j2174J0864Q478j5494j0010J7799J3408j2550j0445Q452K385
$$ y = [-17849, -12806, 12619, 15715, -5845, -10106, 4432, 79, -18898, -13181, 8988, 7626, -7115, -1995, 7781, -8532, -25124, -7156, 16661, 7148, -13522, -9450, -1586, -12430, -14151, 9405, 18733, -6971, -24543, -9765, 1996, -9080, -10392, 8471, 10091, -11501, -16869, -754, -368, -17397, -12625, 10652, 10106, -11727, -16806, -3855, -3929, -10821, -658, 12798, -1857, -24324, -18262, 3220, 5740, -3724, -286, 3284, -10625, -21591, -7127, 8127, 596, -9957, -449, 6905, -6674, -17169, -5997, 4235, -3297, -5911, 6293, 5363, -15055, -18301, 3282, 13353, -34, -7239, 184, -4527, -16148, -5200, 17069, 12519, -9869, -10194, 3718, -870, -11988, -940, 13662, 3427, -8747, 2117, 10595, -4899, -14909, 2890, 16298, 3748, -6697, 1755, 4140]
1513D140j0884L695J9710l98k2242p590J4392O565n830L413R232p164j4636L626
1527c971J3444k786j0457M624J1291k763j0373J308O705m398l767Q719O656j0934
1541C298j1927O976J3014k67n437J375r33j0786k272J4662Q271r850p442O694
1555E376L756q074k047Q122M70q358J893J0910k829j3093M98J2153J689p982o22
1570A862L593o251m517J0976J1040q371j2555J399O695k004j537O240J478q749
1584g01k820Q593L194q683m445O844M064l997j594L361k314n585L436R006j809
1599F550j0718l026O480M050j025J363J218o770o266M924Q202k028p212J291M956
1614A989m37l319K042L32n324k000O891N032n853o089L091N711j168j919M66k217
$$ y = [4140, -6744, -3049, 16661, 16263, -5979, -13569, 823, 7388, 1558, 4971, 14203, 7039, -7597, -3971, 9473, 6687, -3770, 854, 12145, 9382, -991, 317, 7022, 2624, -1143, 7576, 14232, 3298, -8629, -1653, 11361, 11094, 5657, 7032, 6099, -4687, -6959, 7703, 15974, 6124, -1318, 5376, 9132, 1058, -989, 7133, 7603, -755, 1138, 12048, 9219, -3874, -3376, 8777, 10466, 2484, 1862, 5455, -796, -5313, 5663, 16703, 8332, -4223, -2824, 3871, 1867, 330, 6570, 8048, -701, -3521, 5072, 8266, -417, -4862, 1982, 6046, 2049, 455, 3816, 1502, -4083, -647, 8359, 6550, -4168, -7194, -714, 3336, 2311, 3674, 4892, -1878, -8144, -3220, 4982, 2954, -4258, -2967, 1989, 1552, -1767, 275, 607, -4717, -6717, 174, 5206, -647, -6736, -3645, 2066, 898, -1021, -555, -2772]
1630b772n888J313R429L688o899m837K303K142j542m5K256k559m116L570P009
1645C052p98p125j759L432O42p37J746m39m228m85O741L806m828n865o1J651R92
1662d263L395K123l627m269J706N120J68l997k211L07P66K284L713p83m844k207
1678f619L223L132j228k500j773M93K369L630J117l100m121j285K571M053K78
1693B40k726k425J691K805J382j025k279k876j005M037M279n02m059j397J880
$$ y = [-2772, -8660, -7347, 2082, 5770, -1129, -5966, -3663, -1521, -3063, -3108, -852, -3411, -7527, -3957, 3052, 2254, -4871, -6630, -3198, -2556, -3293, -1547, -1986, -6214, -6699, 42, 3848, -980, -6845, -6906, -5255, -4263, -868, 1255, -2372, -6641, -4935, 185, 353, -3644, -5855, -5548, -4782, -2498, 1215, 432, -4412, -6619, -3396, -264, -1492, -3992, -5765, -5272, -2903, 727, 1844, -1256, -5377, -6662, -4091, -38, 240, -2486, -4911, -3220, -415, 967, -58, -2337, -5213, -6218, -2181, 2098, 1596, -2463, -3860, -1980]
$$ [...]
8191C98
##END NTUPLES=NMR FID
##END=
