##TITLE=1H_LR-692-C2K-CHCL
 CDCl3, 8 sc, 
 2.9.2021
##JCAMPDX= 6.0         $$ Bruker NMR JCAMP-DX V2.0
##DATA TYPE= NMR FID
##DATA CLASS= NTUPLES
##ORIGIN= UXNMR, Bruker Analytische Messtechnik GmbH
##OWNER= root
$$ XWIN-NMR		Version 3.5
$$ Thu Sep  2 10:08:04 2021 Russian Standard Time (UT+4h)  she@DPX200
##.OBSERVE FREQUENCY= 200.1312
##.OBSERVE NUCLEUS= ^1H
##.DELAY= (6, 6)
##.ACQUISITION MODE= SIMULTANEOUS
##.ACQUISITION SCHEME= undefined
##.AVERAGES= 8
##.DIGITISER RES= 18
##SPECTROMETER/DATA SYSTEM= spect
##.PULSE SEQUENCE= zg30
##.SOLVENT NAME= CD2Cl2
##.SHIFT REFERENCE= (INTERNAL, CD2Cl2, 0, 15.7039)
##AUDIT TRAIL= $$ (NUMBER, WHEN, WHO, WHERE, WHAT)
$$ ##TITLE= Audit trail, XWIN-NMR		Version 3.5
$$ ##JCAMPDX= 5.01
$$ ##ORIGIN= Bruker BioSpin GmbH
$$ ##OWNER= she
$$ F:/spectra/data/she/nmr/H-F/1/audita.txt
$$ ##AUDIT TRAIL=  $$ (NUMBER, WHEN, WHO, WHERE, WHAT)
(   1,<2021-09-02 10:06:33.81 +0400>,<she>,<DPX200>,
      <created by zg, POWCHK disabled, PULCHK disabled
       configuration hash MD5:
       00 E9 B6 7A A2 85 ED C7 34 08 36 98 17 FE 4E 26
       data hash MD5: 16K
       DA D7 0F 9F 8A F1 34 AD 3D 10 0C 7F 7A 3B 1E 2F>)
$$ ##END=
$$ 
$$ hash MD5
$$ AA C4 A8 D3 CF BB 67 7E 7B 8F FF 37 D4 A6 53 9D
##$RELAX= 
##$RELAX= 
##$RELAX= 
##$RELAX= 
##$RELAX= 
##$RELAX= 
$$ Bruker specific parameters
$$ --------------------------
##$DU= <F:/spectra>
##$EXPNO= 1
##$NAME= <H-F>
##$PROCNO= 1
##$TYPE= <nmr>
##$USER= <she>
##$AMP= (0..31)
100 100 100 100 100 100 100 100 100 100 100 100 100 100 100 100 100 100 
100 100 100 100 100 100 100 100 100 100 100 100 100 100 
##$AQSEQ= 0
##$AQ_mod= 1
##$AUNM= <au_zg>
##$AUTOPOS= <>
##$BF1= 200.13
##$BF2= 200.13
##$BF3= 200.13
##$BF4= 200.13
##$BF5= 200.13
##$BF6= 200.13
##$BF7= 200.13
##$BF8= 200.13
##$BYTORDA= 1
##$CFDGTYP= 0
##$CFRGTYP= 5
##$CHEMSTR= <none>
##$CNST= (0..31)
1 1 145 1 1 1 1 1 1 1 1 1 1 1 1 1 1 1 1 1 1 1 1 1 1 1 1 1 1 1 1 1 
##$CPDPRG= <>
##$CPDPRG1= <>
##$CPDPRG2= <>
##$CPDPRG3= <>
##$CPDPRG4= <mlev>
##$CPDPRG5= <mlev>
##$CPDPRG6= <mlev>
##$CPDPRG7= <mlev>
##$CPDPRG8= <mlev>
##$CPDPRGB= <>
##$CPDPRGT= <>
##$D= (0..31)
0 1.2 0 0 0 0 0 0 0 0.06 0 0.03 0 0 0 0 0.0002 0 0 0 0 0 0 0 0 0 0 0 0 
0 0 0 
##$DATE= 1630562793
##$DBL= (0..7)
120 120 120 120 120 120 120 120 
##$DBP= (0..7)
150 150 150 150 150 150 150 150 
##$DBP07= 0
##$DBPNAM0= <>
##$DBPNAM1= <>
##$DBPNAM2= <>
##$DBPNAM3= <>
##$DBPNAM4= <>
##$DBPNAM5= <>
##$DBPNAM6= <>
##$DBPNAM7= <>
##$DBPOAL= (0..7)
0.5 0.5 0.5 0.5 0.5 0.5 0.5 0.5 
##$DBPOFFS= (0..7)
0 0 0 0 0 0 0 0 
##$DE= 6
##$DECBNUC= <off>
##$DECIM= 32
##$DECNUC= <off>
##$DECSTAT= 4
##$DIGMOD= 1
##$DIGTYP= 9
##$DL= (0..7)
0 120 120 120 120 120 120 120 
##$DP= (0..7)
150 150 150 150 150 150 150 150 
##$DP07= 0
##$DPNAME0= <>
##$DPNAME1= <>
##$DPNAME2= <>
##$DPNAME3= <>
##$DPNAME4= <>
##$DPNAME5= <>
##$DPNAME6= <>
##$DPNAME7= <>
##$DPOAL= (0..7)
0.5 0.5 0.5 0.5 0.5 0.5 0.5 0.5 
##$DPOFFS= (0..7)
0 0 0 0 0 0 0 0 
##$DQDMODE= 0
##$DR= 18
##$DS= 0
##$DSLIST= <SSSSSSSSSSSSSSS>
$$ [...]
##$SUBNAM2= <"">
##$SUBNAM3= <"">
##$SUBNAM4= <"">
##$SUBNAM5= <"">
##$SUBNAM6= <"">
##$SUBNAM7= <"">
##$SUBNAM8= <"">
##$SUBNAM9= <"">
##$SW= 20.0189188712717
##$SWIBOX= (0..15)
0 0 2 0 0 0 0 0 0 0 0 0 0 0 0 0 
##$SW_h= 4006.41025641026
##$TD= 16384
##$TD0= 1
##$TE= 0
##$TE2= 300
##$TE3= 300
##$TEG= 300
##$TL= (0..7)
0 120 120 120 120 120 120 120 
##$TP= (0..7)
150 150 150 150 150 150 150 150 
##$TP07= 0
##$TPNAME0= <>
##$TPNAME1= <>
##$TPNAME2= <>
##$TPNAME3= <>
##$TPNAME4= <>
##$TPNAME5= <>
##$TPNAME6= <>
##$TPNAME7= <>
##$TPOAL= (0..7)
0.5 0.5 0.5 0.5 0.5 0.5 0.5 0.5 
##$TPOFFS= (0..7)
0 0 0 0 0 0 0 0 
##$TUNHIN= 0
##$TUNHOUT= 0
##$TUNXOUT= 0
##$USERA1= <user>
##$USERA2= <user>
##$USERA3= <user>
##$USERA4= <user>
##$USERA5= <user>
##$V9= 5
##$VALIST= <valist>
##$VCLIST= <CCCCCCCCCCCCCCC>
##$VD= 0
##$VDLIST= <DDDDDDDDDDDDDDD>
##$VPLIST= <PPPPPPPPPPPPPPP>
##$VTLIST= <TTTTTTTTTTTTTTT>
##$WBST= 1024
##$WBSW= 4
##$XGAIN= (0..3)
0 0 0 0 
##$XL= 0
##$YL= 0
##$YMAX_a= 93652
##$YMIN_a= -140390
##$ZGOPTNS= <>
##$ZL1= 120
##$ZL2= 120
##$ZL3= 120
##$ZL4= 120
##$ABSF1= 10
##$ABSF2= 0
##$ABSG= 5
##$ABSL= 3
##$ALPHA= 0
##$AQORDER= 0
##$ASSFAC= 0
##$ASSFACI= 0
##$ASSFACX= 0
##$ASSWID= 0
##$AUNMP= <proc_1d>
##$AZFE= 0.1
##$AZFW= 0.1
##$BCFW= 1
##$BC_mod= 2
##$BYTORDP= 1
##$COROFFS= 0
##$CY= 11.3945322036743
##$DATMOD= 1
##$DC= 2
##$DFILT= <>
##$DTYPP= 0
##$F1P= 2.36226072786647
##$F2P= -0.459571619588291
##$FCOR= 0.5
##$FTSIZE= 0
##$FT_mod= 4
##$GAMMA= 1
##$GB= 0.15
##$INTBC= 1
##$INTSCL= 1
##$ISEN= 128
##$LB= 0.24
##$LEV0= 0
##$LPBIN= 0
##$MAXI= 10000
##$MC2= 0
##$MEAN= 0
##$ME_mod= 0
##$MI= 1.114404
##$NCOEF= 0
##$NC_proc= 0
##$NLEV= 6
##$NOISF1= 3.799351
##$NOISF2= 2.8
##$NSP= 1
##$NTH_PI= 0
##$NZP= 0
##$OFFSET= 15.70392
##$PC= 1
##$PHC0= -13356.43
##$PHC1= 8.800969
##$PH_mod= 1
##$PKNL= yes
##$PPARMOD= 0
##$PSCAL= 0
##$PSIGN= 0
##$REVERSE= no
##$SF= 200.130013532006
##$SI= 16384
##$SIGF1= 3
##$SIGF2= 2
##$SINO= 400
##$SIOLD= 16384
##$SREGLST= <1H.CDCl3>
##$SSB= 0
##$STSI= 0
##$STSR= 0
##$SW_p= 3612.71676300578
##$SYMM= 0
##$S_DEV= 0
##$TDeff= 0
##$TDoff= 0
##$TI= <>
##$TILT= no
##$TM1= 0
##$TM2= 0
##$TOPLEV= 0
##$USERP1= <user>
##$USERP2= <user>
##$USERP3= <user>
##$USERP4= <user>
##$USERP5= <user>
##$WDW= 1
##$XDIM= 8192
##$YMAX_p= 0
##$YMIN_p= 0
$$ End of Bruker specific parameters
$$ ---------------------------------
##NTUPLES= NMR FID
##VAR_NAME=  TIME,          FID/REAL,        FID/IMAG
##SYMBOL=    X,             R,               I
##VAR_TYPE=  INDEPENDENT,   DEPENDENT,       DEPENDENT
##VAR_FORM=  AFFN,          ASDF,            ASDF
##VAR_DIM=   8192,          8192,            8192
##UNITS=     SECONDS,       ARBITRARY UNITS, ARBITRARY UNITS
##FACTOR=    0.0002496,     1,               1
##FIRST=     0,             0,               0
##LAST=      2.0444736,     0,               0
##MIN=       0,             -140390,         0
##MAX=       2.0444736,     93652,           0
$$ Real data points
##PAGE= N=1
##DATA TABLE= (X++(R..R)), XYDATA
0@%%%%%%%%%%%%%Pj5J6j6J6k3L1l2M0m8N6o7P5q8J04j21J39j61J85k10K39k71
35a44L05l42L82m27M80n35N94o61P31q07Q94r89J092j203J326j461J608j771J951
54A023k155K384k640K936l276L672m143M712n418O317p514R195j1744J6130k5809
69a6330R0281k5232n1564M5351q4501O1940N2751o1930j8004j8022p2333L2938
81f4655J2264o418L7206l2196m2005L2864k4008J2467O0631j9596J184L0476m1067
94d2853K4389M6700k0832L6490K5771m9244K3027J5657l0542M1798J6486l2118
106E4729J4808k6994l6244K6318r984m48L0032m9610l0730Q259m4502J5123M6678
119b565l3643J429L122n9274J5739L4205j4330M1817J1506m5755J9113L065j2061
$$ y = [0, 0, 0, 0, 0, 0, 0, 0, 0, 0, 0, 0, 0, 0, 7, -8, 8, -8, 8, -15, 16, -16, 24, -24, 32, -35, 40, -48, 56, -65, 74, -87, 98, -112, 127, -144, 161, -181, 201, -226, 254, -281, 313, -348, 383, -424, 470, -519, 573, -630, 696, -765, 843, -928, 1023, -1132, 1252, -1388, 1548, -1728, 1944, -2199, 2513, -2905, 3412, -4102, 5093, -6651, 9479, -16330, 73951, 48719, -2845, 42506, -41995, 19945, 72696, 10766, -7238, -25260, -97593, -64655, -52391, -58809, -21603, -53799, -95804, -62940, -86948, -74481, -13850, -33446, -32262, -1786, -42853, -18464, 28236, 7404, 43894, 69665, 20421, 43448, 59105, 28563, 70361, 86847, 54729, 69537, 42543, 6299, 32617, 22633, 22185, 52217, 2607, -28123, -19864, -64366, -49243, -2565, -36208, -34779, -31657, -90931, -75192, -40987, -55317, -13500, -1994, -47749, -28636, -25571, -37632]
132c7632N8053J2346j8696K8421k5366j8165M7766m904J717L4548l8442j9322
144B0324K2536k7919J0499L0398l5969o291J151m4143J0120J8380k2861J6868
156f907l898l9177O798l462r039L4903p5j1248J4626k3990n546L5295j758J4556
170A078K7818k6949l216J6606j4656K5310K6687j9381Q582m071l2179J9712J0991
183C6332j3556K2381j2434l4430Q415j1273r921K7893j2258j6717O990k9009p279
196d4866K6710j0758O150J6090k8907l166J4038j1670K2475K0870j5106R047l01
209F06j8225K2809J4611m263K1437n695k0830J1020l695q17K2951p026j0159J631
223B4355k2709m040J4385p812L800L084k5122n838K84r996J5506N934j3109M012
$$ y = [-37632, 20421, 32767, 14071, 42492, 17126, -1039, 46727, 41823, 43540, 78088, 39646, 20324, 42860, 14941, 25440, 55838, 19869, 13578, 14729, -29414, -19294, -914, -23775, -6907, -10805, -49982, -43184, -46646, -55685, -20782, -20857, -32105, -17479, -41469, -47015, -11720, -13478, 1078, 28896, 1947, -1269, 15337, 681, 25991, 52678, 33297, 41879, 37808, 5629, 25341, 36332, 22776, 45157, 32723, -1707, 6708, -4565, -14486, 13407, 1149, -15568, -8578, -37587, -44866, -18156, -28914, -22764, -6674, -35581, -38747, -24709, -36379, -13904, 6966, -8140, 907, 606, -17619, 5190, 19801, 15538, 36975, 31280, 10450, 21470, 17775, 16958, 39909, 32883, 22724, 24355, 1646, -2394, 11991, 4179, 7979, 11063, -14059, -19897, -19613, -29609, -14103, -8169, -21278, -17266]
237a7266j0148j2485J8883N078O00J7654r871j0660J2545k628P882K2675n882
250A6377j629O213j6160N079J7121n925P361L923k0980j884K266q338J1635K381
264A7440j4493k31j1323j3282J1656R44m057P768j1534j1510N401k641N759J4214
278e889m143j796K332q845O792J4387J225Q111L112j0819J701M052J245J2158
292B3623K840o889o02q947n075Q354P33j011J432j2162q962n21m238N316M824
307a285p543k850m635r943N990P595k46O109j144q721K775L059L651J2503K781
322H096l488K241m639p59J0882M256J402L089o859p051J275J30L564M125m944
337A1320n958n594p161R23M778l47p37l935p895l073J175L649M969J725k325k984
$$ y = [-17266, -27414, -39899, -21016, -15938, -15338, 2316, -7555, -18215, -5670, -8298, -416, 22259, 16377, 14748, 20961, 4801, 9880, 27001, 21076, 28437, 32360, 11380, 9496, 11762, 3424, 15059, 17440, 2947, 2716, -8607, -21889, -10233, -9289, -13346, -5578, -17112, -28622, -23221, -25862, -20103, -5889, -10032, -11828, -9496, -18341, -11549, 2838, 4063, 12174, 15286, 4467, 6168, 10220, 11465, 23623, 26463, 19574, 18972, 10025, 4950, 13304, 14037, 13026, 14458, 2296, -6666, -7187, -11425, -6109, -1285, -8828, -11678, -16313, -26256, -20266, -12671, -12917, -6808, -7952, -16673, -13898, -10839, -7188, 5315, 8096, 4608, 6849, 2210, 1451, 12333, 16589, 17991, 21080, 14221, 7170, 8445, 8575, 12139, 16264, 11320, 5362, -232, -7393, -6470, -1692, -2039, -2776, -6711, -14606, -17679, -16504, -12855, -7886, -6161, -8486, -11470]
353a1470k444J656O483O235L402O95k505j896Q50M506O305K987m04k869m581j631
369E319J987L424J742j489m516n256m181m66K843J389j110l758n038l581j14L218
385i587L962N97j422k417k641P42N227L750L229R07k978q69J081J675O403L540
401A1199k275l30k710l593L574L772q06J991l803o292n23j227K16M833k244m671
417b889p21n125j591N782j88N08J560n733j829K773j52M974M414l547L95j06l423
434d898N441N042m10K840j666m973K501J46J192N496k074l966L46n059o92M886
450D152j539R5mp055j134Q04k195N288J082n795J678k275m259O582J973j242M995
467A151l504m070N171r21J821P966l762j539L707o026J319P100k415J301J679
$$ y = [-11470, -13914, -12258, -5775, 460, 3862, 4557, 2052, 156, 1006, 5512, 11817, 14804, 14400, 11531, 6950, 5319, 7306, 10730, 12472, 10983, 6467, 1211, -2970, -3436, -593, 796, -314, -4072, -9110, -12691, -12805, -9587, -5625, -5028, -6450, -8867, -11508, -10766, -5539, -1789, 1440, 2347, -631, -1500, -419, 1256, 7659, 11199, 8924, 8594, 5884, 2291, 5865, 9637, 8831, 10822, 7019, 727, 204, -1023, -807, 4026, 1782, -2889, -3610, -8735, -10326, -4544, -4732, -4224, -2664, -8397, -10226, -7453, -7605, -2631, 1783, -1764, -1369, -1475, -4898, 543, 5585, 5175, 8015, 6349, 1376, 3877, 4023, 5215, 10711, 8637, 4671, 5017, -42, -734, 4152, 2613, 2708, 2704, -4351, -5485, -4681, -6876, -1588, -506, -6301, -4623, -6898, -11157, -4575, -2602, -3844, 1151, -2353, -6423, -1252, -2173, -352, 7614, 3852, 2313, 6020, -6, 1313, 8413, 5998, 7299, 8978]
482H978p755R95J528m014N476J030p330J502k330n926O051P80l141M015n091l947
498i179M372k489J572O904m535r95L275n243K813O427k622L358J467o153L446
513B418J535k646P206nn355L277l205l986O304j248k497M192p006k767M010m865
529d638J606N255p362k1K707p138L656M712m676M142O93o353M892J076k964Q294
545C881m18m461N072k150k750P806j477j376M709n953j612M391m328J813M479
560G626p233J74J036o673L531K593n186L648j579o449M612p21k573P135k386l508
576e953M809l401r50P481k518Q92M483n585Q71M646m215M305L750o515K578R13
592E591o238N068J162m924M331k872n915M757k444l155O739m048l951M751n462
$$ y = [8978, 1223, 2218, 3746, -268, 5208, 6238, -1092, 410, -1920, -7846, -1795, -1015, -4156, -141, -5232, -9179, -4807, -7296, -5724, 1180, -3355, -4350, -1075, -6318, -3505, 2922, 300, 3658, 5125, -1028, 2418, 3953, 1307, 8513, 8508, 3153, 6430, 3225, -761, 5543, 4295, 1798, 5990, -1016, -3783, 227, -4638, -3032, 2223, -5139, -5160, -2453, -9591, -5935, -1223, -5899, -1757, -1064, -7417, -2525, -1449, -4413, 3881, 3463, -998, 4074, 1924, -826, 6980, 5503, 4127, 8836, 2883, 1271, 5662, 1334, 3147, 7626, 393, 567, 1603, -5070, -1539, 1054, -4132, -484, -2063, -8512, -3900, -4621, -7194, -59, -2445, -5953, -1144, -4545, -5495, 1986, -532, 360, 4843, -742, 129, 4775, 560, 4865, 8615, 2100, 4678, 5591, -647, 4421, 5583, 659, 4990, 2118, -3797, 960, -1484, -4639, 2100, -1948, -5899, -1148, -6610]
607f610n38O578l733N52M196o326J419M542m287M851L441n421L576R98m856N857
623D239J450l805M834k177m104M415k745j178N273m315k382L288n967M32M351
638A609m743J452J768o357K396J814m858N463J280n201M208o92l571O261j75k585
654a931N977l147k372N625l216j6O054m578q03L810n489J386M013n192K147J709
670C977o481K860R30m969M491K09n614L954j740l383M844r33k379M609k983j807
686d415M564k542K35M691l327j43L384l846K305L004l523K943P92m688L338K13
702B985l067M476j361l405L114k192k342M039k362j381L238m335m35L072l876
717c832J236L476m668J144J800l927K802K689l831L476L77l912M021k3j967M390
$$ y = [-6610, -7148, -570, -4303, -3751, 445, -5881, -4462, 80, -4207, 644, 4085, -1336, 2240, 3238, -1618, 4239, 5689, 1884, 6718, 4541, 437, 4852, 2107, 929, 6202, 1887, -495, 2793, -3174, -2742, 1609, -3134, -1682, 86, -6271, -3875, -2061, -6919, -1456, -176, -5377, -1169, -1861, -5432, 829, 654, -1931, 4046, 899, -1473, 4152, 936, 920, 6974, 2396, 1593, 5403, -86, 1300, 5313, 121, 2268, 3977, -2504, 356, 1286, -3683, 808, 1017, -4597, -643, -2383, -5766, -922, -1855, -4234, 375, -2608, -4415, 149, -2393, -2158, 2533, -794, -937, 2447, -1399, 906, 3910, 387, 3330, 4122, -566, 2772, 2985, -82, 4394, 3033, -372, 2742, 550, -1792, 2247, -115, -1496, 1742, -2593, -3028, 44, -3832, -2596, 880, -3788, -2644, -844, -4771, -1969, 720, -3111, 365, 742, -3170, 851, 828, -1139, 3251]
733C251o06k748L593j926j367M128k170l86K808l620m77K669l472Q63K449m347
749a358J009Q23l929K142O02k746K785o97l348L321j044j559M173j445j480L073
765C22k034j45L537j908J126K485l388J215K427l262K558J751l451J643r3k758
781B5K264L2k456K302j398k822K296j550j438K758k063j333K124k202n27K618
797a370j680L88K201k556J175J782j796K264J532j823J565N96j653K166J61r26
813B026K148j358j530K059j631n76J858j685j012J232k760L55P83k176P69N32
829i66k420P60M26j979J960M74j424J642k62r76K180P5l83K425j131j50K232j253
847A230O44J786j386K9R44j899J016P00j566O26l9j948K76k22j655J102n4j744
$$ y = [3251, 2645, -103, 3490, 1564, 197, 4325, 2155, 1769, 4577, 957, 480, 3149, -323, 540, 2989, -1358, -349, 474, -3455, -1313, -711, -3457, -672, -1369, -4717, -1396, -2440, -3999, 174, -1271, -2751, 322, -1712, -1857, 1680, -228, 898, 3383, -5, 1210, 3637, 375, 2933, 4684, 1233, 2876, 2783, 25, 2289, 2321, -135, 2167, 769, -2053, 243, -1307, -2745, 13, -2050, -3383, -1259, -3461, -3988, -1370, -3050, -2662, -461, -3017, -1842, -60, -1856, 408, 1940, 117, 1682, 2278, 625, 2791, 2952, 2026, 4174, 2816, 1286, 3345, 1714, 1138, 2996, 1311, 299, 1531, -1229, -874, -91, -2267, -1498, -966, -3386, -2626, -2200, -4179, -2219, -1745, -3169, -1527, -1789, -2765, -585, -510, -893, 1532, 401, 251, 2483, 1230, 1874, 3660, 2274, 2303, 3247, 1348, 2364, 3064, 1498, 2124, 2085, 137, 413, 191, -1464, -362, -416, -2160]
865b160P09p90r89R14L1k49J193j154m22J643n86M39J337o6N01L90n90P73J225
884B149n55J437j80r54N93k68p98J390n75n89N1j007r71O17j061j42O26j378j32
903a747K04j067L03P45n72K3K58m58Q94M50m10J019K90n53Q20M26o7Q75K62p8
923A617O75o06k05O83m99R9N18q09m70k13m05L4q0l19l56n13k92l88q3P0J59r9
945a482l16l94J45L96L95L46L22j60k0M58K83K91Q56J03j30M19l27M76J54j39
965A676O76p51j62k81Ll03J9l37L1m79p17K36m30k02J62N7p77k22j02J27K94n9
987a541J66K77k90L17N07k03Q69O91m02N5M87j02M10N79M5R3j11r82N45J56n21
1008A045O64o77o88J05m74p60P33q26M2r0r74K18J48m16M01N16q05l3N50m48O70
$$ y = [-2160, -1451, -2241, -3230, -2316, -2285, -2534, -1341, -2495, -2917, -1274, -1860, -1421, -84, -150, 351, 741, 151, 924, 2149, 1594, 3031, 2851, 1897, 2490, 2222, 1424, 2814, 2239, 1650, 1701, 694, -277, 340, -721, -863, -237, -1615, -1747, -1543, -2610, -2307, -1562, -2134, -2111, -1853, -2311, -1417, -967, -1377, -358, -68, -621, 199, 625, 558, 1433, 1695, 1617, 2292, 1686, 1481, 2164, 1665, 1764, 2282, 1473, 1003, 790, 385, 419, 339, 20, -336, -849, -1141, -1529, -1612, -1542, -1383, -1482, -1798, -2192, -2047, -1651, -1256, -910, -588, -748, -768, -310, -27, 264, 1120, 1223, 1093, 1512, 1185, 1661, 1815, 1676, 2352, 1601, 1439, 1158, 1161, 858, 877, 540, 571, 92, -625, -389, -819, -1021, -859, -802, -1579, -1801, -1903, -1776, -1482, -1541, -1375, -1098, -1388, -1071, -564, -767, 102, 793, 391, 446, 933, 831, 1241, 1820, 1865, 1958, 1847, 865, 1410, 1566, 1045, 1709, 1032, 344, 449, -25, -785, -52, -878, -836, -926, -1900, -1682, -1534, -1950, -1549, -1033, -1838, -1871, -1321, -1769, -1099]
1029a099O77R7L14L14k54P01J45R8Q80m4n08M21m51j0O89n17j43J69r09j55L11
1050G26j060L58r4q55K3o8r78N13R8k82N02l66q15J020j29l1J567l15l97J034
1070D51m65N24R48m77L38O39r70L99N30o82K15L86r49J10j17r51M56N5p93M07
1090E4o74j138R63n91j73O36p30J42P45j094M64J090p78Q86K22n52P21M91o58
1109B6J072L66r18R57q6p39J157m48p52J087r75o00R00r84j60R07j137k55N70
1128a2j088K39M30j063O21R9j156P63N11r63J206L34j105J183k2l54J257k98m48
1147A34J329j153p8J231o22j05Q78p87L9K87r29N44J22j094N53k11r17K65M71
1166d3j033J071l11p41J75j34n89J199k83j23P39r49K21R84o81M54J052r09J06
$$ y = [-1099, -422, -325, -11, 303, 49, 750, 895, 993, 1873, 1829, 1321, 1742, 1291, 1281, 1970, 1453, 1310, 1479, 570, 415, 726, -334, 24, -70, -925, -902, -970, -1948, -1435, -1337, -1619, -1117, -1483, -2298, -1278, -1407, -1438, 129, -186, -583, 451, -14, 510, 1458, 981, 1319, 1958, 988, 1387, 1917, 1235, 1450, 1836, 887, 997, 880, -71, 385, 440, -353, 54, -620, -1758, -795, -1386, -1559, -923, -1653, -1511, -766, -1860, -1396, -306, -1084, -198, 24, -528, 193, 684, 26, 1098, 1464, 546, 1503, 1417, 678, 1835, 1387, 635, 1722, 747, 147, 1047, 63, -97, 810, -327, -582, -12, -1100, -861, -431, -1494, -873, -774, -1930, -1167, -656, -1619, -413, -79, -1184, -1, -23, -377, 880, 582, 134, 1463, 310, 232, 1463, 841, 736, 1614, 827, 866, 1153, 224, 768, 890, -204, 349, 138, -779, -514, -43, -1076, -5, -316, -1057, -882, -1016, -1605, -406, -689, -812, -73, -1022, -801, 183, -498, -44, 1008, 99, 205]
1185B05P79j120Q06M29q78J019j88j089J054k70p04R70k95p91N30j030J35R35
1203D97q61j69Q80j183j48O06m66K94N97j047M36N20j499J204K58o22R15lq60
1222f51J035l76k6J089k46l66O64q62RR23r97L72N55j336L88J62n19N33M13j257
1242d93N36k86r23J061l85m55Q32m86o44R67m13m9R48r55j25J061q01L48Q93o29
1262BM31M13j014N53L62p23P62L44o45L01m68k24O77k50q53Q09q25m83Q16n05
1282e20k22R08o15l61N36q59K59O56o59N86M16j264R52M01m45Q38j81k63M11k47
1302C27n87J484m48l93Q42p54k47M91p84L16P23j093J80l6o42K80M61r06M21N3
1322c12q98N07K5j80O96k0m15O89n31m3P37k16j13O92p45K11P32p37L67O21p35
$$ y = [205, 984, -136, 670, 1099, 221, 1240, 1052, -37, 1017, 747, 43, 1013, 718, -73, 457, -573, -438, 497, -364, -533, 347, -836, -984, -378, -844, -550, 47, -1000, -564, -44, -1543, -339, -81, -703, 212, 209, -651, 384, 8, -18, 1071, 825, 459, 1123, 261, 270, 1193, 196, 568, 1123, -213, 175, 337, -182, 351, 764, -493, 43, -243, -1166, -105, -490, -945, -113, -599, -1243, -276, -689, -738, 210, -745, -870, 191, -610, -262, 631, 2, 433, 846, -168, 385, 747, 24, 786, 1130, 485, 786, 318, 94, 771, 521, -332, 477, -348, -831, -15, -520, -742, 166, -449, -810, -274, -1133, -874, -218, -877, -291, 125, -1139, -187, 214, -231, 607, 426, 163, 574, 327, -260, 1224, 776, 383, 1225, 471, 224, 715, -69, 247, 970, -123, 57, 21, -621, -341, 120, -786, -365, -312, -1210, -703, -678, -858, -162, -182, -597, 92, -439, -482, 255, 39, -74, 618, -127, 84, 816, 79, 446, 1067, 332]
1343C32j11K62o29O49J05l18M5k9q32K78J42n93Q29l76l74L46m57j18Q19m52N7
1364d25L28m88R1O62n78N40L84n51L89j62l28O76J80o45N06j5o21K05L9k85M25
1385C27O4n09J46l80R8O44n84o0K07n54J81O32o04J73M09o55L88L9m08M21K56
1406B31l58N61n0m07J59Nk06O66l16j1m1n10K47M75l39L69k15m36J14M48l68M13
1428D31l59k52M00l20l86P69r8m09N25n65j74K79J0O1N82n01J5J75n74M81M06
1449D96p13M77P4m66M1K60j38K86M0m72L40l17l2N28l00m6n3Rj13k3n5J74K18
1472B15m89J19J15k42J58L26k15m0Ol40J29J82P4M71l36j41N8J2M0%j14L88j05
1495B71k37l36M61m5J9J20k8m08J82l86M23K47l00J00j86J57l67J17qK13P7k53
$$ y = [332, 221, 483, -146, 503, 608, 290, 335, 306, -526, -248, -106, -699, 130, -246, -620, -274, -731, -849, -30, -482, -425, -97, -585, -494, 168, -410, 130, 514, -37, 352, 190, -138, 538, 718, 73, 579, 564, -57, 148, 187, -98, 327, 391, -118, 28, -352, -254, 390, -194, -254, -47, -601, -420, 212, -392, -219, 190, -465, -77, -38, -446, -25, 231, -127, 434, 384, -23, 136, 141, -65, 601, 285, 274, 233, -277, -30, 445, 106, 475, 260, -176, -62, 386, 18, 431, 72, -180, 220, -100, -486, 283, 185, -224, 301, -264, -438, -159, -149, -88, 494, -7, 8, 183, -391, 90, 496, -217, 260, 334, -132, -91, 169, 31, 317, 357, -115, 225, -92, -124, 404, 104, 58, 5, 14, -99, -122, -177, -3, 215, -274, -155, -40, -282, -124, 202, -13, -53, -47, -387, -258, -76, -2, 469, 133, -8, 50, 62, 102, 102, -12, 376, 271, 34, -302, 159, 114, 133, 253, 225, -183, -1, -387, 36, 283, -17, 83, -103, 54, -313, -196, -204, 9, 86, -167]
1517a67j29R5K34k37K77k32L44p2k44j7L39J0k5nj90Lr8K58n0J82j43n6l50R1
1541a82L8J48R1j30k70M5Q2Q6J04J56k15l14%M69p0k19j02N73j73M9j67k6PN32
1565E12k58L2n8l18j4j56L45M2Q2r6k24n0j4j87J93J0k3J2L6K6N8J02m2n4p7k0
1591a41L71o2kN0n8J73o0kL04l05l1J61k37j48l7J14J04q0j27N0q1j32J25J33
1615H2k08L10k16l34K04R9k85K62K67k20P2j29MJ71m2K47J10k91J37p2K7J41r3
1638B43j35j71j42m8K58J38j09m7N2k46l3p2L26j1k87j13J70M5l57O31l14j29
1660c51M37j76p6M35j49NN46l60k99P2p4r3K65L6R2O0n41K21J88l34N96l38l80
1683b18J10Q1n05L50Q9k28J7J33j99J81M2k7K6J50k56M94l91q9L10m40P88K5l38
$$ y = [-167, -296, -201, 33, -204, 73, -159, 185, 113, -131, -148, 191, 201, 176, 171, -19, -16, -114, 144, 94, 276, 133, 77, -273, -182, -144, 4, 95, -35, -305, -260, -178, -92, 12, 168, -47, -361, -361, 108, 38, -181, -283, 290, 117, 166, -1, -27, -20, 512, 254, 286, 228, -90, -104, -260, 85, 127, 209, 113, -111, -161, -175, -362, -169, -159, -182, -170, -134, -108, -50, 52, 10, -44, -121, -141, 230, 168, 166, 216, 158, 331, 271, 269, 573, 268, 237, 398, 161, 13, -24, 90, 194, 114, -13, 37, -44, -176, -51, 82, -126, 184, -32, -366, -162, -63, -348, -86, 181, -39, 33, -96, -92, 79, 37, 284, 394, 103, 240, 168, 195, 336, 243, 108, -63, -205, -253, 5, 143, 34, -13, 39, -207, -240, -312, 14, 3, -284, -397, -227, -182, -539, 92, -222, -351, 86, -90, -166, 269, 120, 125, 671, 311, 12, 84, 10, -83, 182, 218, 310, 370, -171, 50, 238, -96, 500, 162, -218, -108, -27, -532, -182, -93, -321, -304, -171, -370, -189, -147, -174, -148, 2, -254, 240, -151, -240, 70, -370, 418, 443, 105]
1706A05Q9K19m56K85j7l09L48l95JL34j32L1J52m22%jr1L18J13k91j46J81n43
1729f27M90L49p14N06p3l69K14Q4J07K80k37j97L25k52J8K81l23K83K07k01j32
1750A9L35j01J9J2k34K49j33j93K74l09l58N08J34l91k15L86k0j68L3k03L00j12
1772a68L9L5k35K43J81k30OL02j21j97L24r9J67K0k57K75L10m63K60j49k44J45
1794A44Q5k07J97k93j82J84j27J30j02j48n1L43m75L46n2n2K5j84K28J26L3k29
1816b61M61K6k18L22l3k18L97j80r2K75k68k34L42k17n2L82m30J19K72n13J09
1837a1J85l97J48J95m70K8N2j25M62m02k9K30k87L35j46j26K24K34k6M4K48n44
1859a78L73K97n66O20n28L11j81J88k1j78L42m57p0o2k32N22l72k40M26j73j62
$$ y = [105, 194, 413, -43, 242, 225, -84, 264, -131, -130, 204, 72, 103, 255, -167, -167, -168, -259, 59, 172, -119, -265, -84, -627, -137, 212, -502, 4, -69, -438, -224, -140, -33, 247, 10, -187, 138, -114, -96, 185, -138, 145, 352, 151, 19, 354, 253, 272, 284, 50, 299, 166, -27, 247, -62, -420, 88, 222, -169, -384, 2, -18, -186, -153, -356, -56, -168, -129, -94, -329, -86, 95, -135, -129, 173, 52, -145, 179, 80, 247, 267, 10, 285, 595, 132, 392, 243, -1, 144, 229, 22, 219, -74, -256, -72, -199, -69, -171, -319, -370, -27, -502, -156, -208, -260, -235, -419, -191, -65, -32, -261, 200, 226, 8, 330, 297, 79, 476, 296, 204, 479, 211, -23, 319, 102, 50, 432, 2, 121, 393, -120, -11, 174, -223, -75, 120, -350, -322, -270, -395, 67, -335, -364, -134, -421, -86, -232, -358, -134, 100, 74, 118, 366, -178, 195, 492, -74, 546, 18, 329, 148, 336, 315, 137, 479, 22, -48, -110, -342, 180, -192, -432, -6, -179, -341]
1880c41k8j6J78J04j3r1k9k19L16L23l11K22n6l39P93k71j54K37m8k54K19P7k26
1903G3K26m80J88l08J27Q1r8P0o6K93l01j41K60k08K40pk30K03l70K83J37j29
1925a57O1K61k4m52L89K26k07M15m93J32R3q7k22J96k88L08K81n22K74J18k02
1946A00j37J32r9j23q2k50J76K50p7O9l8j92L8l34M36O0k18J68K81j72N4N6M6
1969A44nJ12k42J41J49m44L25l11J95L11q0j19M9k27J26j46J07q3M6k59K54Q2
1991A25l43L02j24m5j38J61J17r0J04J6l41J98j4J94M7j79p5J60N1j29J42l8K60
2014C61l92L54j41j22L20n13L44o5l48K30O4q8R1k0k3j81m2p7j8K73r5J22o1k03
2038b30J26O3r4K21J21j17k7j9J09l4q1K3M01n34K69k30K66k01K96j97Q2j45j45
$$ y = [-341, -369, -385, -207, -103, -116, -207, -236, -455, -139, 184, -127, 95, 39, -300, 493, 222, 68, 305, 257, 3, 222, 299, 73, 299, -181, 7, -301, -174, -93, -191, -121, -187, 106, -195, -336, -76, -284, -44, -51, -281, -78, -448, -165, -28, -157, -96, 165, 141, -311, 78, 304, 97, 512, 19, 151, 244, 157, -65, 131, -157, 151, 432, -90, 184, 302, 100, -37, 95, -4, -127, -209, -459, -283, -33, -110, -41, -79, -271, -233, -567, -131, -71, -289, -121, 160, -12, 42, 98, 144, 139, 251, 9, 150, 299, -145, 180, -131, 64, 375, 295, 176, 225, -2, 124, -22, 85, 2, 48, -211, 43, 125, -218, 84, -40, -85, -223, -62, 55, -35, 69, 85, -256, -58, -72, 122, 169, -10, -85, 75, 126, -3, 139, 101, 361, -31, 323, 182, 60, 380, -133, 211, 146, -202, 28, 92, 4, 95, 75, 52, -129, -171, -248, -266, 7, -88, 34, -27, -230, -104, -41, -135, 86, 207, 90, 63, 44, 153, 119, 38, 61, 462, -72, 197, -33, 233, 32, 328, 131, 213, 68, -77]
2061g7P3L5O9k27J57o0O8j68j38N13m48L13k08m4k0kj58K15J57r5J35L2J5k84
2085a47J90J2K60j5j48QJ14k43J88k64K29j04j88R3j5N9j44o7J32K22m25OJ3N1
2109a83j38K31k9j34J55J42K68k80P6j26J73j63K06l37R3M5K23Q9k82O7J76n7
2131B15j89R2k7kk5p3J45j26k5K7J57k34N1R6j20K2l42L96l43K77oj16J79j09
2155h0L7M18l56Lj23J16qO6Q3j65k4K47k00l1oj37N08o19K11k29N3L35l04K11
2179Fm3J31o6j8J06j50Q4j38J09j31k3J79m6n1K08j84J44R3j03k32j8K71K02o2
2203B68k41mR0j63K1j1j7J28J21k56q3M42l32l3J1m1O6J34j33K1J9n7j4O8QK58
2229B70n93M46q1P1L0P8l29K18j38J7j78L51o9n1n6k22L57pj0l0J04k42L90m55
$$ y = [-77, -4, 31, 100, -127, 30, -30, 38, -130, -268, 245, -203, 110, -98, -142, -162, -164, -322, -107, 50, -45, 90, 122, 137, -147, 43, 55, 315, 300, 152, 160, 274, 31, 219, -45, 184, 80, -108, -15, -30, 29, -115, -182, -50, 172, -253, -247, -234, -183, -321, -90, -119, -253, -98, 44, 312, 32, 108, -18, 155, -8, 198, -139, -46, -1, 222, 311, 29, 96, 272, 215, 26, 118, 91, 89, 64, -9, 136, 10, -15, 12, 169, -65, -14, 82, -38, -16, -358, 38, -305, -28, -34, -150, 29, -80, -43, 375, 19, 22, -101, 15, 7, 73, 156, -9, -33, 214, 14, -17, -23, -160, 348, -271, -60, -289, -236, 99, -205, 6, -37, 94, 28, 10, 116, -34, 50, -88, 21, -110, -133, 46, 0, -51, 157, -27, 117, 210, 107, -125, -143, 128, 330, 268, 27, 23, 113, -50, -29, -40, -57, 71, 192, -64, -147, 295, -37, -70, -59, -100, -34, 100, -33, -12, 7, -50, -64, 4, 12, 270, -323, 123, 42, 113, 143, 221, -108, 110, -28, -11, -189, 162, 93, 42, -14, -236, 121, 114, 104, 74, 178, -64, 326, -129]
2253a29J21J6p7pm4K2J15O0N2m66J94p8K96j29J50k5k14O2O6R6p0Q3kJ52j84j55
2279i5L68j41p6j12M3j01J29Q7k45K11J68m49K94P1L4O9l40n6M21l16m0k8j1j9
2303a34K23Q1l09K47j24k1l0N35o53K52k79L18K8j8P8oj49O8J92k55k60K53P1
2326A08l82Q0M1N5J23P9k33L9Q5J31l22K31k25K98j60l3P8M4K01l65m0J56K21
2349B10J89k64K12m02Q6J12k90Q3o5J36j27R3j37P9j1M74m90j09O2R2N5j60J45
2372b7j33J1K27j61J26l42M53j93J43J17l94M1J01J22j08n5J99j56J58m2k23K66
2394A30j35j99K69n8k36L03j85J5L5j06K2Q7J0J22J69k71q4J36K08k78K39l54
2416a61K74j75j6O2j70K26j2j39j0J54j64P9J04m9J1J3P5j04l4L3J23j58k43L86
$$ y = [-129, -8, 8, -69, -76, -120, -98, 17, 77, 129, -337, -143, -221, 75, -54, 96, 71, -143, -81, -15, 81, 11, 94, 92, 244, 60, -95, 273, 132, 56, -56, -13, -114, 15, 102, -143, 68, 236, -213, 81, 152, 186, 255, -85, -141, 280, -36, -76, -104, -115, -134, 89, 170, -139, 108, -16, -37, -67, 468, -185, 67, -212, 106, 134, 116, 194, 188, 39, 107, 299, 44, -216, 37, 108, -274, -194, -153, -98, 25, 104, -129, -90, -5, 126, -196, 35, -190, 108, -52, -85, -7, 37, 238, -127, -167, -11, 210, 399, 135, 347, -55, 31, 143, -147, -64, -129, 7, -120, -27, -164, -85, -96, 378, -112, -221, -159, -67, -12, -172, -27, -160, -149, 78, -83, 43, -299, 154, -39, 104, 221, -173, -132, -31, 91, -17, -72, 127, -29, 129, 87, -136, 130, -5, -204, 65, 7, -229, 74, -111, -96, -61, -167, -145, -58, -48, 74, 243, -28, -112, 24, 232, -46, 193, -161, 113, -62, -78, -16, -186, 40, 28, -111, -121, 33, -131, -52, 52, 3, 14, 27, 102, -2, -36, -3, 120, -38, -281, 105]
2440A05K3M5l88L4L12k73m8J18J58kk41L0J67K26l85M02j87K2j02q5K28Q8k23
2463B4Pj52K7n9M6J95J65q0Pk69J42l12L30N6l17K92j04J03r2J14j54k46K47j72
2487b02L42J32m12n5L71k6j98J18k18J15k25K29k4K55m9k2l70J46M50l95j1O1
2509A2K20j77Q8j00j54q0K16k6j02J60m2q4J58k99K83k11J65Kj00P9r5K13j33
2532gk03J79N7J14j15j99j26J23L19r3o6Q2k2j86J60M8L2j45J52o6J14N3k36K45
2556B14j89j60L16j84R8j62J84k29J02m8L25l73K97j24j60r3K55L9m66M13K34
2577B89k61jR1m6J27l34Q4j69L8K28k1l19J99K68o9j15J81k07M6m4O0k85M24k58
2601i4Q6j07J06J11j18J30l8j13qm5j6Q0o8L99n42P3J25N2o3L0M1j7k46L4J37
$$ y = [105, 128, 173, -215, -181, 131, -142, -190, -72, 86, 84, -157, -127, 40, 266, -119, 283, 96, 118, 16, -69, 159, 247, 24, 31, -121, -94, -153, -107, 88, 253, 173, 180, -89, 53, -259, 71, 127, -190, 102, -2, 101, 9, 123, -31, -277, -30, -202, 140, 272, -140, -195, 176, 150, -48, 70, -148, -33, -258, -29, -53, 202, 153, 131, -239, -93, 357, -38, -49, 12, 232, 55, 143, 43, -111, -191, 25, -1, -103, 57, 15, -69, 89, -210, 73, -138, 27, 29, -71, 8, -87, 126, -7, -210, -31, 26, 140, 25, -174, -300, -177, 142, 49, -17, 65, 43, -143, 17, 65, 97, -48, 104, 38, 152, 205, -31, 214, 25, -135, 181, -3, 95, -67, 117, -112, -10, -58, 267, -106, 191, 67, -93, -186, 69, 108, -358, 55, 289, 28, 27, 118, 72, 199, -135, -51, -220, -182, 46, 25, -294, -95, 173, 104, -11, 170, -37, 9, -35, 25, -260, 164, -94, -8, -115, -9, 102, -16, 114, 76, -37, -45, -90, -106, -26, -94, 305, -237, -164, -39, 13, -50, -20, 21, 4, -242, -208, -71]
2626g1j15K35j40J62mJ44j61k52K09j47j37K55n8n4K36j49L39k28j49J53J67r8
2648A37J53m03K22j53j24J42J23k03l43K86j7K49k25J9J09Q3j90J75p9j4J77l28
2670b04K56p7J94k53J33j53Q3J31j24j02K03K06k18m6k8L07l53j23K63j24O6q7
2692e0K08l83Q4K00K1k22K95j57k6J26k60J88K4L0j44J15j64J71jq5L07k53k6
2715bL6k05J63J28J90n50L01l3p2j88K34L9O4J66k80O3n5P2j7O0j48J88m18k3
2739b87K94qk6j66L15l2Q9k20J07J5j36J83n8j55n6J69O4k00J33k09L59l26K66
2762A15Pj65N0K7m7n4J68k92J99o9j1O0M5k7j80J43k15K71n9l9j9J95P7j31j56
2787a07J29L3l97N63j41j53O9o8K29k14J06k00M09j17j04k52K34M4J40m44J75
$$ y = [-71, -186, 49, -91, 71, 67, 211, 50, -202, 7, -140, -277, -22, -80, -134, 102, -47, 292, 64, -85, 68, 235, 137, 290, -113, 109, -44, -168, -26, 97, -106, -449, -163, -180, 69, -156, -137, -28, 55, -135, 40, -39, -53, 124, -204, 52, -25, 169, -84, 49, -104, -21, 110, -14, -116, 87, 293, 75, 29, 1, 308, -45, -168, 95, -29, 37, -50, 158, -225, -141, 59, 80, -142, 153, -4, -30, 96, -164, 24, 48, 78, -66, 49, -115, 56, 55, -30, 277, 24, -2, 34, -171, -8, 120, 310, -240, 61, 28, -44, -232, 2, 41, 105, 271, -9, 54, -1, 71, 54, 114, -34, 154, -264, -287, 7, -1, -27, -193, 122, 90, 179, -41, 66, 81, -55, 128, 70, -85, -141, 28, 92, -108, 25, -184, 175, -151, 115, 122, -43, 7, 34, -13, -67, 101, -191, 8, -61, -72, -12, 33, 6, -174, -31, -246, 25, -34, -73, -92, 103, 180, 49, -107, 22, 55, -342, 221, 80, -73, -4, -72, 157, -57, 49, -151, 258, 141, 37, -215, 19, 63, 203, -241, -66]
2808f6J27m1j32K51k34J46Q3k39O5Oj19j20J13K46o8j64O2R8k82M20Q6k04j27
2831i3K55k33r2L02m45J73M97q4k34p4O7m8J31j16j39J34ON5k71q4J24L76j92
2854A5j44K98k74J37J01J2j64j12K54r8J87j10jJ37l41J07RJ22l3q8j5J68L33
2877E00p23K35j42K50j50K43j19k51J62J19k62P1q2J18j85J65O6q9J01k62K14
2898b1j4O2k98K83J06j31J57k06J55j78K50j87qN3m5L14m15M22l77K18M1j88M3
2921C6J08k34L15K0m49J57K45o9j18k90K88q6K52j61q6K13J02m31K63k54J78j43
2943a44L90j31J26j51j52K25k07q8J93k05k1J25R4j34k1k0K87N2l51J46j39K8
2965i8J57o3k14K41k63J53p2k44L67K33k01l1L2lk00K25p7m8J21j42J10j20J65
$$ y = [-66, 61, 20, -112, 139, -95, 51, 134, -105, -40, -34, -153, -273, -160, 86, 18, -146, -84, 14, -268, 152, 238, 34, -93, 162, -71, -163, 139, -306, -133, 364, 280, 46, -28, 39, -9, 122, 6, -133, 1, 7, 62, -209, -293, -169, 207, 15, -129, 169, -105, 32, 133, 145, -19, -131, 123, 25, 212, 102, 101, 238, -103, 4, 13, 135, 102, 14, -1, 167, 500, -223, 12, -130, 120, -30, 213, 94, -157, 5, 124, -138, -67, -149, -31, -216, -51, 15, -74, 27, -235, -21, -35, 27, -271, 12, 118, -13, 144, -62, 93, -85, 165, -22, -30, 23, -22, 292, -123, 299, -78, 140, 181, -7, 36, 144, -90, 225, 245, -204, -47, 198, 129, 11, -279, 9, -77, 175, 14, -72, 141, 243, -188, 75, -179, -1, -144, 246, 115, 241, 90, -62, 163, -44, -132, 61, -144, -165, -40, 54, -80, -101, -121, 166, 218, -133, 13, -126, -98, 59, -4, -218, 23, -240, -87, -159, -403, -36, 197, -4, -35, -3, -6, -206, 19, -58, -106, 15, -127, -17, -137, 28]
2988B8j44n4M0K52J09k38J22j67J75m03K09pk5R1r8J01j93Q1K75j34K4J7P6l08
3012a71L37l41J48l8Q0jq7J36j91N1j70L16l7r5L56l17PJ63k70K27k11J08j61
3035a61M3k10N23j27j38j24K78j91N3k3p6K80j28L27l35j01J05P3j32K09k26j15
3057a96K05rJ35N4j04j43O9p8k05K17J90j15K23l75m7K16m4j02m8J29m7L12n93
3080c56M17j35n2R0l6M2M7j95K35n4L8K7P7k80j32%L27k24K21N8j68P8K13j21
3104A17Mj74o6L99j97J60j69l3p8r0M6q0L25k89r5L67l06j42J88K2P1O5n81P33
3128A97k62J32j77K53r6p3K5k8j4M0J14k07k4J46J91o3j06k29N02l30J40J08q9
3151A50q7r6J38n2l75L64O7k25J9P6j6p7J69j94K08K0k07L25l27R0j4L5j78K19
$$ y = [28, -116, -170, -130, 122, 231, -7, 115, -52, 123, -280, -71, -78, -103, -12, -110, -9, -202, -121, 154, 20, 44, 61, 137, -171, 166, -175, -27, -65, 15, 14, -73, 63, -128, -77, -247, 69, 32, -63, 293, -24, -17, 146, -124, 103, -108, 0, -161, -118, -328, 195, 68, -70, -194, 84, -107, -54, -77, -153, 127, -1, 326, -9, -110, -5, 68, -64, 145, -81, -196, 9, 0, 135, 189, 85, -58, 11, -67, -272, -55, 135, 20, 243, -132, -179, 37, -7, -109, -157, -28, -75, 237, -356, 61, -74, -126, -36, -72, -30, 17, -178, 57, 3, 41, 68, 145, -135, -267, -267, 60, -164, 57, 115, -53, 25, 238, 117, 121, -53, -119, 280, 83, 243, 74, 41, -37, -127, -81, -161, 164, -125, -220, 147, -159, -301, -113, -91, -20, 45, -536, 197, -65, 67, -110, 143, 47, -26, -1, -29, -43, -3, 111, -96, -120, 26, 217, 154, 48, -181, 321, -9, 131, 239, 150, 63, -33, 105, 53, -322, 42, 109, -116, -97, -21, -37, -114, 55, -139, 69, 89, -118, 207, -120, -30, -44, -9, -187, 32]
3175C2O3j02j49K16l8j62J86m02J86L3K2PL1o9J80J76k40kj14M56r7j49J1K65
3199C40l15K6k3LL7l60J65J6J42k52J67J05j30j98K80j2j4o7J5J05j19Q6J7J31
3223A45l89R2L2o9P9J89K3n1K5k2j48J61l6N8j22rJ49l49P3K83k38L33j83p5J58
3248A09k7j9o5J91q8J6j20j06j26J67J80k23J80k25J97j24L1K62k44n9K67j91
3270a7J10l60L3M66j37J7n3j4J35k84j74L69j59K31j47j98K84k88J18J69j43n4
3292i6M22j27k03J51j34L81m10PQj10K89j92k65N6M84k68j10j48K87r9J38j30
3314f9J4O8j07J7j11K76m5N4j24j61N03m15L3j9j04K73l15M45l42L19l44K59j68
3337f3J10j11K1L37j77k54K14n9M7j74J20K31j86J3j82J12K89l34r3k5R9N8K24
$$ y = [32, 95, -7, -156, 60, 22, -140, 46, -356, -170, -137, -115, -108, -77, -146, 34, 210, -30, -32, -146, 310, 213, 64, 75, 340, 25, 51, 28, 31, 68, -292, -127, -111, 31, -221, -54, 51, -79, -277, 3, -9, -23, -90, -75, 30, -89, -3, 14, 145, -244, -152, -120, -189, -110, 79, 102, 51, 76, 54, -94, 67, 31, 89, -33, -42, 107, -242, -169, 114, -124, 209, 26, -49, 109, 82, 63, -2, 189, 101, 117, -3, -109, -235, -68, 112, -111, 69, -156, 41, -83, -52, 210, -34, -93, 174, -17, 93, -267, -234, 232, 95, 112, 59, 45, 180, -104, -278, 91, -68, 163, 16, -182, 102, -186, -68, 101, -42, -96, 326, 199, -4, 147, 13, 394, -16, -9, -1, -111, 178, -14, -279, -223, 261, -7, -117, -265, 22, -77, 61, -69, -55, 13, -94, -77, -188, 88, 43, 97, -27, -188, 315, -100, -67, -86, -190, 83, -232, 213, -129, 190, -154, 105, -63, 47, -64, -43, 294, 117, -137, 77, 18, 65, -109, 11, 242, 56, 69, -113, -1, 288, -46, -139, -164, -65, -7, 217]
3360B17k70o2j51J24Q6p7n9K83k5k03K07Jj58N1Q0nm8J98o3j0k95J81K27j7j71
3385D1L2ql96M63l36J77j70J63QJ83m02L73o0J0qq3J59j2j46J58j92q9K26r7Q3
3410G7p8R6l57K14k25J02J40J03j71J17l8m8M0J21MJ91l21j7J91j1k47J86k39
3433a70J82o4j35K56j18M6K28O5n84L13K4j88NN1L65j67k10j15Q2K05o3L36j69
3456A75k92Mn0L3Q6Q8j83P8l12O42k41m9J55l09P2r0j2n2J97j48M4L8L61m53K7
3481a91j58L34n8J58q0N7k7j05K39j06r2J58j26o2p3J3Qo4J03O8K66j37l97K66
3505fr8K0K1k9J43m8K07j27l02L51j01J15j28m3L2q3Q5j48J85K3N7j31M1%q0Q7
3531D3j73L65j62nq9j3J12j37O1j42M28m99K32j40J08j63J99J7J42j75j40M59
$$ y = [217, -53, -115, -266, -142, -56, -133, -192, 91, 66, -137, 70, 71, -87, -36, 44, 39, -9, 189, 126, 116, -179, 2, 229, 212, 41, 73, 65, -331, 132, -204, -27, -197, -34, -26, 157, -245, 128, 68, 78, 70, -13, 146, 134, -12, 146, -46, -135, 91, -6, 77, -1, 95, -262, -48, -273, -171, -31, 72, -99, 18, -20, -68, -28, 93, 97, 288, -33, -50, 141, 130, -117, 69, -170, 12, -52, -187, 69, -49, -3, 225, 290, -294, 19, 43, -145, -140, -89, 276, 109, -101, -216, -134, 71, 8, 344, 175, -117, -113, -163, -130, -44, 44, -139, -61, -373, 269, 28, -21, 134, -175, -103, -193, -205, -257, -60, -208, -164, -126, 235, -218, -191, -349, -15, -73, 85, 5, 62, 35, -70, 169, 63, -29, 129, 3, -59, -132, -119, -111, -175, -72, -4, 262, 125, -272, -6, -104, -84, -63, -92, 51, 3, 210, 83, -219, 132, 31, 146, 18, -25, 7, -76, 9, -139, 46, 69, 126, -5, 36, 36, -44, 43, -130, 235, 73, 68, -21, -34, 78, -59, 2, -140, 288, -211, 21, -119, -11, -174, 25, 42, 184, 9, -131, 328]
3553C28k10m6k26p4J22N6j6L1RJ11k12R9j37j0Q8J46M6j08J24J60m97K89j27q1
3577a35J94j19j64J63q3J25R4k14L38j20N1j15l3J29K59k62k39R8j21K54k3j06
3599b9l94N33k25Q7o0n7j70L20o4j37K23J22k42k27J70J01j5J29l12L43J70l99
3621a33L27k83j77M22j44J02R8l21Q2M9j56j08L90l77R8j20J59j14K77k73K06
3642Dm9o8K66k7Nj13m6J56j91r8L39j99K46j78o1j55L24l08L47r1j84K89k27J64
3666A45k63j66K51J76k10K48k29n1J37O7J48r9r9o1o7J34q3l9O2J3k40L96k17
3689d7K10o9Rp3J66l87j72L21N0M9o5k38M3K62J15j69j08p9J07J15K41q6k28N5
3713B2j28K21p6J31j70n8j8J14k7K31k18j36K15M4j30K57j03l15p7j05K35K5j7
$$ y = [328, 118, 72, -154, -228, -106, -50, -66, -35, -26, 85, -127, -28, -165, -175, -87, 59, 105, -3, 121, 281, -216, 73, -54, -135, 59, -60, -224, -61, -144, -19, 75, -139, 199, 79, 130, 15, -18, 111, 370, 108, -131, -33, -154, 100, 77, -29, -423, 110, -115, -28, -88, -145, -315, 5, -59, -196, 27, 149, -93, -320, -150, -49, -64, 65, -247, 96, 266, -133, 194, -89, -266, 156, 12, 114, 212, -109, -27, 22, -134, -242, 148, -229, -131, -251, -92, -206, 71, -202, 4, -45, -113, 153, 126, 131, 18, -28, 128, -63, -161, 178, -21, 225, 47, -14, -169, 155, -153, 194, 103, -81, 208, -19, 145, -118, -284, -33, 143, -67, 181, -48, -99, 38, 105, 253, 154, 55, -6, -73, 61, -22, -61, 1, 14, -226, 170, -47, 163, 94, 103, 30, 196, -191, -363, -42, 8, 57, -8, -246, -203, 59, 174, 5, -103, -182, -75, 40, 281, 195, -33, 22, -106, 115, 39, 170, 0, -58, -76, 38, 11, 242, 24, -112, 103, 147, 17, 274, 171, -144, -221, -326, -91, -66, -83]
3736h3K21j79j51J06O5j39J70J87k26J31n2M9j00Lp8J04o5j49NJ01k4L21k61q6
3760a30K15l64M36p9J0j84J66l8K6o9q3j8K53J0J08j18Mk62J69Q0J25l77j20N9
3784a81N8K29n0j73K92l20M59l93P1R8j29j86n0K74j73J72r5J84j80K36J84l59
3806c2Q1k60J83k67M34n5j87M34l00LL04k50j10M5Q9o2J19k39O1j53R5J50o1q0
3830e8K9j12L07j74k2j36J67O7R6k05L3j51k1K24L6L4r0P2J71j92k98L10m2P3
3854A18j31n0K4J7K74l25L09k74O4L0j41K1j3J20Mj7n6J8k15M20j92m1J03j62
3878i5R5K75n06L45k30K09r8J05P9k29K05j03J24k83L26k81j57K70O9l41K00L8
3900A7j01K69j33lK96m03Q6m3O6K04Ml73K73Rk93j00J92J18o9P9j73Q5M6l05J68
$$ y = [-83, 138, -41, -192, -86, -21, -160, 10, 197, -29, 102, 50, 99, -1, 2, -76, 28, -37, -186, -181, -80, -104, 217, -44, -130, 85, -279, 157, 78, 88, -96, 70, 32, 58, -11, -94, -112, 141, 151, 259, 141, 145, -117, 52, 132, 257, -120, -240, -181, -123, 106, 56, -117, 175, -145, 314, -79, -8, 90, -39, -225, -275, -1, -174, -2, -97, 87, -93, 143, 327, -32, 49, -211, -28, -295, 139, 84, -103, 331, 31, 34, 338, 88, -22, 23, 112, 50, 169, -70, -9, -162, -67, 83, 22, -58, -29, -141, 166, -8, -30, -166, 1, 68, 164, -41, -8, -159, -180, 44, 80, 114, 24, 96, 267, 75, -223, 87, 45, 118, -13, -63, -39, -22, 252, -73, 236, -38, 26, 56, -85, -64, -77, 43, 47, 30, -26, -8, -223, 197, 5, -36, 67, -95, 0, 275, -231, 114, -116, 93, -5, 100, 179, -50, 155, 52, 176, -107, 219, -62, -219, 51, 120, -221, -21, 17, -84, 185, 52, 49, 345, -58, 28, -15, 51, 255, 259, -114, 159, 168, -125, -225, -33, 85, 16, 95, -78, 7, 53, -252, -84]
3925h4p7J87P9j99L8J54n6%o8R2r4K65j15q7j64K8K04l90K42J39j02J00J51j66
3949G7K57k85m5K3q2J74l22K56r5J82l12J54k40L47K5j17L2p8L26l07J38k08J79
3972G9J83l29o0j91J35Q0J78j49K49n4l95J38L66j54k49J49j5q4J65k1J1o7j27
3995a62L19j42j38J00lL52k80q6K15k98K46J25r9j90j19N3O8j13K82j41J21p5
4017C5j15O4o8J12J9j9k38K30p6R6j08J99n51N66k66q3J20K25M8k19j22Q4J65
4040I8J68L9l63L9o4R1K81k72k35K16k08K42p4J32n6J48l9l52n7M66j24J41k53
4063c6J71k13L49j25k99L10l65P7R3J21k7j01M1J17J2l46K03L6L0L5o1P8j6J84
4087B68k66L1K8r5K05p4k17k4k1J71r9L3l0L7PJ48j05N0q1K7MJ60k43J39j60J48
$$ y = [-84, -161, 26, 105, -94, -56, 98, 42, 42, -26, 66, -28, 237, 122, 35, -129, -101, 103, -287, -45, 94, -8, 92, 243, 77, 334, 49, 4, 27, -55, 119, -203, 53, -42, 140, -172, -18, -258, 89, 114, -3, 29, -49, 277, -30, 108, -100, 79, 262, -67, -127, -318, -183, -103, 75, -74, 175, 121, -274, -136, 230, 76, -173, -24, -39, -123, 42, 21, 32, -35, -162, 157, 15, -123, -23, -26, 326, 46, -40, 175, -123, 123, 248, 149, -41, -160, -107, -39, -152, 130, -11, 110, 35, -80, -16, -84, 28, 47, 28, -210, 20, -56, 40, -68, 131, -420, 146, -120, -203, -83, 142, 190, -29, -151, -67, 98, 266, 305, -58, -19, -83, 8, 289, 17, -218, -2, -210, 32, -42, 90, 34, 182, 143, -209, -266, 200, 76, 217, -36, 135, -78, 271, 146, -153, 157, -208, -131, -38, 83, 56, -45, -4, 113, 125, -221, -18, 18, 48, 83, 22, 100, 84, 268, 2, 33, 61, -34, 171, 97, -120, -144, -165, 6, -93, -60, -90, -53, -46, 102, -3, 47, -34, -7, -3, 157, -86, 53, -107, 41]
4113D1Mk18L66l55K57l06L01N0j79J38Q7j91j13K68j93R4q9K03j5k42LK28k14
4136g5Q6mO0j95O6j70L45j61Q1J46l04K28k45J37KJ85l94L40k28J27j88j97P36
4159C78k91l00J54K97k60Mj85L99l79J37n7mK49n11K69J38k03M00l30j18K57o3
4181a9Mr6K69k56J68k21M55J7l96J60l00Q8L21l55K80k40K31j14N7k57J64J11
4203G1j2K47j42jP3k83J96l1j77k47M47j86P2j67K21R6k55j66K42J22j95J3J42
4226H0k25K26j84r2K93j80K15j6r2N8m9J02k5r0j17j44o2L51k36J18J69k13J07
4249fJ93k30j10L20m82K90j31J97K8K0m2m2o7k8L5J24P9j55mj50Q7m3Q5N9k0k34
4275b27L75m6Q9k09J42J5j91K75n02K16M6m0j39K44J62l4l03K00L4j05J67k92
$$ y = [41, 45, -173, 193, -162, 95, -211, 90, 140, -39, 99, 186, -5, -118, 150, -43, 51, -38, 165, 150, -92, -89, 139, -75, 11, 7, 67, -128, -62, -232, 113, -48, 33, 179, -125, 103, -142, -5, -3, 182, -212, 128, -100, 27, -161, -358, 378, 87, -213, -59, 238, -22, -18, -203, 196, -183, -46, -103, -107, 142, -369, -100, 38, -165, 235, -95, -213, 44, -19, -15, -111, 158, -98, 70, -151, 304, 321, -75, 85, -215, -127, 194, -161, 119, -121, 110, -4, 53, -204, -40, 71, 59, 306, 164, 163, 236, -47, 149, 118, -59, -306, 141, -45, 27, -140, 81, 177, -78, -244, -2, 120, -75, -62, 80, -145, 81, -103, -195, 98, -82, 133, 117, 25, 83, 34, 136, 111, 21, -96, -240, -302, 49, -187, -69, 100, -113, -6, 187, -43, -153, 167, -315, -25, -156, 41, 69, 89, 47, 5, -62, -90, -55, 69, 148, -7, -11, -161, -74, -117, -32, 27, 7, -227, 148, 102, 191, -18, 124, 139, -52, 223, -279, -63, -17, -57, -196, 48, 210, 176, -127, 73, 107, 2, 169, -123]
4297a23J91k2q0J32K6j73J45k07J20k51J46J38PQ7l7k41K03k98m3P4L06Q2l90
4320b08N5J33J58j06J21j85J04N1K5j13k02J50M4k6j0J40q0j33J17k19J87q0K8
4343d9L9J34j68J13k9K5j6r0K06j9k67J83p9Mj1J77J12j12k56K69l95R6L51j31
4367H7j45lK67l53K16J26l9l34J32J01j5J9j23K75l64K03P9j03M6j7j63m9L73
4390B16l18J98k06Q8M24n14m6J64J36l26J54L3J79j05j01J69j91M27n27J04j11
4411a53L9K40k7j02Q6j30J6P1K35k53q7jp9J79n7K07k58j13J51K67j76k5J31j77
4435a6j21J75n7J49N3j31p6j80M47l85L8J68j57L7r5J35N3l2J38m24K56J83lj04
4459E1j33J56j28P5J57N4j88M5k0j42K42m8o5k48J93k11K10j12K40nj3k42L42
$$ y = [-123, 68, 46, -34, 98, 124, -49, 96, -111, 9, -242, -96, 42, 49, 136, 99, -142, 61, -237, -280, -206, 100, 182, -208, -153, -20, 138, 32, 153, -32, 72, 123, 148, 35, -167, -17, 27, 1, -9, 131, 51, -82, 35, -184, 3, -77, -49, -10, 124, -44, 69, 40, 65, 49, -41, 165, 146, -121, 62, -17, -13, -24, 153, 265, 153, -103, 166, -229, -133, 218, 87, -58, -61, 206, -147, 69, 195, 156, -178, -46, 55, 40, 59, -64, 211, -153, 50, 129, 26, 72, 55, -108, -157, 216, -102, 96, -110, -22, 402, -112, -158, 6, 142, -184, -30, 3, 182, 77, -24, 145, -46, 381, -146, -42, -153, -114, 126, 99, -3, 83, -47, -31, 40, 275, 22, -65, -66, -145, 34, -23, 184, -74, -187, -36, 231, 55, 30, 161, -16, -137, 38, -19, 130, 183, 52, -24, -204, 243, -142, -104, 64, -93, -56, -151, -16, 37, 5, 143, -281, -25, 158, 155, 51, -82, 74, -54, 21, 178, 232, 44, 89, 69, -73, 169, 121, 56, -192, 1, -210, 0, -112, 128, 123, 110, -132, 210]
4482B10m4l93J00R2R8L1J65l88J12J17k7m09Q5L35J88l39L9J00l15N1L53k70%
4505a09j03L6J83j47J01p3J40j9N7j24l6J94R5j34J0J88l42J88k40J10Ln0J81
4528A09mo8Q4j29j28J42j42O7J09r4J83Jk72J78k0QJ15j9r7l3l7j10J60K8l25
4553b94K52p0R8J20k2j47N7K2J0j2J8j11K24j22j43J51ro9K85k75n3l3j04M78
4577B51l54J79j28j9J68o9l07L31J44l10N1Rj88J82r7K62R5l46K28J95o06L90
4599F1o5o0j70J26K00k66J17L48k87M7J14l4r1k26J91J05j90K04k52J97k31L50
4621A88j07j1K7k8P7k11j77K62o2k98K66j24J60k2L05k40M1l31K84K5J44k11J8
4644b5L5K9J8j34n8J94j12N5n2K29r0j80K1m58N10J93j30r2k33M99k42O1R1J39
$$ y = [210, 166, -227, -127, -35, 63, 94, 259, -129, -17, 100, 73, -336, -251, 84, 272, -67, -28, 72, -243, -192, 161, -109, -109, -212, -176, 7, -140, -39, -112, 28, 9, 66, -58, -94, 100, 195, 61, 71, 259, -83, 105, -135, -25, -22, -72, 109, 105, 37, 121, -8, -136, 6, -136, -69, 40, -54, 129, 130, -142, 36, 16, 24, 139, 120, 23, -10, -47, -157, 3, 31, -294, -42, -112, -14, 106, 84, -63, -6, 16, 26, 14, 32, -79, 145, 23, -120, 31, 22, -47, 238, -37, -90, -123, -227, 251, -103, 76, -52, -71, 97, 28, -279, 52, 196, -114, -63, -54, -242, -60, -157, 105, 200, -146, 82, 277, -329, 61, -4, -64, -234, -108, 92, -174, -57, 291, 4, 51, 165, 131, 40, -186, 5, 110, -80, 124, -128, 69, -162, 188, 81, 70, 97, 69, 146, -65, -242, 20, -42, -340, -74, -198, -38, -60, 245, 5, 46, -285, -1, 24, 168, -43, -25, 10, 39, 57, -77, -135, 59, -53, 2, -50, 179, 89, -91, -70, -528, -18, 175, 45, -47, -280, 219, -23, 38, 129, 268]
4668B68k51j25J27R0l4k21J83P1k36l8R0K44l12L08j41m8j46K01M1k45M63k31
4690E8l7k23J66j02L3K19q5R1o0lo8M9lj37J8J39j55j15K98j62N4R8m7J02p9m0
4716Ij76L43q3r4j2K9J42O2m02L30k09J21j68L32q8k94P5l9L8J6J03k1j57L7j2
4741a18J91j02j16J94J07l89J47j32K25j71K21L53l89j28o6K50q7O1p3j21J17
4762b6O5J04l27o8n3N08k63k3q7J9K35j70K00o5J8k25M6K02j75K70j69K18r9j62
4786b7N8L59j81j62J7J66j48m0j62N4J59j69L95q4k92Q5n0k7J90j90K26r2j71
4809h6j19L23r2K23n62L04K03m4k21R8k27L56k77P8j48m5N07j24j08n7L2R9j02
4832A1o8rk75L46l71L09L08j36j80qK84l99N4lL79k55R8J45k63J53O9l99L48k48
$$ y = [268, 17, -108, 19, 109, 75, -146, 37, 108, -128, -166, -76, 168, -144, 164, 23, -25, -171, 30, 71, -174, 289, 58, 21, -202, -36, -138, -105, 114, 29, 120, 60, 57, -11, 38, 35, -102, -84, 55, -100, -215, 83, -79, -25, 73, 26, 128, 49, 9, -167, 176, 93, -1, -13, 16, 158, 220, -182, 148, -61, 60, -108, 224, 136, -158, -83, -122, -84, -68, 35, 14, -143, -106, -118, 73, -29, -145, 49, 156, -233, -86, -218, 7, -164, 57, 410, 21, -107, -173, 77, -10, 51, -22, -143, -26, 39, 143, -184, -252, -305, 203, -60, -83, -170, -151, 84, -86, 114, 49, 67, -158, -112, 90, -85, 185, 16, 234, 135, -27, 31, 390, 209, 47, 64, 230, 82, 42, -120, -66, 93, -76, 319, 235, -57, 28, -22, -49, 141, -49, 177, 85, -86, -205, 118, 26, 249, -313, -9, 194, 150, -71, 27, -200, 156, -121, -43, -191, -236, 271, 147, 39, -18, 14, 113, 11, -57, -66, -341, 5, -366, -57, 251, 115, -65, -73, 211, -188, -134, -137, 242, -13, 85, 230, -33, 120, 189, -210, 138, -110]
4856a10K86j26j94J65j55M69l53J30j75J97M9N9k19k68L37R6O6m03K24Q9k04J27
4878H7p7q5l1J59j05J30j84NK2J26R6j01K17l00j69J98K33j56J33j77O5m02K02
4901a14M23n52R7n2J84L5J38k18K07j61j0K3j9j21L8K12j08j73K55p0k6j12J51
4924B7j46RN5Mj13O3K99j81J96J64m20N3j95K23J66k13j20j7l9L55o7k26n7J22
4948e8K22o2k02K7R4l8p0k00M14k37N6m2K31l4l24Q1o0K23k71M57k38l37M20k86
4972b34K91MJ39j65N0p2j05J32Q4O3k14r4K29j99K64l28j22L30j4J07l51J09l76
4995d72M51M7R9j92R2J29k67j12L6J56l0K6J45K9l41N17l73r4n3R1J23J0pJ04
5019A14N5n5l40L11m8j20K18r2J28k09j44J90k8j46J75N6o9n9K50k40J84q7j49
$$ y = [-110, 176, 50, -144, 21, -134, 335, -18, 112, -63, 134, 183, 242, 23, -245, 92, 188, 254, -149, 75, 164, -40, 87, 10, -75, -106, 53, -52, 78, -106, -101, -79, 47, 143, 42, 259, -41, -210, -12, 221, 65, 198, 21, 86, -316, -114, 309, -243, -146, -198, -14, 21, 159, -59, 148, -13, -23, 0, -19, -140, -102, 110, 2, -171, 84, 14, -12, -124, 27, -119, -110, -55, -51, -164, -101, 198, 17, 213, 377, -43, 10, -185, 38, 204, -9, -129, -146, -185, 170, 103, -123, -180, -58, 164, 102, -100, -73, 21, -17, -87, -287, 127, -110, -54, -96, 135, 101, -223, -142, -202, 21, -250, 207, -31, -368, 52, -234, 57, 61, 200, 35, 85, 13, -92, 40, 124, 187, -27, -121, 108, -91, 173, -155, -277, 53, 39, 146, -205, -96, -472, -21, 26, 125, -67, 25, 154, -113, -225, -189, -33, -63, -37, 108, 137, -204, 313, -60, -154, -207, -116, 7, 17, 10, 114, 169, 114, -226, 85, 37, -83, 135, 43, 171, -38, -182, 8, -20, -166, 9, 65, -4, -63, 187, -53, 131, 44, -105]
5042a05J57P4o1l29L92o5J26P8j85J45k65P9l3J83m0p2J0j49n0K1p5J87O3k00
5066a14K44k17J66j56k20L88j88J63j16K09j68q9L03ok5l97K07O3M9rk9L0k05
5089a17Q7M8j66J24m4K65j71J99l30J98k16K79L6k85j57K66P3q7J52p0k0j16M6
5112fj26K14L5l23K18j7j10J77l8k94J10J45J94k87K85k30k04L30l74L43K21l70
5134a07O5k54L27Q4J76l9Ll84j49J62j5P6J33m6r9P3j63O1K34j36k49K97K52j74
5158A28k36K63j63j42j63K42n2P6K65k75P7o3O0J68j85j53J21m8O9l69L46K06
5180A72j96O5r6L35j23k62L9J72j35J76j14j12L8P4N7l16L49k0j86J57k10K9K59
5203A52j16k28m1J71Q5J87k83L3J63J53k12k88K45J43j31k3p3P9Q9l17J64l9j31
$$ y = [-105, 52, 126, 65, -264, 128, 63, 189, 267, 82, 227, -38, 41, 8, 191, 151, 79, 89, -60, -110, -89, -164, 23, 86, -114, 130, -87, 79, -77, -297, 91, -97, 66, -50, 159, -9, -98, 205, 199, 174, -223, -16, 47, 96, 87, 58, 88, -117, -30, 18, -148, -24, -68, 197, 26, 225, -105, 93, -123, 156, 192, -93, -250, 16, 89, 2, 154, 84, 64, -52, -6, -132, 82, 117, -206, 12, -5, -115, 62, 24, -270, -160, -15, 179, -108, 177, -53, -257, 73, -301, 42, 263, -107, -42, -296, 31, 115, 291, 252, 255, -129, -278, -116, -131, -55, 78, 32, -67, 6, -157, -96, 138, 2, -247, 50, 302, 128, -108, 155, -8, -150, -313, -71, -123, -47, 218, -57, 20, -43, 17, 185, 0, -153, -32, -80, -11, -380, -34, 172, -24, 41, -55, 280, 157, -105, -66, 106, -29, 147, 33, -79, -41, 33, 90, -226, 123, 103, -83, 74, -136, -107, 152, 36, -192, -233, -62, 23, 210, -73, -40, 123, 276, 64, -224, 21, 164, 33, 10, -63, 16, 105, -212, -48, -87, -218]
5226b18J76N2j28K61j8j82j83R6J57k0M3J96l12j02K2R4J41l23J44QJ88j18p1
5249i7l0L58j80m3j7J11J27k92j58L58q0m2K56j43k5j85J90q5j86K25N4oj81J91
5273A20J15m55J16Rp1K31j27r7J13j29M5l6k3J65L00l60q4J18l1j87O1J13K30
5296A36n5m0j00j04r8K54J40j29m5J54K3k58J67j84qJ53Q7j26PJ70p0j25K03j27
5320B5j87K1K94j93Q4j07o1ML6J44k70N0K02q2K18l4j06j18J99k0J2P7k48J49
5344H9j69J14j65J96j56J79r4o2M7M47m33l6J95j10j24K5R7J97k99O8q8J54NO8
5368A45j91Q8l05K02Q3j63L91r1j04m3l84M21kj16k8JJ97k14rJ17J97m06N79m48
5392h3K11j65J05lr7n4%M38k84K5j53R6j43J37n9M7p3k34K33m8K03l5l55N06j72
$$ y = [-218, -42, 10, -118, 143, 125, -57, -240, -144, 13, -7, 36, 232, -80, -182, -160, -66, 75, -248, -104, -96, 92, -26, -97, -127, 231, 51, 8, -9, 102, 229, -63, -221, 137, 57, 15, 271, 128, 103, -82, 108, 23, -163, 62, 116, 110, -71, 120, 235, -220, -104, -95, -166, 65, -62, -159, -46, -175, -130, -166, -189, -24, 276, -84, -168, -50, -81, -268, -207, -94, 136, 81, 41, -59, -163, -261, -7, 133, 4, -41, 113, 136, -122, 45, -139, -147, 6, 93, -33, -26, 144, 74, -51, 152, 25, -162, -141, 153, -40, 44, -63, -124, -120, -84, 60, -210, -160, 42, -40, 178, 144, 38, -80, 119, 99, 111, 188, -60, 89, -80, 34, -131, 65, -91, 88, -6, -68, -21, 426, -7, -43, 152, 42, -82, -57, 40, 237, -62, 6, -82, 72, 77, 145, -46, 42, -263, -61, 22, -141, 250, 159, 55, 12, -372, 49, 47, -69, -97, -96, 101, -113, -122, -5, 192, -214, 365, -83, 128, -37, 68, 65, -32, -86, -86, 352, 68, 93, -60, 36, -107, 30, -29, 18, -55, -289, -56, -104, 99, 64, -291, 215, 43]
5417D3k22j94J51J54J62q1k20J11J87j81l9K45j6J75k54J57k48J88j20Q4J13j06
5439H9r5N4j4k09K6K8Q4M6L7j11J32J69k59Q9J40k04J87ml24L28l21K47j04Lm4
5464c0m8M8l24M25p9J91l70R8L33j92j09J05k82L92k62n2K0J33J7q2q1K97j66
5487a8Q1Q0j26p7j04L66l82K58p1n2Q1m4l9j80J92oR9r0J15j34J43j54NM1J60
5512A44J61k94K4j20O8O1m09N05M9J4l19K84l73K37J58l01J51Ol5J97l2j49p2
5535d5r9M01k31l5L4j44n0Q2L7J03l43K83O3k98K14j38M45k78K40q8j35o2o7j53
5559b64P1M76k98O7j95K56n9j05k3n9K84k54L12j30n0k95M69j41k46J58k4J81
5581A31j00j32K45k82M51l92L1k25L78M3q8J69m22J34j17mn1M73l17J00N1j1k75
$$ y = [43, -179, -373, -222, -68, 94, 13, -207, -96, 91, -90, -129, 116, 100, 275, 21, 178, -70, 118, -2, 82, 195, 89, -6, 48, 34, -175, -149, -121, -37, 9, 46, -65, 67, 236, -23, 66, 206, 2, 189, 185, -139, 189, -132, 115, 11, 14, -30, -78, -30, -354, 71, -8, 183, -187, -89, 244, 52, -57, 48, -234, 158, -104, -156, -136, -3, 14, -68, -149, 148, -18, 63, 143, 17, -60, -164, 202, -180, 78, 7, -45, 36, -8, -47, -227, -35, -41, 58, -32, 83, -51, 92, -62, -57, -16, 144, 305, 11, 35, -85, -17, 44, -365, 140, 189, 203, -116, 168, -205, 32, 190, -111, 40, 46, 11, 208, 176, 27, -45, -144, 257, 26, -9, 25, -119, -169, -87, -50, 53, -290, -7, 56, -242, -28, -166, 279, 1, 241, 153, 18, -44, -111, -264, -193, 283, -15, 52, -143, 113, 54, -51, -74, -133, 151, -103, 209, 79, 29, -266, 203, 62, -184, -26, -50, 131, 31, -101, 144, -138, 313, -79, -48, -273, 105, 148, 60, 229, -193, -59, -176, -180, -231, 242, -75, 25, 76, 65, -210]
5604b10R4J31j86K75j89J18j2j95J25O7k21M50m25P5j36L58J3j76J13q0k16J38
5626h9RK47k54J51o3k7q4J92j56J84J34l70k2m9M34J38n33P9L45m53J39K16j73
5649eJ2j39K9K83k7j40R9m06M82j18j32k2J51Q8q2o1J19k8j1L2k71K05N7J12j45
5674H2L3k08n9K45j55L5N4J7M2j75L68k31j59L15l5j86m0j05k05N32k96K93K14
5697C76n65K93j62j0k24L25M3r4k0k49M8pL00l48K46Qo0o6L32J42j72k44L33j43
5721H2j09J74m4l3k5j98K64n4J1k62J63M8J46l08J61rJ41O5k8k77O2J10p1J62
5745A71k59J65p1q0l9KJ4R1l0kK43j70l6K31k55j62N5K66Kk14l1j24l9L64oJ99
5771B85l54Q9Q3k63M44j96j35m4M8J74k77K18m61M30J37k39K39k69J2K59j67J04
$$ y = [-210, -116, 15, -171, 104, -85, 33, 21, -174, -49, 18, -203, 247, -178, -103, -239, 119, 132, -44, 69, -11, -227, -89, -80, 167, -87, 64, 1, -26, -110, 82, -74, 110, 244, -126, -148, -197, 237, 375, -158, -79, 266, -187, -48, 168, -5, 7, -132, -103, 180, 153, 13, 112, -294, 188, 70, -62, -84, 67, 155, 73, 12, 131, 103, 92, 124, -147, 58, 115, 227, 82, 115, -93, -152, 93, -62, -27, 27, 44, 86, -89, 279, 48, -111, 204, 169, -17, -57, -162, -367, 165, -131, 162, 376, -189, 104, -58, -68, -292, 33, 76, -18, -38, -287, -239, -246, 54, -294, -48, -40, -100, -166, 166, 308, 136, -108, 225, 82, -27, 147, 103, 70, 45, -153, 111, 57, 68, -194, -31, 17, 163, -145, 16, 7, 148, 213, 185, -92, -30, 80, 9, 171, -88, 77, 6, -74, -113, -111, -97, -6, -36, -38, 205, 35, -1, 230, -25, -187, -132, 134, 136, -78, -109, -233, -272, 92, 86, 285, -69, 20, 103, -160, 284, 88, -47, -91, -43, 131, -146, 72, -389, 41, 178, -61, 178, -91, -79, 180, 13, 117]
5793A17k86J70k21J33j03M69k31p2o6L0K33k11J84k66L07j0k22K27k70l2M91l74
5815cjJ03p3n0K46j67M4k79k4K40k1j12K3J32q6j72K99l7k01p0O10m27K10j98
5839a4k32Q1J37K3j44L19K8k42j06J28l8J88j58K22k45l7j1J19k8R8o8J18M8j91
5863eJ32k95J27qJ87M1m33J44J43K31j99j40O2Lp6L47m21N9k2J43l22N2M49K4
5887B23k58Ko9MJ62j52J19%m5K27l51J87j12p0L90k59K04Rj79M7K0J13mq1j74
5912d7J55o3J2N1j15J00rq9jj17Q8k60L26k10O2P5O8R8k48J78Q7j20J0q5mK20
5938A62m82M77k10K07k13L46j96k9%l83L50j1K69k16Jj13Nj67K35k34O9J87j82
5961a28J20q5L23j67l8J2k59QJ48Q0j98R0K36j99J0M4P8Q1l68J84K7P2R9ml03
$$ y = [117, -169, 1, -220, -87, -190, 279, 48, -24, -90, -60, 173, -38, 146, -120, 187, 177, -45, 182, -88, -120, 371, -3, -4, 99, 26, -24, 222, 55, 99, -180, -204, 36, 15, -97, -74, 58, -28, -200, 99, 62, -139, -209, 401, -26, 184, -14, -246, -165, -28, -5, -149, 170, 198, -44, -150, -22, -60, 128, -30, 192, -53, -90, -101, 18, -10, 88, 20, 138, 186, -5, 127, -168, -41, -49, 138, 179, -254, -110, 33, 264, 65, -75, -13, -10, -86, 261, -160, -101, -123, 20, -302, -250, 199, 223, -35, -33, -102, -98, 64, -88, 31, 31, -14, 213, -138, 49, -63, -133, 257, -2, 202, 211, 32, 79, 99, 212, 208, 127, -47, 108, 45, 57, 108, -7, 93, 84, -5, -6, -123, -35, -295, 31, -179, -117, -42, 26, 124, -124, 54, 141, 21, 31, -54, -58, 162, -320, 157, -53, 154, -59, 287, 91, 62, 62, -321, 29, 18, 287, 71, 72, -41, -36, -203, 32, -202, -133, 54, -128, -8, -93, 230, 63, 25, 37, -222, -214, -66, 14, -184, -94, 142, -57, -47, -3, 75, 156, -212, -28, -1, 71, 170, 166, -137]
5986a37J62m4J5j15K0L49k79N1j28K76r2k01j10K57M1k96J65Q3J1O2k30L24l24
6009a40M09q4J28k33q7J16l79M92l02k06K69j03K09k14O1J52l4J23k46J80j5l8
6031E8l38K5J24K14J70n50K50j31N7J68k51L50R7j39k30O0mJ36j63J15J42j02
6053E8J16j05k0l50K18J23j33K09j05j6l6j6R8j54n0J52p4K11j6q5N0m3K3N9Q8
6078B02m10J88R9o3j25K16J8P1k37R0o3P5o2j24L22j96L03j99n3j50K09k06K92
6101A97m0L7k36N1K47m87L07k7J8j47J16j0K21R8m51r5j1L80j70k17L71o8j22
6124c8J20k24q1L23l7j1O9N8l59R0k24N13k69R5J02j51po9M1N2P0k79J50Qk4j04
6150a86L65n7J80k98K68l47J02k5m3mR4J28k31J07J1j68L1J61R6K5k55j5J51k81
$$ y = [-137, 25, -19, -4, -119, -99, 250, -29, 22, -106, 170, 78, -123, -233, 24, 65, -231, -66, 17, 28, 90, -140, 184, -140, 269, 185, 313, 80, -7, 109, -270, 222, -80, -286, -17, -120, 89, -125, -64, 88, 54, 177, -69, 111, 96, 58, -280, -255, -131, 83, 253, -297, -47, -178, -121, 47, -204, 146, 243, 104, -126, -66, -70, 66, -97, 18, 160, 58, 174, 69, 49, -301, -83, 40, -93, 116, 11, -5, -41, -57, 41, -113, -163, -11, -85, 126, 110, 25, 75, 32, 55, 114, 202, -208, -20, 79, 16, -109, 107, 125, 196, -41, 49, -14, 61, -1, -125, 197, 1, 304, 105, 52, -98, 111, -95, 197, 157, 194, -42, 9, 256, -231, 76, 49, 67, -80, 36, 26, 247, 345, -106, -201, -212, 168, -2, -219, 152, 84, -38, 82, -142, -223, 100, 63, 52, 121, 179, -180, -90, -314, 199, -70, 25, 127, -24, -31, -100, -59, -7, 63, -216, -66, -58, -82, -186, 179, 122, 302, 4, 272, -75, 27, 2, -41, -45, 49, 177, -54, 53, 64, -104, -73, 88, 184, 209, -46, -61, 90, -191]
6174a91J22K34l09K63j34j5j35K47j70J78k52J17m4O1j15M43l12k16N80o8l16
6195c2J40O6j77J62K0l23M33l21K15k10n3J97K8j23j51L70j64o4r5M65k45l46
6217b08J16J87j87K43j71J07j40J5k0k8J49m2L9J4J51j28j03J94j18n3M2K8j02
6240a5K49m26L15j02KO4Q4m3J19j61j81K18j68J77k29K92j62k90J51J64j30N2
6262b0J92l56jJ22m2R3J67k22R6M1j82J7L26l78K66k37J19J76O6q9j88j69j08
6285c11N06k97J74K96l17j33J24k75K15J36K7jk91L05j30K83l69q2K53q5o3r9
6307a34J35j39R7K0O4Q6l78L15N0O2j12j61J93j13k0J57J99m14J39r0j4P2l15
6330c01J20J46K16l26o7K59j57K04K87m05MRK61l57P4P7l92N50k46K3j02R5j96
$$ y = [-191, -69, 165, -144, 119, -15, -30, -165, 82, -88, 90, -162, -45, -89, -28, -143, 300, -12, -228, 352, 284, -32, 108, 174, -3, 159, 179, -144, 289, -32, 183, -27, -80, 117, 145, 22, -129, 241, 77, 13, -82, 383, 138, -208, -92, 95, -92, 151, -20, 87, -53, -38, -58, -86, 63, 21, 60, 74, 225, 97, -6, 188, 70, 17, 59, 87, -15, 234, -192, 123, 21, 23, 87, 171, 128, 247, 86, -95, 123, -45, 132, -97, 195, 33, -257, -106, 58, -72, -20, 172, -184, -185, -63, -105, -12, 155, -67, 29, 70, -112, -95, 231, -147, 119, -118, 1, 177, 243, 154, -34, -203, -311, 195, -102, 72, 368, 51, -82, 42, -233, -18, 118, 145, 144, -147, 158, 28, 311, -58, -140, 113, 28, -35, -134, 1, -138, -41, -21, 43, 129, -249, 66, 116, 178, 66, -95, 98, -15, -35, 122, 321, -93, 46, -44, -58, 14, -301, -181, -35, 181, -145, -212, 47, -110, 94, 381, -24, -20, -11, 250, -107, -33, 44, -348, 202, -44, -21, -123, -28, -224]
6353b24L51lk09r9K25J48j91m4r5J68l83J35LL24k91M6J21K75m35J94j2j56K16
6376F4j48j9J27k66M62P4j10j54l4J33m37P3K61J52l63N5L26m3k86K82j13k73
6398b37M15l90lL55k49J19R5j39J33j61J19L2j94k13K27J78n9l4M14l09n22O02
6420A79j61j55J83j49O1J50J21j33k56J98k66M26o5j86J55L7j76o0P4n4J48j66
6442i5K01m07J51J58J85l7o7k17J14m7m1J38j81J52R3k18j10M89j71q4j64K09
6464E1Qj81L03j29N6n8Mj51Q6R9j43J97m19K16M1J65q8k02J60r1j29pJ79Q7r3
6489c9k01N66j12R6j66J44l02K80k40J62K1l55N8j4J33n7K31l25L02j63K7J02
6511A48j10j91J91J4N4j95K07l78M40j06Jk94L91k13m1K75r5j44m1j50K35Q1J76
$$ y = [-224, 127, 124, -85, -184, 41, 189, -2, -46, -141, 27, -356, -221, -218, 106, -185, -139, -18, 257, -178, 16, 4, -152, 64, -84, -103, 24, -242, 220, 294, 184, 30, -4, 129, -308, -235, 26, 178, -185, -130, 196, 153, -133, 149, 36, -237, 178, -212, -215, 140, -109, 10, 105, -34, 99, -62, 57, 89, -105, -318, -91, 87, 28, -6, 408, 99, -423, 179, 18, -137, 46, -103, -42, 108, 229, 96, -160, 38, -228, 198, 133, -53, 102, 139, -37, -97, -23, -77, 71, -95, 106, -301, -150, 8, 193, 156, 89, -128, -14, -61, -102, 36, -145, 7, 100, -118, -228, 261, 90, 6, -158, 51, 59, -122, 181, 52, 108, 50, 54, -97, -11, 88, -55, 142, -277, -61, -20, 145, 57, -145, 15, -76, -205, -212, -33, 54, -39, -240, 326, 214, 310, 144, 288, -14, 266, 26, 188, 209, -146, -88, -102, 31, -26, 205, -120, 182, 19, 46, 148, 38, -153, 38, 52, 106, -89, 118, -260, 180, 74, 75, -219, 172, -41, -82, 193, 98, -46, -87, -237, -2, 79, 255]
6534B55q0m93M13j62r9j11N43j33l03J25J94k78K62k65J03K71k25P6j23K94q2
6555A82k0j6l28K36k5k66P5J9Q3J83k23j32L28o3J04j35k2j60O1M2K2j71N06l65
6579h5J6L8j65M7P6N4K11j01m3P3k37j69L62L3j92J27Rn0k51R0K18r3J8J44j24
6604Fo4K12%k43Q0K8j37J82j45J31K6L7m0k31J17K58n08l3L91j36K08K4n5J3m5
6629G6j33J03l4O3q2j10K25k1N9j54j95K61O4j09L21l56J3j64Q6L2L02j75m09
6652c37M42k37J64M4j18K00j58m9J7k4M7J97j65L7P0J73k53r1n1j62N62j79l8
6675I1p2k29J87J98l25J84Q1r1Nl39L04k1J03n0O9q5N2L6j20M8R0j80O9j53NL20
6701A77n2j64j35K35n0m0l9J84P8m64L02j09J06j69M16j05j64j8RP1n7J00j27
$$ y = [255, 175, -318, 95, -67, -166, -277, 266, 133, -170, -45, 149, -129, 133, -132, -29, 242, 17, 93, -30, 264, 182, 162, 146, -182, 54, 29, -237, -162, -143, -60, 123, -100, -232, 96, 33, 137, 2, -20, -180, -119, -77, -55, -226, 280, -85, -69, -31, -196, -149, -73, -19, 192, 91, 48, 121, -116, -285, 77, 110, -82, 45, 54, 4, -247, -157, 61, -32, -14, 130, 6, -58, 154, 154, -89, -9, 19, -118, 64, -81, 50, 76, 113, 73, -158, -41, 217, -291, -324, 67, -69, 139, 163, 108, 121, 76, -57, 46, 12, 75, -7, -117, 108, 87, 146, -8, -203, 58, 122, 13, 334, -22, -9, -173, -87, -55, 247, 72, -337, 105, -132, 32, 76, -42, 158, 0, -49, -32, -56, -9, 188, 23, 60, 130, 303, 50, -41, -92, -254, 308, 129, 91, 19, -210, -23, 175, -150, 34, 115, 24, 29, -310, -6, -27, 76, 26, 95, 10, 62, 98, -22, 26, 116, -64, 5, -148, -143, 177, 125, -39, -174, 61, 11, -29, -68, 116, 194, -270, 32, -77, 29, -140, 276, 171, 7, -11, -2, 69, 12, 112, -15]
6724a5K3ml5j4j88L42k47K87k55L25l46J30j50O0j8O5L39l99J44P8j92l7K76o8
6748A01j43k2L4K05k37J91M4j44O7l30N3J89j1o4j28o6K80J17l77J53K94j03j99
6771i6o0J28J26j63j51M04l10m5L66k60k6J66j13P1L51l57J49k0j91q1K98j68
6793A8n3K15k55J46p1o4k9jJ41J75m4k23K05j08j58K11j34j4J78r1j66M0K21l04
6817a65PK67J15j80q8p8N1m5j88l1M71l12J97k0o8M2K97m47K94j41R8q8q2J70
6841G6L0k53L61n37L26J59k89J40j35O1q5K08N5j30LM3n1J51j25j3j4r7pK01j57
6866g9l8M6K59k60N9J33j07N5j78jJ70m71M42m1M3k08J75k15J37R4L88p63L59
6889aK79k57J89k55r1J48L3k47K25JJ0k00K59J62j85p1J57l27K86%k16J95o5k41
$$ y = [-15, 8, 4, -31, -45, -233, 109, -138, 149, -106, 219, -127, 3, -147, -87, -105, -40, 299, -100, 44, 122, -70, -107, 169, 101, -42, -64, -30, 175, -62, 129, 173, 29, 96, -234, -181, 8, -3, -67, -195, -261, 19, 136, -241, -88, 206, 103, -96, -156, -28, 98, -65, -216, 188, -122, -167, 199, -61, -87, 79, -34, 37, 388, 31, 180, 160, -31, -112, 186, 18, -35, 180, -75, 71, 0, -64, -93, -94, 47, 222, 178, -45, 160, 52, -106, 105, -29, -43, 135, 44, -122, -82, 139, -165, -158, 109, 224, 44, -44, -122, -71, -116, -304, -335, 136, -176, 21, 1, -67, -25, 272, -175, 119, -22, 76, -12, -94, 76, 106, -147, 214, -323, 3, 162, -127, 13, -122, -61, -146, 62, 117, -13, -10, 33, -18, 133, 8, -5, -19, -116, -123, 78, -79, -117, -71, 188, -72, -13, 120, 13, 68, -110, -111, 59, -412, 30, -11, 32, -176, -1, -216, -79, 15, 403, -360, -1, 278, 21, 210, -45, -136, 12, 45, -202, 23, 24, 34, -166, 93, 255, 70, -1, 156, -171, 115, 115, -101, 94, 29, -212]
6913b12K75J14j71O1j59Q3j9K27l31k1K71l8J6o1j63K71l88M08j72l6k9L1L24
6936B81j90k39K43l71J86J70L4j51l7J27m5J87k69O7O5j18j18J65J06K81k80j14
6958b0O4O8J13l07O6lk44M41j79M6j4L67n33K0J06L32k37k12L94n43K30p8J5n4
6982a62p6P9L03k00J44j10L5j03p7n1K90j28J43j82M10l82J07j54O5J14k77Q8
7004a24J7J72N4J20k31Q8L6p3n6J26j53Q9l40L35K9k37J95K6j36J6r8J36J90k86
7028a05K44j63J48k51K24Q6k57K9K27l23K92j25J24j88L7KQ1j5J3p5K75k58j71
7051a49K16P7l78J05j64L73r8p1J43j32o4K60k97K37l9J34m8O8p6k21K4k73L00
7074g3L30l92J7J61o0K13o8j92k30J04RR9qJ09O9p4m5k1n9PK0O4J42l41K66j26
$$ y = [-212, 63, 177, 6, 67, -92, -9, -28, 199, -132, -153, 118, 80, 96, 35, -128, 143, -245, 163, -9, -45, -74, -43, 281, 91, -148, 95, -276, -90, 80, 114, -37, -74, 53, 8, 195, -74, -7, 58, -60, -178, -13, 93, 374, 94, -20, 44, 112, 225, -82, -16, -19, -263, 178, -1, 45, 31, 398, -135, -115, -9, 323, 86, -126, 268, -275, -45, -123, -108, -162, -238, -159, 144, -56, 88, -22, 13, -90, -167, -218, 72, -56, 87, -95, 315, -67, 40, -114, -49, 65, -212, -124, -107, 65, 119, 239, 8, 96, 132, 59, 3, 129, -24, 65, -275, 60, 89, -148, 47, 73, -63, -47, -145, -9, 181, -105, 139, -24, 124, -127, 97, 183, -74, -45, 182, -141, 151, 26, 150, -38, -1, 1, 82, 67, 80, 5, 280, 22, -149, 67, 144, -234, -129, -293, 80, -18, -89, 54, -78, -142, 118, -179, 58, 19, 153, 105, 173, 97, -124, -100, -373, -73, 257, -135, -118, 43, -17, 196, 128, -64, -294, -190, -181, -82, -90, 19, 88, 14, -31, -52, -111, -104, -84, -20, 122, -219, 47, -79]
7100g9r7L92j46rj6m13L74j51L24k11M2L4M3M4k19J73r6l1K72N1j31j06J40k88
7124a04Q2k07J44k8K04n1j56J79k34M12l47M1J07o6k64L55k04K09m0k51J24K27
7146A32J86m38J25j83K36J78l31M5p7J34L7m2K34k70N0J44k12o3P8J22P6j74r6
7169a09N4K56m04J03O4j53J24K06j97K77k56k60L74j10J17Om7Jp1J45l9j98j8
7192a35M35m31r8L39N2O3l61J00P3mJ11q5k31l2J47K39k10kK7j51K71l03J59K71
7216B44l38M7o8J46k25J15K05P6m93K86M36n23K67l49K57K6K04k07J76k83n9j5
7238g5K83j83j2P5k16J30m9J11J46l64K27L7k30J65o1K47k10j31NQ1M7o6R0n0
7262cj06L0j35K6J87Q3o3k88P4K24J50k4j09pk30K55l4L3o6O6o2j3p3J29R6O3
$$ y = [-79, -176, 216, 70, 61, 45, -368, 6, -145, 179, -32, 10, 44, 87, 131, -88, 85, -11, -42, 230, 281, 150, 44, 184, -104, -22, -229, -85, -113, 91, 40, -116, 63, -171, 241, -106, -65, 42, -24, -288, 67, -137, 72, 32, -219, -95, 132, 318, -120, 5, -178, 58, 236, -95, -50, -127, 7, 44, 2, 236, -34, 16, 160, -52, -115, -37, 85, 161, -13, -109, -55, 201, -203, -100, -36, -189, -65, 141, -56, 221, -35, -295, 79, -31, 86, 92, 45, 46, -25, 120, 81, -117, -135, 300, -131, -229, 110, 162, 225, -136, -36, 37, 33, 144, 59, -172, -204, -57, 182, -28, -30, -3, -154, 117, -186, -27, 244, -94, -47, -115, 31, -194, -79, 126, 202, -291, -5, 431, -92, 175, -174, 83, 109, 313, 106, 282, -1, -60, -75, 208, 25, 13, 88, -128, 2, -47, 64, 210, -154, 73, 110, -120, 45, -16, 231, 21, -110, -105, -24, 23, -43, 47, -3, -109, -79, -214, -188, -1, 82, 19, -269, -195, 29, 179, 155, 46, 39, -191, 64, 30, 63, -3, 63, 1, -12, -85, 44, 140, 203]
7288B03j58J66n02L93r8k28M70j79n5K31l79J1J35P9p1l7K9l0N9J55k60l06J77
7311a95J73k2J64p5j29K61l48j20J75K63k89M56j33M7j31kl61N37m55K31K00m87
7333b40%K50n8K93k61l9J26l26L53r6P7j66J32K87k99k4j42K47J8k43J37P0n71
7356d75L92K24l10J53l1j0m45P26j25k18J01k75L50j53p9M2J19j60L19j43j09
7377a07K29k59J91J06k81K40l31J20K2j07L8L66l31J99K48m35o8L17k48j4j7K30
7399A08J19J40l98J64j27M9j28kK16k17q5L07r2J16m59K61J67l20K41j66R1j49
7421a64Q0M3K53k13j70q0K13p7k09M74l6l08L23j06k02K02k26L19n4J38l06m2
7443a48N2K0K84l51K12l90K90J4m6J72m6m0p0K31j38k9J30j50p5J62J09k92Q2
$$ y = [203, 45, 211, -291, 102, 4, -224, 246, 67, 12, 243, -136, -125, 10, 89, 18, -19, 10, -20, 39, 194, -66, -372, -195, -22, -44, 120, 45, -84, 177, -171, -291, -116, 147, -142, 314, 181, 228, 97, 95, -266, 271, -184, 47, 247, -240, -240, 10, -48, 245, -16, -55, 71, -255, 98, 2, 79, -87, 45, 332, 33, 9, -133, 114, 132, -111, 26, 96, -475, -83, 141, -169, -16, -47, -57, -502, 224, 99, -119, -18, -293, 57, -96, -175, -133, -14, -174, 145, 2, -107, 122, -137, 54, 160, -121, 119, -212, -92, -70, -177, -139, 227, -104, 95, 343, -92, -160, 157, -91, -105, -122, 108, 227, 367, -31, 133, 6, 55, -73, -75, 141, -76, -161, 146, 54, 170, -289, -28, 139, -181, 60, -106, -15, -164, -84, -41, 212, -1, -171, -251, -38, -115, -324, 150, 114, -194, 129, 23, -179, 23, -203, 116, 62, 200, -106, -148, -96, -76, 208, -143, 69, -321, -31, -17, -63, 109, 63, 23, -47, 184, 46, 17, 147, -3, -78, 84, 193, -99, -17]
7466a7n3J0K51O2j23l26J89j8K25k11J59j46K39j43O9j18m4j54k4K25j23j49J57
7489f3R5o4J3j4J89j60M2j16L12n0k58J61p2k9o9K53j72j58m7K46q4J79L9k01
7513b8K14Oj83J08Nj53K17j23l10L29k58Q7l4K04J29l02K55p3j11J8J73j8j70
7536a8j34j27K83J58j94jL1j87J98Qq5j77K69n7j61N1Q0j67K1K39l3P9K8Po3l0
7562A8n4J93k63l22N63k11O9J38Kl32K63k0rJ35Rm01K61N2q7O9J06j86J89j20
7586F2k23K13j22N7m3j50J27R8j27K76l09K14P2p0PJ81k34n1R8P7K3k66P5J73
7610A58l02J48r3m4L34k71J47q6j56K93j37j8J72j20k58J63K43k75P9J4O3j6J1
7633D9j61k5Q5K0nJ04m7M9Pp9l2J05j56J75l57L89l1r4j28K26j12j9K70r1J73
$$ y = [-17, -70, -60, 191, 253, 130, -196, -7, -25, 200, -11, 148, 2, 241, 98, 167, 49, 5, -149, -173, 52, -71, -220, -63, 32, -32, -19, -33, 156, -4, 38, -78, 234, 184, -74, 87, 15, -14, -83, 170, -2, -160, -207, 39, -45, 134, 173, -28, 186, 192, 9, 117, 122, -31, 186, 63, -247, 82, -176, -89, -123, 81, 210, -92, 163, 90, -21, -3, 170, 152, -18, -152, -279, 4, 162, -32, -33, -2, -189, 9, 17, -68, -245, 24, -33, -194, -143, -63, -230, -209, 30, -3, 76, 104, 111, 48, 18, -36, 157, -106, -428, 135, -76, -7, 131, 133, -199, 64, 44, 35, 170, 179, -222, 39, 91, 4, 73, 179, -7, 182, 62, -161, 52, -70, -13, -56, -206, -79, 19, -108, 168, -141, 73, 145, 75, 82, 263, 29, -22, 76, 153, 176, -90, -15, 158, -144, 4, -89, -133, 201, -70, 77, -9, -165, 128, -9, -27, 145, 25, -233, -70, 173, -102, -23, -9, 54, 38, 49, -112, -137, -52, -32, -37, 67, 20, 69, 76, -3, -35, 70, -86, 89, -268, 121, 90, -4, -132, 94, -18, -37, 233, 142, 315]
7658C15o25K77n3K07o4p7j9M2j41J88p3R0j27J58K5j29p7M78m96j16L34q2q4k00
7682b49K27k21L32j04L43j60k38J20o7l0O0K8K66j80j23Jj58L04p7l73K45j24
7704a78L67r1k33M2R9Q1R3m53K98J36J4j37j8M0k44K16n3M8p4J84k78J59j21J35
7728C2L7j90J58r8k89M44J2k97K82l02J46N8R9q5J14j2j68L48l46p1J48O8R5j0
7752A73l38L68k04Nj0p0J08k57K93O7m1k08L73m37L5J07J11j95M15l47j33K89
7774A04j79J83m23K20L08j99k17n5J40R2R8K0j96J85k81M36o5k22J8J23j6k00
7796a26K09j72o5J28Q9j16J05R5k04J72j36j06j23L38k31Q7L3M3N5j77j3o5j09
7819b89M46k53M0K02j50R2o1j82j82N36j77k17P9O4O4rJ99k86J57K27k18J74l49
$$ y = [315, -310, -33, -86, 121, 57, -20, -39, 3, -138, 50, -23, 67, -60, 98, 123, -6, -83, 395, -101, -217, 117, 35, -49, -249, -22, -243, 89, -15, 328, 168, -70, 50, -17, -47, 13, 41, 307, 127, 4, 5, -153, 151, 74, -299, -54, -178, 189, 98, -135, -93, 6, 87, 180, -273, 25, 161, 175, 38, 20, 60, -184, 32, -21, 27, -47, 137, -141, 18, -103, 32, 69, -121, 37, -61, -350, 94, 106, -191, 91, -211, -65, -7, 92, 7, 121, 109, -59, 289, -57, -128, 20, 88, 183, 173, -165, 203, -1, 4, -6, -76, 32, -225, 68, 135, 94, -114, 259, -178, -143, -36, 75, -120, 295, -52, -185, 104, -75, 108, -315, -95, 213, 14, -203, -258, -118, -26, 72, 92, -104, 81, -200, 236, 171, -51, -33, 90, 74, -126, 83, -89, -154, -26, 63, -53, 52, 147, -57, 115, -21, -127, -250, 88, -143, -56, -23, 20, 75, -102, -115, -180, -289, 157, -96, -56, 146, -4, 88, 27, -155, -337, 199, 22, -195, -116, -52, 12, 3, 202, -84, 73, 300, 82, 256, -93]
7842i3K78j1j65k2J8J93j51j00l9k09J66J70j48L8J52J77k65k32J88L94k19k46
7864a26L42j17k70M64j41m45L34l7J85j60J8m4l0J97k05Q8o3l9J90k38K76k33
7886e4K0m1k18N23q1k39r1J74P4J6j41P3q5p2J46j29j06K45p8n8J53OK07k01j44
7911a01LL4K72k69O5J89q6n4R0j05M4k23J94L4j47L1o6m4L53l89K50p4j06Q3o4
7936h6L03k10M0Pj83J06K2k15L69l15K55rJ23l0j15l53K78J29k46K86j04R3k46
7959a01K74l85L46o2k58J63p9R7q6K29N0k21k30J60N4J46k12K40k30n7Q5J55p3
7982Ek81L01j16j8J60m6p9l4L08J27m39N2K88m96K53j4K4j62R5o4M35m94M05j15
8006I5o0L0k83J72J10r4J80k27J80p0j15N8k32L09j12J22J84j44r2j14n0K90m87
$$ y = [-93, 185, 174, 9, -13, 5, 198, 47, -53, -92, -301, -135, 35, -113, -75, 77, 254, -11, -243, -55, 339, 120, -126, 216, 99, -171, 293, 152, -293, 41, 4, 189, 29, 47, 3, -27, 170, -35, 53, -10, -49, 141, -97, 179, -54, -34, -75, -293, 230, 149, -90, -181, -7, 67, 83, -58, 15, -70, -142, 4, -125, -231, 14, -64, -122, 31, 37, 244, 43, -101, -98, -64, 208, -61, 4, 193, 107, 53, 143, 38, 82, -141, 53, 87, -60, -29, -95, -139, 214, -175, 75, 1, -105, -22, -86, 217, 7, 47, 54, -129, -23, -1, -216, 153, -162, 93, 84, 207, 177, 62, -291, -13, 116, -130, 156, 52, 145, -101, 173, -212, 134, 72, -186, -23, -102, -5, -91, 138, 188, -33, -263, -103, -49, 97, -115, 125, -105, -162, -77, 78, 5, -276, 25, -91, -109, 51, 5, -74, -108, 200, 327, -112, -60, 228, -268, -15, -29, -5, -167, -72, -136, 299, -195, 210, 95, 35, 65, -218, -46, 64, -30, 150, -77, 103, 33, -82, -24, -256, 53, -59, 63, 247, 103, 11, -103, -153, 137, -350]
8029c50L15L17k41K10k52j9N4q9K99m93K73N6r5j04J40J61k66R0mj83K0J46J46
8052A31K6k12K40k88j36M31k64k18L20j61K98j91k0J84l78j35L23q9K06k2j65
8073a20J88R6J56k88J34j93J87K0j41m5P4q2M30n04lrm8J30m3p5K93k68j03K24
8097A0J64L6k74J83j88j07L43j51L5k18J77L51k92j54Q1r8l6K50q5J3k13J72j4
8120a5J06p1k17K33j80L01k23L13m15R3r5J28J98j05mJ45k20j96R3K01q0j32K60
8143A18K5K58n54L16j89J36Q5k46N9o3j1J58k62M43n16K43p7K97j54M2O9l23L4
8166a12J60j08J57k62J88N8J5k22J81j69L5J99O1j12q5L05j13J63m44K62j30r
8188A8k7R1M
$$ y = [-350, -35, 282, 41, 251, -1, -20, 34, -55, 244, -249, 24, 80, -15, -119, 21, 182, -84, 6, 2, -181, -161, -15, 131, 157, -55, 185, -103, -239, 192, -72, -290, 30, -131, 167, -24, -44, 140, -238, -373, -50, -139, 67, 45, -120, 68, 164, 320, 32, 166, -27, 160, 180, 39, -6, 68, -14, 416, -88, -91, -100, -148, -18, -61, -136, 157, -111, -214, 10, 174, 210, -64, 119, -69, -176, 167, 16, 51, -167, 10, 361, 69, -85, -4, -102, -138, 112, 27, 40, -173, -1, -15, 91, 20, -197, 36, -144, 157, -66, 247, -168, -75, -170, -42, 156, 51, 47, 192, -28, -224, -131, 70, -10, -142, 118, 143, 401, -153, 163, -26, 110, 195, -51, 8, -55, -66, 92, -170, 273, -243, 0, -77, 220, 66, 108, 177, -146, -112, 48, -60, 97, -165, 23, 81, 96, -126, 55, -114, -79, 120, 181, 69, -16, 289, 176, 339, -105, 157, 27, 18, -9, 82, 86]
8191H6
$$ Imaginary data points
##PAGE= N=2
##DATA TABLE= (X++(I..I)), XYDATA
0@%%%%%%%%%%%%%%%%Qj6J6j6J6k4L2l2M0m8N1n9P2q1Q9j04J20j36J52j70J91k14
38a13K38k65K95l28L66m04M46m94N46o02O61p28Q03q85R77j077J189j318J464
57G71j630J825k057K333k672L100l661M428n541P315j0563J8364p0731q1671R9089
72d1301l9919K3230P0807p2129m5149K7485l5560M1689N7637j4808K3183n976
84a0811m2955M8701J8953j357N9359j1166l1637L5118k3532q94N3873k7006q981
97E7665K4141n7364p541L2002l7831R607J9852n5008q643m716l7866K9232J2456
110b4014k1113K1339l2272l8803L5682m264R055N9799k4429k2831K6778l0805
122d5878J5279O4601j0238J1668K0150m9639P852L3342j6028L6173J5172m8843
$$ y = [0, 0, 0, 0, 0, 0, 0, 0, 0, 0, 0, 0, 0, 0, 0, 0, 0, 8, -8, 8, -8, 8, -16, 16, -16, 24, -24, 27, -32, 40, -41, 48, -56, 64, -72, 80, -90, 101, -113, 125, -140, 155, -173, 193, -211, 235, -259, 287, -315, 346, -382, 421, -464, 513, -564, 625, -693, 771, -859, 966, -1091, 1242, -1430, 1670, -1991, 2437, -3104, 4211, -6352, 12012, -58719, -140390, -41301, -81220, -57990, 12817, -59312, -104461, -76976, -112536, -70847, -13210, -28018, -4835, -10811, -53766, -5065, 13888, 12531, 71890, 60724, 29087, 64205, 40673, 39779, 93652, 66646, 57665, 81806, 24442, 16901, 48903, 11072, 20679, 40531, -14477, -23120, -27836, -65702, -36470, -24014, -45127, -23788, -56060, -94863, -59181, -63445, -54390, 5409, -19020, -41851, -15073, -45878, -30599, 34002, 23764, 35432, 55582, 5943, 13795, 47137, 31109, 67282, 82454, 33611]
134C3611P227p913l2069M0312M350l2730J7750l0782l8695L0879r682j0692L1183
147B749l2337k5660J9522k4241O754L9411j7904J045J3195l1182J1452K6381m171
160a4986K9448J0625k4263J2632l318q505L9962N664j0560J8144k6112j9957K4935
173C3709q272L686K2304l1071j6256L906k8995J1159K2269k3331K820l495l7832
186d9399J0722J2631j1062K4172j068k6951J2952n262n475L7299K140q114J9279
199A1864j8471p908K9722j099Q782K2128k1141o852R124j6229J4171J9787j7911
212B5967J934m274k8900P208P167r602J3051p307k3728J381j0019n621K1707l152
226a4188p365O408j8199m685J7543l62J1635J2519j4969J428M897p043K0841J4174
$$ y = [33611, 40838, 32925, 856, 41168, 45518, 12788, 30538, -244, -38939, -8060, -17742, -28434, 2749, -29588, -55248, -35726, -59967, -53213, -13802, -31706, -30661, -17466, -48648, -37196, -10815, -14986, 14462, 25087, 824, 13456, 10138, 1633, 41595, 47259, 36699, 54843, 28731, 8774, 33709, 25437, 29123, 51427, 20356, 4100, 8006, -20989, -9830, 12439, -10892, -8072, -11567, -49399, -38677, -26046, -37108, -12936, -14004, -40955, -28003, -33265, -38740, -1441, 699, -7415, 11864, -6607, -14515, 15207, 14108, 22890, 45018, 23877, 17025, 26149, 9920, 24091, 43878, 25967, 27901, 23627, -5273, 1935, 9102, -500, 12551, 5244, -18484, -17103, -27122, -32743, -11036, -14188, -21553, -15145, -33344, -38029, -20486, -20848, -9213, 3306, -11663, -10235, -5338, -12381, 8460, 22634]
240B2634q156R473n196j5658J4485N854k508J5691r583j6640N100j0813k296J8013
254B0400r180q658K176k0304n877J1858o008N116M953j7727k218J547p074J4957
268a6039J0158p062N660l358r364J3075Q223L277J3215m365q075N489k924M399
282A2309J5262k985l683R2j2751k103P605j655L416j875j4266m737l792m748Q812
297e099J987p114j302q041p028O849L852M172O528o527m000L537j797R059J2420
312G496j158J174J011p818M080Q680J950O655m16r681j476j552k526Q550J572
327A6541p241k959p534p872L272K461oJ301o971p267j197j005M137P502l11k398
343i547j436l370J926O767O517M307J88l337r22R30M055O662L962j300l533m069
$$ y = [22634, 14478, 23951, 18755, 3097, 17582, 23436, 20928, 36619, 27036, 10396, 15496, 4683, 2387, 20400, 11220, 2562, 4738, -15566, -21443, -9585, -15593, -10477, -5524, -23251, -25469, -23922, -30996, -16039, -5881, -12943, -7283, -10641, -20005, -6930, 1293, 4570, 17785, 13420, 5345, 10834, 7910, 12309, 27571, 24586, 20903, 20995, 8244, 6141, 13746, 12091, 15507, 13632, -634, -5371, -9163, -13911, -5099, -3112, -10226, -11528, -19569, -26597, -19748, -15896, -11724, -5196, -11723, -15723, -12186, -13983, -4924, 7496, 6338, 7512, 8523, 705, 4785, 13465, 15415, 22070, 21654, 11973, 10497, 8945, 6419, 14969, 16541, 9300, 6341, -1193, -9065, -5793, -3332, -3338, -2037, -9008, -16275, -17472, -18477, -14340, -6838, -7149, -9547, -10983, -14353, -12427, -5660, 857, 5164, 5352, 2015, 1093, 2023, 6078, 12740, 16702, 15402, 11869, 7800]
359G800j605J432L383K391k235n283n097m299q43K823K287j483m033n464l248
374a3474k76K885M441J671k126k972j846P79M484N367L893o32k073q42K9L197
390B505O215K704n20j370m089j826L202J479K554J82n856l481j463k880K731L510
406C597l648k067k768n665J421K805L60L338j883n263J222Q5r2P794J690k425
422a499J870l037j064N999K132K085L541m845k628K633k379L308N218l907j873
437E554j266n688J870K624j331K323l090o580O86j434o36N943r39l384N91m695
453i452k35N478m42L234K901o116M21K782k286O216M817m224K043j013n127N571
469D568K267j741N332l548o371L788k898j341P047l042m326J744o431j569N672
$$ y = [7800, 6195, 7627, 11010, 13401, 11166, 5883, 786, -3513, -4356, -1533, 754, -729, -4762, -10226, -13474, -13750, -10865, -6424, -4753, -6879, -9851, -11697, -10918, -6434, -1067, 2826, 2194, 121, -721, -692, 2505, 8720, 11424, 10904, 9534, 5445, 3619, 6821, 8300, 10854, 11036, 5180, 1699, 236, -2644, 87, 3597, -51, -2118, -4886, -10551, -9130, -6325, -5965, -2627, -4510, -9773, -8551, -8466, -8558, -764, 926, -1499, 371, -2666, -3730, 2269, 4401, 6486, 10027, 5182, 2554, 5187, 2808, 6116, 11334, 7427, 5554, 4288, -1400, 470, 3094, 1763, 4086, 996, -5584, -4898, -6332, -6968, -1025, -1964, -5348, -4757, -9452, -9687, -4209, -4651, -1417, 1484, -4632, -4211, -1429, -3715, 2501, 7318, 3094, 5137, 4124, -1003, 4568, 6835, 5094, 10426, 6878, 507, 4295, 1397, 56, 7103, 4061, -265, 1479, -4952, -6521, -849]
484h49k800J323K788q059K00K253m118N527L956m801K378m24m514O130K198r04
500B84O441l162m398N198k057j91P847l305k152K485o282N61M651m194K711J067
516E504q634J396P73n091N485Q71n817L154l108m572O806j080j426O739m806l030
532f836O220l612J505P894m427K17L986o231K908N528m469M231J676p939K991
547C642J162m965N956K08o460L300l418m802O221k347k322N038n957l095M686
562c153m199J744N809m678M82K777n758M066M476l847N360P99n757M432Q29l231
578A51P194p57m071M345m146k767O463l411p44M239p104j468L648n727K139M058
594B042o499J501P20o489M491K022m213N532o43n698N437j81k589P641q29l704
$$ y = [-849, -3649, -2326, 462, -7597, -7397, -5144, -9262, -3735, 221, -4580, -2202, -2626, -7140, -1010, 1188, 284, 6725, 3563, -835, 4363, 2306, 2115, 9962, 6657, 4505, 6990, 708, 1269, 5920, 1726, 4437, 5504, -3130, -1734, -961, -6052, -567, 304, -5513, -2359, -5467, -10039, -3233, -4313, -5739, 1000, -3806, -6836, -616, -4228, -2723, 5171, 744, 961, 4947, -1284, 1624, 7152, 2683, 6914, 8590, 651, 3642, 4804, -161, 5795, 6003, -457, 2843, -575, -5377, 844, -1503, -3825, 1213, -4744, -7839, -3153, -7352, -5608, 201, -4477, -3995, -1218, -6976, -2910, 1566, -2281, 3079, 3878, -1879, 2553, 3382, 151, 7345, 6588, 2517, 6862, 2716, -51, 6412, 3001, 2257, 6496, -608, -2076, 1572, -4155, -2016, 2042, -4457, -2956, -2236, -8725, -4234, -2212, -6425, -893, -1536, -7234, -1797, -1978, -4567, 3074, 2245, -1459]
610a459N848l913j280P152l383L99M810o057l67L881n498K631L677n872J173j87
626A555o069M116L70m276M886k386m692M166j959j834O075k985j094M136m599
641d590O60N689l702K287L996n814K270L325m774M625K188n043L739p75m923M968
657D126n97l893N289l322m393M580l083j750N195m052j815M125n480M14M558m427
673d525J891L400n529K058K724m123M307K047m171L490l20l231N192l78k409M887
689E310k664k862M231k420p23L712l283m58K482n024J103K701m417K524Q30n262
705d220K448O47l532M049k44l436L765k053k314N273j799j187M934l406q79L906
721A952k875Q93M358l645R41K146m033K143K112l070K371Q08m642K455K70l464
$$ y = [-1459, 4389, 476, -804, 6348, 2965, 3364, 8174, 2117, 1750, 5631, 133, 2764, 6441, 569, 1742, 1555, -4514, -398, -28, -4304, 582, -1804, -6496, -2330, -4289, -6123, -48, -3033, -4127, 9, -4590, -3930, 1759, -1943, 344, 4340, -1474, 796, 4121, -653, 3972, 6160, 1117, 4856, 4081, -842, 4126, 3529, -364, 4925, 1603, -2790, 1790, -1293, -3043, 2152, -1900, -3715, 410, -5070, -4656, -98, -4525, -2634, 766, -4763, -2705, 19, -4104, 203, 2250, -1921, 1569, 1249, -1982, 3210, 2832, 423, 5310, 2646, -216, 4015, 1595, 872, 4584, 1301, 843, 3325, -1699, -596, 2105, -2312, 212, 1042, -4220, -1772, -1125, -4657, -608, -852, -4288, -523, -2576, -4890, 383, -1416, -2603, 2331, -1075, -1954, 1952, -923, -30, 4328, 683, 1624, 3770, -263, 1880, 3992, 922, 3293, 4101, -541, 1914, 2184, -1280]
737a280L334o05l165K558k242k155L802k393j085L635l408j018K804k547J248
752b517K944k888J290J591l123K396J774k405L437K66k899K745k85j541L437j152
768C070j331K552k984q86K740k444k68K535m055m23J901l217J140J417k980J249
784a984M14l052K255N18k117K899J16k287K754o34p71L207n16n20K447j678k63
801G88K976j464M9K112k364j43J327k218Q40Q83k367Q31k98k613J405l49j955
818b560J852j053k154J926j327k38K059j468J25J565j672Q82K035j016R63J852
834A771j938J342R24r79J571N46j161J507n80j831J763l33j373J452j354j510
850a83J070j685o14J566j930j17O72j966N8R08r57N65J274j877P38J139j091J718
$$ y = [-1280, 2054, 1449, -1716, 842, -1400, -3555, 247, -2146, -3231, 404, -3004, -4022, -1218, -3765, -2517, 427, -2461, -1171, 420, -2703, -307, 1467, -938, 2499, 2765, -134, 2611, 2326, 785, 4222, 3070, 1739, 4291, 1307, 421, 3161, 717, 449, 2984, -1071, -1494, 407, -2810, -1670, -253, -3233, -1984, -1570, -4622, -2367, -1849, -3966, -1067, -951, -3238, -484, -1118, -1889, 1318, 802, 282, 2729, 1051, 788, 3764, 2300, 2349, 4461, 2097, 1954, 3281, 1063, 1903, 2786, 419, 1250, 952, -1661, -256, -605, -2560, -708, -1761, -3915, -1989, -3316, -3554, -1495, -2963, -2838, -1273, -2945, -2063, -28, -1044, -81, 1771, -167, 1175, 2099, 1120, 2691, 3237, 2076, 3583, 3003, 1172, 2935, 2602, 1229, 2681, 1327, -183, 887, -798, -1412, 154, -1776, -1893, -1221, -3187, -3129, -2221, -3178, -2613, -1339, -3216, -2478, -1339, -2430, -712]
868g12P44o67J443j7o39J810Q1k03J220j16j005P26k03k55N87j091r7L4j543j95
888i8M32j364N56Qj349j27J9j084O92L21n02P39m81l12J034J73J67J161j21j67
908c03P70p1M74J019r4M00N10r87P2K96m55N32L9r11n23N2n64J20m07m54L73o43
930g55p94m04J14k16N05j85m24M00j12R0N06K13M25K79p7M35J74O21j21N91Q7
951A352P3j64J29M22k5J5j9m34k85Q4j65m70O2j3o13m19o61J60q4j85j53j00j46
974a639l43L22L17M4L89k07L6L38L27K75M94K69J4N97m92j4Q84p9J47M31n53k96
996A261L20k37J53l5l64n22k42o67j12J00n02N4l96n68j73N10o52O60N13q25J11
1017a613L85k06J061k67K12J042m47n8O53P3M43L05n6J01J09n56N73M52q65L21
$$ y = [-712, 32, -635, 808, 791, 152, 1962, 2043, 1840, 3060, 2944, 1939, 2665, 2462, 2207, 2794, 1703, 1606, 1640, 97, -98, 334, -1030, -474, -466, -1815, -1942, -1923, -3007, -2315, -1994, -2496, -1757, -2238, -2550, -1516, -1343, -1176, -15, -136, -303, 467, 396, 870, 1889, 1795, 2195, 2705, 1718, 1790, 2086, 1631, 2163, 2202, 1291, 768, 820, 256, 376, -31, -485, -112, -755, -1549, -1953, -1839, -2055, -1550, -1735, -2159, -1759, -1871, -1781, -1275, -1062, -637, -358, -435, 0, 174, 795, 674, 1265, 1352, 1425, 1261, 1390, 1812, 1787, 1802, 1783, 1349, 1064, 1148, 983, 513, 575, 562, -51, -470, -1131, -971, -1055, -1240, -1393, -1493, -1639, -1982, -1660, -1343, -1299, -910, -1117, -1081, -743, -416, -141, 353, 622, 636, 1233, 741, 727, 1611, 1532, 1679, 2110, 1557, 1261, 1581, 1344, 1497, 1462, 1098, 576, 334, -333, -445, -345, -847, -793, -1189, -1757, -1930, -1420, -2072, -1412, -899, -1724, -1613, -1228, -1434, -373, -640, -428, 614, 167, 109, 762, 835, 1278, 1583, 1527, 1628, 1737, 1181, 1754, 2206, 1341, 1662]
1037A662o76p69j4k32k49N23p46p46M39q97j80Q36n13k97J090r33mQ35p58R67
1057f62P29o27L07O70o19R87L71j08P07Q7j011P93j87m57R81p24l89N21q17n99
1077d7Q24j013L3N53j499J6J05q43M26O24j154N32R3o31R18K87n85J223J65r48
1097i21J329j59N4J051k73R5Q36j452O33Q59j119M93L96j133k46M35q93L87M2
1116D14r55M22l72j141Q58p5q83J253o18r44J337n04k39J362m95J0P08p90N13
1135a39J140j024P45P00j135K13Q44r09R94K57j080P14p73o77J099m47o98P02
1153E26j021m54R17p89J01Q36j343M04R4r44P53N00r61J054K42j041R34O1m41
1172e72J406l54o07P66k38o36J506l04n09J165r75k80O51r65LJ180j008L8L02
$$ y = [1662, 986, 217, 203, -29, -278, 245, -501, -1247, -808, -1705, -1885, -1049, -1562, -1859, -769, -1702, -1706, -871, -1629, -662, 67, -560, -253, 417, -202, 785, 1156, 1048, 1755, 1842, 831, 1624, 1437, 980, 1961, 1237, 848, 1369, 552, -47, 777, -236, -203, 350, -1149, -1133, -1028, -1871, -1445, -821, -1975, -1443, -1350, -1981, -1063, -776, -1361, -138, 27, -921, 408, 249, 303, 1354, 1081, 1176, 2012, 560, 1193, 2052, 933, 1426, 1822, 689, 443, 878, -15, 372, 414, -541, -119, -491, -1632, -774, -849, -1732, -479, -1097, -2041, -704, -1208, -1447, -85, -580, -570, 138, -652, -139, 1001, -23, 722, 1422, 287, 500, 1344, 435, 1429, 1686, 606, 1320, 547, -130, 969, 522, -176, 526, -495, -949, -32, -821, -720, 116, -1227, -823, -729, -1673, -920, -420, -1381, -327, -85, -1126, -192, -131, -572, 834, 480, -127, 639, 401, -235, 1271, 967, 458, 1623, 648, 368, 1019, 54, 57, 1237, 229, 267, 569]
1191E69j208M22N08j022N08K87j213M66j2o17J042p8n07O88n58m21J486n37j66
1210c63J113r27J7Q12o61L70P73q66n1Q17r38M50L22l24K13j96n96O29n60l11
1230b77R17o55l67R84j234m47J178r00m7R18j358M17O80j035Q97M27q85O26K78
1249A17n54Q19J54q14J075M9j032J082m18l59J218n66l08Q99j128k23R10o53p0
1268A98M03j263M12K88r97L38N24r53O25k38q42J002K62o48Q65l88n89R30p9N6
1288i4Q79l24n65J083r15PJ158n38M3L03q50M20J09p64O20j60n20L32k68q69J070
1309A57n99l27O89o48m03P77m60J14Q47r13M34K75o24N08N04m71N40J31m49L77
1329D59K48q89J048J5l10L16k25q15P18m9l35N21n06n27N57q36M48N89q78lK61
$$ y = [569, -639, -217, 291, -731, -223, 64, -1149, -683, -695, -1312, -270, -348, -855, -167, -725, -1146, 340, -197, -363, 750, -177, -160, 652, -9, 361, 1134, 268, 217, 1034, 96, 546, 868, 544, 757, 561, -35, 594, 34, -277, 640, -15, -382, 602, -632, -1079, 99, -801, -848, 70, -1288, -871, -191, -1226, -329, 98, -787, -161, 117, -437, 382, 536, -278, 797, 846, -186, 896, 478, 119, 1337, 771, 463, 1362, 234, 11, 921, 268, 198, 601, -662, -250, 38, -959, -621, -97, -1050, -425, -663, -1505, -503, -241, -889, -24, -412, -1001, -71, -150, -94, 785, 461, -104, 979, 64, 71, 1229, 691, 734, 1037, 187, 607, 716, -48, 572, 412, -108, 224, -44, -913, 157, -442, -769, -80, -728, -1131, -354, -814, -700, 147, -766, -332, -57, -681, -173, 331, -140, 400, 531, 82, 459, 707, -182, 866, 881, 571, 887, 662, -153, 565, 516, 181, 702, 196, -331, 226, -610, -162, 427, -451, -454, -193]
1350a93p85N19J96k52L78Ll60M77j52j25R99l01m14N20j23n07Q92l00j42J76k14
1371B92j55L56n91J16O22n50Oj71l76M90K0p53N91n7m43K40jq8L71ll91O64n01
1394c12K8N43k09q7P16o42k82N66m32K29O29o47J39J20p80Q30j47l3M7r5l90L78
1416A69l38P3K33k25m74Q10o63M8M52j15J25k4l73j52L62j63J99N26n89J83J82
1437B46l89L11J31k83K49j59j61K26K0k55N51l62l23J75m0r1K79o7o8K9k23L4
1459a70P3n5J88J60n81L65k36p7J79K35j20J87j62k86K88M1J54o9n7M8R0l44k50
1482c99O65p7J13j05l25NJ13j97M10K14k22Nk24j61J75k33J15K55l00r6j5J18
1504a66J64K54k45j89J9p3L95k46P4J95j42ml0L8J97l2m0m43M92k04r0J26K76
$$ y = [-193, -978, -459, -263, -515, -137, -134, -494, -17, -169, -294, 705, 404, -10, 510, 387, -120, 772, 472, 330, 506, 292, 137, 493, -98, 18, 640, 90, 96, -75, -451, 39, 59, -694, -103, -160, -603, -363, -364, -452, -81, -84, -475, 189, -312, -284, 259, 50, -37, 679, 37, -245, 321, -111, 118, 747, 100, 239, 359, -421, 409, 262, 229, 276, 181, -209, 169, -169, -96, 137, -88, -562, 248, -415, -367, 85, -30, 95, 71, -302, -454, -92, -255, -56, 470, -119, 64, 246, -143, 168, 299, 16, 265, 106, -55, 171, 191, -64, 487, 125, -198, -23, -63, -154, 125, 58, -10, 19, -204, -170, -97, -152, 36, 196, -385, -20, -256, -333, -154, 81, -39, 148, -14, -300, -12, 29, 183, 114, 57, 105, 195, -149, -399, 266, 189, 302, 197, -128, -123, -10, -207, 203, 417, 195, 200, -24, -185, -10, -243, -128, 127, -173, -269, -284, -166, -2, 252, 7, -182, -163, -236, 159, -87, -13, 182, 40, 36, 6, 44, 241, 209, 169, -274, 218, 14, -76, 50, 326]
1527C26j19k45K11j45j47J63k90J02K0j60L06l27J07J4J43k2j91P3o5L05k30m6
1549b17L58j56N9q6j70K98k4L10k31P4j6K2M6ok09O4K9k60O4k12Q5J02K17l93
1573b52K29j1j42l8K44j50o3Q7r9P0NO27k85n0k03K77m29M57P6j98R6J19j01k5
1597B41j48L5rp8q1k00P7k52oJ76O8K26o28K14K65l27L31J39J32j34k02k43M07
1620CM12j46j93N7r7K95k88K31K54k90K02l67k25K10p9M00l47l16K61j47k33J81
1642b22J95j45q5p6j05J66N2L4L62m4m7J4j09o6L92J34m68K39Ml08L40m0K5j7
1666B25j33QM4k71J09K88j61l07N9L8r7N03m53M9P9k70K8j02j32O05k78k41M84
1689G4l5L9J1K30m85J91j29J96j27K03J7J22r6j47K96o73J53N55j74k8J82n38
$$ y = [326, 207, -38, 173, 28, -119, 44, -246, -144, -124, -284, 22, -305, -198, -184, -41, -63, -254, -181, -246, 59, -171, -217, 141, -15, 44, -42, -212, 86, 62, 372, 141, 215, 199, 221, 267, 261, 52, 116, 145, -115, -51, -263, -178, -76, 141, -252, -23, -34, -176, -214, 30, -120, -183, -96, -195, -125, -120, 507, 222, 172, -31, 246, -183, 274, 350, 152, 248, 367, 266, 241, 93, 128, 119, 41, -40, -240, -163, -415, -421, -245, -177, 49, -579, -365, -100, -427, -96, 43, 175, 41, -161, -404, 3, 415, 269, 76, 133, 36, 331, 43, 274, 528, 238, 440, 73, -152, 58, -21, 379, 32, -284, -23, -170, -403, -222, -27, -172, -257, -333, -438, -272, -220, -186, 176, 132, 85, 99, -10, -76, 316, 450, -18, 221, 225, -83, 257, 217, 242, 225, 92, 100, 144, -127, -18, 270, 109, -198, -139, -101, -198, 305, -148, -99, -20, -290, -262, -364, -496, 109, -169, -410, 74, 39, 78, 89, 319, -166, 25, -104, 92, -35, 168, 185, 307, 211, 64, 360, -313, -160, 395, 221, 193, 375, -163]
1711a63L04n2n38M76k67N9K79k48k79M64j36O6Q5j67P4k04L64o7L00k97K4l6K3
1734F4j96M68l08o1O8Q6K0j06m8K68Q7m24K60k77o9L16k53K47J21m88J9J30j55
1757b31j43K43M5K0r7k30K18L7K20J17k13J02J52k90J05J80k76m0K16p9j03N08
1779D61j45k12K93n36L32k6j42R1J25m25J58j3j40j80M45j28qj69k37N74n97M87
1801HJ33k41n8K39m51J00L11o8l4M97o12L75j8k51L84Q4N0l84N4j41L74N0j78
1824B23n7L7k14J38r8l38K40j41m37M74k94K72J25k53J62j6j04J82J02k88K59
1845b6L65j38L4j50K3K51n9MK74j84j74O8N3j84L12l32j36J71k85M6O8j81J31
1868d9P8l99M1K23N9k49J79k49K93n5k89L62m7k42N96r4l32K72K83j65J11j03
$$ y = [-163, 141, 89, -449, 27, -240, -181, 98, -150, -429, 35, -101, -35, 50, -117, -43, -247, 117, 50, 350, 53, 77, 41, 64, -132, 336, 28, -33, 35, 121, 141, 35, -13, 255, 342, -82, 178, -99, -168, 148, -105, 142, 263, -225, -206, -76, -231, -374, -131, -86, -66, -163, -393, -175, -138, 82, 199, -14, 88, 240, -50, 55, 235, -41, -81, 135, 56, -47, 461, 316, 104, 397, -139, 193, 167, 25, 116, 241, -184, -26, -39, -179, -359, 86, -42, -50, -219, -456, 118, -479, 8, 141, -100, -158, 81, -370, -270, 41, -27, -61, 436, -176, 199, 181, -70, 314, 398, 448, 64, 118, -23, 351, 401, 223, 166, 203, -11, 127, 29, -309, -69, -210, -647, -173, -467, -195, -70, -323, -161, -177, -281, -99, 3, -285, -26, 339, 201, 235, 85, 108, 359, 300, 304, 578, 394, 220, 288, 341, 157, 469, 137, 1, 172, -113, -67, 1, -180, -49, 29, -370, -329, -106, -47, -296, -117, -366, -73, -128, -417, -55, -102, -344, 252, 158, -174, 98, 381, 216, 327, 224]
1890B24J11J0k64P5L88l51N1J90l79j67K21j16r5P8j44R0l63J0O23k38r7O8k12
1913b87n9K62j29L97j86L3J47j34j0P4o5J46J44j46k50Q0L3m2K67n0j7k22L0N7
1937G3p1k16K13J4j53J27o5j85k6J82j7O6mP5J4J37m06J99K84j34K04l02M5J48
1961B02j13L3O0q2L0J7j10K58j59m2l07N01l00K44P3l39J10k01j75J33J39q7j1
1984a26lK3j7K04l08J26q4j13K23k83Q0K02L35l29K50j75R0L4k12K30l2J12M3
2007B70j22k0Lo4N3j56M8K58j62j63J17j19j29K1p7j5J02K06m53L16J03j36J64
2030D5k30j36L06j52j4K86j96K12k7m0J0J44M1j36k83K93NJ38l55K00m4j0J06
2053A63k29r7J60j4m60L57J51m85K09J88jJ2j10J02J74j55j17Q6K31n7j4mJ78
$$ y = [224, 335, 345, 81, 156, 544, 193, 244, 434, 55, -112, 109, -7, -102, -24, -168, -78, -441, -431, 192, -46, -143, -75, -287, -346, -84, -213, 184, -2, 31, 178, 44, 34, 108, 43, 189, 333, 187, -63, 17, 50, 8, 275, 225, 208, -14, 16, 73, 2, -214, -1, 13, -140, -13, -78, -263, -289, -107, -124, -58, -62, 13, 27, 164, -242, -43, 241, 107, 311, 9, 54, 202, 89, 122, 182, 100, 130, 147, 37, 295, 136, 94, -213, 288, -12, 232, 305, -34, 76, -125, -300, -167, -28, -115, -126, -129, -106, -123, 81, -227, -101, -185, -298, -75, -358, -278, -76, 259, -70, 180, 5, 95, 129, -83, 147, 115, 227, 270, 148, 128, 131, 67, 120, -36, 12, 270, 108, -55, 62, -57, -186, -165, -242, -257, -155, 51, -402, -86, 17, -119, 45, -185, -321, -15, -167, -181, 105, -91, 121, 94, 54, 64, 208, 249, 113, -170, 123, 128, 266, -89, 111, 67, 57, 163, -66, -163, -3, -17, -477, -120, 31, -454, -245, -57, -58, -46, -156, -54, 120, -35, -152, -66, 165, 108, 94, 90, 268]
2076B68j77J62J31k87j9O5j43L4J34l01K09k71K67r6j20J37J8j48P3l16L57j26
2098a49j17R2j75L1J02M5Q2mK04o2j44J53r0Q7J03j22j07j27L67n1j27KN1L75
2122D19l98J65l26J1PJ41N1l82K85k04K43J57l71M3j7p0q7J42K02q8L38j19o8
2145G4K41m27L04j57j00L03k15N6j4K19r2j76J81j97J44l12M18l49J98pl9l49
2167b96L9J90j20K21k59J02R4O2j0qr6J03K73o00L65l72L65k16K58O5l21K03j60
2190a18M05l83L30Q0k11k88K33k5J81j33m7J62k99k4kj4K16L3k91j9o1K36m5K06
2214A22k95j19J42j9L02n3k46M2J03l1K32k71K47k33j3K15k2J66l39L33j15K26
2236C74l81K75k24j12J46j42K7Jj22pk0M46k37o5P0P1j48J42N5m14M9M6J59J23
$$ y = [268, 91, 253, 384, 97, 78, 143, 0, 34, 168, -133, 76, -195, 72, -24, -144, -7, 11, -137, -64, -380, -23, -149, -266, -174, -349, -318, -216, -171, -89, -93, 111, 49, -95, 58, -32, 55, 158, 36, -71, -198, 169, 118, -9, -7, 44, 419, 21, 186, -140, -129, -122, 19, 70, -312, -27, -231, 12, 169, -202, -159, -176, -246, -333, -191, 11, -77, 261, 142, 74, 315, -112, 192, 35, -65, 238, 23, 79, 65, 284, 192, 16, 197, 0, 144, -168, 250, -99, 99, 92, 53, -296, -257, -67, -187, 34, -225, -123, -29, 33, 23, 15, -81, 22, 295, -305, 60, -312, 53, -163, 95, 160, -161, 42, -118, 287, -96, 234, 314, 103, -185, 48, 23, 204, 71, 24, 186, -113, -137, -139, -153, 63, 96, -195, -214, -275, -39, -84, 122, -173, -292, -150, -169, 133, 80, -166, -124, -21, -52, 180, -91, 156, -77, -90, 125, 103, 269, -70, 263, 148, 374, -7, 268, 44, -68, 78, -64, -37, -36, -158, -165, -185, 261, 24, -41, 29, 100, -48, 94, 149, -265, -216, -170, -11, 112]
2260A12r0k48J95l2K20k7j90J41j46K18j0k13rM51k27k33N5L22Q9m4l86m1R4P3
2284G4j95L01j25l42J77j30K93m9K14k59j17K29m8N8J43m23K11P5k00L00k8j26
2306C3J39j49o9n1l3Q0J10ok61j19j2K62j3Q4p8J74l33K30j53k5J36m3q5L25j46
2331cM4J70m09L06j46j89K41K37r5k71L58k10q9K87k64J48J3k95K35l8Rj94k9
2354a84J19j3k6n2j06K19oJ39p9j73R6P9P1p8o6K97k47r8Q8O6j14jJ91K6j05j66
2380a23R4j8J65k45L42j73J19j82K17l36K59j97q4J05m3K90j05j38K1N2q8J69
2402A01p8l1j52N3j14M88k09p4J82l8k94K70l69K29Q0j18J86q6L1k3KJ90J13n68
2426b29Q1N4J26l76M81l24K10K05m84K33l25L87L2k4k79L91r8J32k53J86l7j0
$$ y = [112, 22, -226, -31, -63, 157, 130, -60, 81, -65, 153, 143, -70, -79, 372, 145, -88, -33, 289, 378, 334, -52, -93, 1, 74, -121, 180, 55, -287, -110, -240, 53, 4, 218, -41, -158, 71, 23, 81, 224, -199, 12, 87, -113, 187, 159, 33, 172, 23, -46, -97, -130, -50, 60, 54, -207, -326, -338, -76, -89, -5, -83, 91, -242, -12, -165, -190, -54, -97, -182, 143, -3, 41, 211, -198, 108, -38, -227, 14, 251, 156, -115, 243, 33, -56, 231, -33, 115, 128, -167, 68, 30, 39, -155, -184, -65, -78, -104, -156, -262, -43, -49, 90, 11, -162, -66, 13, 84, 6, -60, 237, -10, -108, -20, 46, -68, -69, 122, 148, 43, -123, -29, -47, 118, -127, 215, 42, 161, -21, 196, -140, 119, -78, -162, -57, -100, 190, 85, -53, -32, 20, -68, 101, 23, -8, -160, -107, -221, 267, 58, -16, 166, 128, -166, 104, -265, -36, 44, -74, 112, 26, 57, 34, 36, 226, 339, -229, -148, -94, 32, -344, 137, -187, 23, 228, -256, -23, -348, 39, 71, 47, -232, 159, 61, 193, -60, 126, 89, 79]
2448G9k18L8K96k44K83m51K92o3p9l2l8J84m1M6O1n1j46L1K53k97OL86k87K51
2472B59j83p1NR4j39m6L3K01k97J18J05k41J00J20j7j15K32j51Q4k5N7m97K93
2495h1k61O13k99j60K69j6j47J79o8P5P7n5j48j74L7J84L4Q1p2l83M07J5m3j14
2519e0j38O2j9J46q4r8J85j96J58L76m05oK93k73K34j50j5N6K58n00j6J57J37
2542A12k01O9L9qj09J35q1O0K9j35O5m0L08j86M6K6l61K61O7o9J49l09L41q0j16
2567A2p7J41M1q7Q9l09R0J12J16k33M09l86M1L35l10J38K6k22j15K42q8oL44m41
2591a38K97j81j81N0L3O26o54K51J95m93J42J9Q4j04j09J46o0L4K53l26j79K27
2613f8J92l29J23r9J2K64k10R7r0K44l87K21K30r0k01j16J18l4K34k25J43q0J49
$$ y = [79, -139, -101, 195, -49, 234, -217, 75, 12, -67, -99, -137, 47, 6, 52, 113, 62, -84, -53, 200, -97, -91, 295, 8, 259, 76, 5, 10, 104, -35, -81, -48, 153, -144, -26, 79, -162, -62, 58, 41, -74, 158, 7, 91, 66, 123, -374, -81, -342, 271, -28, -188, 81, 65, -82, 97, 29, 104, 181, 126, -22, -196, -159, 25, 59, 140, 68, -315, 92, 107, 64, -50, -188, -126, -145, 1, -83, -181, 4, -192, -34, 342, -63, -69, 224, -49, 185, 35, 20, 76, 334, -166, -182, -25, 112, -89, -20, 19, 11, -98, 37, -44, 16, 45, -90, -25, -65, 243, 57, 103, 129, -232, 29, 96, 27, 176, -133, 208, 128, 12, -65, 76, 117, 30, 119, -190, -100, 12, 128, -105, 304, -82, -41, 294, -16, 122, 148, -74, -189, 53, -35, -41, 303, -138, 159, -22, -203, -153, -120, 506, -148, 103, 298, -195, -53, -34, 50, -54, -163, -17, -77, -43, 210, -116, -295, -68, 124, -205, -82, -181, -169, 95, -115, -18, -108, 136, -251, -30, 200, 110, -91, -207, -89, -123, 111, -114, 29, -51, 98]
2636I8q8k04L45nj7n81N70k16j92K85O2j1j41n7J39K41k39k13L24M2k05j67L45
2659A15j81j2J81L2J68j91K01k14j2p3j21K06k48K94m20K28J83k3q3j10K75l74
2681a79M6j53J81k33N02j92K6L0J03n5n7Ol7J31p3k23K63M1m7j47l0l7O5j0l0
2706a09J18q8L54l32q2p1K66j07q6K34k97L76k88m30M56J54k26l1J62J19m8k85
2728b41L29J5J42l22m7J84J31q1j04j1q2J40j24J06p5Q6j32K94j31O2l58R6L50
2751B27j64j94M05j49k35K36l31OK21l04N04j64k22L85m15K26K46k83o5K03j1
2772A22l06J7p4J36P2k78N19j45j10J45j28r1N50o08J55k3q7N4P1p3o6O9k2J98
2796I7Q0J33k36N2k25p9K05K78o49L57P8k39J69J83l30K21k01J19Q0k70K56k91
$$ y = [98, 10, -194, 151, 146, 129, -452, 118, -98, -290, -5, 57, 46, -95, -152, -13, 228, -11, -224, 100, 142, -63, -230, 115, -66, -78, 103, 135, 303, 112, 313, 99, 87, 14, -107, 99, -149, 145, -275, -47, 136, 113, 30, -80, 195, -179, -133, -286, -105, -338, 164, -28, -2, 28, 131, 76, 19, 25, -12, 119, 46, -177, 86, 127, 80, -67, -97, -134, -69, -79, -109, 9, -79, 275, -57, -139, -210, 56, -51, -137, 97, -200, 176, -112, -542, -86, 68, -158, -189, -27, 92, 44, -241, 88, 103, 245, -77, -124, 60, 191, 110, 6, -5, -87, 53, -71, 35, -40, 46, -86, 208, 77, 139, -219, -123, 227, 63, -131, 274, 125, -110, 126, -205, -199, 22, -282, 222, 58, -164, 221, -194, 32, 278, -5, -70, 133, 122, -184, -167, -241, -105, -33, -311, 208, 63, -47, 98, -30, -121, 429, -179, -24, -47, -134, -80, -9, -82, -148, -79, -101, 97, 177, 310, 74, 126, -99, -178, 27, 305, -344, 13, 91, -148, 21, 204, -126, 95, -106, 13, 93, -177, 79, -212]
2818b12P0L49j01m6n6k06L19m37K78k06K33l15K57K4j09R7p5J98l7j2L2Kl0O7
2842H4j1j45L16j24j85k2J6J3K17j24%k35J66K4L0P9K69k55k14M00l79r5L13m4
2866I4K0j51L6N1l67L81p6n7J26j62o8L06k82k4R4R2n3k6r4K06k15J48J15j94
2890a00Q7q0K47L87l16k25P1j54j96L30j54K59l30K76j45K09l24L86k24j84K24
2911D4k96K12l1k3J80j60J37k45K34j66L56k43j61M06j43Q2j44j65L39k85L4J
2933c7J64Q1l5k05j35M47k38J6j97J15j36K08L0j52k8K0R9k6J28Q2%l07m0L23
2957A77k26r4JQ7L19k76q2J23q8J8J58j12J83j12l75K27J06O4m9j70J86j16j36
2980a87K11O2kOqL35l31m1k93L17k08N1J61O6k26J14J49j95K53l51J66Nk9l1Q5
$$ y = [-212, -142, 207, 106, 60, 4, -202, 117, -320, -42, -248, -15, -330, -73, -49, -158, -61, -136, 62, 25, 13, 45, 47, 17, 84, 73, -72, 244, 120, -65, -87, -71, -58, 159, 35, 35, -200, -34, -10, 20, 99, 368, 113, -101, 299, -80, -175, 138, 94, 114, -37, -1, 50, -317, 64, -12, -69, 57, -105, -173, 133, -149, -173, -79, 13, -40, -66, -160, 46, -169, -21, 94, -100, -13, -93, 154, 541, 225, 0, 71, -83, -279, 51, -103, 156, -174, 102, -43, 166, -158, 228, 4, -180, 44, -252, -40, -71, -94, 86, -74, 63, -182, 52, -114, 242, -1, -162, 244, 101, 183, 39, -126, 213, -72, -38, -37, 127, 208, 173, -32, -167, 280, 42, 58, -139, -24, -160, 48, 78, -74, -102, -82, 17, -9, 119, 201, 201, -106, -146, 177, -49, -143, -142, -55, 264, -12, -94, 29, -59, -41, 117, 5, 188, 76, -299, -72, 34, 98, 49, -121, 65, -51, -187, 24, 86, 84, 90, 82, 417, 86, 45, -248, 69, -139, -88, 73, 139, -87, 27, 176, -19, 234, -117, 49, 54, 25, -6, 79]
3005G9K28j96O4k18J52N9j14J37J7k07k06K3O6L42k16q2k20K24j3K30k15k04L02
3028C2j34K66qj53O6J28o2k55J06J19o4l09J91L23m21R4K5l3O1q9M5K01k34J66
3052F1j6Q0k68L52j84p1j89K16l8R8j90o3P1K79l94L40J30l53J12n5K42m7P0k14
3076c1J97K8l54l3J23j22J32R2J69o0j07M0l21o5K69J38k22K30l6JJ1q0O8J00
3100A67j11k9j67K32k01L28m94L25J1l4q6J19j84M3m1J43M4M1n3RM0K98m14rJ85
3125A62j72N1j25K90j27j0j59J51mJ0j24N7l7J39k02k41M38j24J80r1k92K65j30
3148i5J10l49J61L19k22l0L5O9R3j04K1K7j50J42l29J71j16J27%J56p5o1K42k18
3172g6L8Q9j76m5K64j49P7Qj98M8K94l06L07j21j39OJ54j40l9N2J77j55O3k8j77
$$ y = [79, 307, 111, 175, -43, 109, 168, 54, 191, 208, 1, -205, -182, -116, 226, 10, -72, -292, -68, -81, 149, -66, -270, 32, -102, 164, 156, 3, 69, 197, 135, -120, -14, 105, 41, -268, -77, 246, -175, -81, -56, -89, -28, -117, -72, 129, -105, 61, 45, 125, -143, 209, 25, -46, -235, -19, -57, 41, -149, -212, -141, 138, -256, 84, 214, -139, -27, -82, 160, 113, 183, -31, 166, 194, -160, -193, -70, -192, -60, 32, 201, 141, 34, 74, -247, -312, -43, 95, -127, 103, 67, 68, 79, -1, 67, 167, 56, 27, -140, 92, -109, 219, -275, 50, 61, 27, -59, 60, -124, -81, -122, 21, 65, 106, 53, 62, 102, 400, -14, -23, 162, -10, 41, -84, 206, 79, 69, -90, 61, 57, 67, -57, 0, -37, 102, -100, -341, 97, -27, 153, 62, -230, 35, -95, 15, -334, -173, 146, -76, -106, -71, -2, 91, -13, 8, 35, -115, 27, -302, -131, -247, -120, -120, 36, -39, -100, 142, -76, -38, 51, -125, -170, 94, -55, 22, 30, -168, -120, 174, -132, 175, 54, -85, -79, 75, -65, -104, -52, 125, -30, 33, 5, -172]
3197a72j89L75P3j49J82k24j4J1M24m46K86k27K59N7l61J88K3k24J71Q4j78J59
3219A08p8M85o40N0K3K00m4k93K76p6N1j82J46j64K82N1j33K3l79N77m35J75J8
3242D1k11K25q6P0J63k11R1J1o4L3M9q9l6J3N2l7j6N1K16k46J3J27k93J6LN0K59
3269A94j08j55K70k17k24J88J56l60K27J01J48j09l32L09j98K18o5k19K93k20
3289a03J04j52L81l38J14J52M8k82K38M6j96n4R0N6j45OJ12l7n4N8k47J8K89k06
3313a02K48l02J59KR9k62J61j13K27j81J96l09K31m3j61L26m9k88j61L63k89K60
3335A2K05j39r5J86N4j90k36M76o2l66O2L67m07K52j84J51R3n5j36j89l7q3J67
3358a54K13J38p1j82p9J11R1k6J29n9j9k62Q9ok22J98O4o2L45k35k79K19M9K08
$$ y = [-172, -361, 14, 87, -62, 120, -104, -118, -107, 317, -129, 157, -70, 189, 246, -115, 73, 96, -128, 43, 127, -51, 108, 30, 515, -125, -75, -52, 148, 104, -189, 87, 11, 62, -120, 26, -138, 144, 195, 62, 85, -294, 283, -152, 23, 41, -170, 55, -31, 39, 202, -9, 82, 93, 29, 62, 111, 22, -14, -1, 51, 14, -2, 49, 265, 19, 32, 159, -134, -118, -115, -65, 194, 86, -69, 201, -16, -240, -52, 104, -256, -29, 72, 220, 111, -221, 88, -110, 108, 43, -176, 117, -103, 1, -151, 230, -108, 6, 158, 206, -76, 162, 208, 12, -42, 48, 104, -41, -35, 77, 40, -14, 44, -203, -185, 104, -102, 146, -156, 3, 5, 104, -158, 3, -110, 117, -64, 132, -177, 54, 11, -150, 176, 127, -161, -322, 41, -248, 12, 217, 78, -17, 169, 223, 33, -203, 273, 211, -155, -93, 274, -133, 119, -65, 86, 179, 124, -12, -201, -238, -321, -154, 59, 197, 126, -56, -135, -24, 67, 41, 170, 111, 92, -170, -81, -87, -309, -111, -47, -109, 236, 1, -278, -59, -10, 198]
3382A98m55L06o5j12PL61j43l02j1K32J3l0j05o8M9j07K54O3k39N0J74n1P3j36
3406d4Q5O7K68m78j38K53R1N5k17m3K28o9oj04R9J35j50k1q8J15j58J35r2N5j59
3431a81R7k17J56M1K37j69K08k44P9o7J38k9k7k04K81k03R7J3j96m0K67N3Q9j18
3455F1j55K10K5J40m55J38J11N8j92k13L33n3O4Nj9j59q6O09n19P1J34j5k13n2
3479a72J64L1j78K24J9k03n2J1J50J48k03oo6J09j46L09o4j56P1j11L8J9J19k5
3503C0O3j19M6J50Q8k98J37m14J58M29l34O2j14R9Q2k12L29j69j00l1J70K2q3
3526ij0j55J78m64K54L88j01m9Kj43j77M00l44K61r9p6L41Kk88K29l05K18L9j02
3550a0J75l50K41QN8J20k90j59J60k6J30O3Mr2j64K98o7k39K63k6k09J92o4q1
$$ y = [198, -257, 49, -16, -128, -121, 240, 97, -205, -216, 16, 29, -1, -106, -174, -125, -232, 22, 85, -154, -104, 70, 19, 92, -44, 41, 108, 376, -102, -240, 13, 104, 159, -58, -101, 127, 58, 52, -52, 47, 182, 32, 11, -77, 38, -120, 15, -77, -22, -181, -84, -301, -145, -104, 133, -36, 172, -72, 7, -60, 78, 49, 22, -182, 99, -104, -7, 6, -190, -230, 37, 90, 179, 61, -94, 116, 141, 281, -174, -36, 75, 133, -59, -272, 61, 8, 72, 77, 58, -101, -187, 422, -97, -26, 108, 93, -120, -172, -8, 23, -155, 69, 88, -115, -167, -156, -6, 142, -61, -67, -133, -24, -170, 139, 75, -81, -10, -121, -83, -64, 55, 30, 93, -26, 20, 170, 258, -40, 97, -317, -159, 270, -64, -2, -116, -17, 65, -147, 182, 13, -87, -118, 52, 74, -9, -19, -174, 4, -460, -206, 182, 81, 32, 34, -109, -286, 114, -230, 31, -68, -144, 197, 199, -89, 140, -165, 53, 92, -10, 165, -185, 56, 64, 122, 242, -48, -207, -47, -73, 57, 120, 124, 32, -132, 166, 99, -140, 123, 97, -112, 80, 16, -65]
3574f5J3J18l28J14Q0kO6j48k0J92J41l79J62J93K24n29Q4j6J60r2J07j14j1N9
3598IkK07m2j58K23l20M14n32J58j52K85n3p1j25L1j76K09n0L13j82k8J17j59
3621h4R7j95K01l5q4J64k71K05j99P4K9j38L38k24K71M7j26k55J81Q9j28j9R7
3644C5L7J05j73o9J44o2N9m04M37J4k70N2m6L1R7K8n0P8P3p1lJ14p5L6o1L0M1
3671A27j67k1N1K4J29K1k80K43j63P6l9J80m33L37l00L85r3J07o0j13j44L09l2
3694A44m00K61m3j70L86k83J89k24N6k2P3J71l16K98j74j18P8L02k14K02k38J96
3716A54k38L50r9k91J6k4L22k0k73J97k86K00J30q4J88j89p3O9rp9J51j75J9j06
3740a50K90k03r1Q3M4K4j6J38l14J48K01M8l13J37R2k4k00J81L6k56J67k5K79
$$ y = [-65, -52, 66, -262, -148, -68, -70, -4, -152, -172, 20, 161, -218, -56, 137, 361, -168, -84, -100, 60, -32, 75, -39, -50, 9, 7, 214, 172, 14, 237, -83, 331, -201, -43, -195, 90, 37, -34, -159, -128, -304, -95, -145, 168, -14, -42, 75, -84, 13, -182, 19, -16, -100, 64, -207, -2, -201, -127, -98, -236, 102, -122, 149, 196, 70, -185, -4, 85, -43, -62, 35, 72, 177, 4, -65, 79, 17, 76, -328, 109, 123, -147, -95, -141, -110, -13, 15, -35, 43, 116, 45, 42, 156, 81, 117, 56, 86, 127, -40, -61, -10, 14, 143, 164, -116, 127, -36, 40, 1, 181, -252, 85, -215, 170, 77, 184, 124, 11, -133, 176, 144, -256, 5, -38, -208, 178, -105, 84, -140, -84, -106, -33, 138, -178, 120, -54, -172, -94, 208, -6, 196, -42, 154, -84, 266, 167, -124, -108, -132, 190, 170, -103, 94, -192, 8, 138, 54, 242, 53, -20, 49, 40, -39, 112, -63, -44, -150, 140, -63, -154, -71, -27, -3, -19, 119, -195, -47, 154, 202, -111, 26, 118, 94, -106, 75, 111, -145, 22, -3, 276]
3763B76l27N0o5r0K20j08J20K9j77P5j00J63j51J13J48j60K89n7k52J93k45m9
$$ y = [276, -51, -1, -66, -156, 64, -44, 76, 105, -72, 3, -97, 66, -85, 28, 176, 16, 305, 248, -4, 189, -56, -105]
$$ [...]
8191b16
##END NTUPLES=NMR FID
##END=
