##TITLE=1H_LR-691-R2-OST
 CDCl3
 8 sc, 
 26.6.2024
##JCAMPDX= 6.0         $$ Bruker NMR JCAMP-DX V2.0
##DATA TYPE= NMR FID
##DATA CLASS= NTUPLES
##ORIGIN= UXNMR, Bruker Analytische Messtechnik GmbH
##OWNER= root
$$ XWIN-NMR		Version 3.5
$$ Wed Jun 26 13:51:03 2024 Russian Standard Time (UT+4h)  she@DPX200
##.OBSERVE FREQUENCY= 200.1312
##.OBSERVE NUCLEUS= ^1H
##.DELAY= (6, 6)
##.ACQUISITION MODE= SIMULTANEOUS
##.ACQUISITION SCHEME= undefined
##.AVERAGES= 8
##.DIGITISER RES= 18
##SPECTROMETER/DATA SYSTEM= spect
##.PULSE SEQUENCE= zg30
##.SOLVENT NAME= CDCl3
##.SHIFT REFERENCE= (INTERNAL, CDCl3, 0, 15.7039)
##AUDIT TRAIL= $$ (NUMBER, WHEN, WHO, WHERE, WHAT)
$$ ##TITLE= Audit trail, XWIN-NMR		Version 3.5
$$ ##JCAMPDX= 5.01
$$ ##ORIGIN= Bruker BioSpin GmbH
$$ ##OWNER= she
$$ F:/spectra/data/she/nmr/H-F/1/audita.txt
$$ ##AUDIT TRAIL=  $$ (NUMBER, WHEN, WHO, WHERE, WHAT)
(   1,<2024-06-26 13:50:01.32 +0400>,<she>,<DPX200>,
      <created by zg, POWCHK disabled, PULCHK disabled
       configuration hash MD5:
       00 E9 B6 7A A2 85 ED C7 34 08 36 98 17 FE 4E 26
       data hash MD5: 16K
       DF 48 26 EF 9C 87 4E 6F 2F 7A 4C 9A 1E 5C 50 79>)
$$ ##END=
$$ 
$$ hash MD5
$$ 90 3F F3 8D C8 1D 3D 43 4F 02 52 B6 1E C1 5E 4D
##$RELAX= 
##$RELAX= 
##$RELAX= 
##$RELAX= 
##$RELAX= 
##$RELAX= 
$$ Bruker specific parameters
$$ --------------------------
##$DU= <F:/spectra>
##$EXPNO= 1
##$NAME= <H-F>
##$PROCNO= 1
##$TYPE= <nmr>
##$USER= <she>
##$AMP= (0..31)
100 100 100 100 100 100 100 100 100 100 100 100 100 100 100 100 100 100 
100 100 100 100 100 100 100 100 100 100 100 100 100 100 
##$AQSEQ= 0
##$AQ_mod= 1
##$AUNM= <au_zg>
##$AUTOPOS= <>
##$BF1= 200.13
##$BF2= 200.13
##$BF3= 200.13
##$BF4= 200.13
##$BF5= 200.13
##$BF6= 200.13
##$BF7= 200.13
##$BF8= 200.13
##$BYTORDA= 1
##$CFDGTYP= 0
##$CFRGTYP= 5
##$CHEMSTR= <none>
##$CNST= (0..31)
1 1 145 1 1 1 1 1 1 1 1 1 1 1 1 1 1 1 1 1 1 1 1 1 1 1 1 1 1 1 1 1 
##$CPDPRG= <>
##$CPDPRG1= <>
##$CPDPRG2= <>
##$CPDPRG3= <>
##$CPDPRG4= <mlev>
##$CPDPRG5= <mlev>
##$CPDPRG6= <mlev>
##$CPDPRG7= <mlev>
##$CPDPRG8= <mlev>
##$CPDPRGB= <>
##$CPDPRGT= <>
##$D= (0..31)
0 1.2 0 0 0 0 0 0 0 0.06 0 0.03 0 0 0 0 0.0002 0 0 0 0 0 0 0 0 0 0 0 0 
0 0 0 
##$DATE= 1719395400
##$DBL= (0..7)
120 120 120 120 120 120 120 120 
##$DBP= (0..7)
150 150 150 150 150 150 150 150 
##$DBP07= 0
##$DBPNAM0= <>
##$DBPNAM1= <>
##$DBPNAM2= <>
##$DBPNAM3= <>
##$DBPNAM4= <>
##$DBPNAM5= <>
##$DBPNAM6= <>
##$DBPNAM7= <>
##$DBPOAL= (0..7)
0.5 0.5 0.5 0.5 0.5 0.5 0.5 0.5 
##$DBPOFFS= (0..7)
0 0 0 0 0 0 0 0 
##$DE= 6
##$DECBNUC= <off>
##$DECIM= 32
##$DECNUC= <off>
##$DECSTAT= 4
##$DIGMOD= 1
##$DIGTYP= 9
##$DL= (0..7)
0 120 120 120 120 120 120 120 
##$DP= (0..7)
150 150 150 150 150 150 150 150 
##$DP07= 0
##$DPNAME0= <>
##$DPNAME1= <>
##$DPNAME2= <>
##$DPNAME3= <>
##$DPNAME4= <>
##$DPNAME5= <>
##$DPNAME6= <>
##$DPNAME7= <>
##$DPOAL= (0..7)
0.5 0.5 0.5 0.5 0.5 0.5 0.5 0.5 
##$DPOFFS= (0..7)
0 0 0 0 0 0 0 0 
##$DQDMODE= 0
##$DR= 18
##$DS= 0
##$DSLIST= <SSSSSSSSSSSSSSS>
$$ [...]
##$SUBNAM2= <"">
##$SUBNAM3= <"">
##$SUBNAM4= <"">
##$SUBNAM5= <"">
##$SUBNAM6= <"">
##$SUBNAM7= <"">
##$SUBNAM8= <"">
##$SUBNAM9= <"">
##$SW= 18.0517418723606
##$SWIBOX= (0..15)
0 0 2 0 0 0 0 0 0 0 0 0 0 0 0 0 
##$SW_h= 3612.71676300578
##$TD= 16384
##$TD0= 1
##$TE= 0
##$TE2= 300
##$TE3= 300
##$TEG= 300
##$TL= (0..7)
0 120 120 120 120 120 120 120 
##$TP= (0..7)
150 150 150 150 150 150 150 150 
##$TP07= 0
##$TPNAME0= <>
##$TPNAME1= <>
##$TPNAME2= <>
##$TPNAME3= <>
##$TPNAME4= <>
##$TPNAME5= <>
##$TPNAME6= <>
##$TPNAME7= <>
##$TPOAL= (0..7)
0.5 0.5 0.5 0.5 0.5 0.5 0.5 0.5 
##$TPOFFS= (0..7)
0 0 0 0 0 0 0 0 
##$TUNHIN= 0
##$TUNHOUT= 0
##$TUNXOUT= 0
##$USERA1= <user>
##$USERA2= <user>
##$USERA3= <user>
##$USERA4= <user>
##$USERA5= <user>
##$V9= 5
##$VALIST= <valist>
##$VCLIST= <CCCCCCCCCCCCCCC>
##$VD= 0
##$VDLIST= <DDDDDDDDDDDDDDD>
##$VPLIST= <PPPPPPPPPPPPPPP>
##$VTLIST= <TTTTTTTTTTTTTTT>
##$WBST= 1024
##$WBSW= 4
##$XGAIN= (0..3)
0 0 0 0 
##$XL= 0
##$YL= 0
##$YMAX_a= 206732
##$YMIN_a= -291093
##$ZGOPTNS= <>
##$ZL1= 120
##$ZL2= 120
##$ZL3= 120
##$ZL4= 120
##$ABSF1= 10
##$ABSF2= 0
##$ABSG= 5
##$ABSL= 3
##$ALPHA= 0
##$AQORDER= 0
##$ASSFAC= 0
##$ASSFACI= 0
##$ASSFACX= 0
##$ASSWID= 0
##$AUNMP= <proc_1d>
##$AZFE= 0.1
##$AZFW= 0.1
##$BCFW= 1
##$BC_mod= 2
##$BYTORDP= 1
##$COROFFS= 0
##$CY= 11.3945322036743
##$DATMOD= 1
##$DC= 2
##$DFILT= <>
##$DTYPP= 0
##$F1P= 15.6554695791079
##$F2P= 12.8336369535428
##$FCOR= 0.5
##$FTSIZE= 0
##$FT_mod= 4
##$GAMMA= 1
##$GB= 0.15
##$INTBC= 1
##$INTSCL= 1
##$ISEN= 128
##$LB= 0.24
##$LEV0= 0
##$LPBIN= 0
##$MAXI= 10000
##$MC2= 0
##$MEAN= 0
##$ME_mod= 0
##$MI= 1.114404
##$NCOEF= 0
##$NC_proc= 0
##$NLEV= 6
##$NOISF1= 3.799351
##$NOISF2= 2.8
##$NSP= 1
##$NTH_PI= 0
##$NZP= 0
##$OFFSET= 15.70392
##$PC= 1
##$PHC0= -25314.05
##$PHC1= 9.587481
##$PH_mod= 1
##$PKNL= yes
##$PPARMOD= 0
##$PSCAL= 0
##$PSIGN= 0
##$REVERSE= no
##$SF= 200.130013532006
##$SI= 16384
##$SIGF1= 3
##$SIGF2= 2
##$SINO= 400
##$SIOLD= 16384
##$SREGLST= <1H.CDCl3>
##$SSB= 0
##$STSI= 0
##$STSR= 0
##$SW_p= 3612.71676300578
##$SYMM= 0
##$S_DEV= 0
##$TDeff= 0
##$TDoff= 0
##$TI= <>
##$TILT= no
##$TM1= 0
##$TM2= 0
##$TOPLEV= 0
##$USERP1= <user>
##$USERP2= <user>
##$USERP3= <user>
##$USERP4= <user>
##$USERP5= <user>
##$WDW= 1
##$XDIM= 8192
##$YMAX_p= 0
##$YMIN_p= 0
$$ End of Bruker specific parameters
$$ ---------------------------------
##NTUPLES= NMR FID
##VAR_NAME=  TIME,          FID/REAL,        FID/IMAG
##SYMBOL=    X,             R,               I
##VAR_TYPE=  INDEPENDENT,   DEPENDENT,       DEPENDENT
##VAR_FORM=  AFFN,          ASDF,            ASDF
##VAR_DIM=   8192,          8192,            8192
##UNITS=     SECONDS,       ARBITRARY UNITS, ARBITRARY UNITS
##FACTOR=    0.0002768,     1,               1
##FIRST=     0,             0,               0
##LAST=      2.2672688,     0,               0
##MIN=       0,             -291093,         0
##MAX=       2.2672688,     206732,          0
$$ Real data points
##PAGE= N=1
##DATA TABLE= (X++(R..R)), XYDATA
0@%%%%%%%%%%%%%%Mj2J6j6J6j6K2l0L2l8M6n2O0p0Q1r1J04j18J32j52J74j94K18
37A16k45K72l03L39l76M17m62N08n62O22o85P54q31R15j008J112j228J357j502
56g90J671j866K090k356K679l077L585m254N177o547Q781j3025K3832j02007k04986
71b91093K52521K45304j06164j98984O5471J39164m1326j30089k8902J7748O175
82g0175L7867O3580R987J647N3869K5184q4508q1661J4990J9744n7267l2548N7437
95d1854N5555q607k014K5283q034k8398K1299K6477l4099k9223L9822J6178o4307
108c1922k6995O7665K2226p1440j985J11588L2287j07729n2032P3836J7274r8174
120f5401l6047Q5932M7651m0384M312O8591M965o4345j5996K9104k2585m4857
$$ y = [0, 0, 0, 0, 0, 0, 0, 0, 0, 0, 0, 0, 0, 0, 0, 4, -8, 8, -8, 8, -8, 14, -16, 16, -22, 24, -28, 32, -38, 43, -48, 56, -62, 70, -82, 92, -102, 116, -129, 143, -160, 179, -197, 220, -242, 266, -296, 326, -359, 395, -436, 479, -529, 583, -645, 712, -790, 881, -985, 1105, -1251, 1428, -1649, 1936, -2318, 2859, -3688, 5093, -7932, 15900, -86107, -291093, -38572, 206732, 100568, -98416, -32945, 106219, 64893, -65196, -94098, -76350, -70175, -32308, 31272, 41259, 42906, 96775, 121959, 37451, -44210, -29220, -9476, -66743, -99291, -41854, 13701, 5094, 3080, 28363, 20329, -8069, 13230, 39707, 5608, -23615, 16207, 32385, -31922, -58917, 8748, 30974, -40466, -42451, 69137, 101424, -6305, -58337, 15499, 32773, -65401, -101448, -15516, 32135, -8249, -3937, 64654, 69619, 5274, -10722, 18382, -4203, -49060]
132d9060K1798M5834j7400l1042L3592M0611l0123m7107J2951L5278m197k2732
144a1597k368O851O193J2967M28k2632m935L6460K0527l1230k4589J8646O146
157A0867l4620j4301K7609O224k2652J7326N1082j699m8724j285M1022j0060n4754
170c3965n216M4027Q561k5960P202K9981o748k3239J0565J3727k7187k5045K4626
183h671K6186k4008k6796K2881L3836q759k3336Q182K2073j399j7000q121J535
196c397q5m002n645j033J1524J3325l982j1113P942J4748j2671k5012L660K2083
210F342k064j9213O408K3957J794j5821L35R690p849j3488M901N995j2048n927
224a6988J7414J0673j5001p765K1215J2989k0263j8256J5220J6282j5340k1593
$$ y = [-49060, -27262, 18572, 1172, -29870, 3722, 44333, 14210, -32897, -19946, 15332, 11135, -11597, -13965, -7114, -921, 12046, 12474, -10158, -15093, 21367, 41894, 10664, -13925, 4721, 10867, -23753, -38054, -10445, -4221, -26873, -9547, 41535, 39836, -8888, -10173, 30849, 20789, -33965, -39181, 4846, 13407, -12553, -5351, 24630, 17882, -5357, 5208, 18935, -8252, -33297, -8671, 17515, -6493, -33289, -10408, 23428, 14669, -8667, -485, 21588, 20189, 3189, -4932, -3397, -3482, -7484, -13129, -14162, -2638, 10687, 6705, -4408, 3534, 18282, 5611, -19401, -15741, 6342, 4278, -14935, -8527, 15430, 17224, 1403, 1738, 11428, 3579, -9909, -5008, 987, -11061, -16988, 426, 11099, -3902, -11667, 9548, 22537, 2274, -15982, -762, 15520, 180, -21413]
236b1413Q387K3919K120j5928l585J4443Q988r256j5545m651P309L813n771n973
250a3143N319J1824N540j065p16K13k821j744r93n378r446k60J0807N229p438
265d072j796J2208Q017p334q537K135J951p966m900N157K058m920K261J4458O361
280A5081r570o843Q654O599j0752j5166n73Q526J683n377n64P178O809J909q44
295F750j778j414j336j199l302m108j929L517M981J758j735O00N851L507n394
310D769p487j456L409j220n606j400N714L951J02K014L290J00l892R11J808m042
326I65p375L83N937j7o290Q40Q830L695n383m246L768L617k575m873j659J253
342c130K073K162j00k771k01N159L577k922o287q28M545J872m920m568K496N339
$$ y = [-21413, -13026, 10893, 13013, -2915, -6500, 7943, 16931, 7675, -7870, -12521, -5212, -1399, -7170, -13143, -7824, 4000, 9540, 8475, 7759, 7972, 5151, 3407, 2414, -2964, -12410, -12670, -1863, 3366, -4072, -5868, 6340, 14357, 7023, -1514, 621, 2572, -5394, -10294, -5137, -3079, -7999, -5738, 8720, 15081, 5511, -1332, 7322, 13921, 3169, -11997, -12570, -4044, -2361, -7738, -8302, -1124, 5685, 7594, 6750, 4972, 3558, 2222, 1023, -2279, -6387, -8316, -4799, 182, 1940, 205, 805, 6656, 10163, 4769, -2718, -4174, -765, -1985, -7591, -8991, -3277, 674, 776, 2790, 6080, 6180, 2288, 3199, 5007, 965, -6410, -6027, -90, -107, -6397, -5557, 3273, 6968, 1585, -2661, 1107, 4724, 2149, -2724, -4383, -3130, -1057, 1105, 1005, -1766, -1967, 3192, 6769, 3847, -2440, -3268, 1277, 3149, -1771, -6339, -3843, 1496]
358A496J191m615j666L575N161j604m758J40L296L68l097l43P72j460o24L022
374H54J483m084l249M589N686k899o278J060O054L29m629k169K513P20j65R33
390G48n8j545Q59M531k7n282l094L966K958l690n363N74N771K945k539l054J690
407f10M807J836m349m481J394L615j258l967m52K721Q69n98J646J075k087o53
423d92L316O36n564l716L959M101l194l373L423N420L0l185M3L28j974o57L53
440e46j677k386J768M605J95l169J60L480J284k550k126J24O38O05o67k388q93
457c543L653L282j066l346J395L902q79n293j605J159n2l32J036J545r2J462M290
474E516j66n046k281L027P25m620k354K491L000l8l88J067o80N81K268P82m603
$$ y = [1496, 2687, -1928, -3594, -19, 5142, 3538, -1220, -1080, 2216, 2584, -513, -856, -84, -1544, -2168, 854, 2337, -1747, -4996, -407, 5279, 2380, -3898, -2838, 3216, 3545, -1084, -3253, -740, -20, -185, 748, 690, -855, 4, 4535, 4508, -774, -3868, 98, 3056, -634, -5997, -5423, 348, 3293, 754, -2300, -610, 4197, 6033, 1684, -2797, -1403, 2212, 954, -3013, -3465, -744, 125, -473, 1173, 2248, 161, -492, 2824, 3460, -2104, -5820, -1861, 2240, -954, -4327, -904, 4516, 4546, 1361, 1404, 1732, -242, -899, -546, -2223, -4609, -2841, 1764, 1959, -1210, -1050, 2430, 3714, 1164, -962, -838, -200, 405, -262, -2650, -3543, 110, 3392, 2326, -1020, 375, 4277, 3398, -1895, -3500, -2341, -2393, -2725, -1689, -144, -236, 1226, 5516, 5350, 304, -1977, 1050, 1775, -2845, -5199, -2708, 292, 254, -134, 933, 253, 834, 3102, 3884, -719]
491g19l394L364K757l098m951K218M898J485r13R42K08N4N94p57m945m372K503
508d126L656j140l181K411N821J654k188j048l87q51O53N29l407l910K056M890
524A432j233m356J366N619J791k598k42M93j440j846L39j330l716O17N184K454
540B534l035m35N083K844m407l424P51K33p89j412q38j311J011L432J750l038
556a051n55M552L615l094l531O60J050k308k498l52m53M93L795K259j633j244
572b95L300L243l986n388N78L197j335l123J22J974J245J539J491p26j687K075
588B224L304k212n475j910K581O91k912r66K154K400K400J519o6k176L2J748j239
605B097n506k002L769K231k565j411K291L431P89q69n39j234r46K095r4m124k503
$$ y = [-719, -4113, -749, 2008, -1090, -6041, -3823, 1075, 2560, 1647, 2589, 2797, 2851, 3445, 2688, -2257, -6629, -4126, -470, -1610, -4791, -2380, 3441, 5095, 2907, 1859, 1472, 621, 1274, 1803, -1604, -5514, -3458, 1432, 199, -4157, -2791, 2828, 4619, 2021, 1779, 2272, 832, -1014, -675, -2005, -5721, -5104, 80, 2534, -501, -936, 4147, 6991, 2584, -840, -89, 144, -645, -2057, -2895, -4206, -3195, 237, 1987, -1051, -1606, 2946, 6561, 3467, -64, 596, 1646, -662, -3160, -3512, -3965, -3472, 323, 2582, 949, -295, 3005, 6248, 2262, -3126, -2548, 649, -686, -3809, -3687, -1713, -468, 1071, 2562, 1836, 149, 2224, 5528, 3316, -2159, -4069, -1488, -797, -3709, -4675, -2521, -121, 2279, 3798, 3732, 1556, 1588, 3336, 2097, -3409, -5411, -1642, 589, -1976, -3387, -1096, 2335, 3124, 2255, 1716, 482, -464, 1631, 1537, -2587, -5090]
622e090K456L886j052k030J682L330M78j447m84j450j521N86J73j825k046K369
638a985L703j48k788J143L432l58k262j145K10q56N3J076j009j647J285L442M30
655B576k593j125K753P71k802j596N39L11M97N31J17o99J014K490J20l233j431
672a760K038J537k383k180R26K105N54l15n87m36O45J359M1k216j811J714K183
689A414j392k010P12K284J303q92j185k88L31M93j42j878j728J499K578N1k039
706h89j98J950J610r81j710p10N02O92k07j053j445J165K397j1j151j058J619
723E22J895j050k300o92J035O82k38j077l83Q74K256N55j205j587J003J553j008
740H35k043p84J499O18p53k72R1Q31J360L22j009r80O14J585r62k295o87J419
$$ y = [-5090, -2634, 1252, 200, -1830, -148, 3182, 3660, 2213, 1729, 279, -1242, -656, -483, -2308, -4354, -1985, 1718, 1570, -1218, -75, 3357, 2999, 737, -408, -198, -1054, -1001, 75, -934, -2581, -1296, 2146, 2576, -17, -1142, 1611, 2382, -420, -2016, -1477, -1166, -669, -138, -21, -720, 294, 2784, 2904, -329, -1760, 278, 1815, -568, -2748, -1822, 283, 837, 522, -65, -501, 144, 1503, 1544, -672, -2483, -769, 1414, 22, -1988, -1276, 1008, 2311, 1419, 234, -54, 277, 770, 628, -1250, -2978, -1479, 1099, 1150, -889, -1087, 863, 2473, 1492, -218, -928, -426, 266, 59, -994, -2439, -1274, 1123, 1112, -39, -1097, 522, 2417, 1367, -933, -1625, -590, 92, -146, -1223, -1606, -732, 1524, 2079, 874, -713, 290, 1843, 835, -1208, -1992, -493, 125, -628, -900, -809, 22, 1382, 1704, 695, -285, 329, 1914, 952, -1343, -2030, -611]
758f11J143q41q38M4J265J033N89j098j298L39J126J2k116j177J432J326M5j239
776h64M02J431J067j54j425j092J66J143k40k203j221J691J979J58j456K60J597
793A239J010k82j271j648J56J096k90j274j200J184K200L27j033k40J076P23o42
810A131j457r28m9Q56o8m16o79J219K060K76j139q41P86Q13o97j870j219L17J331
829e74N03o98m25J078K100O30j378j218nJ358r33j859r50J224J192N5l47j34Q43
848D62J226L56j535j383O7Q64j08j639n41J320J798N34q80l23M59J118r1j550
866A54j356QO84K49r42n18J173J587L11o11k61K21M0M9r00j255K8J237O07j285
886g80m25J533J027L31j155p66K59M96n44o58j065O98J024Q04o31l54O47J112
$$ y = [-611, 532, -309, -1147, -1103, 162, 1195, 1784, 686, -612, -273, 853, 865, -1251, -2428, -996, 330, 375, -864, -462, 969, 2036, 1882, 457, -635, -469, 674, 434, -1769, -2990, -1299, 680, 838, -618, -358, 1239, 2249, 1967, 696, -952, -796, 300, 10, -1264, -2464, -1280, 920, 1247, 214, -26, 1050, 1773, 1131, -326, -1254, -1303, -447, -515, -931, -1610, -391, 1669, 1945, 806, -35, 751, 1564, 867, -1003, -2222, -1905, -574, -71, -769, -1194, -116, 1984, 2614, 1236, 18, 13, 1371, 438, -1421, -2371, -1147, 45, 100, -247, -381, 462, 1688, 2044, 509, -874, -807, 57, -51, -1690, -2231, -911, 887, 1421, 541, 218, 677, 1795, 1704, 154, -1202, -1194, -510, -261, -1203, -1721, -548, 1039, 1350, 739, 478, 699, 739, 788, -112, -1367, -1339, -102, 505, -780, -1205, 328, 1355, 1686, 531, -235, 24, 520, -24, -682, -1747, -1049, -25, 779, 148, -206, 441, 1553]
904A553m50j199l49O4N46l98p01l66M07J212M87m15o97M83J391n2k048p02M16
923h18P12o9o15n66J051J132N95r32q23K54J156n22j068j165P41O25L07j60k68
942d33L38J074P20o24j359j59Q59k10j157q48P70J309J36k90J36K92N56K51p68
961E93r12l37J70M56q37o83Q61J135P00m20j28l13R96l2j117j295l62Q76J61o36
981a124l50P06J830L38m53p6J11%m80n42j035n40M61J104n51p07R69J895Q75j666
1001G65n47K52M77p21j367p79K47J281N08j11l05P56R55O96j077r90j96P3o26
1020g09n94l50M79R84O49k3l67N53J181J09j254j258n8O61l23q97n83N19J286
1039EP41J16j92nQ51J6r30j810k46P22L98n63m09R19Q67P59j08p10q4M79L20j329
$$ y = [1553, 1103, -96, -445, -381, 165, -233, -934, -1300, -893, 319, 806, 391, -306, 177, 1568, 1516, -532, -1234, -818, -106, -175, -790, -1356, -305, 827, 1422, 490, -333, -79, 1077, 555, -513, -1678, -937, -312, -5, -165, -433, -95, 979, 1699, 1075, -284, -443, 416, 206, -951, -1799, -1029, 280, 416, 126, 262, 554, 1110, 1361, 593, -319, -656, -486, -30, -867, -1550, -689, 446, 1146, 726, 598, 285, 1281, 1249, 132, -1163, -1525, -649, -488, -1124, -1474, -768, 1062, 1400, 947, 871, 982, 982, 502, -40, -1075, -1615, -1154, -50, -601, -1308, -339, 1556, 2431, 765, 218, 470, 947, 226, -1141, -1920, -1673, -392, 116, 5, -300, 456, 1411, 2107, 1030, 40, -156, -83, -709, -1303, -1653, -1174, -190, 459, 436, 69, 622, 1803, 1912, 658, -600, -658, 3, -320, -1217, -1800, -1281, 5, 746, 862, 670, 665, 1516, 1532, 602, -1208, -1454, -732, -334, -897, -1306, -387, 480, 1239, 1131, 421, 337, 816, 1136, -193]
1061a93j385L72P24M21r68j15J021R68P44o80k45m21J84L6q00j097j03O45P91
1080a01j60J03K45J039j17m99o69o7M34k00l07r26K24J152K88m66m25P09J352
1099A609l06p96o96L0n4k57k4o04K18P60J187l32n94K55O49k44j105l86j26N66
1119b50L17k86n92K56J297N60q16n09qN59J52q46p69K18M30J16J29j29k34R39
1139E34Q44m15j105n86J187k15p06q28O01R23L06j57k38K31P81k37l31j090o7
1158e68M30N8n07k18J95O07L94l7k53J69K84Lk55j117J9O92P3k06k29P8J061K46
1180I19j90o28l6J23j86o86k59p6N98M01K97l67J83O56M05q39q61Q8Q12m63m86
1201e95m32M55M92O76k49l74N24K89M36r12o40l73O03R9n56k71M08P23O94k68
$$ y = [-193, -1578, -1206, -482, -61, -1029, -1144, -123, 845, 1589, 909, 664, 243, 427, 463, -337, -1434, -1537, -892, -101, -261, -158, 87, 1126, 1009, 510, -159, -226, 208, 8, -299, -1225, -1001, 151, 439, -27, -452, 257, 1609, 1303, 507, -189, -159, -213, -470, -494, -1098, -880, -120, 1067, 735, 141, 396, 1045, 801, -304, -690, -816, -250, 67, -219, -811, -555, 742, 1302, 486, -23, -31, 528, 680, -166, -935, -717, -287, -171, -42, -171, -405, 534, 1378, 963, -142, -728, 459, 244, -462, -1290, -689, 234, 540, 383, 145, 376, 1157, 920, 589, -501, -568, -138, -80, -587, -805, -610, -3, 391, 354, 101, 270, 554, 557, 302, -815, -796, -104, -31, -237, -466, -388, 673, 919, 729, 101, 65, 188, 2, -684, -943, -1019, -421, -20, 277, -90, 93, 749, 1154, 315, -546, -458, 354, -109, -595, -1027, -572, -80, 596, 347, -27, 497, 786, 1222, 310, -330, -703, -100, -1, -557, -828, -420, 303, 997, 729]
1221G29n29l27Q51n27l9r31l37P07J18J7m62O60Q17K20k20m01m21M20j61j54q47
1242h17l97R42M63l19l2P6P91L48l87o38l89J27O6j94k77k9M56O66L6k15j33N10
1264F54L03p78p52O0J01K24l58j44K61R63QJ68m82k1M61K15p90q61J09J26L79
1285a54k40K24l6P37J23K8l72j25L14k15n74m28n9M60K59k18p7M00N93K31J7q76
1307A2l45K27N39q06n71l33Q99N88r7l71M53N06O7j81m19p36N43j89m64l0L14
1328c94O37L00k61pn8K79L05q25n68q6M53J18l02l89j66J384N46m98q2M4p3o5
1350B92l15m14l30J44K39K74k32J47O56K45J41p14j5k0K16o94m99k29P55M53K7
1371A27p2r0N13M95m9j020k5n1J34l30J1k99J91Q07J64j9k00K63K00n18j46m72
$$ y = [729, 200, -127, 724, 197, 158, -773, -1110, -403, -285, -268, -730, -70, 747, 967, 747, 346, -75, 345, 184, 30, -817, -1214, -272, 191, -128, -160, -84, 707, 1055, 668, 30, -359, -232, -166, -360, -637, -666, -210, 456, 492, 277, 144, 654, 957, 179, -573, -513, -412, -188, -546, -690, -429, 534, 542, 710, 228, 207, 668, 883, 93, -768, -659, -533, -154, -394, -170, -206, 531, 654, 682, 310, 185, 499, 284, -290, -718, -777, -317, -58, -276, -353, 47, 640, 871, 888, 12, -333, -106, 433, -373, -944, -1277, -378, 210, 113, -258, 195, 701, 768, 587, 168, -568, -25, -214, -678, -708, -394, 243, 543, 282, 275, 217, 496, 801, -24, -592, -678, -225, -107, -409, -798, -964, 420, 966, 468, 386, 430, 357, 292, -23, -437, -767, -623, -384, -110, -342, -195, 461, 706, 847, 133, 118, 98, 314, -380, -879, -1108, -353, 100, 127, 55, -35, 478, 973, 924, -96, -121, -172, -38, -368, -357, -656, -465, 342, 506, 487, 287, 550, 750, 232, 86, -386]
1393c86j31L25J30m13J37O20M17j57j20l0J56K2l94q64M1K26N3K06k14P0Q03J61
1415F58PJ1n39J46k86k43m06l47N18O13r7j44J88N32O98o76q22K8P2k74Lm58j5
1438h33L09O08K83j73L09K4M84m29r63J33k13j51K15l76L96J05P89J72k14k32
1458B43K88K65l51q89k1k23L20k60K12K84L50N85R5q6q50L04j9m64m60k35P14
1479a98M6j48K73J73N32L0L7l36o34J85k39m21j44r8N05M53M22m00L57N57k78
1500F74k31j87m24K59o52K45m58K38M07Q88j87m55L64J38j65l99r6m06k76K28
1520d95L01m20M5N60P60j83J7j3j51j1m86k44r8l15M71M6J28j4K24L75L74p78
1542I3l09M57jm97l58M4N38k5k83N21l25N03L94Pm08p13j59O77q05q3K38K39K33
$$ y = [-386, -517, -192, -62, -475, -338, 282, 699, 542, 422, 392, 548, 570, 176, -688, -647, -421, -368, -162, -376, -306, 497, 658, 665, 676, 137, 283, -3, -246, -652, -999, -481, 132, 35, -109, 79, 611, 1309, 633, -189, -161, -89, -363, -360, -818, -833, -524, 84, 367, 194, 503, 527, 1011, 582, -381, -248, -461, -612, -397, -773, -377, -272, 517, 689, 475, 243, 531, 796, 445, -444, -465, -688, -368, -628, -416, -132, 218, 803, 898, 812, -38, 266, 247, -217, -677, -912, -198, -152, -300, -27, 146, 678, 708, 745, 409, -225, -40, -279, -700, -844, -942, -437, 16, 438, 38, 395, 952, 674, 443, 256, -168, 91, -561, -316, -774, -536, -129, 759, 572, 117, 481, 619, 454, 55, -41, -447, -723, -495, -194, -614, -569, -9, 751, 568, 585, 572, 421, 410, -76, -320, -418, -733, -262, -216, -88, -102, 122, 497, 871, 93, -216, 241, 240, -257, -615, -571, -33, -58, -341, 180, -145, 358, 752, 759, 351, -362, -521, 156, -649, -732, -494, -255, -22]
1565b2J24K37n0l5L09n3n43n35J14M34k78n38L16N99K05J11k21N9M2J66j69k43
1587B9m52j88M19l9k31j37R96J76k00N3j45p9k64k44N3m63lM91O48l83k30Q24
1609F31L31k03n39k02N8n18P4j99K94n03M51P61q6j21l8N03m11n52j95L76j37
1630b25j39R1j50L06K04M71j06j19k28J55J5n88l71L93Rk46q0O51j11K14L32l1
1652D47k48k14K96j31m06l97M20J60J04j67M78J90j42J54r3m16m47r0K58m24k6
1673f94N68N18m02J55J47K11n1q2k16k42l65K69j86j58J67J74J99L15j6r9L52
1694E64P7m49l51l01J36r1Q6M6N6J81M59q2J18l80L38l23l60L6r0K8%K27K48j79
1718fJ64L62K6Rk84k54R9k70l34p9J84K16L41k47M06l7j65O05m05o36M9J23j96
$$ y = [-22, 102, 339, 289, 254, 563, 510, -33, -568, -454, -20, -298, -836, -520, 79, 284, 395, 174, 233, 275, 441, 272, 29, -423, -611, -192, -231, -462, -599, 397, 573, 373, 426, 281, 202, -62, -306, -253, -716, -719, -228, 420, 37, -193, 631, 962, 759, 220, 18, 76, -442, -368, -567, -273, -776, -325, 436, 350, 229, 191, 694, 283, -269, -464, -88, -225, -364, -273, -423, -117, 87, 558, 452, 333, 105, 260, 275, -313, -684, -291, -282, -528, -608, 43, -68, 146, 478, 447, 199, -15, 281, 150, -256, -653, -233, -73, 31, -136, 342, 532, 390, 544, 451, 35, -412, -502, -244, -668, -694, -126, 392, -10, 145, 292, 503, 452, 370, 154, -88, -453, -184, -370, -528, -361, -187, 12, 327, 311, 212, 564, 641, 192, -159, -460, -324, -415, -329, -283, -227, -46, 413, 331, 449, 69, 407, 84, -276, -240, -330, -302, -302, -75, 173, -6, 158, 520, 546, 555, 271, 17, 116, -154, -488, -567, -383, -167, 174, -73, 333, 296, 131, 736, 331, -305, -256, -133, -329]
1741c29j57r3L29M74k8M5J77K6m65M80k11n37j14L99o23L18J8M54K51J08J5l82
1763A55j71K89j36q9o82J21J98J61J78j07M46J27n9J08p3n04N8k52j64j20r4O12
1785BJ01k89L71K55p9J47l81o7j49M2j60j59J08j35K43M18Q0J52L07m48J47m31
1807G5k45l8Nj1j50K10J06M02m5P4J33l43K83n49L02o82p8L09P5j94L56o1M60
1830C94J29j4m22k6j39k04J0k15K74l15M43J8L09l3L49l12J44m69k1r2j97j94
1852e83L00k89M73R0M19l16K97J79j87k74n93L35k8O8k42k04N25r6M14P9j03L7
1874C01J04m96J36l05R1k80K64LL47j06K88Q2k22Q6M3l05k77m4N1j28n6L00J70
1897D7J18K09J23J18l22p0r7l90j43J9o7P5O3M99o4L18J3M1M23p52k55m3J15k94
$$ y = [-329, -486, -579, -250, 224, 196, 241, 418, 444, -21, 459, 248, -289, -403, -4, -627, -309, -291, 163, 414, 522, 537, 155, -16, 273, 137, 48, -634, -513, -315, -154, 24, -83, 363, 490, 431, 539, 466, -38, 20, -232, -396, -516, -610, 2, 103, -186, 185, 440, 361, 508, 127, 60, -89, -47, -207, -366, -258, -393, -150, 268, 348, 500, 807, 359, 506, 75, -170, -208, -203, -214, -364, -154, -48, 354, 309, 383, 516, 173, 456, -93, 209, -473, -551, -242, -167, -361, -5, -66, 394, 523, 509, 87, 61, -78, -282, -272, -487, -213, -528, -85, -67, 242, 209, 558, 246, 390, -79, -100, -192, -389, -583, -283, -572, -99, -9, 410, 94, 391, 570, 383, 109, -484, -149, -177, -109, -351, -555, -30, -126, 288, 367, 264, 301, 405, -91, 45, -260, -169, -449, -185, -182, 165, 59, 347, 429, 207, 293, 336, 31, -246, -290, -239, -367, -423, -123, 47, 165, 374, 497, 615, 293, 223, 126, -264, -407, -388, -455, -380, -317, 182, 118, 436, 449, 490, 913, 161, -94, -137, -22, -316]
1921c16r8K06%M0K50j5J45P3K07n19J41n37Q9k5j84J39J3K94M73j17K96j87j34
1944B34k03j07j48Q4k38J94j9K39O8J18L7J35k9j58q8k70r6j93K1L21N3k4K29
1967A60j41L12J89R9l75l22q9k89N4q1K15N7m6P89m30K27R1j89k78j06J09k29
1989b73k00l4J80M4P6N64QK61k12k07p2%j58j82q1R7j71K77RJ73K72j67L09r4
2013D19m46o9O0m35R4r5J60o2J65N85jk07M30j75m14j80J64j36j60J9P4R1m2M37
2037B76J72j49j28K08k79q9k05j27j87L64k84K22N80k27J94j25J96p9l78j11k54
2058d10k12L82k61K70J82J08M24mj56k36J0N2j02q1l75j7nJ48L05M58n55J21L79
2081D25j73m45J79Pl15k76K66p5L75p3J35L9K47Q0J02j88k88m21KK75j95Q6O6
$$ y = [-316, -414, -208, -208, -168, 82, 67, 212, 285, 492, -27, 114, -423, -334, -359, -543, -404, -391, -97, 376, 259, 555, 368, 234, 31, -76, -224, -140, -378, -184, -203, 36, 104, 222, 259, 394, 365, 207, 119, -151, -247, -440, -419, -98, -45, -69, 160, 19, 331, 520, 619, 244, -78, -167, -456, -402, -483, -268, -211, -257, 532, 102, 329, 420, 231, -47, -153, -44, -273, -473, -507, -327, -283, -207, 357, 365, 626, 414, 207, 135, 135, -23, -205, -286, -189, -360, -83, -74, 99, 371, 204, 513, 419, -27, -96, -36, -471, -377, -472, -312, -374, -209, 376, 375, 168, 598, 423, 9, -171, -7, -143, -303, -284, -210, -119, -161, 276, 448, 299, 171, 379, 100, 11, -194, -321, -508, -144, -428, -206, 374, 147, 341, 216, 412, 333, -45, -156, -410, -622, -240, -501, -231, -49, 59, 483, 479, 323, 87, 97, 149, 47, -34, -409, -426, -431, -283, 22, 480, -75, 46, 425, 252, -193, -14, -7, -322, -598, -332, -407, -32, -105, 30, 69, 316, 396, 498, 310, 22, -399, -397, -122, -317, -231, -165]
2104a65j20J88L03J87j90J15K6j98n08L3J42j69J3M46L6J63j50KM73l59j85q5
2126bL6p80N75k08M94k26R4K1M30q4j26M0Q6n93O6J19l73L88k55Q3O3K15O4J00
2150B27j63K33n60J33k1k75K00M6k41L06p1M60L1O4J11k0l59k85j41m4M3J10L53
2173A37k19L40M2J13m18P3K01K5q06K32j62JK71O6nL58o7p2K41k78m6j94K2j03
2197b48K35k34J19Q0r9M20Q1k00L17j53j38j10j18J3n18M10j79J91K47n8J88P2
2219C18p6l87J06J44l35k41K66K32j13K2n8J96J01O8j03J26r8j06l72p9R9N1j67
2242d06L60J33J09L39k94j06L8J6l12Lk26K59j40J09K22k4K71jk5l1j25l95J06
2265a20k64J57k20K45j3J96L01L37m15J22j51o1j98r4J46l42J07J79J78k43M35
$$ y = [-165, -285, -97, 206, 393, 203, 318, 344, 146, -362, -329, -187, -356, -343, 103, 139, 302, 152, 154, 627, 268, 83, -2, 34, -746, -171, -379, 115, -111, -17, 4, 434, 350, 224, 264, 350, -243, -177, -58, -431, -43, -298, -215, -152, 63, 127, 227, 64, 297, -263, -130, -151, -426, -226, -180, -421, -115, -186, 274, 305, 369, 480, 460, 101, -184, -325, -369, -326, -216, 137, -82, 258, 300, 413, -5, 68, 269, 294, -512, -280, -442, -441, -170, -104, -109, 249, 182, 110, 351, 73, 27, -167, -145, -248, -13, -247, -128, -48, -147, 273, 354, 154, 471, 318, 180, 70, -48, -35, -553, -143, -322, -131, 116, 58, 246, 318, 242, -145, -39, 105, -230, -471, -205, 27, -86, -64, -122, 74, 175, 243, 140, 266, 168, 62, -310, -389, -290, -239, -406, -46, 87, 196, 535, 241, 135, 173, 189, -123, -120, -346, -87, -227, -118, 104, 80, 351, 350, 325, 294, 169, -226, -120, -384, -227, -447, -202, -215, -19, 282, 619, 204, 326, 175, 114, -84, -178, -32, -374, -267, -88, 90, -153, 282]
2286B82r3K43j86K05l10j19l39j21K17j00Q8L88j62L41k88K53l53K9K13k30o1
2307a03k73J93M4P5r1R2K47J27k20O1P0j24m48L2J10j17j71L03L3L88M7j46m1
2330H8j9j64Ml8j21K25l44K10M0J73r5K55j23M2J78k05K3k9k17l3KP7k43K86p3
2355a01L75lj55Q8l32J5k24L7J46P5k21L16k73N52j28M9K11m2n56J06j17K06k31
2378b07l18L20K17J13n6J31q5O1o2n8l46K4P2k2k3j28K29J53L41l20L26m57J53
2401E8J97k08j80k03M4J28J38J99r2M05l80j02l7M7N3j38j33J35j39K3j44L54
2423B5K32j47J89l8J58l47n12J91K14l60K47j88M07R7l27O78l40p1K6L6k8l33
2445a91o4j27L18r7K4J67ONJ76q4J21m9k14m44K00k24L3K84J10J88K28j18M4L4
$$ y = [282, 189, 432, 246, 451, 141, 22, -317, -438, -221, -321, -233, 155, -7, 334, 46, 299, -54, -25, 188, -42, -103, -376, -183, -139, -64, -155, -63, 184, 311, 91, 152, 222, 98, -350, -318, -208, -325, -496, -193, -160, 228, 275, 129, 88, 69, -95, -91, -129, -250, -25, -369, -159, -119, 54, -41, 214, 91, 133, 311, 106, 129, 100, -117, -150, -148, -71, -314, -28, -101, 274, 271, 116, 204, -128, -113, -337, -300, -154, -79, -300, 16, -257, 295, 167, 216, 427, 385, -171, -65, -182, 24, -207, -525, -205, 12, 125, 69, 200, 115, 176, 114, 56, -290, -266, -194, -216, -239, -367, -138, 15, 356, 36, 362, -95, 58, 255, 47, -133, -336, -292, -164, -26, 173, 81, 486, 106, 4, -33, 14, 67, -71, -204, -69, -208, -185, -329, 25, 257, 110, 299, 261, 419, 72, -440, -249, -35, -395, -148, -336, 71, 168, -159, 519, 179, 108, 134, 170, 142, -191, -255, -382, -64, -161, -137, 30, 36, 41, 217, 133, 254, 205, -9, -453, -253, -477, -444, -160, -50, 138, 366, 248, 292, 326]
2469C26k8n26r2J49r9j02K13q8M3L74J58M8P7J24l84l09L16n70L5j41L54L83m81
2492b20K07J34j69J48L80n26l1pl69J8Q7P1K46J7L78k63M49n05K20N8r0l05j47
2515b19j60J73L1J56k8J06j47N63r7P6l1o01j52O9j85J37P1oJ97J57J41J72J52
2538E75m77J94l59k74J02k84M17k21J01M72m36L56P3P9j65n1j21k0j86M2O7O5
2560e1j86L70J9N3j97N73m67J04l25J00j02q5Q2l32N48k55L61r6Q7Q7Q9m96k0
2583a39K45k67J16k52J46J87K3K01J23k54L93l29k45r0MJ3o8k0J42j13M72j76
2605A12J63N9j75k0j93k71J95j42L3J57OM7K03l9K01k74J70J84l40o9j70r4K78
2628B1m11J34M79P6l69L31J6k89k25M08l56n3K35p1j60pO9L57j52R5J09k28L12
$$ y = [326, 298, -228, -320, -171, -270, -372, -159, -247, -204, 170, 328, 376, 453, 577, 193, -116, 200, -370, -335, -476, -122, 261, -220, -13, 121, -48, 100, 480, -46, -77, -84, -453, -435, -348, -277, -31, -14, 364, 101, 550, 45, 265, 323, 233, -72, -219, -379, -206, -175, -19, -47, 59, -88, 475, 378, 454, 423, -178, -330, -261, -446, -309, -238, -244, -47, 110, 251, 423, 575, 98, 292, -67, -341, -239, -523, -106, -327, -226, 246, -190, 166, 239, 318, 153, 102, -19, -39, -225, -183, -116, -51, -237, 133, 152, 205, 8, 581, 114, 218, -107, -7, -109, -194, -112, -444, 104, -151, 210, 114, 201, 288, 377, -119, -139, 106, -161, -45, -297, -151, 36, 59, 260, 383, 129, 522, 193, -52, -142, -138, -125, -193, -213, -71, -184, 288, 112, 275, 334, 159, 139, -54, -325, -130, -272, -239, -82, -76, -29, 174, 135, 336, 62, 232, 416, 76, 7, -163, -257, 21, -390, -256, 223, 299, -70, 261, 277, -12, -237, 171, -185, -238, -3, -74, -234, -241, -172, 185, 33, 128, 237, 9, 321]
2651C21l86n1R4l88L91J85l80L78k28M26l18L27n68K50Nj56k17j3J28J18J55n7
2673A6j8K72l4R2k71j0k32K4N5j61L80L2l44n6P28J07l07j60N6o7j89m50J95J80
2697a62J88l7k85M33k89O05m07J32j27oo4l18j02K35L31k4p6q8K63Q3j79j89M10
2720C27r7m07j79J51j42K16L0K64J51k99L2O3n9r3j14j82J11J58L0l4m8L51k73
2743d3K41K4j4k46K4j16Q0k58m8L49j9q7K50j99K84p7Q2l21J16j85r9K52j83N3
2767a40j19L53J42j31J71Q7q8m53L48k66O0j03p9J15k7J54j7L63k16J58k78n3
2789a9k6P3l41N0R1j41K05J38K55J81k25J27k49k5j37j83q8O5o2K04O4J10j48
2812h1K05r9M57l28l23J09o8l9k10M7J78M3J72K80l9k33l6K35O2l87k54K1Q3k66
$$ y = [321, -65, -116, -22, -410, -19, 166, -214, 164, -64, 362, 44, 371, -197, 53, 58, -98, -315, -328, -200, -82, 73, 16, -2, 270, 236, 328, 57, 47, -185, -161, -106, -267, 113, 145, -199, -255, 473, 580, 273, 113, 169, 102, -87, -537, -342, -162, 26, -11, -296, 137, -152, 453, 46, 178, 51, 45, -19, -337, -439, -204, 127, 103, 27, -61, 202, 285, 106, -83, 327, 230, -177, -356, -205, -347, -131, -101, 163, 314, 15, 47, 110, 51, -42, -156, -338, -227, -69, -39, -73, -121, 230, -43, 198, 222, 208, -38, -14, -130, -50, -308, -356, -7, -26, -113, 137, -62, 222, 145, 227, -94, 22, -163, -262, -10, -193, -140, -259, 94, 236, 105, 276, 363, 275, -178, 170, -96, -36, -139, -218, -103, -130, 24, 7, 370, 154, 312, 34, -19, -45, 28, -313, -263, -172, -313, -108, 30, 285, 466, 241, 368, 119, 94, -43, -226, -314, -249, -311, -107, -43, 67, -81, 124, 25, 482, 154, -169, -60, -128, -167, -377, -330, -152, -109, 63, 343, 304, 71, 35, 270, 332, -55, -309, -288, -205, -471]
2836d71J92J71K64n0Q3k77M47k81j75J51k91L51k32J00j48j69L03M53kk31Qk0
2858A76j44p7k1j0Jk73N28k90J50m0L71L7l86n6j15j86N3q3L52o3Qm5k0K93p2
2883H8N9n8R6m13N5J3J46j36K9j17L09rK3K12j59M1j88P9m71J04o5K01l7M86k89
2908aL11n8Kl39J75Q3j15k34k10L69m83M35m5L32j62J03o7Q2l2j77Q1J28m30P
2932b45J77K40j25kj18N80k88j50l21M14l38L2j17J7N2K31J25l46M06j96K02j09
2954A21K3Ql37R1p9j07M3j29L99j98M10M7L8l83L70k20M0m47N7K73o0l22L95l6
2978cK88l28M60m42J91R1m62k0j01K00l61M23K65j4M3O1j96K52m29J05l43L11
3000il77K23m6p3K85j4K84j04J01Ql25m37M18k0m2l29M00R3J04n1p5J88k8k20
$$ y = [-471, -279, -108, 156, 106, 189, -88, 359, 78, -97, 54, -237, 114, -118, -18, -166, -335, -32, 421, 419, 188, 196, 176, 32, -45, -66, -76, -75, -348, 180, -110, 40, 0, 371, 408, 22, -34, -149, -335, -282, -365, -13, -76, -68, -113, -133, 160, 88, 147, 89, 185, -228, -173, -160, -14, -150, -121, -238, 71, 62, 85, 297, 138, 179, -9, 70, -401, -297, -362, -161, -198, 288, -1, 310, 252, 254, -85, 90, 173, 58, -176, -386, -17, -500, -65, -110, 222, 60, 163, 96, 178, 146, -31, 50, 178, -252, -245, -68, 172, 47, 45, -73, 507, 219, 69, -252, 162, -176, -144, -261, -244, -192, 39, 164, -182, 224, 28, 230, 121, 144, 152, -185, -94, -173, -280, -237, -366, 33, -165, 245, 292, 330, -53, 317, 97, 137, -310, -253, 20, -40, -362, 33, -3, 285, -43, 417, -25, 166, 257, -205, -225, -326, -126, -487, -64, 201, 187, 230, 291, 95, 347, -82, 23, -320, -9, -386, -163, -209, -282, 3, -11, 273, 169, 270, 278, -47, -484, -66, -86, -128, -457, -57, 36, 140, 89, 14, 202, 174, -46]
3024d6J51l02R9j64P3O1k11M35M2J63m25K45l5J28m88l32P91r2k05L3j19L41m23
3047b80L20J57j78K45K2n53K84j5j30j45J24L9K0J61P9k7k8j11J24j68j20m1J11
3070a10N4j26j3J74L96k31K1O4o6j38o7k96L71j50l90L82J60r6J27j3J41j32J19
3093A81l59K49m75L61pk27J70j4J08K43k3P5P7k76l41K57j83L4R8J27j56r6K07
3116C0J51k44N4k9l8L67n33MJ66j12K1J69k22K68K79l65K50k04Pn8k33J31K28
3139H7l10N1J40J00J73k96Q2J58J13j11r4m21J29N3l69L69R9J75O6j45L07j70
3161A86j84J16j85J05k19j45K83k2j2J02N1l8J23p0j8j04j44Q8j05K11J1j84j22
3184b76N55k60J35N7p8O2k16jj24O5K11j8m66N13mJ7N3j2pl59L71l78K62m1n7
$$ y = [-46, 105, -197, -98, -262, -189, -128, -339, 96, 138, 301, -124, 121, 86, 214, -274, -606, 185, 93, -112, -79, -198, 143, -280, 40, 197, 19, 264, 286, -267, 17, 2, -128, -273, -149, -110, -90, 71, 150, 123, 95, -16, 108, -60, -180, -221, -110, -56, -182, -195, -21, 375, 144, 165, 229, 163, 25, -42, -338, 33, -117, -507, -125, 35, -61, 66, 53, 194, 62, 181, -178, 71, -404, -43, -50, -277, -107, -121, -13, 230, 207, 282, 359, 83, -258, -1, -184, -150, -52, 75, -81, -177, 30, 181, -63, -9, -38, -76, 291, -242, -238, -72, -184, -163, 6, -216, 52, 331, -34, 216, 12, 19, -39, -272, -141, 87, -223, -172, -32, 68, 241, -55, 27, 185, 298, 187, 93, -328, -199, -146, -515, -146, -47, 128, 194, 49, 356, 186, 2, 118, -67, 38, -181, -326, -43, -65, -77, 25, 76, 38, 161, 91, 73, -31, -175, -87, -192, 19, 30, -154, -276, 279, 19, 154, 211, 133, 195, -21, -22, -146, -81, 130, 112, -354, 159, 155, 172, 225, 213, 206, -153, 218, -160, 102, 61, 4]
3209Dj41K5K92j19J74n7j97J32J67j70r0o4J04j2l35M59j52N5J0K29q5j00J53
3232B82n09m8Q3n3J34j51L68j39n4m5M74k98K7k09M8j83J45K21k70J39J57k49
3254a30K06L47m84L47o7j20J06l07LJ63l18J18J02M41k18l8L07o66L04j73k06
3275b83P2J10J67k31L41m6j08jJ23Q8j95j6Q6j47J99Jl25J21L70l39K93j19J19
3298B80j25J60k20j93j80m3K42Q0l47J62M17j29j52N25l32j0l00J10Lk91J15L40
3320A12j03p0N0K25j37J08k82J67j29J00J5k88K05j46L44l91K23J93k9n8j08K3
3342B4k59Q6K11m80J52J33j00J6L22o4K3q1J56j07R4K6j79Ok01N4J32K80j41J55
3366B58l00k47L96k95R8K14n27M18l44J60K47j74K13j71L71k26K19l18j31J13
$$ y = [4, -137, -112, 180, 61, 235, 178, -19, 113, 280, 110, 20, -44, 60, 48, -287, 172, 20, 75, 85, 314, 229, 129, 282, -227, -275, -192, -245, -111, -262, 106, -33, -87, -132, 342, 44, 71, -138, -90, -273, -128, 93, -177, -38, 119, -130, 76, 423, -61, 286, 219, 99, 205, -102, -99, 64, -254, -136, -34, 407, 189, 151, 458, -208, 96, -77, -283, -211, -101, 66, -165, 176, 130, 22, 21, 144, 232, 37, 21, 107, -40, 159, 160, -165, -44, 326, -13, 280, 161, 280, 155, 315, 95, -98, -278, -321, -79, 1, -346, -184, 233, 104, -48, 477, 145, 135, -165, -55, -52, -343, -228, 112, 9, -61, -11, 214, 77, 185, -97, 70, -59, 41, 56, -232, -27, -173, 171, -220, 3, 196, 167, 109, 1, 24, -235, -149, 62, -418, -266, -133, -233, -217, 105, 41, 64, -17, 139, 32, 126, 152, -27, -21, -222, -168, -36, 244, 103, 258, -42, -289, 107, -188, -90, 124, -403, 15, -329, -169, 78, -96, 117, -54, 317, 91, 310, -8, -139, -26]
3386b6K15k44k58J95K7J56K11r3R7k07P4j13j48M1l67K98O9O5K3RJ7Q6J51k4j65
3411H9oM8p5J10j5k01K13O2m30M50o4K1rk12J21q4l3j47r0J71k35J41K86j48L98
3436C61l69O8J65m54K67j32q3j77m7M08M6l9J69J7k25J25l94M7K28N8j66k04J10
3459b21J16J63K48m36J35Q1J79l99O6K86o75L97M5k76N54j5k00l15L98p4j76%
3481a19K01l1j80Q2O1J34n3J45o7k92L67k06Jk35J78J32j22j05j37J76J70k29
3503a29O3L94k77p1Qj90L63l23k3K10J31m8p8o9O9Mk28K91n4j82Q9l6p9oj41L49
3529C7k06K65K6n4O1J49k51r0K6M0N9l83M14m6p8J88j68q6N36l65J01j31J73l57
3553a40N9J04j51P8j6J50N1k6r5K09nk11r3j29J51J40K6k06P0P2K26k07k5L89
$$ y = [-26, 189, -55, -313, -118, -91, 65, 276, 183, 280, 73, 147, 34, -114, -73, -440, -142, -73, -8, 15, 24, 41, 127, 278, 254, 89, 83, 131, 56, 166, 151, -50, 163, 225, -205, 245, 181, 202, 193, -19, 102, 18, -15, -162, -252, -81, -316, -175, 111, -37, 361, -8, 60, 225, -229, 38, -94, -177, -354, -401, 7, 53, 14, 183, 200, -25, 100, -294, -247, -19, 39, -127, -331, -221, -105, 58, 306, -130, 5, 86, 265, -134, -68, 218, -457, -60, -15, -291, 263, 248, 48, -267, 131, 57, -119, -119, 82, 51, -129, -47, 14, 148, 95, 240, 173, -119, 248, 42, 43, -192, -14, 118, -4, -109, -246, -70, 100, -129, -66, 328, 51, -20, -12, -202, 161, -162, -185, 25, 156, 108, 30, -39, 30, 34, -194, 97, 43, -139, -50, -86, -165, -171, -312, 37, -169, 96, 122, 68, 129, 278, 27, -63, -37, 3, 62, -321, 93, 47, -31, 157, -11, -97, 439, 74, 175, 44, 217, -140, -81, 23, -128, -50, -66, 84, 135, 109, 14, 223, 218, 7, -86, -215, -64, 76, 102, -104, -34, 38, 264, 57, 32, 421]
3577D21o47M7K87j81j24Q5L11p5j30J56Q2Q4j3m49J24k06r7K25k64N54m18L8O2
3600a28N0J95k52lJ6J98k73K41N1m08O8K23j81L2K41J94m44M11r6k44K3o0R4R4
3624D2k10J78l1K52q6J53j34j81k34N25l58l3j6J00P0r5J40l2q2J40l53J20N4
3647g1r6K89q9j22L47m15q6L5L18J06lJ17k81r4K32j84l17L31k88J29J23j35J07
3670d7K34j07O8J1j16l74J62P8Q0Mr0MJ90POo4L2K17m56M01n32K98j37J27j43
3695a47Q6PJ23R2j60q2L1L48n38L38n06J76M94k96p0n0J44l9J61j40J8J08N1k88
3719a39j2K04l08K47p2K13j34Q0j03k68L55oj62n5L91N4o9R8j15m45R9L22l54
3742a79L7K81j60J31l65j47M24o5K31l54K42k77M15k08Q0J72l75k4p2k25M10J35
$$ y = [421, -226, -179, 108, -73, -197, -112, 199, 124, -6, 150, 232, 316, 303, -146, -22, -228, -325, -100, -364, 190, -228, -190, -128, -78, 117, -135, -138, -122, 76, -197, 44, 95, -313, -245, -22, -203, -171, 70, 264, -180, 231, 135, -109, -86, -146, -52, 42, -168, 10, -21, 231, 145, 298, 164, -17, -251, 274, -84, -117, -133, -33, 37, -58, 82, 50, -32, 108, -245, -125, -71, -167, 122, 33, -89, 258, -157, -243, -208, 110, 216, 213, 330, 49, -45, 187, 3, -314, 17, -271, -142, -19, -154, -47, 187, 80, 148, 159, 43, -331, -169, -91, -11, -7, -97, -93, 97, 104, 110, 46, 78, 295, -161, 240, -292, 6, -131, -4, -147, -61, -54, 69, 161, 1, -81, -50, 298, -240, 98, -408, -232, 262, -34, -104, -154, -10, -49, 112, -28, -10, 98, 149, -139, -151, 53, -255, -8, -80, 133, -1, 79, -24, -292, 63, 57, -105, -160, 231, 285, 216, 314, 199, -246, -147, 175, -179, -142, 139, -21, 110, -255, -402, 22, -43, 188, -166, 76, -201, 214, 6, 86, 258, -117, -141, -213, -438, -28, 107]
3764A07p6QK6j06J81K69l16Q6l9k52j81M68l25J2Q0k3j29L31j68J59N9m50K85
3787FJ6J2l51L24p2K35j98L57m64J05P7j12J80l05J27j16K78l0J18Np5k07K64
3810A74m2n4J96j06k63o4qp8N4M13ml76K98l0M2m2NK57k71o0lR2j96N2J32J08
3836B26k57L52l07J50K23l17j51J62j34L3l4J85P2j33J64k7l09Rp6Q5k8l7K11
3859F2N1j80p5J60J49p8R8r6m34K49R0k33j2J47L3m3j28L96O4j80q7M5J44k40
3883i8r1J22P4p9L0K8L19k35ol12L68l8ol03p5L82r9k43J60K7K3LR0l0J68P5l75
3910a21%L6K19m39J68N7J33qQ0M0j11n1o8K6k09M46k52j29RJ9k2J45m4J14O5J58
3936B61k73j06j2K27q7J71k01K11l66K66%l0j13J21J15k18J04k39jJ8J04j43J33
$$ y = [107, 31, 39, 65, -41, 140, 409, 93, 179, 140, -112, -293, 175, -150, -138, -58, -81, -210, 121, -47, 112, 171, -279, 6, 22, 34, -317, 7, -65, 170, -28, 329, -135, -30, 47, -65, 115, -190, -63, -179, 99, 69, 187, 192, 117, -90, 174, 132, 78, 274, 168, -95, -159, -167, -245, -191, 222, 218, -158, 140, 110, 152, 110, 115, 372, 101, 41, 38, 130, -66, -14, 118, 226, -31, 321, 14, 164, 387, 70, -81, 81, -53, -20, -54, 131, 203, 70, 234, 207, -102, -93, -169, -84, -112, -149, 62, 113, -67, -142, 18, 167, 89, 187, 91, -343, -94, -4, -237, -249, -102, -69, -112, -240, 156, 220, 40, -47, -2, 142, -98, -189, -67, 7, -72, -42, -14, 305, 70, 64, -248, 120, 82, 76, -227, -302, 80, -19, -262, -102, -75, -52, -49, 41, 11, 179, 254, -121, -121, -85, 134, -305, -137, -80, 53, 45, 125, 165, 54, 3, -65, -39, -248, 198, -54, -183, -174, -155, -177, -32, -76, 38, 103, 261, -12, -118, -130, 97, 10, 181, -20, 191, -175, 91, 91, 61, -52, 69, 184, -34, 70, -169, -170, -152, -48, -191, -58]
3959e8J80j14r1J62k81N3R1J12j22j64K20j5j41J02J62N3J37j80n1K68n52P7R5
3982e7j93jk5M19k14K16J09j70mP2J4k93M11n66K51J8j46K2L69l12K95k53K4K05
4006A91p6k53J26k82K26j05J29p5O6L32k08J85m6l68l2q6K22j04j57L32p2J7m9
4029h7J33k06L25Oj78l7K6j09j00K24P1j17J08J61k42L8J52p1j84J59j33L8k96
4052c19L82K1j86K51j96O0Or7J01J1J55k71K5R2q3j11R1L31l30OK77j99J82l32
4076a33K46o9O7l3r1P3Q6j16j10LJ66k03K43k23O5j46j32L35K5m6J60q2L2k28
4100a11N6J7K3J23J14q2l67J21j09M0N1J62j12O9MK37l13L30n11J62%r2L93p5
4124A30j2j01r2L70k04j91p8L03m23K94l7J46m7j00j28J85K06k68r2j2L51j61
$$ y = [-58, 122, 8, -83, 79, -202, -149, -58, 54, -68, -232, -12, -27, -168, -66, 96, 149, 286, 106, 55, 323, -229, -152, -57, -250, -251, -276, 143, -71, 145, 254, 84, 80, 152, 166, -127, 284, -282, -31, -13, -159, -137, 232, -80, 215, -38, -14, 191, 115, -138, -12, -294, -68, -173, -44, -119, -53, 279, 71, 256, 210, -158, -190, -276, -54, -158, -315, 17, -55, -38, -87, 46, -160, 165, 171, -7, -44, -18, -127, -227, -3, 68, -49, 59, 220, -22, 16, 168, 97, -87, 72, -61, -23, -319, 63, 84, -102, 149, -47, 13, 19, -78, 23, 34, 189, -82, -57, 35, -48, -159, -68, 263, -67, -61, 216, 17, 199, -133, 113, 44, 111, 78, -13, 60, 146, 30, -80, -77, 89, -114, 129, -94, -29, -175, -307, 28, 53, 7, 167, 85, 117, -111, -55, -38, -15, 108, 222, 140, -227, -106, -215, -175, -124, 38, -74, -5, -1, 236, -77, 253, -258, -96, -96, -188, 205, 130, 118, 17, -75, 295, 91, -100, -178, 125, -298, -4, -41, 105, 58, -42, -170, 15, 221, -47, -139, -151, 200, 39]
4146C9j52J47K0m17L37RJ86k20P4L2r6k6J14nK6J8j37j69K96O7n7l31L38k30K87
4171A50k36j43M09j58n6J16j97j0L53M9k15RJ12N1k43J08k42J3M45l45m9k7J99
4194I3j95K24J74j93j97J30Jj2k86N02k65k05n6L18j39Q4J65j21J57j98j68M4
4216a43L35l07j53K95l20L50J51j14j59J03k60L24l32J54K00l55K62k42L50j71
4236c2J67k0J11p3j27k77M1q6M88j44o1n6J27K62l39K55k10M9J3j6j77P5j24j47
4260c01J62L1J31K73n2j85J01q5l4M8l9k5L3Ok48L14j13L50k59o3j30K45j30o6
4284c6k97J44n0R6j16M18j9M8N4k24o9J00j87J08M1j48R6P2m86N94M6l55K85j91
4308g6k67K42j23K45J24l97L11J1k81J35j47M22j52J26l1K03m26j1m0K8J70q6
$$ y = [39, -113, 34, 54, -363, -26, -17, 169, -51, 23, 55, -41, -67, 47, 42, 68, 86, -51, -220, 76, 143, 86, -245, 93, -137, 150, -86, -229, 180, 22, -34, 82, -115, -125, 228, 277, 62, 71, 183, 234, -9, 99, -143, -130, 315, -30, -79, -106, 93, -102, 122, 296, 103, -94, 36, 37, 25, -261, 241, -24, -229, -285, 33, -106, -22, 143, 22, 179, -19, -187, -143, 192, -115, -268, 27, -293, 57, 208, 94, -65, 38, -222, 102, -230, -76, 124, -231, 31, -211, 139, -32, 135, 115, 226, 153, 26, -251, -210, -296, 192, 48, -13, -69, 58, 320, -19, 236, 26, 75, 88, 72, -105, -30, -154, -301, -139, -108, 23, 296, 244, 59, 160, 75, 41, 89, 50, 25, 58, 64, -184, 130, 17, 367, 108, 45, -85, 160, 30, -36, -333, -189, -239, -143, -259, 159, 140, 188, 242, 18, -51, 49, -138, -30, 11, -137, -41, 31, -455, 139, 185, -170, 115, -76, -343, -101, -224, 21, 145, -252, 59, 70, -211, -76, -223, 199, 47, 173, 142, 345, -81, -92, -132, -104, 66, -20]
4330b0J88k34L01o5k93m5K95j80l8k2M7n3p2N8K34q5k75J51J70l5J1K04m91K99
4354E0l6k39P5N2r7J69k54M43j93L9j3J22j24N1k3k83M32q4O5k24N13n95L51k98
4378a01o4K49k15J62N3o5j51K0K57o3Qm0k6J02l17K15j81J02p5J5N1RJ2j9o4K89
4404A63j96J80k67J54l4k19K90j34Q0k72L55j61K9J98J93j83J00j43j68%J19l07
4426b23K24o6m6O2p2M5j78K87Pk57j08L33q7O3k58L07k05L7J27J0op6K88l40K53
4451A21r4k64J38J25J26l29K2K93q9J72o3j22j98J96k02J56K22l18r9K83M9k70
4473a45L02l76J47M5j34N5L95k93k5Lk1p4K64P4j42j63%L0j88K48j67j55L29m8
4497c9O5j11N1K0J9L25l98l3J04L8o2L43m73m7K37k95L83k1J23J98m52j1l3l5
$$ y = [-20, 168, -66, 235, 170, -123, -168, 127, -53, -91, -113, -66, -119, -191, -133, 101, 16, -259, -108, 62, 27, 38, 242, -249, 50, 14, -225, -150, -98, -195, -26, -280, 163, -30, 9, -4, 118, -6, 45, 22, -261, 171, 87, 152, -72, 441, -154, 197, -101, -165, 84, -131, 31, 84, 19, -132, -112, 145, 82, 90, 50, 24, 126, -191, 24, -157, -55, -130, -115, -64, -55, -43, -62, -126, 163, -33, 147, -120, 34, 0, -219, 71, -63, 17, -255, 100, -61, -32, 166, 359, 176, 276, 133, -35, -35, 84, -223, 1, -65, -111, -49, -121, -76, -254, 33, 40, -217, -325, 8, -79, -16, -274, 33, -172, -135, -8, 2, -4, -80, 208, -132, 121, 27, -237, -99, 26, 152, -177, -155, 138, 49, 221, 158, 36, -162, 34, -168, -12, 210, -108, -207, 76, 125, -145, 157, -219, -72, -27, -161, -106, 289, -4, -29, -26, -47, -121, 143, 217, 75, -88, -88, -58, -246, 2, -165, -320, 9, -39, 26, -85, -34, -14, 5, 330, -68, -101, 3, 41, -21, 322, -151, -198, 39, -256, 127, 106, 229, 427, -25, -36, -69, -104]
4521a04k0J4J10K20k43J57j12k5K75N6k15l06L46j12j62J3J81r7J69j3l66K00
4543c4J18m1J48j70jj40j1N6K9K17j03Q2j8j51k5K10n5l76R5K76N8l06J41J23
4567A22l27J11P3L6P5r4j24L8jq7j9k64L27J73q9j10J13J33n7J88k92M5J41R5
4591B06k89J03n4J56j41k03J21J80j14J82k35L29k11j0p9k2j20j01M87j03j80
4612i8L69k36j42J9J76k45j17K42%K15K3l06N5Q6J12J49o4l98J52L9k84L06k7
4635B6oJ98j2k37M1J74k75K06l98J52K56k56J51Ro7q1J90m9L6l57K25M8j07qJ18
4660b3J77k97M58n00M30j52K3j69K66l62M0M6p7K1K82p5m68N85k70P3q2J86r1
4683B1rN9j26k73K55np2K41J99m07K07J36J5m20J5J36l4O4j56J44J89m78L41M0
$$ y = [-104, -124, -110, 0, 220, -23, 134, 22, -3, 272, 328, 113, -193, 153, 41, -121, -108, 73, -24, 145, 132, -234, -34, 84, 43, 191, 21, 20, -120, -131, -75, -46, 171, 68, 150, 132, -19, -44, 166, 111, -265, -170, 106, 164, -142, -1, 122, -205, -94, -21, 15, 90, -4, -128, -90, -91, -178, -197, -461, -134, 39, -50, -160, -47, 86, 29, 217, -75, -30, 111, 206, -83, 20, -34, 122, -19, -222, -101, 79, -35, 147, -88, 241, 30, 20, -59, -81, -201, -302, 185, 82, -98, 271, 35, -107, -88, 88, -157, -274, -32, -32, 183, 206, -100, -45, 41, 153, 302, 238, -160, -8, 31, -253, 53, 26, 20, 218, 206, -31, 10, 184, -91, 115, -283, -131, 125, -131, 20, 29, -38, -119, 71, 22, 58, -299, -74, -26, -133, -141, -23, 154, -143, 315, -185, 245, 93, 116, -53, 213, -149, -109, -63, -140, -119, 163, 88, -380, 205, -65, 8, -74, 112, 21, 12, 71, -55, -328, -73, -78, -150, 91, 290, -117, 90, 226, 241, -179, -164, -28, -62, 2, -154, -10, 179, -299, 42, 82]
4707H2K81m65qj36M26P4m20J09j14K85k01M50l23j91J98L7J44l19j04K98o6N5
4729I2j90m0K07K4k42J06j66J28Q4j47M9J36j35L6J22j03rp2l4Q9P4P5k91K14
4753GK33k51J74j52j9j01J5o2K41P7j92J82j94Q6Q8j25n8k1J24k06J77p7j71J90
4777c5J10mJ1L1n07M22o5J69j51J46K5O1k56J0J35j09L27j01j36k97J66p6L11
4800A87j75j13J55k83K83l7R2r3j2j41J43M7n6P0j55k9K5P3k6l19M46K0l99m1
4824c38L24Q8J49j76K4k75Q2%K50k44o8m0L04j58J72j89k8l1J92m6Lj05J1L5R8
4849C4J15k37k16K31N4j06l7K17R2m69M65l48K95j68m7R6k29M58l56J14M8l7J89
4872A58k64K76J47k72l7j09p2Q6m0J81K4q3k40L91L4l18L21l32K52k28J3q0P7
$$ y = [82, 363, -102, -110, -246, 180, 254, -166, -57, -171, 114, -87, 363, 40, -151, 47, 84, 228, -91, -195, 103, 37, 92, -98, -138, 69, 93, -149, -43, -209, -81, 3, -144, -95, 41, -94, -58, 64, -39, -48, -120, -154, -65, 9, 84, -207, 7, 240, -11, 163, 11, -8, -109, -94, -156, 85, 162, -30, 152, -42, 44, 132, 7, -51, -72, 52, -154, 23, -54, -225, -35, 75, 71, 82, 113, -394, 28, -37, 132, -19, 127, 152, 213, -43, -33, 102, -7, 320, 219, 83, -214, -48, -124, 187, 12, -101, 54, -229, 54, 17, 109, 16, 4, -137, 6, 53, -3, 67, -88, -117, -92, -19, -45, -364, 82, 102, -297, -338, -14, 74, 223, 47, 71, -204, -122, -122, 128, -116, -184, -224, 80, -78, 94, -95, -123, -154, 38, -8, -5, -110, -99, -64, 34, 149, -88, -304, -73, -19, -125, -162, 55, 147, -322, 143, -205, 90, -78, -125, -29, -258, 200, -156, -42, 6, -31, 158, -106, 170, 317, 45, 8, -101, -173, -87, -127, 54, 78, -5, -245, 146, 180, -138, 183, -149, 103, -125, -112, -192, -115]
4895a15J0J28Q3O0m27L40J99m23L80k68J66j99J47PN4j94J90j99j35O24l15l1
4917H2K16l91l7K52l18k33L59K41k50K52k53L40k16j10o4N0O3J65k39j81L48Q9
4939A65k73L5M72j50j96q7J83J84l13K85k47O7l3m65J14K96k11J65Q8j09J7Q1
4961F8J93o11M25M8P3k4J25m3k92J75%K4j09m2n64M01K39r4j00O7P1r6J57m40
4985c49O24j60J19l7l03N8n4M2J59j32k4M29l75J72j04J9k49k5n1K32O3j01J29
5008H2j72J82MNP7l81K66j20j02J94J77m24M81k00J60j9j67k03K97l7m7k23K34
5031F4L7l62L46J03q4p0J15K49o18P0K20l9J90k51m0j59M42j16k09N8O6k22K07
5054cK2N1j2O5K8m35K41o1J49Q4l25J96j67K50j57R4j33J36n6n7j7K31k01M1Q9
$$ y = [-115, -105, 23, 106, 166, -261, 79, 278, -145, 235, -33, 133, -66, 81, 88, 142, -52, 138, -61, -196, 428, 113, 82, 298, -93, -130, 122, -196, -429, -70, 171, -79, 173, -80, 260, 44, -66, -130, -80, -17, 148, -91, -272, 76, 165, -108, -73, 399, 249, 53, -34, 149, 333, 20, 305, 58, 125, 92, -373, -259, 37, -174, -9, 79, -30, -13, 68, 261, -350, 75, 123, 196, 172, 297, 254, -38, 137, 137, 161, 52, 10, -554, -153, 86, -8, -108, -41, 30, -66, 91, -349, 275, 115, 234, 197, -106, -48, -102, -60, 99, -33, -57, 372, -3, 169, 65, 84, -165, -190, -241, -9, 54, -47, 82, -90, 92, 96, 101, 178, -203, 63, -57, -159, 35, 212, -212, 269, 69, 229, 210, 43, -160, 137, 100, 53, -170, 64, 101, -261, 85, 188, 104, 34, 149, 398, -220, -150, 70, 31, 221, -30, -70, -229, 213, 97, -112, -54, 12, -210, -3, 19, 70, 58, 123, 151, -284, -43, -104, 45, 129, -196, 0, -167, 83, -74, 20, -113, 23, -33, -90, -107, 124, -77, -36, 53]
5079E3PJ66l92J65N5k36K57M6n1M2j21jp3J61N3K9j4l47M46r7j61K15l34j14o4
5104c10L57k8J4O2%J81j71r8j00K12j02m8M7J34j36J51r3m8O5n5P6p5j71K74m75
5129c37J45R5O6Q6k67K70o9J28k93k0k62O88k93l60L22kJ11j45R6J61j65K13K
5152A70k72K5J11j02n3R7q0L02m16O9j28K9M58j81p8J14j26l2M2j16M2rQ8Ll2
5177g5J69j1k57K26q0J13j74k63L23Q1n5J76o6j28K42j96RO8Q5m13K41L4q8N6
5201A7M0j15J77j18P4m5m6n4K30n4j92L27k27LJ28j53J89k84J44Q6m7k3m4q7Q0
5226FQnO2m1j31r8J40K18j56J82k50K25j10l42K02J07J73l62j9l1K01J31j09k1
5250b0o2J88n5K04j34Ll73J12K4k0J98j42L60m26J09L42l43q2K72l17J86o6j22
$$ y = [53, 60, 226, -166, -1, 54, -182, 75, 121, 70, 112, -9, -10, -83, 78, 131, 160, 146, -201, 245, 148, -13, 202, -132, -246, -310, 47, 19, 33, 95, 95, 276, 105, 7, -93, 119, 17, -31, 16, 150, 14, 165, 72, 24, 89, 34, 110, 35, -136, 138, -337, -192, -97, -31, 55, -212, 58, -11, 117, -176, -196, -458, 230, -63, -423, -101, -103, 8, -137, -41, 120, -45, 168, 170, -102, -77, 34, -68, -121, -24, -104, 198, -218, -149, -277, -248, 210, 29, -49, 65, -61, -93, -51, -167, -125, -134, -46, -43, -75, 94, 83, -174, 52, -28, 85, -89, -352, -29, 52, -3, 173, 107, -21, 221, 25, 34, 102, 187, -226, 15, 49, -39, 17, 57, -58, 119, 1, 75, 30, -16, -70, 160, 106, -86, 241, 14, 17, 145, -8, 181, -103, 41, 127, 80, 57, 13, -74, 6, 14, 9, 71, 30, -101, -199, -59, 159, 3, 185, -65, 160, 50, -292, -90, 17, 190, -172, -191, -222, -21, 110, 1, -20, -82, 106, 51, 255, 121, 124, -249, -137, -113, -133, 65, -77, 283, -143, -34, 308, -35, -117, 155, -162, 24, -42, -164]
5273a64N7L13K7l56K28k26L57j44p5l8K0j59J93k23j0J86J2M5J5j55J75l3k46
5296b01J20k12K95j24J61j05j8K93k86K30k98K1J52O3k17m6M8J16Nl3J45k82J06
5319f7m2K13k55l1J99J40l06p0K70J3m6n3j5q9J95m2k49K08n1p7L54k53J62l0
5343G8k3J00kl63N2K14j63M0Pp2L00l30J76M5j22P6k7J39m5k5J23j13k28P4R9
5368A0l2J05j02k3j94L90j05k17J06J54K5j37J4j9K59k99K5Q6l23M59K1m59M52
5391A96m23q4N1L38R5l94K66J32l33L14k71j0L27l53J70l35K59M0M4l27L88j21
5413c1q3J4L63n0j97J50r1K29m44j76J85k6K97r7j43N7k97L38n5L9o0J64k16o4
5437a94J93N1j98K04J6K44l75L7K72l02M1M2l04J32K88k7Ok12n8M3M9J40j32N1
$$ y = [-164, -107, 206, 233, -123, 105, -121, 236, 92, 17, -21, -1, -160, 33, -190, -200, -14, -2, 43, 58, -97, 78, 45, -201, -81, -293, 2, -122, 39, -66, -84, 209, -77, 153, -145, -124, 28, 91, -126, -172, -124, -8, -3, -36, 109, -173, -67, -109, 104, -151, -182, 17, 157, -149, -219, 51, 64, 18, -35, -50, -139, 56, 14, -235, -27, -78, -155, 199, -54, 108, 78, 55, 155, 153, -210, -158, 56, -107, -67, -60, -132, 168, -162, 14, 59, -63, 13, -14, 125, 80, 55, 178, 65, -163, -89, 10, -22, 83, -19, -42, -236, 154, 49, -168, -62, 92, 117, -20, -6, -25, 234, -65, -40, 46, -277, 182, 203, -256, 196, -227, -311, -260, 78, 173, -221, 45, 177, -156, 158, -113, -123, 204, -149, 21, -314, -55, -15, 29, -298, 90, -31, -114, -100, 263, 213, 16, 166, 75, 304, -140, -316, -131, -157, 140, 43, -100, -43, -340, -2, -57, -18, -78, 86, -130, -194, -1, 50, -148, 56, 72, 316, -59, -22, 250, -52, -11, 31, -273, -141, 147, 120, 126, -86, -144, -101, -52, 88, -44, 7]
5461GP8j20J19J10l91J89L0k26j02K00O8J39K2m25N35r6J91j46j33l23K82JLk0
5485hJ44l52K00K64l48J40J29j95j58L02k30P4J02j34K1J75J49o34J39K22j10
5506a08k46L97o8q9O4J63j59P7j6k06L97j98Q6j38J8J08J79j64R8K3j70k68L66
5529A46k61k7L08k2J26o00J82R4J79k77K40l42K77q5l18K11K5N3Q6O6K72j59l55
5552a81K51m3R1j38kK49k04J40j40O8m7r7N0J8k1K37m66k7K24k2M0j74L39N7m5
5577A57K5k59J5K54k3K3l10R9j20L14k4k73R5L6o9k70L87J54k66J32m31O1K56
5600c7M47l52j11J63M2l44K82J24o9j66k11M7L1K06k06M5K63l21N15o19L88m3
5622G4n1K1j39J54J30k21m17M62K9pr8M89k75k68L95m75j11M01J38j73k15J27
$$ y = [7, 85, -35, 84, 194, -197, -8, 22, -204, -306, -106, -38, 101, 123, -302, 233, 137, 328, 182, 49, -274, 8, 9, 12, -8, 136, -216, -16, 248, -100, 40, 169, -26, -184, 118, -112, -38, 64, -70, -49, 126, 275, -359, -220, 2, -108, -354, 43, -25, -114, -50, 113, -46, 31, 15, -191, 206, 8, 94, -44, -26, 82, 261, 97, 195, 218, 48, -220, 146, -115, -142, 166, 144, 270, -330, -148, -54, 125, -152, 88, -254, 23, -62, -380, -169, -144, -91, -5, 61, 333, 174, -181, 70, 27, 118, -20, -22, 227, 23, 163, 23, 91, 44, -53, -3, 15, -6, 231, -235, -262, -38, -60, -20, -194, 145, 202, 157, 182, -77, -62, 192, 169, 192, -118, -19, -139, 175, 151, -122, -27, 9, -60, -330, 57, 211, -55, 77, -354, -293, -37, 410, 58, -53, 110, 152, -192, 90, 214, 145, -21, -232, -185, -154, 52, -154, -109, 154, -167, 348, -271, 117, 74, 23, 44, -95, 59, 189, -32, -449, 13, 42, 35, -63, 426, 151, -117, 278, -197, -308, 93, 231, 58, -157, -30]
5644c0j13J23J46l7K46m93pK19l6N3l9R8l5j34K47j15j2J16m25J07K30k58J42
5667gJ42k6k14J70n9o3J72j16K50m33K68oj41n3J99j52J68o5q3K35n36K04J61
5690A5J22j76O5j07M75k34R4q9l43R0N0K16N6j50q1L34l16K6n9r9j9J86J76P4
5714C06k36J4J6j34N3J92r4k23L27n38K91LK26k11J58l08K98j8j05n3J44j7l89
5737b98L56J34k35r3K59k47J77k71M21j33l01l3k8K06l2J2m2j35K32j41J39P0
5759A7K21j14j15j51K89k14O1J84j90J12j98L54j82L6m0j73K49J6m3O0K6k36m5
5782g6J54O2j67R3K05m1p8j64O2Qm7j49Q8L12k37J22p8J99l05J25k12N4oJ23L9
5807H6m0j21j2K00l43J8K81M6j58K44l57P4m3Q8J87j53J28n9M9k14J71l7N7j17
$$ y = [-30, -143, -20, 126, 89, 335, -158, -165, 54, 18, 71, 32, 130, 95, -39, 208, 93, 81, 197, -228, -121, 109, -149, -7, 135, 109, -105, 65, 6, -57, 115, -1, 249, -184, 84, 78, -63, -116, 83, -69, 99, 34, -49, 186, -350, -146, 15, 137, -39, 26, -81, 394, 160, 254, 165, -178, -88, -38, 178, 234, 84, 3, 337, 21, 47, -12, -111, -130, 56, 232, 306, 70, 84, 100, -34, 19, 211, 117, -106, 221, -317, -26, -23, 203, -8, 150, -158, 140, 122, 17, -36, 108, 91, -298, 58, 192, -43, -136, 123, -124, 53, -218, 203, 70, -231, -264, -292, -86, -118, -106, -148, -283, -51, -192, -53, 17, 238, 124, 9, -142, 147, -67, -6, 178, -12, 100, -98, 256, 74, 110, 70, -103, 146, 162, 119, 179, 205, -31, -76, 78, 140, -27, 66, 271, 230, 152, -12, 50, 58, 11, -138, -50, 262, 25, 147, 69, 268, -37, 88, -124, -70, -76, 47, 86, 46, -75, -87, 113, -230, -212, 69, 115, -43, 201, -156, -82, -125, -37, 150, -3, 125, 66, 115, -99, 72, 35, 92, -25]
5831b5O7j29J72j14J64j24k00m6L09m3j32j58K82k4Q3L1k88K89o7k88L53q4j61
5854a33L55k75r7M22k80k21K50q0J68k39j2j7L7J34J4K0L4j29Q5K2K00k73K11
5877A96q0k06K26K0k83L75O0m73j3L26j40O5p3N6k40J91J68n3j41J7j7J99j48
5900C2r9K93l38P1R4k41L50k04J3O0J02j21n8J04J06l6m3q2j98L95j70k10K39
5923E9K65m14K44j33j76O3O9J43j19Q6O5l2K0r5j24K84m6m7n3R6k89P3l7O6J07
5948G5o9l8L36m3p8m71M50l65K16j41K00k03n4j3K26o4L40m04M7J70k04MJ04j35
5972a14R6K36l41K08q5j4J59n7L9l4j80R7l9q7m0J73Jj2L0P0N7lr2k30J68r5L3
5999e6N0J74j13J28k31n0k7K16k51L64q3p2J2j25J31k0p3L2k01M26k47K6m1L4
$$ y = [-25, 42, -87, 85, -29, 135, 11, -189, -235, 74, 31, -101, -259, 23, -1, 82, 113, -175, 114, 47, -241, 112, 28, -133, 222, -53, -150, 272, -8, -229, 21, -59, 109, -130, -142, -159, -122, 12, 26, 46, 80, -49, 36, 58, 258, -15, 196, 116, -90, 136, 156, -127, 248, 308, -165, -178, 148, 8, 73, 0, 56, -184, 7, 175, 122, -19, -2, -19, 180, 32, -67, 226, -112, -41, 53, -188, 162, -42, -29, 31, 133, 12, -46, 58, 164, 128, 85, 3, -195, 200, 30, -180, 59, 324, -90, 154, 21, -155, -92, -23, 120, 1, 87, 152, 120, 140, 45, -79, 205, 159, 112, 59, 155, -134, -61, -98, -32, 75, 6, -32, 304, 261, 183, -288, 162, -203, 13, -128, 72, -131, -185, -198, 28, -36, 304, -100, -53, 117, -87, -83, 21, -114, -18, 218, -123, 85, 0, -14, 145, 88, 127, 93, -87, 10, -29, -116, -156, 17, 18, 6, 36, 106, 163, 160, 68, -162, 6, -89, -56, -6, 168, 55, 183, -48, -98, -125, 91, -160, 204, 121, 49, 61, -64, 67, 47, -26, 6, -195, 231, -16, 10, -31, 3]
6023CR7k50R7K16j22J2l07J85J76k15J77j14J2K20l1R7l31%K14j33p6K08l16K67
6047H6nq3l4K39k56j63J70k03J57R7m2k8j8J29K5j89L81l15L17m41O0Jo2J90K03
6072B16m21J59k65L22k77L81J30m28R5M9K36j22o9j19k3j75O03k56p5p5Q6J35
6094A07j60J79l45N0q5L25K32o33K10Q2K9K99m27K14j20L2j53N0J07J4q6K00k0
6117A01j32M2k5j02j5J36m1L60j74k65K38p3J9jq2j45K32L6j1k01n0M5L18j38
6141G2k55L14p2j12n5J12q2RJ8K30k74L67k93M7k25K36J08j01J17j00R8kJ8n8
6165A17j17j60J26o6o4Q9K19q5l13N05k58L1k55K87n8l5m3j92L25M2J9j40j65
6188a91M05m31L20J82m25j90m2M20k26R1J40m1J88p8j12lJ55J7l57J29K2j08m4
$$ y = [3, 100, -150, -53, 163, 41, 53, -254, -69, 107, -108, 69, -45, -33, 187, 156, 253, -78, -78, 136, 3, -73, 135, -181, 86, 81, -2, -36, 203, -53, -216, -46, -249, -92, 5, -37, -65, -83, 46, 71, -118, 263, -52, 265, -176, -116, -115, -177, 13, 216, -205, -46, -311, 11, -266, 115, 245, -183, -88, -39, 197, 75, 6, -113, -136, -311, 292, 36, -39, -114, -28, 107, -53, 126, -219, -169, -254, 71, 303, -330, -120, -38, -9, 290, -137, 77, -43, -11, -164, -114, -7, 7, -79, 121, 101, -31, 11, -14, -116, -131, 5, -36, 324, 150, -115, 123, 50, 69, 68, -14, -159, 73, 109, 98, -103, -153, -108, 210, 72, -183, 131, 59, -53, -108, 4, -78, -69, -51, 179, -95, 272, -21, 26, -199, 37, 145, 44, 161, 61, 159, 157, 175, 117, 0, -160, -34, -100, -164, -75, 144, 59, -254, 251, -7, 24, -231, 56, -2, -37, -80, -272, 53, 95, 114, -26, -191, 214, -217, 103, 285, -140, -330, -372, 48, -178, -87, 53, 12, 200, 122, 10, 7, 162, 179, -178, -49, -27, -135, -179]
6211a79L08q0j42P0L24l73q9M08j30j67nj15K97j22J07K8l22J51n9j39M07nm61
6234b88M88j1l18J14J12O4k08J51o8k04j23K76j37J39k61L30k89J44M2L04kK5
6256B80k51K26o7l78M58l23J30k82K0K47j98K12J38l78J86J38k90L20l67j87J42
6277b24N6M38j25n30L13L0k27K90j30J72j74J46q6K53k99J17q1L3J48j55j06J56
6299A5J40k38L53k16L5J3k35j50K08N5J19K32l44l0J41J7j46M4l34K53R6J05k04
6322g1M3m5L1P1Q4P2j62j98J55J91q4j90p7R9o7q5K71j33L46p8l14j32L92J70
6346B89j86J95l07l0R9l77K27M40n66J50L1Mj73K02P6j80j00K90j13N2O7N7j20
6369B7lj48Q2Q7j08rn3L2Q1k09K26j61J55j22j6j81L00o1j48J42P2j74r5N54m45
$$ y = [-179, 129, 49, -93, -23, 301, -72, -161, 247, 117, -50, -55, -170, 127, 5, 112, 140, -182, -31, -90, -229, 178, 173, -288, 200, 189, -129, -15, 97, 161, -47, 104, 36, -168, -291, -15, -152, -13, -274, 56, -233, -89, -47, 257, 255, 280, 29, 255, 188, -190, 268, -55, 75, -207, -187, 60, -138, 74, 212, -166, 20, 158, -132, 188, -179, -366, -224, -168, 270, 145, -385, -72, -42, -269, 21, -109, 63, -111, 35, -51, 202, -97, 20, -61, -28, 120, -35, -141, 15, 155, -83, 270, 54, 89, 102, -133, -283, -75, -20, 99, 331, -13, -43, 98, 115, -31, 13, -321, -68, 28, 133, -71, -28, -73, -42, 29, 113, 185, 23, -175, -20, 171, 87, -103, -180, -81, -148, -233, 38, -95, 251, 173, -141, -273, 119, 289, 103, 298, -9, -39, 60, -317, -90, 350, -216, -66, -35, -31, -204, -2, 74, -106, -206, 84, -29, 23, 90, 147, 27, 24, -124, -42, 45, -63, -72, -125, -93, -12, -221, 5, -156, -1, -123, -139, -320, -20, -81, -229, -87, -15, -189, -284, 270, -175]
6394a75R4k59L15r0J6ro0J52L68n2n11K62J39rj62m9K78k85L6p2M27k75J44k15
6418Hj10Oj02J34J79k31M3Q3k54L48j64L0J86k59L2K75m5n4m0j25j35J02J69l3
6442D3j73P8Q4m0k10L07jK6J07j34m29K28j06k7J04K51k88L50p5k8o9Q0j21K8
6466a5K03j93k19K70j19l7J61j21O9J84k78rk6J49J62n32M60l8j12K74m19K31
6488D5l41K61L17o1m18K37L06m10J40r9l7r4L66n2k09J58k70L65Q8n09Q7Q4r6
6511a42L17r6j69J32j7K7O3L8j94K52j62j65j1J1J07l9J43J21k64J24k55M47r4
6534A74j29l0j50O9J67j94R4j91K73J58j85l01L58r7J00k68P5J71J30j44j18O3
6556B5j34R9j19L58l97K37l42L54q1O1r6J75j70J27j91J60J06k00k2O6j82J26
$$ y = [-175, -81, -340, -25, -115, -99, -108, -168, -16, 352, 300, -211, 51, 190, 181, 19, -30, 248, -37, -1, -73, 354, 79, 223, 8, -102, -96, -198, -64, 115, -116, -73, 10, -244, 104, -60, -30, 156, -103, -71, 204, 159, 105, 65, -60, -195, -93, 76, 43, -130, -52, 32, -8, -218, 89, 88, 114, 221, 87, -342, -114, -220, -247, -143, 108, -180, 170, 95, 67, -2, 78, -43, -15, 188, -5, -224, 46, -73, -110, 51, -70, -1, 183, -95, -104, -130, 19, 181, -351, 109, 71, -41, 233, -186, 45, -296, -35, 282, 221, -197, 40, 346, -64, 76, -23, -60, -154, 212, 160, -49, 109, -161, 204, 292, -217, -130, -46, -142, 175, 79, -90, 42, 25, 52, 115, 153, -41, 211, 49, -116, -127, -116, -9, -48, 95, 216, -48, 76, -179, 268, 174, 45, 15, -135, -66, 101, -93, 1, -190, 83, 241, 56, -245, 113, 16, 116, -152, -77, 94, 224, 80, -38, 25, -109, -10, -129, 229, -168, 69, -273, 81, 0, 61, -35, 140, -30, 97, -94, 66, 172, -28, -50, 16, -166, -40]
6578d0r6L09lk98J6K51j89J33j4q9q5K56k41M84n63J91k2j3q6J86J22l37J46j7
6602Ar5K56M1l52K42j41J46k39J21j39J60j75K24L5J5r8J79k16j8j33k07M72j69
6625i0P4j79K58m05L71K53k51mK14j69k52q7L59j1N5Q4k69OJ5J66j07q9K3r7j01
6650b33R9K62k53K69L4J8j06l18J09J82j96K00J67k84l2K75j38o7J05lk29j00
6672b39P3L64j52q0K40k10J13J39n34J90R3J5p6j35J21N1J31r8J13m37M1K40K0
6695a7K89q6k7j77j4P8j29k39M83j81k5J40j0L01n54J33k32K80k64J06j9J75P5
6718H6k55K14J25j72l20N52k19l00O15k86q1j28K29r9j14L15q2j32J75J30k95
6739d2M9Q2R4l37J71J70l20Q4j17K25o0j14K08r1R6l36K17J35j30M5j5n8K9j4
$$ y = [-40, -136, 173, 170, -128, -112, 139, -50, 83, 69, -20, -105, 151, -90, 394, -169, 22, 0, -13, -99, 87, 209, -128, 18, 1, -94, 162, 203, -149, 93, -48, 98, -141, -20, -159, 1, -174, 50, 85, 100, 2, 181, -35, -53, -186, -393, 79, -90, -16, -195, 63, -342, 29, 282, 31, 27, 241, 72, -180, -267, 92, 81, 136, 220, -49, -43, -28, 138, 31, -58, -35, -132, -233, -134, 128, -125, 144, 178, 196, 90, -228, -119, 63, -133, 67, 234, -50, -82, 193, 55, -12, 93, 90, -139, -239, -166, 198, 46, -34, 206, -4, 109, 248, -286, -96, -3, 12, -64, -199, -78, -27, 104, 6, 119, -318, -277, -37, -17, 272, 186, 159, -18, -32, 46, -83, -322, 161, -20, -45, 95, 85, 386, -168, -35, -267, 13, -251, -145, -164, 11, 86, -169, 45, 170, -2, -322, 230, 11, -289, 326, 40, -41, -169, 60, -39, -153, 162, 80, -52, 123, 253, -42, 7, 89, 183, -154, 17, 187, -133, -49, -166, 59, -1, -115, 93, 2, 98, -238, -21, 114, -16, 29, 14, -44, -15, -29]
6763b9K2j80K28j43K13k13J75l09K37M5l51L12J39K8l13J02J75k36J16o0J69l15
6785a88J12J26nN1k82J82J88m54J75Mj46J7M63j80r0p1L06r1o0m9L4j18j17K08
6809A5r5J6J3R5J35n3k45j17K27L6J4mj48J96n5n4j7j90L07k64J92J30k76J58
6833A6Q6m9Q4m13K45m7j0mj59J63J1R7Q4k50j5L1K74m38J55r8J84J03j30O9K07
6858A96l76l3L04m9k4L4J51m95N00n94M40J76l70J61kk02L44k78J95p5j20J21
6880DJ64k54q1Q4p8K16qj03J07j01R4J37j90K98j67k07J4k41K97J43k38J12J02
6903A04M4j30L21k20r2j74M67m59k0K69k7j51l1J33k11K89m44L01L4j36K5K41
6925A33m46M54l33N4L67j60J5J5R7k52K33J08l90J53J38j05r6K0N1J19j20L5r8
$$ y = [-29, -7, -187, 41, -102, 111, -102, 73, -236, 1, 46, -305, 7, 146, 174, -139, -37, 138, -98, 18, -42, 127, -188, -76, 50, 45, 96, -186, -4, 184, -270, -95, -91, -237, -220, 243, 63, -27, -98, 208, 117, 57, 8, 42, -76, -193, 15, -80, -64, -51, 44, 179, 126, -119, -236, -9, 27, 41, 37, -111, 85, 30, -24, -41, -231, 76, -188, 4, 134, -142, 16, 102, 53, 137, -276, -31, -78, -88, -92, -251, -88, -77, 20, 104, -146, -161, -130, 144, -294, -139, -237, -53, 50, -80, -11, 196, -180, -213, 91, 42, 18, 52, 203, -292, 208, -386, 54, 230, -140, 21, 19, -183, 161, -117, 78, 3, -117, 4, 168, -86, -167, -83, -161, 55, 47, -56, 51, -50, 44, 181, -9, 289, 122, -85, -71, -312, -15, 128, -110, 2, 104, 148, 18, 339, 119, 27, -147, 320, -139, -159, 110, 83, -68, -99, 34, -177, 112, -332, -31, 3, -133, -108, 133, -313, 141, -192, -138, 229, 69, 84, 99, 196, -56, 177, 285, -105, 48, 186, 81, -15, 5, 56, 175, 55, 90, -8]
6948hO2k2J5j54K76l37K55K06m42J17J30K4j50J28N6m21M27k40K60j83J29r8L
6971C3l06L0L30l15P7K4L23j55O5P8k56k52L91k53J48J32Orj77K5j50J97J82J1
6995A79n50M15j82J54K67k05o6J41O9m10L41j08Q6j46l6N9J36J98j94l9J07l53
7017a37J38j86P4j27M10l63J70k61L04P7k0q3R7j02L8k17L7o1L59j35P7K00l31
7040d2P4J00j10r1r9k26N21q9j80K34j88R5P6j33P5J6j10J26K60k59J23j35Q0
7063A18Q4k31J5J49q5L2p9j34L49j06r2j77m8J75K37Op3q5Pk0K4j03P0P0j76L5
7089c8L1P9q9p7j19p4K53j88L61k0k34p2j6K45N9m3J29l17M53n04O3M0Q4n2Q9
7114D3Mk17J25J05k42J19l9nM59m53k3Lj73L39l00L56L3j75m5K2j66J88J60l24
$$ y = [-8, 54, 32, 47, -107, 169, -168, 87, 293, -149, -32, 98, 122, -28, 100, 156, -265, 162, -78, 182, -1, 128, 30, 33, -273, -243, 87, -228, -151, -127, 196, 41, 106, 184, -72, -324, 67, -186, -38, 94, 100, 91, -86, -61, -211, -14, 168, 179, -371, 44, -138, 16, 283, 78, 12, 153, 222, -188, 153, 45, 131, -15, -51, 8, 144, 342, 148, 109, 216, -137, 1, -185, -111, -238, 172, -191, -21, -282, 22, 99, 79, -4, 93, -9, 29, -188, -151, -212, 147, 12, 89, 289, -42, 32, 132, 22, -69, -168, -394, 127, 38, -142, 92, -96, -1, 75, -58, 17, 33, -77, 49, 309, 50, 173, 38, 118, 202, -29, -14, 135, 50, 82, 3, -131, 218, 112, 20, -157, -205, -30, 207, 213, 140, 55, 62, 42, 66, -37, 33, 103, -73, -38, -7, 72, -17, -94, -213, -287, -34, -222, 139, 119, -115, -187, -203, 42, 101, 58, 187, -130, 323, -181, -118, -78, 6, -46, 43, 47, -170, -45, 60, -182, -63, -102, -107, 352, -101, -124, -121, -294, 45, -255, 101, 134, -41, -86, -64, -230, -42, 118, -206]
7138b06J88j57pJ73j30J65j96J89J5M8p7p7J81J8q2J0R8j46k20K01r9J33N0L6
7162A08L6m38M30l18J45K17M1l07j02J53K20l52J42J48r7j35K26r3L9J04j76k45
7184b54M44j7p1k23J47K0L36j87N8k32j89J94o8j5j56K4K57o2j73J08K29j28m3
7207aj40J55L8r1Q6k74K75Ln4L21l95K07k18j43M00l32P5K68j1k98j00J81N9O6
7231G7o0k41P1k34N94l16P9L17l68R4J63j62Mj95J65q8Q2P4J39q2o2j79J79j12
7255f1k47o1K88j8J16j42J07K1L4q0RJ71j60k6O3Q1P2R3m92q9K52M1j52K56J2
7280H8j0J90m25K95m15O20l14p5k48K59J21J8j62J85M8k35K44j27k51j45L56k32
7302b15L76k30J92N2k2k94j0K49j52P1N5j14J21l79K06j22K09J73l68K22k57M03
$$ y = [-206, -18, -175, -182, -9, -139, 26, -170, 19, 34, 82, 5, -72, 109, 127, 45, 55, 153, 7, -213, -12, -111, 22, 72, 108, 144, -294, 136, -182, -37, 180, 221, -86, -188, -35, 185, -167, -25, 123, 26, -109, 117, 24, 63, 167, -9, -254, 190, 173, 102, -121, 26, 46, 382, 195, 253, 21, -168, 26, -42, -57, -213, -189, 68, 6, -167, -59, 170, 42, -1, -141, 14, 52, -39, 47, -227, 48, 51, -3, 318, -77, 130, -88, -231, 169, -163, -88, 180, 169, -129, -229, -48, 11, 77, 17, -224, -153, -387, 207, -109, -30, 287, -81, 13, 176, 14, 18, -177, -12, -100, -18, 56, 195, 113, 51, -128, 51, -61, -308, -369, -81, -99, 17, -125, -18, 3, 37, -43, -34, 137, -23, -49, 14, 95, 167, 260, -232, -321, -69, -28, -180, 76, 88, 78, 268, -157, 138, -277, 343, 29, -46, -294, -35, 86, 104, -58, 127, 175, -60, 184, 57, -194, -339, 17, -215, 161, -69, 123, 175, 153, -141, -151, 98, -54, 17, 72, -42, 79, -300, -94, -216, -7, 166, -202, 20, -237, 166]
7324A66K0l93K00j62J45Q7N7J67m77J72q2qK34j21l7k24J11L51j04k25K84j28
7346C3K3J3p0L5j57K37k24MJ05J10J27l10J2K1m5L42m3P0k15k35J1L17j3k20j20
7371a92K34k95K67L9n7mJ93J03m8m07Q2j50MK78K3J63L4k02P3k93J99Q0l14Q5
7395a05M7L3j35J16J17K13j21L4p5k43j41K19R2j37K40k50K32m09J07N3L61l42
7417i4K50j99K26m64K92J00L5m4j24p3%p1M4K02l12J70J71Pl97K44j20M9r1M09
7441B10l48K55j92R9k24J52K27j68K20k80p0j13j55M13k03K38K56l22J38k51J47
7462B9k2O9k39J05J24k37R9n7r0R5K16l1K54j61jr0N4k67M9mj15M43j82j71J94
7487F4j49J45l47L32K%J10P5k28j6J13p1R3k66M85k08k26J65M1l2n76P02l08K48
$$ y = [166, 186, -207, -7, -169, -24, 63, 120, 287, -190, -18, -100, -108, 126, 5, -32, -256, -145, 206, 102, -123, 161, 33, 56, 69, -1, 34, -123, 114, -110, -106, -1, 109, 236, -74, -62, -41, -86, 256, 213, 283, 68, -167, -156, 161, 148, -72, -192, 42, -253, 14, 53, -4, -8, 185, 288, 240, -167, -85, -235, -231, 47, 70, 233, 267, 65, 138, -155, 44, 124, -190, -105, -58, -25, -160, -44, 73, 286, 165, 199, 124, -119, -260, -41, 51, -86, 154, -96, 136, -273, -166, -113, 248, -94, 156, -43, 183, -281, 11, 111, 146, 102, -22, -95, -95, -166, -122, 80, -232, -62, 109, 116, -281, -37, -157, -108, -199, 210, -138, 117, -75, 24, -200, -48, 179, 11, 231, -49, -119, -232, -387, 26, -177, 61, 317, -5, 133, -118, 29, 7, 76, -163, -58, 66, -171, -72, -129, -219, -124, 92, 61, 315, 154, 153, 63, 117, -150, -101, -105, -220, 223, 41, -130, 64, -85, 60, -287, 45, 47, 47, 157, 232, 4, -12, 101, 30, 123, -143, 342, 134, -92, 73, 114, 82, -494, 208, -100, 148]
7511A48j36j33O8K60m59L73n6Q9r9j48K7mL01k31J49j59J26k86J86j08k9n3K63
7534H9j30r0k9L62M2j85J09q0Q4j90J12j80j0kJ47m0r3k64N6K05rM27j06m11K43
7559E7k10J42j32L23j59Q5j5j05j10K41o7J6o6k3j0j41O7r6K16J57k16J16j1k79
7583b20J69Q3Q2j78N5J02j41K1K88m18n5J39K15k72J50M31o60O07l51j18%L08
7605B37l84j4K74J73k67q6K01k33K1O1j30J84O4r5J10K0n0j05J84j86r6qK39n8
7629E6K4Pj13k15K66O7J8J32l55j6L49m78J88J85p6M8k33J46N5j69J32k17O8J37
7653Fo0k40M03l36M97m49K59j1j79j45L00J34p4kk09K66k64K95k17r9J71j4l38
7676c06K93l5K81k81j03K84r4J17K06n41j19L50m2J71k29lJ89l7O9K0K00m42k2
$$ y = [148, 12, -121, -53, 207, -252, 121, 65, 154, 55, -93, -66, -70, 231, 0, 149, -10, 116, -170, 16, -92, -121, -174, 89, -41, -131, -160, 202, 244, 59, 168, 88, 172, -18, 94, -86, -96, -98, 49, 9, -84, -348, -292, -87, -96, 331, 225, -186, 57, -153, -11, -143, 180, 21, 106, 91, -14, -124, 117, 50, 66, 0, -23, -33, -174, -107, -203, 13, 170, -46, 70, 59, -220, -51, 32, 114, -64, -9, 93, -48, -27, 261, -157, -212, -73, 142, -130, 20, 451, -209, 398, 47, -71, -71, 237, -147, -161, 113, 286, 19, -67, 134, -99, -78, -17, -147, 37, 101, 6, 116, 136, 86, -19, 165, -21, -117, -125, 114, 56, 80, 87, -26, -241, 25, 92, 110, 242, -113, -129, 220, -258, -70, 115, 39, 87, -146, 0, 55, -114, 18, -199, -131, 6, -54, -294, 109, -227, 270, -179, 80, 69, -110, -255, 45, 179, 105, 103, -106, 160, -104, 191, -26, -125, 46, 32, -306, -13, -48, 233, -48, -151, 133, 39, 156, 362, -179, -298, 52, 10, 181, -48, -51, 138, 101, 170, 190, 390, -52, -74]
7699g4k1L57n26l6J69K95l10j03K87j22J75k09n0M3J56j30k8qQ5J68j90L31j75
7722H4l9K56l68J19P0m24L38J52j68QN6k40J21J45j57m8K2M8K36j03l80L89L0
7745A47N2l78J50p0J55j49K54k08kL6J54l00M9N4j37L01k62K67r1j77J73R5j5
7768I8j80J02L35o52J93LL17j34J25N2k92J62j26O3k49M1P7k17J24M07j39k3r0
7791ck09L41k0N3k59K82l46M05j65r7L6k84K23P0k22K95k1l61L01n7m3R7J05P8
7815A99l76OP4J39J07%l99K94J55j10j21j58R7L68k69k45K98R8n1k19J76P9p5
7838F7j44J74o6j68K49N0l4l4j20P9J10q1J06n39N84k16p4K13k11J78Oj56k97
7861c24L41l0K35q7r9j1P3l89L91k36J51J53q1k59J99j81j61N82L8k91k41J52
$$ y = [-74, -95, 262, -264, -300, -131, 164, -146, -249, 38, -84, 91, -118, -168, -125, 31, -99, -127, -135, -50, 118, -72, 259, 84, 45, 301, -67, 52, 122, -302, 36, 188, 20, 28, 84, -156, -35, 110, -47, -95, -73, -25, 211, 108, -272, 117, 147, 199, -179, -29, -99, 56, -93, 161, -47, -49, -13, 141, -159, -110, -56, -193, 108, -154, 113, 22, -155, 18, 113, 98, -82, 20, 355, -297, -104, -101, 216, 82, 207, 259, -33, 129, 3, 66, -183, -142, -65, -282, -158, 249, 110, 87, -3, -212, 129, 109, 162, -97, 185, -161, 244, 79, -18, 18, -266, -43, 27, -195, 100, 79, -282, 19, -38, -81, 16, 121, 199, -177, -171, -97, 42, 149, 149, -250, 44, 199, 89, -32, -190, -93, 275, 6, -239, 59, 157, 106, -113, 63, 142, 67, -77, 97, 31, -137, 112, 162, 128, 94, -26, 53, 163, 82, 188, -351, 233, 17, -57, 156, -55, 123, 129, -27, -324, 17, -13, 222, 135, 36, 25, 98, -291, 100, -136, 15, 168, 87, -172, 27, -154, -315, 267, 305, 14, -227, -75]
7883g5L0K00r9Q4Q3k09J3k46J18J90m00L8J64J54K1J66j55m0j5qR1j68J46n7J63
7908A89l81j00N70k16j43k41L72j15L2J15l9O3j31Q7J4l9k43J32R2l6oK33j61
7931D8j22q1kJ95J11r5mJ40k69j24K28O1k35k2L39l96J27J59k7j68J09m1j44L71
7955A58J7o6q4k13P5k18L29k5J15q4j49K00k25L34o2l68K96p8K99j78l1r1Kj60
7979b07L51j07k67J61k1J93k2k19K52k10M44l68J5q9K5j52N2j07N29j91q7L55
8001C30r5k82L5l9jj8J2J17L6l5Q5Mk36j01J09J47J24m09K94j67L11j83j84M62
8025C16l41n9j01J43R5j03j6j2j13K90N1j46k41L24k54J95PJ92k85J15j81n0L3
8048a41J9m1J20K9q6K45l19J31J42j95k1K76k37K9p5J82r8J47k06j00K60n9j94
$$ y = [-75, -45, 155, 56, 140, 223, 14, 27, -219, -101, 89, -311, -273, -109, 45, 66, 232, 77, 37, 22, 14, 105, -63, 83, 26, 189, -192, -292, 278, 62, -81, -322, 50, -65, -33, 82, 43, 106, -25, 62, 76, 37, -206, -74, 18, -18, -24, 209, 48, -74, -155, -157, 38, 149, 54, 50, 190, -79, -203, 25, 86, -149, -171, 168, -228, -101, 58, 31, -137, -28, -69, -213, 158, 175, 109, 25, -188, -113, -331, -2, -27, 88, 4, -145, 55, -170, 164, 102, -266, 30, -48, 251, 73, 42, -49, -47, -207, 144, 37, -230, -69, -90, 103, 81, -138, 114, -96, 348, -20, -5, -94, -69, -221, -169, -276, 253, 62, -25, 330, 235, -47, -12, -51, -52, -70, -58, 59, 95, 60, 145, 149, -87, -188, -79, 68, 192, -217, 77, -90, 221, 38, -146, 316, -25, -84, -185, -42, 53, -50, -66, -78, -191, 99, 150, 4, -237, 87, -167, 28, 35, 227, -58, 57, -124, -174, -141, -122, -163, -43, -14, -100, 145, -174, -43, 99, -96, -117, 159, -78, -49, -124, 58, -40, 107, -99, -199, 61, 2, -192]
8071a92J18J54r5J72J4k25L27l72n2J98J9K23l13l15L86j34n2J73L8l4m9j23K61
8094A27k51J50l5J2J54l44K81l5m9j21J12k32M03j6J3j95K7n2nj26L95l10Ol4
8118a25QK88l18p3L88N8j37Q3L9J2l25j99L34k8K17l62M6M2R0k50K3K59K12n67
8142b85N40j68j27j75J55L34j21q3k97N4j41K15rl0R4m5j8k54L06K53j20J15j20
8165G3M1j26L54m81mK14K25l44J21n6J59r0j3j90J88j68K2pj9o2J01J22M1k95
8189a94J98j28
$$ y = [-192, -74, 80, -15, 157, 171, -54, 273, -99, -151, 47, 66, 289, -24, -339, 47, -87, -139, 34, 72, 38, -11, -134, 127, -124, 26, -9, 3, 157, -187, 94, 59, 10, -111, 1, -231, 172, 156, 169, -26, 1, -51, -56, -182, 213, -97, -91, -125, -117, 171, -147, -220, 168, 226, 89, 172, 211, 223, -102, -301, 33, 5, 222, -140, -94, -52, 38, -212, -189, 70, 282, -285, 255, 87, -40, -215, -60, 274, 153, 70, -227, -173, -314, -99, -108, -138, -44, -89, -107, -361, -55, 198, 78, 193, 73, 114, -12, 342, -139, -143, 71, 296, -48, 73, 17, 176, 86, 73, -117, 71, -97, -75, -82, -101, -163, -62, 60, 101, -194, 4, -124]
8191a24
$$ Imaginary data points
##PAGE= N=2
##DATA TABLE= (X++(I..I)), XYDATA
0@%%%%%%%%%%Qj6J6j6J6k4L2m0M8n6P2q8J04j20J42j66J92k24K57k96L41l90M42
33B34m99N67o40P19q07R02j007J122j249J387j538J702j880K076k291K527k784
50a459L066l376L721m106M533n012N557o181O902p745Q747r965J1480j3429J6040
65H773j9733K5412l5364N7864k05952L3176L22415j67059j54139J05030K15730
76A86153n3355j32579l0626N0024j9029o703L682j9261l4204M1013K9141m0999
88b6743l2148P2808N7365l7594m5672L4263J3604n7327m8150J6609J0158K563
100d0264M7887N9245p590k1738K6347R65q2512n1183M3227J3663o7306K389J12350
113C5480L9570r2315l1126R5037L0741r6536m0500P9093L2660o8229k2334N8198
$$ y = [0, 0, 0, 0, 0, 0, 0, 0, 0, 0, 0, 8, -8, 8, -8, 8, -16, 16, -24, 24, -32, 40, -48, 56, -64, 78, -88, 104, -120, 137, -159, 182, -208, 234, -265, 302, -338, 381, -426, 476, -531, 591, -658, 729, -809, 893, -987, 1089, -1202, 1325, -1459, 1607, -1769, 1952, -2154, 2379, -2633, 2924, -3257, 3645, -4100, 4647, -5318, 6162, -7267, 8773, -10960, 14452, -20912, 36952, -169000, -135824, 186591, 19532, -134607, -29577, 186153, 132798, 219, -30407, 19617, 588, -6115, -2433, -21694, -55898, -14885, 14256, -26743, -58891, 13917, 71282, 33688, -11984, 22279, 35883, -21444, -69594, -52985, -42827, -40264, 7623, 66868, 59278, 37540, 63887, 64852, -17660, -68843, -25616, -11953, -79259, -76870, 35480, 75050, -17265, -48391, 46646, 77387, -19149, -59649, 19444, 52104, -16125, -38459, 19739]
125A9739P438n6882k0N4382L27l7944J6176L4824l2579m9377J8330L4380k6701
138a7907l3034L6799N6593J520k6501m525M313q686j0673j3288k1714J131L9384
151C412K4462k3872j6025K6997J3283l2818j9533K2226M171k7878O906M1727l330
164A9728m2354P994N1363j460m9618k331M1775j811m3648p289K4781n006k0202
177b8078J7559K7668j1261j4641K7072K1610l1746l5616J6007K6448j7009k6543
189b8530J4286L0192K636j5095k204P128j098q781q924m155N805P836m558o750
203a2212J2286J8393o216j8904P244K0852q011k6564k60J8899k317j8331K843
216a2298J7317N48q464P352P533j1391j0365J0124N130j7699p672K1970J5505
$$ y = [19739, 27177, -29705, -29725, 24657, 24984, -12960, 3216, 38040, 5461, -43916, -25586, 8794, -17907, -50941, -14142, 42451, 43971, 17470, 12945, 17258, 8572, -2101, -15389, -37103, -35972, 3412, 27874, 4002, -12023, 14974, 28257, -4561, -24094, -1868, 2303, -25575, -18669, 23058, 19728, -22626, -14632, 36731, 35271, -14347, -16678, 25097, 23286, -20362, -27651, -2870, -7876, -28078, -10519, 17149, 5888, -8753, 18319, 39929, 8183, -27433, -11426, 15022, -1987, -28530, -14244, 15948, 18584, 3489, 1285, 8413, 7315, -1466, -10390, -14545, -8740, -904, -5462, -12212, 74, 18467, 12251, -6653, 591, 21443, 13432, -13132, -13392, 5507, 3190, -15141, -12298, 5019, 5567, -2897, 4455, 11988, 597, -9768, 356, 5486, -12213, -19885, 2085, 17590]
229A7590j5618j1526J9869J6703j8386k4553O722J7526n964k1141j218J9033J2140
242A1177o990q545M621J1308K335j1399j0581J420O178q52n091Q6N897M492L094
257G150K953k348p338k333M939l121j2769m697J1341Q823m412k422J0024Q177
271A3967m275m926J627j968j0562l818P409J997j0001j944J4573J1491o419r882
285b731L737Q906l397j1820n555M142L850q30l7K884M134L725J928j384l725l045
301G82p26j398l757m816K66O832M785j210k370M340O790j063p072l763K519n9
317H0m062j236L155J303q81L135M966j827n432J030M524l116q609r29P252K234
333A587n635j707O903O018j992m083k45J672K95j528k693l561j91M711K763k816
$$ y = [17590, 1972, -9554, 10315, 27018, 8632, -15921, -9199, 8327, 2363, -18778, -19996, -963, 11177, 4187, -4358, 263, 11571, 13906, 2507, -8074, -6654, -476, -1328, -6419, -6333, -436, 4056, 7150, 10103, 7755, 417, -1916, 3023, -98, -12867, -17564, -6223, 2600, -1812, -4234, 5790, 13967, 9692, 4766, 6393, 4425, -6137, -9955, -2546, -549, -10550, -12494, 2079, 13570, 7151, -2731, 1006, 9912, 6515, -5305, -10860, -6718, -2868, -3698, -3735, -851, 3283, 7008, 8936, 7552, 3827, 782, 56, -1342, -5099, -9915, -9649, -2817, 1968, 758, -1612, 2728, 9518, 8455, 1383, -2380, 139, 80, -3982, -5218, -2063, -760, -1641, 1494, 6460, 4633, -799, 231, 4755, 1639, -6970, -7899, -647, 1587, -4048, -5755, 1148, 7166, 5174, 1091, 846, 2518, 2813, 1285, -1408, -4969, -5160, -449, 2314, -502]
349e02l823K274O032J183n243l814K622M537q25n685j251M633L899k167m474J164
365a440M267rl345j298J804k67j202K168P71l730k936M598N084l419n541K340
381b155O762M18n352j330L387L17j544j371m06j768Q07L312M53m291p51N497L379
398E364l895m997J969M495K94m982l434K177N190J413l691k497L764M434k066
413C538n092j111J858q8k138L22K260q61L68M206J324m222k120M058K879n247
429f6m881K166M698j499k972M76K791L96L97P74j181k426P14K165k100l782K08
446d122M541J833j480n29J689J887m07k162l226j888J871J948j896k255K748N199
462C751K70l744o68K426j98k638j77N2j762N37K707M49l007L14M945K187m170
$$ y = [-502, -4325, -2051, 3981, 5164, -79, -3893, -1271, 3266, 2441, -3244, -4495, 138, 4037, 1870, -2604, -1440, 2827, 2818, -527, -1825, -21, -288, -1490, 678, 1449, -2281, -5217, -619, 4465, 1046, -4495, -2155, 4607, 5025, -327, -1657, 1730, 2047, 503, -868, -1274, -3042, -2235, 1077, 1530, -2761, -3512, 1985, 5364, 1469, -3528, -1559, 2936, 3230, -1752, -5186, -3009, 2181, 3594, -97, -2594, 1170, 5604, 3538, -1554, -2665, -807, -895, -3033, -2711, -451, -1312, -944, 3262, 4586, 364, -1756, 2302, 5181, -66, -4947, -2781, 1917, 418, -2554, -2078, 713, 1109, 1506, 2280, 1099, -1327, -613, 1552, -548, -4330, -4122, 419, 2252, 772, 243, 1932, 3819, 3412, 1250, -1976, -3864, -1993, -45, -1941, -4196, -1448, 3751, 4021, 277, -391, 2035, 1837, -801, -978, -926, -2688, -2151, 556, 1005, -2002, -1688, 3257, 5444, 1274]
479A274k798K107R58l085k702l49J014J346L860K517k268j267L830K285n131o130
495d539Q15L488p29k772N34K066J988J236J086k129j874K870K920m050n578J030
511c638L532l08l134L33K921K295K256Q52j884l155R38J989l931o329N82N369
527a312J576k259J067L577Q58j000R23n38l345p91K899p97n377j342M550K710
543A399l235j713M274L972m12j829q55j494j103P25j128l542p98M955M048k065
559A199j682K726K681j777k500o25q46r39O98j28k718j167M538L259k105k215
575a601L921M435j619m417j607O62r58j420n84q17l81L761M424n62l127O45L305
592D060L55m757k712Q51R77m23q0k89j22K069L628L80l122k34L126N51n345l763
$$ y = [1274, -1524, 583, 1541, -1544, -4246, -4595, -3581, -2235, 1625, 4142, 1874, 607, 4437, 6722, 1591, -4539, -3724, -236, -965, -3737, -3203, -1137, 851, 2087, 3173, 1044, -830, 2040, 4960, 910, -4668, -3638, -106, -414, -3548, -3215, -294, 2001, 4257, 5109, 3225, 70, 1008, 2997, -934, -7263, -6681, -1312, 264, -1995, -928, 2649, 3507, 2507, 3430, 2892, -453, -1244, 1655, 858, -4519, -5861, -1311, 1399, -1836, -3549, 725, 4697, 4285, 2456, 1601, 107, -996, -271, -1399, -4941, -5739, -784, 3264, 1199, -483, 2243, 4924, 3147, 647, 22, -824, -1763, -1065, -1193, -3911, -5078, -540, 2719, 614, -1601, 2320, 6755, 5136, 719, -888, -226, -1184, -2604, -3188, -4005, -4386, -625, 3799, 3237, 110, 755, 4060, 4415, -342, -3054, -2203, -1226, -1649, -1729, -2018, -2140, -71, 3557, 3937, 815, 581, 3707, 4258, -1087, -4850]
610d850J320K231o39n27J162J066J799K927K53l142k460J610J601l344m008J481
626c520L149K54o41M82J337M27J007M28k197k486J010J830j794l437J191L802
642H42P89j568L90J623J84p14j68j748k333K14K677rk958L17M011J201k154j163
660e67J114J154j123n01j121n01N98J694J29k417J24K505J861k485k389J141J717
677I33o45j263p95M21R98K020J8j864m46J760J467k066l078O52J996N99j332r26
695a551O80J270Q70M15j952r20J328J961j218l048k58K399J297j293j051Q16J270
712A015N90l14j359j570O74J729o08k223l12K190K153q54j719N43J388J068j302
729A089j940p98P76J235j95j499n57J536K070m92j726k62J942O68j775j399L7
$$ y = [-4850, -3530, -1299, -1938, -2465, -1303, -237, 1562, 4489, 4742, 1600, -860, 750, 2351, -993, -5001, -3520, -371, -117, -758, -276, 1061, 1488, 2495, 2923, 726, -1760, -750, 1080, -714, -4151, -2960, 842, 1631, 63, 453, 2076, 2260, 1546, 1378, -370, -2703, -2489, 188, 179, -2779, -2462, 1549, 2750, 596, -567, 547, 1701, 578, 77, -1044, -1545, -947, 747, 876, -1541, -1417, 1088, 2949, 464, -1925, -784, 933, 288, -975, -1770, -1349, -351, 1669, 1687, -177, -623, 1137, 2604, 538, -2540, -1888, 108, 707, -625, -1551, -871, 399, 1269, 1684, -268, -1188, 140, 2101, 883, -2165, -2423, -24, 1273, -20, -1071, -255, 1015, 1605, 1291, -68, -1638, -964, 765, 157, -2066, -2378, -188, 1965, 1111, -608, -65, 1323, 2391, 1089, -851, -1649, -873, 362, 167, -1332, -1889, -353, 1717, 1225, -501, -763, 1179, 1847, 72, -1327, -1290]
746a290P08P49p56n20q1J680J725n48k082l32K025K18j724j340k13J308O23j83
764c3n16l73J288J637k03j515q95J065P59j129j757l54J578P09l53m53KJ200J396
783B053n47j771r27J305Q65j405j995L58J731J378m40q07J88Q86J262o47j570
800h3j283N03R43o92j351p1J960J499m10o61J05Q94K96r75j444r94L91J324j21
819a70j605J82J764J753j12j388p22R06O03n13k164n88M90J434K84p95mJ408J610
838B373p10j081j058O44L43r07j650r0J112J217J66k64j65J203R38l90k077m88
856h84O02M34o26j045l33J277J606Pm81p36Q03R54o63j563q90N27J045m71p11
875a148K85J368Q23K08p87q87N50L67l44j632q82P37J653j96j167K39J703R39
$$ y = [-1290, -582, 167, -589, -1109, -1190, 490, 2215, 1667, -415, -747, 1278, 1496, -228, -1568, -1781, -473, 150, -33, -549, -922, 366, 2003, 1800, 285, -610, 455, 1214, 85, -1672, -2026, -448, 261, -92, -545, -543, 657, 2053, 1506, -265, -1192, 113, 978, -427, -2422, -2064, -333, 1045, 605, -202, -14, 872, 2134, 1487, -83, -1366, -863, 80, -612, -1963, -2034, -74, 1425, 1015, 354, 459, 1353, 1649, 674, -770, -1764, -1373, -49, -170, -1775, -1593, 171, 1924, 1812, 424, -298, 608, 1211, 698, -1466, -2054, -1564, -130, 154, -641, -645, 763, 2373, 1663, 582, -476, 168, 511, -396, -2046, -2136, -1024, 193, 359, 95, -70, 1133, 2071, 1681, -396, -884, -282, 152, -474, -1519, -1852, -575, 1031, 1038, 557, -179, 624, 1578, 915, -648, -1538, -1011, 34, -437, -1148, -863, 505, 1328, 1536, 749, -138, 412, 779, 435, -1197, -2079, -1342, 311, 115, -1052, -813, 890, 1829]
893A829k95j090p22K34O19k34j585q27J140J579Pj040K52J109M35o48p81r52J83
912g87Q01j56q34p63J575J436k23q23n01R69Q45j131j171o05N46N34K58m55n24
931a009R46J518J38j169m47J04M57m30j074k80K63Q75P25o43n04P16J405J17j571
950A37p31L47N73p29q03k28O92Q16M27l11K2N07R38j46j423o90k45M21l33p66
970a525m0Q40R42O44k05k12J86P84k46j538r19M88P94m12q85M23J168N47N6J39
990A029m49K42Q6m01j240j217K21J080P07p64k2J607J295j01j160n57j21J12J16
1009D63j721l98J16J326K82j15K19O62R92m61o64l07l57j23k90j141n83Q66J411
1028A77N46n70k18J278P07l62j430p37j67K15j59l74m82P56J177R77k37n19K32
$$ y = [1829, 1534, 444, -278, -44, 575, 341, -1244, -2071, -931, 648, 655, -385, -133, 976, 1411, 763, -18, -970, -787, 14, -142, -976, -1739, -164, 1272, 1049, 226, -275, 694, 1539, 408, -763, -1368, -822, -288, -30, -485, -1009, -63, 1455, 1593, 424, -23, 81, 538, 108, -966, -1246, -983, -108, 617, -26, -530, 186, 1591, 1708, 137, -594, -247, 326, -403, -1206, -1434, -742, 74, 501, 190, 212, 719, 1657, 1511, 88, -602, -847, -426, -759, -1525, -1565, -725, 217, 861, 656, 444, 630, 1414, 1168, -370, -1289, -801, -7, -419, -1304, -881, 287, 834, 890, 1029, 580, 822, 908, 507, -733, -1950, -1729, -649, 58, -706, -728, 879, 2174, 2073, 913, 356, 235, 347, 463, -1258, -1656, -1540, -214, 68, -47, 172, 834, 1826, 1365, 701, 394, 37, -86, -376, -1517, -2100, -1234, 177, 723, 153, -65, 1213, 1920, 1558, 128, -609, -776, -561, -720, -1094, -1576, -820, 357, 1334, 1097, 578, 810]
1047H10Q03l09j665p52M1J99M6j63l33O97J559P60p66p40M07R16o81j712n86L57
1067a112M86M0k98N15O34P39M51o38r16Q8M59j22j014m62K15R06k99k2K61Q40
1087G51K82K74n41q81J61L30n46j018o60J216J024J15o68L0R04J94j72m02o11
1106b18m41R14k74n16n72L04J463J82o78l49P47N98n84j017l63J86L89K90q39
1125g78r9J018O03P32j253k46L22K2L3o09n07j90O23N41j2o67K26J198P6p00m81
1146a48K99M34o85m28k15J90M83N80o06L84J71N58k22o12p92n6K39M03l17r9J92
1167b47R63m2j80j98lL96j21p35j054M15N36L80k47n34O65R17P7q09r6J95l28
1188e0J26o19l33j44R76P98p34p3N42P17q4j236n89K20L32l81L5m26M37R19N19
$$ y = [810, 1613, 1304, -361, -1113, -1072, -873, -827, -990, -1323, -626, 933, 1693, 927, 187, 594, 1510, 829, -883, -1469, -1112, -626, -586, -884, -369, 265, 1004, 1455, 817, -99, -11, 448, 326, -688, -1150, -935, -29, -328, -350, -89, 751, 1033, 1307, 766, -115, 46, 376, -170, -1188, -1848, -632, 392, 507, -161, -131, 773, 967, 795, 393, -218, -659, 255, -19, -535, -1107, -803, 660, 842, 164, -185, 562, 1160, 576, -441, -804, -618, -229, 61, -778, -877, 141, 744, 1476, 223, -23, 299, 321, 354, -255, -762, -952, -329, 212, 200, -467, -241, 957, 1033, 333, -148, 151, 585, -100, -528, -743, -553, -70, 510, -96, 288, 459, 1017, 795, 183, -609, -665, -426, -23, -340, -439, -247, 716, 674, 494, 296, 293, 689, 568, -167, -1221, -806, -270, 110, -137, -671, -6, 911, 988, 179, 83, 278, -50, 76, -543, -876, -1020, -44, 754, 20, -53, 489, 1206, 1122, -114, -703, -483, -151, -532, -497, -923, -486, 433, 952]
1209I52m95n96L19N42L29j475k51KL14L06o10K27M03qR12l9q19K59P5o7p78m84
1231i82L41L55N6K76l38L67Q38q2J17j024r4K24Pq66n07L10J057K58p6k50J21
1252A08N23N17n98q27m35N46n3o71k2M24O61L50j08n67Q17J3k60n19o89L56n8
1273d92J46k8j40L16N76M67k45n18J73J94n0p83l65K09K86J68j93q8L96O67P2
1294G68m20j10k82M86l62n87k81O1O49K0K58l64r8O54O19l04r64J65P6N1o64n16
1316a145N29O15K41M2PJ4M02K1k96r02K9J28n9l24k69O55M59L21j91m6q5L30L41
1339H17n16j168k18O90N21n61k09K36P78K87m9n07r1J72J1l54n45k9K02P75k68
1360b6j64N34L22M51o06o46l5M83m81l00o13K05P17L25q3k06K26P10K70o81o52
$$ y = [952, 457, -139, 180, 722, 1051, -424, -675, -673, -359, -53, -663, -436, -33, -41, 871, 832, 13, 272, 347, 280, -498, -982, -641, -286, -230, 46, -292, 75, 913, 831, 948, -76, -170, 54, 61, -805, -1312, -1002, 55, 313, 237, -13, 108, 631, 1148, 550, -277, -712, -166, -219, -890, -912, -488, 173, 523, 415, -152, 665, 678, 418, -101, -790, -434, -492, -346, -374, -514, -198, 378, 845, 600, 82, 255, 449, 399, -384, -749, -540, -254, -86, -279, -367, 29, 696, 768, 348, 238, -44, 442, 80, -507, -788, -727, -78, -58, 200, -164, -262, 392, 1011, 707, -257, -92, -16, 35, -629, -1145, -616, -1, 240, 282, 289, 303, 705, 726, 430, -472, -443, -315, -374, -698, -967, -312, 147, 468, 277, 231, 146, 476, 817, 301, -867, -1085, -395, 126, -435, -644, -408, 370, 657, 608, 101, 10, 182, 193, -161, -706, -735, -533, 242, -26, -190, 344, 666, 1117, 511, -135, -170, 313, -168, -468, -1081, -876, -159, 166, 83, -123, 103, 813, 1083, 402, -250]
1381b50j2J30k92j02l57J97O88N53k26j73M24r5J03o32o55K52J09L4l20N2N03
1402f9M11N68r8n43j60P8K74p55m63l20M68N99k16L3K85O12J58m60l02l37O1K87
1424A11p12o15J30R53P4N1j40M63N24J42l91o44l39N2K72n07k92K02O84M71K06
1445F95k52k4N10j92n25m23p63N78N1J43k71K6Q71K42L73n30j45L69l60m86k60
1466c73k88j90K71L01j05M69K55P67j01n49p4M6n97m30k57q6M22L70r5J04M02
1487B62N15L91o47r60K63j2K32n47n3k08L28N71o4J43M35k71K35Q7p11o37O12
1508c6k99m59j64M79M18N93k71M7M94m69n2n7l39n35j78O36J45n98J43R99mQ3
1530E76j19M7q7l88k16r6k73q8M42O0k49L63P38J72l63k45k86K31l89n01J1k1
$$ y = [-250, -262, -132, -424, -526, -883, -686, 2, 555, 329, 156, 580, 485, 588, -44, -699, -447, -338, -304, -624, -572, -69, 342, 910, 812, 269, 109, 187, 461, -294, -757, -1077, -609, -10, -226, -193, 92, 704, 862, 402, 100, -237, -176, 111, -601, -1216, -1086, -133, -59, -8, -148, 315, 839, 981, 590, -54, -393, -341, -69, -576, -868, -666, 18, 489, 695, 443, 419, 929, 737, 212, -211, -974, -396, -345, -202, -473, -447, 424, 666, 1039, 509, 364, 733, 373, -113, -373, -661, -851, -580, -279, -384, 85, 340, 1107, 1006, 457, 383, 429, -168, -598, -855, -941, -519, -149, -244, -140, 262, 777, 1168, 521, -439, -176, -188, 44, -503, -556, -764, -436, 135, 71, 214, 649, 378, 613, 700, -11, -648, -36, -335, -794, -958, -479, -61, 532, 261, 308, 802, 333, 281, 224, -115, -650, -828, -192, -47, -645, -502, 497, 493, 576, 457, 504, 417, 29, -187, -283, -556, -644, -202, -142, -391, -28, 710, 882, 519, 274, -12, 219, -170, -671, -660, -681]
1552f81M8O46J79j50k02P08K60n50l24J31n3j67k92j18J0O13j50L46L08m74K27
1573C15K67%q54j70K05Q3n37K50J88K55L90L52m29l6lL98Kr37p25K45P57j56k68
1596d08M28L16n3M2p5J13k80K27l38o21o0J88P04k42k96O91K66l1k26o2k26l67
1618c10L00k76j76n06P18M03J59j80K18K10Q5l82j58l59j65J70K55m47p7K65P19
1639D66K22k76k35L23J39p96j46k98L06k98M59J56q1L88L52K21o62j28m8K56p83
1660d63l34L09N58m18N73k22J49J42L84Q9o33l45J33j41j01j77m5P15l42L69J34
1681C34J99l43L12k25r2o65J70p0J2l66M85L12L08k95K80J61l99N5N5l06m56%
1703e34Q6Q1J16m9N92J97J80j94j50O4o01K9j49p9J64q9M36k34J09L97J34rn22
$$ y = [-681, -633, 13, 192, 42, -160, 548, 808, 258, -66, 65, 12, -155, -447, -565, -555, 58, -92, 254, 562, 88, 315, 582, 582, -272, -442, -237, -154, -691, -441, -253, 2, 392, 744, 315, 279, 276, 674, 676, -261, -986, -741, 16, -140, -408, 20, 336, 283, 325, 250, 363, 83, 310, -28, -649, -709, -521, 183, -59, -355, 336, 602, 571, 345, 283, 57, -310, -10, -286, -462, -968, -250, 153, 312, 132, 350, 560, 645, 263, 105, -254, -419, -249, 6, -441, -518, -253, 466, 688, 412, 177, 500, 639, -157, -303, -601, -295, -593, -134, 22, -59, 329, 681, 902, 240, 112, 64, 320, -463, -797, -488, 70, -348, 225, 3, 152, 294, 678, 767, 134, -211, -78, -219, -320, -497, -542, 173, -169, 200, 334, 533, 190, 502, 277, 185, -480, -310, -380, -368, -734, -249, 63, 371, 76, 356, 517, 118, 173, 228, -78, -534, -534, -448, -367, -251, -300, 292, 489, 669, 475, 325, 389, -212, -183, -332, -411, -247, -336, 100, -134, -25, 372, 506, 497, -25]
1726b5R1o9l30l0K60k94N6K33M25j03j73M39j64K5k45k02j73K4l30J90K23k22
1748c94P88J72q0r2Q8l26M59r89n1Q1K71j44Q5q8K51J07K32p0k80J17N0j68l96
1771c77p6L4L67K8q7K70M52j63Ml0k56j44k30%M9m74M89J66p4M98K36m54J84J40
1795E52m07j15m99J82j7j50r1L81J47J67J71R2N2p8j08n00m7k09K06K4j41oK84
1818a10M11M69m36P4k9j19m45l35j81K34N02p4j39J2N47O5nj94o0r9k28L0k69
1841c79j81P1K42L72j24L89p6L38k51k23j02r5r9k30l00J85L10J84K43J67Oj02
1863C45J39k31m03Q9m46qM26k89K75m9N00J68j46O0O1k38k2n65k27K07j07K05
1885b56n7K63N08n3O6Qk69j18j14J25m78k93K51K05N92k84P2L61R9q5n66K09k52
$$ y = [-25, 66, -3, -333, -363, -103, -397, -341, -108, 317, 214, 41, 480, 316, 341, 96, -106, -279, -255, -585, -395, -172, -394, 394, 566, 486, 394, 482, 156, 615, -374, -425, -344, -73, -217, -132, -220, 31, 138, 370, 300, 20, 137, 187, 19, -377, -453, -419, -52, -24, -111, 159, 611, 448, 452, 422, 166, 22, -208, -208, -159, -633, -144, 22, -52, 446, 682, 228, 412, 552, 145, 30, -469, -287, -304, -454, -545, -164, -17, 150, 321, 413, 465, 387, 279, -221, -268, -477, -271, -247, -388, -394, -110, 301, 770, 334, 408, 379, 260, -185, -520, -701, -467, 35, -39, -178, -166, 381, 446, 441, 247, 187, 88, -140, -110, -379, -560, -489, -247, 125, 1, 390, 314, 652, 401, 178, 76, -19, -118, -348, -648, -463, -153, 31, 274, 441, 447, 345, 484, 253, -150, -61, -507, -515, -89, -378, -103, -152, 348, 516, 370, 430, 491, 253, 231, -334, -561, -354, -461, -256, -313, -50, 458, 405, 471, 479, 210, 92, -22, 103, -375, -668, -417, -212, 380, 96, 168, 529, 628, 543, -23, 186, -66]
1908f6j49r6R0j91J74K75J44R5l17N64j96Ml32k84J22k75K14LM4J74J14J71kj19
1932A61L13j4l52l89o3j5j05J72m2K9L75L35J03J54n17k30j38K20p5l33j6K79
1954a48K1J22J41RK99L05m13k73J85l55L5l17j44L53J46pJ7N3K58l0J82l67o0
1977A2j71k25J35k15o0k7P07N6J33Q9J99k81l02O3l89k89n2O72j24m05L42O00
1999D68j2R5l25j38Q1k24J5n54K69k22L48L03j77L2J67L46l57o4J09j45p2m87
2021e44P1R4M18J58Q3l7j20K45J27j29n12J32Q2k22l05Q9K68k8J69K90r0L29l92
2044A76K31k83m70k9K80k24J95J22j73P8K66n9K55k03j14K4l67m7k03L30OJ56
2066e3K02r1N99j78k65r2l1m7j90j44n5L5J38O8L2K19L02j19n9j91L02j22k46
$$ y = [-66, -215, -311, -221, -412, -238, 37, 181, 276, -41, 523, 327, 331, -1, -285, -163, -438, -224, -221, -177, -3, 111, 282, 280, 161, 474, 460, 108, -281, -344, -359, -464, -292, -334, -305, 70, 405, 508, 662, 145, -85, -223, -3, -78, -411, -427, -148, -127, -5, 136, 145, 444, 749, 336, 63, 248, -107, -72, -389, -533, -180, -34, -41, -24, 29, 287, 257, 439, 72, 12, -159, -384, -249, -464, -524, -551, 156, 212, 345, 434, 633, 352, 50, 113, -276, -565, -617, 55, -69, -474, -132, 468, 456, 551, 226, 88, 169, -55, -40, -594, -325, -547, -199, 104, -73, -41, 126, 472, 115, 51, 160, 15, -57, -544, -473, -379, 39, 197, 280, 243, 123, 368, 495, 366, -146, -14, 68, -154, -459, -370, -102, -130, 39, 329, 239, 568, 176, 407, 124, -346, -375, -95, -319, -124, -2, -175, -97, 169, 110, 365, 162, 48, 72, -295, -342, -545, -215, -209, -53, 149, 58, 657, 479, 214, 122, 91, 44, -146, -290, -345, -310, -172, -104, -72, 147, 449, 330, 271, 80, 382, 260, 14]
2089A4m01J75P5QrM63l86N4J88K49j68j95m60K99l54J84j14J79l0K66M47J16n15
2112H5K84M2j28m7o04J16J42m3k55L68J7P6K14M68n93n7j89J51j99j99kK78%O7
2136hL06Mk87L73l2l77k85K58j8j07l68N77q8L75m6k98K56j5Mj05R4j98k87K5
2160b47J19k90J62N19J4j01J89p1J55m25m9k50j35J25L04j47m03K61L09M72k45
2181B66Q3n9p5k46l46L36l77J1K60N9K59k21J49N71k98n6j21j37l07j75K35j72
2203c61J59K7M00k72K40L28k42l23J29l31p3m7Q9O8j12J5M77L6J2j74o5J98j59
2226A9l83K96j00k97K64M5m7J86K37J32r0l07J25q1Q2l13k2j56J83K32P2m8L09
2249C38o6O9j81J20k1l00k2k25J42P5K01k04J01K49q3q5j92J00j34j32J81k12
$$ y = [14, -387, -212, -137, -129, -138, 325, -61, -7, 181, 430, 262, 67, -393, -94, -448, -264, -378, -199, -229, 37, 484, 600, 85, 369, 411, 283, 236, -368, -252, -110, -153, -408, -40, -23, 53, 267, 735, 142, 85, -104, 47, -152, -351, -353, -75, -75, -8, 298, 302, 15, 388, 356, -21, -306, -48, -66, -173, -541, 36, -52, 323, 277, -21, 235, 220, 224, 119, 213, 15, -272, -247, -128, -418, -256, 263, 277, 176, 365, 294, 449, 24, -25, -275, -410, -285, 19, -128, -531, -270, 39, 511, 266, 349, 290, 215, -31, -377, -41, -418, -407, -147, -88, 171, -50, 99, 670, 372, 316, 195, 58, -249, -424, -189, -361, -202, -175, 225, -47, 193, 521, 279, -44, 85, -246, -319, -366, -277, -209, -321, -306, 171, 207, 219, 45, -20, 178, 19, -364, -68, -168, -465, -201, -156, -203, -17, 220, 352, 262, -45, 80, -1, 81, -232, -254, -410, -227, 5, 77, 29, 338, 272, 341, 160, 280, 259, -41, -63, -288, -146, -71, 130, -74, 27, 276, 193, 108, -84, 16, -118, -250, -69, -281]
2271b81K52o01P29o9N5j25K63J48M7m97k62J89m9j07m3J11k5M58J26l1o0J3k6
2294B15kj16l98N0j65N88l06qL79k23K53j31O3o6j26J56j46m70J91N3k17K81J57
2317A2K56j8mJ76k75j31k39Q3r4j06K22p3N5L55R2j60J48m2k33m1j61q1J66j94
2341b87J38K25o2J01J25P3O8l16j26kn0l23K96k20Q9J90L55k58K60J08m04K17
2363A97k19k65j6k3j29K31K20j83K01L23k44J30K9m78j15K15l0l24K41j04K36
2384a07J3J31KL69l03k40K31K53n18j83J48j80K48O8Kl8K67L4J09l5m25Q2K3l93
2408d42J02l1J08L93k87K42M27o2j61j77k08k39O0J28l69J85J28R8K35J22J63
2429D15k22k9J23j39j67q4k17j33J35k1K19L15NK76j76j60R7k03o0j55j8J81m9
$$ y = [-281, -29, -630, 99, 30, 85, -40, 223, 371, 418, -79, -341, -152, -201, -308, -351, -240, -265, 193, 319, 288, 228, 241, 215, 213, 97, -301, -251, -416, 172, -134, -142, 237, 14, 267, 136, 199, 133, 7, 163, 17, -453, -262, -209, -426, -145, 12, 268, 250, 246, 422, 147, 16, -223, -140, -234, -340, -118, -191, -136, 219, 311, 151, 299, 257, 24, -17, -178, -259, -93, -287, -149, 76, 14, 115, 240, 313, 381, 65, -61, -63, -113, -436, -140, -360, -271, -81, 274, 16, 276, 384, -20, 197, -22, -287, -303, -326, -455, -224, -4, -187, 14, 337, 93, 223, 252, -226, -341, -126, -156, -480, -239, -343, -107, -94, 37, 39, 408, 105, -135, 96, 349, -169, -352, -204, -384, -136, -68, -66, -104, 163, 197, 306, 271, -154, -72, -49, -442, -340, -371, -263, 130, -157, 85, 512, 450, 289, 112, -96, -335, -275, -147, -516, -331, -203, -105, 130, 252, 415, 193, 164, 287, 148, -19, -103, -320, -453, -318, -339, -120, 195, 200, 476, 300, 140, 237, 34, -26, -181, -199, -18, -67]
2452f7l15J68J89J11M8k1J82k02k21L7j11j45L43r2j2O9L63N7j22j22J33k57j48
2475a35q1J04k35o0K73o7K05O8L11k23K83j50k69N7j70j47J3K39j31J09l06N94
2497B82n1kll6l38L58r8j95j62j47L41m1M91m29L30R1l85O5J11k74M5j54J26k64
2521c39N18k95L55J27nl5r2J08m53pl68L32K68o4j90j14M4J03L20rK2l05K6O1
2545Hj29j54L62l10j61K80J98J14J70m3J55p29L13j42l18J73n4J54Q4J64k0Q4
2567A99k48L90O3k08k97J57j98j18j6n5K57J94m8M2J84j67p0j52j11n4K06k01
2589b51j52K48J03J40O7N4J67k05p7o8j10k74J98Q7Qk19P8K92K35o01O33k13j75
2612c5J96k32j36L7k99J92N3J23L18N9j76L4K16j19L9n76P6o6J31k59L13N8J19
$$ y = [-67, -382, -214, -25, 86, 134, 113, 295, 93, -128, -91, -202, -347, -4, -96, -108, -39, 324, 381, 259, 137, 270, 13, -135, -216, -112, -347, -407, -134, -201, 4, 72, 383, 160, 443, 293, 24, 81, -89, -236, -223, 16, -115, -6, -312, 282, 231, 229, 226, 190, -148, 210, 112, -83, -245, -392, -51, -92, 399, -30, 300, 391, 6, 71, 182, -92, -47, -201, -75, -339, 179, -116, 239, 366, 361, 326, 234, 342, -111, -118, -486, -154, 114, 50, -140, -254, -210, -107, 213, 204, 226, -79, -53, 8, -121, -275, 87, -223, -384, -104, 94, 208, 378, 335, 490, -239, 74, -68, -386, -213, -267, -113, -29, 135, 115, 199, -49, 341, 404, 196, -101, 56, -142, -260, -276, -331, -74, 120, 72, 114, 298, 131, 61, -91, -202, -256, -50, -251, -403, -155, -52, 88, 155, 209, 376, 171, 94, 26, -84, -358, -160, -73, -65, -284, -206, 86, 321, -280, 353, 140, -35, 161, -71, -207, -170, -469, -277, -224, -101, 217, 276, 100, 134, 350, 231, 270, -306, -230, -296, -165, -424, -111, -53, 66]
2635F6j50K6K51N9l27J2M9l46L25k16J04J23N4P1O5p5K06l53J82m14J87j5k64
2658c80K58K8p8K31K22o9j15K88j24k90K12k54k89M33l74JJ81R7K15j58K5J61
2680B21R9n5l08j10j86J48n3M2J40R8J6L1K28j91J1l2l51K71j91J18k44K35J21
2703E8J50J68j27k04L44m83K05k73J62j23j5J16N0j38R2L9K04k00K71j52m28K84
2725@j2j94p2J8K50k01L98j6k8%J14j79k10o4J8K03j54q5K29j03K67O6j41n2K57
2750C09k40J16l37O4k45J2K59K09k99K16n8K98k01J13k21r3k1m2J65j80P6K47
2772A47J32l18J76j17K25k58L07k54Jm63M68k26k6j87M92l3K00p9M1Jk44m03K29
2795a89m3J30J12q9K87q2j1J22O8j45M8k48j65ol00J91J47j16N22j83k04L39j66
$$ y = [66, -84, -58, 193, 252, -75, -63, -14, -360, -35, -251, -147, -24, 30, 101, 166, 91, 297, -56, 126, -288, -101, -116, -380, -122, -94, -172, 59, 281, 212, 97, 385, 261, -29, 183, -71, -360, 73, -301, -300, -119, -22, 193, 35, 60, 221, 320, 265, -43, -153, -339, -191, -244, -202, -62, 36, 52, 83, 311, 120, 131, 99, -252, 19, -172, -54, -298, -63, 58, 208, 376, 249, 45, 389, -94, 111, -162, 0, -123, -138, -22, 28, -110, -18, 21, 225, 25, 296, 144, -284, 0, -12, -206, -278, -260, -10, -211, 187, 171, 143, 143, 257, 78, -132, -196, -178, 25, -129, -214, 15, -88, 179, 245, 104, 52, 309, 69, 185, -152, -88, -333, -321, -62, 147, -152, 64, 6, 304, 103, 216, -5, -98, -119, -161, 4, -176, -100, 147, 279, -39, 137, 20, 245, -13, 294, 40, 41, -422, 46, -180, -206, -393, 99, 66, 266, 187, 228, 229, -15, -418, -189, -232, -102, 10, -79, 208, 126, 115, 237, 305, 160, 208, -40, -205, -211, -511, -320, -173, -289, 233, 50, -154, 185, 19]
2818A9j16j37Q0J35l57M25k98l7K46l6K55P6P0K22n94k56M10j76k5J68k67J45
2840d8L3m6J01J52l19N46k34j84j90R5K0k6k58K05J76J19j16n9K68j81R4n1j57
2863f0J06k69j90M70k07J34J19j58Q9M6K60k25N9p3o86O07j99k11N79l0J50K3
2885C34n57K94J5K90l82K38n23K17q7N9o4L21j15K47N5rl64r8P1l52M04n7j33
2908a96J34O9j51L07J93k76oL61l82j09M6j42n4j9j9M45j67N9J13J34N4l77L0
2931D7J29m53J59K8j42J38K98m45L42P5j00r4k4P6l7O2j92k30J31l2N29n32L18
2954E1R3J70j81n1j86l82Q4J39K37k10L01m1J44k13K24j07o7l79M95m8k20J04
2976d3l60M35j70lJ84J98K03l94J05J35n94J5k8L0P0N8k6q9K32MJ71J9M0j42k04
$$ y = [19, -97, -234, -154, -19, -376, 49, -249, -286, -40, -76, 179, 255, 325, 547, -47, -303, 107, -69, -94, 74, -193, -48, -15, -61, 40, 192, -127, 419, 185, 1, -189, -94, -74, -100, -358, -153, 23, 142, 26, -33, 235, 54, 148, 97, -60, 46, -223, -413, 57, -150, -16, 103, -55, 34, 80, 340, 115, 174, 101, -585, 22, -177, -388, 191, 161, 311, 334, -223, 71, 86, 376, -6, 232, -291, -74, -161, -102, -166, 155, 40, 287, 342, 333, -31, -129, -58, -410, -6, -63, -196, -62, 7, -144, 163, 356, 80, 74, 435, 53, -56, -10, -152, -206, -225, -244, 201, 34, 93, 206, 340, 394, 17, 47, 176, -277, -118, -90, -232, -94, 204, -241, 101, 176, 76, -18, -42, 34, -3, 59, -133, -363, -232, -264, 265, -267, 51, 144, 314, 133, 82, -104, -486, -402, -263, -26, -236, 65, 24, 168, -45, 179, 72, 5, -374, 121, 73, -147, -43, -403, 32, -138, -141, 43, 241, 444, 50, 155, 290, -304, -289, -317, -287, -217, -159, -185, -274, -42, -38, 133, 152, 192, 50, -154]
3001a54J99l58k29M17J52J52K1N6K01j53l61K9J05j85J12j87j2j28J69M2K04J1
3023A03q7mR9J25p2j70k55N8j32M3L23J9K17j57r1J86q7o3J69k30j93Q8k70J79
3047b02K81n1N3J29l71L99m3k0k00O9J42j90k59J16Q9J7KJ74k0N3j15j28L10n43
3071c08m9P7rJ24L20l06K57L0P4J72m48L59k77k02O0J36j29n0J18J52M4O1J8j21
3095A03J82k87j79K8j58L11N6pO3k38L43J77l56k7K4j60lp1N2K2R0M2j19j02J22
3120i2j59L54J12M9n53N40n51l4J27J87j84L68j28q9K03j38O0J45n9k94J05J4
3142a7m4j67L8K99J19j12k7k5Q5n4n0m5J98n45M2K14r4J77K29J45l25k23K66j45
3166f1J37J27j98k24K15k15J47K21m0P4p7N8o0j24L5p0O3l7Jl11M69l91J30J80
$$ y = [-154, 45, -313, -542, -125, 27, 179, 200, 256, 457, 304, -57, -28, 77, -108, 4, -183, -195, -323, -154, -112, 92, 103, 16, 12, 111, 236, 164, -6, -261, -203, -335, -292, 31, 50, 267, 110, 19, 205, 118, 55, 224, -6, -199, -111, -381, -202, 79, 28, 81, 210, -161, 238, 195, 175, -25, 44, 186, -4, -263, -147, -58, -41, -39, 135, 115, 168, 53, -75, 235, -308, -357, -280, -289, -165, 155, -151, 106, 136, 210, 382, -66, 293, 16, -186, -126, 10, -119, -169, -51, 101, 145, 206, 224, 103, 285, -2, -181, -153, -311, 0, 56, 49, 112, -126, 217, 394, 38, 11, 35, -125, -128, -199, -147, -125, -35, 7, -112, -214, -92, -251, 103, 215, 264, -289, 251, -300, -334, -207, -20, -204, 164, 36, -53, 150, 12, 72, 217, 158, -136, -31, -17, -61, -228, -190, 109, 228, 116, 89, 64, 149, 95, 45, 0, 198, -347, -305, -91, -185, -8, 221, 366, 41, -182, 84, -61, 76, 203, 5, -219, -4, -219, -72, 149, 109, 183, 106, 164, 104, -20, 15, -55, 8, -29, -28, -339, 130, -261, -131, 49]
3190D9Q4N3o5Nk1j49k6j96J91l0J98j62L67l59L25k41L3L2k90O5L4j66q0k1O6
3215c04K35L86j57n8L2J83m29j6J01k06j35M12R2j46O3J32j64K9M5j0J00l25j20
3238b60K42J06j93J10J99j51o2K86j98j43L9J30k68nl0J11l6J68j15K35Ql17L49
3261B05l98K1K74ql8l65J16N9qM9JJ41J40j39K86k76l9n18L17L30k02K08k88R0
3285d2J91k93M77j35k71N3l03L82n2q2o9PnK85K11l45K14k39j02K50k91l4J8J08
3309f7R6k06L77k09K2K9J05j70J86M6m67K66n06L84j70K65l24P79j57Q6k12j99
3331d6P1j00j29R3O7N2k00m1J77J57j63R8J2k92K16K20p0k01m0k6K42k43j62K63
3355d5J74l75M62j02nl05K38j04j9J67j80R2K78l17L21l51j07J95k66L82j14j97
$$ y = [49, 133, 186, 121, 126, 105, -44, -70, -266, -75, -105, 93, -69, 298, -61, 264, 23, 56, 88, -202, -137, -103, -269, -349, -370, -304, -69, 317, 160, 102, 134, 317, -112, -128, -27, -233, -368, 44, 136, -10, 53, 185, 21, 50, 95, 85, 185, -140, -260, -18, 88, -105, 5, 204, 53, -9, 277, 79, -64, -25, 105, -163, -168, -198, -87, -123, 45, -70, 165, 173, -144, 205, -193, -172, 102, 94, 56, -309, -193, -134, -142, -93, -92, 49, 189, 50, 336, 60, 21, -497, -180, 150, -52, 156, -132, -42, 149, -144, 333, 198, -73, -20, -323, 59, 7, -75, -144, -137, -142, 143, 354, 9, 223, -16, -118, 132, -159, -193, -175, -67, 29, -177, 200, -9, 13, 42, 147, -23, 163, 209, -258, 8, -498, -114, -284, -19, -343, 436, 279, 365, 153, -46, 25, -75, -204, -111, -44, 8, -192, -233, -56, 101, -62, 36, 48, -244, -28, 192, 122, -79, -119, -145, 97, -146, -308, -45, 129, -246, 216, 114, 109, -196, 42, -62, -81, 86, -94, -2, 276, -41, 280, -71, -178, 17, -249, 133, 19, -178]
3377a78J95j3k09K60p2K03j13j42J73Q5j18j01J26j72r9K67k09q4L19k8J83p4
3399A99o8k37M0K00m53QNL94J9k73K75l03M85M7k74j27lJ64l62O2OJ56j14K87
3423A33l2M5L17n85K5K64K93k48k65NM9J89m6j85L27j88R8m1n9j23k3R8M1l35
3447b46K48Q0j06J7J77j7n4MP8j61k70K71j85m9L51k54L06n2QJ59l96O0l61L30
3471f2j83O9K36j14n1L6l7J86l8L2J09Qp8j03k06K3J91m27J39J58K79l00K48j41
3495b6K6J04l60%L16j81P1j81k57N51j01L91j34j7k80L51j86j31J39q7P1l03J12
3518a12L05k26j8J74J92j39p4L8l81kk8M5J59K36j76K19j4k14j34L04j25j00n0
3541a21M3N6R0L4j68J62l47K47p3L42l23M4k33K06P8k52L55o11M19Kk87M33j25
$$ y = [-178, 17, 4, -205, 55, -17, 186, 73, -69, 104, 189, 71, -30, 96, -76, -175, 92, -117, -201, 118, 90, 273, 199, 131, -106, -66, 134, -319, -311, -306, 88, 107, -166, 109, -194, 291, 338, 64, -63, -66, 98, -264, -202, -196, -40, -154, 133, 101, 146, 463, -122, -97, 167, 460, 212, -53, -48, 1, 190, 144, -41, 286, 98, 196, 155, 96, -27, -50, 48, 89, -246, 2, 82, -24, -7, 170, 153, 99, 103, 181, 20, -250, 21, -164, -213, 138, -116, 190, 138, 146, 305, -91, -31, -392, -62, -245, -176, 60, -54, -105, -69, -106, 80, 42, 74, 183, 191, 113, 10, -196, -173, 18, -409, -270, -112, 167, -133, 115, -26, 0, 104, -256, -256, 60, -121, -50, -231, -488, 63, -38, 353, 219, 202, -78, 273, 87, -44, 95, 8, 79, -224, -112, 193, -33, -51, 123, 315, 176, 102, 140, -241, -243, -271, -226, -67, 169, -7, 212, 198, -16, -150, 154, 29, -71, -121, -78, -22, 68, 102, -66, 96, -251, -4, -77, 265, -58, -14, -247, -41, 37, -215, 140, -471, -52, -50, -337, 96, -29]
3564b9K66j00k62J13Lp9l61J92P0l8L13l9K04r6l8j82J30j95L55k68j2L70l56
3587c9N5j15J24J78n8q3J40K3m38J84k26R7j17J72j24J96J33J29Q6k37p7m4j76
3610b17L73k84O5n4J85R4j73J66r0J53q3k38J51j00p0n4R1j04J05J16n08N01k0
3633EK9K4J48l9j95J43j5j87j54j30N40q5j53L6J01K9P5j53j33m9J74k8j78L20
3657A25M6k47K25Pj51J41j44R5j17J68k49J19m8k1J55J5j14J39r2N0k70J48j02
3680a22j60R7ON2O3L3n0K16Q7k99J26OQ7J20l30J90p8j67L19j79k28O52m77Jp2
3705a07J58j33K2J21J4k38J48R5Mo8J84k30K26j49L1m3j58r2n3K93J8j48J37k05
$$ y = [-29, 237, 137, -125, -12, -9, -88, -449, -257, -187, -225, 88, 49, 253, 157, 119, -63, 67, -128, 227, -41, -53, 317, -39, 16, -99, 25, 203, 145, 62, 202, 225, -213, -29, -255, -158, -275, -103, -227, -31, 102, 231, 317, 80, 3, -41, -217, 156, -128, -63, -117, 68, 162, -11, 155, 65, 218, 135, -103, 48, -52, -122, -176, -85, -189, -84, 32, -476, 25, 5, 34, 58, 206, 167, -28, 115, 100, -87, -241, -371, 169, 84, -69, -33, 68, 97, 172, 19, -114, -163, 11, -17, -195, 125, 171, -76, 149, 156, 5, 146, 2, 97, -20, 148, -101, 18, -30, -51, 104, 119, 5, 144, 52, 102, -168, -20, -122, -282, -185, -179, -127, -64, -31, -81, 135, 222, -77, 49, 55, 142, 262, -68, 122, 44, -123, 196, 17, -211, 441, -36, -35, -107, 51, -82, -60, 61, 75, -163, -15, 80, 84, 16, 200, -30, 196, 47, 78, 35, -123, -215, -268, 25, 43, -105, 32, -173]
$$ [...]
8191A29
##END NTUPLES=NMR FID
##END=
