##TITLE=1H_LR-691-R2-CRB-C1
 CDCl3
 8 sc, 
 6.9.2024
##JCAMPDX= 6.0         $$ Bruker NMR JCAMP-DX V2.0
##DATA TYPE= NMR FID
##DATA CLASS= NTUPLES
##ORIGIN= UXNMR, Bruker Analytische Messtechnik GmbH
##OWNER= root
$$ XWIN-NMR		Version 3.5
$$ Fri Sep  6 15:42:15 2024 Russian Standard Time (UT+4h)  she@DPX200
##.OBSERVE FREQUENCY= 200.1318
##.OBSERVE NUCLEUS= ^1H
##.DELAY= (6, 6)
##.ACQUISITION MODE= SIMULTANEOUS
##.ACQUISITION SCHEME= undefined
##.AVERAGES= 8
##.DIGITISER RES= 18
##SPECTROMETER/DATA SYSTEM= spect
##.PULSE SEQUENCE= zg30
##.SOLVENT NAME= CDCl3
##.SHIFT REFERENCE= (INTERNAL, CDCl3, 0, 15.7039)
##AUDIT TRAIL= $$ (NUMBER, WHEN, WHO, WHERE, WHAT)
$$ ##TITLE= Audit trail, XWIN-NMR		Version 3.5
$$ ##JCAMPDX= 5.01
$$ ##ORIGIN= Bruker BioSpin GmbH
$$ ##OWNER= she
$$ F:/spectra/data/she/nmr/H-F/1/audita.txt
$$ ##AUDIT TRAIL=  $$ (NUMBER, WHEN, WHO, WHERE, WHAT)
(   1,<2024-09-06 15:40:55.96 +0400>,<she>,<DPX200>,
      <created by zg, POWCHK disabled, PULCHK disabled
       configuration hash MD5:
       00 E9 B6 7A A2 85 ED C7 34 08 36 98 17 FE 4E 26
       data hash MD5: 16K
       37 F3 1C CA EF EE DA AF 89 1E 1A FD 88 06 8A CE>)
$$ ##END=
$$ 
$$ hash MD5
$$ 05 88 AF 60 7C BB F4 38 0E 57 D3 B6 4E 1B EE 0D
##$RELAX= 
##$RELAX= 
##$RELAX= 
##$RELAX= 
##$RELAX= 
##$RELAX= 
$$ Bruker specific parameters
$$ --------------------------
##$DU= <F:/spectra>
##$EXPNO= 1
##$NAME= <H-F>
##$PROCNO= 1
##$TYPE= <nmr>
##$USER= <she>
##$AMP= (0..31)
100 100 100 100 100 100 100 100 100 100 100 100 100 100 100 100 100 100 
100 100 100 100 100 100 100 100 100 100 100 100 100 100 
##$AQSEQ= 0
##$AQ_mod= 1
##$AUNM= <au_zg>
##$AUTOPOS= <>
##$BF1= 200.13
##$BF2= 200.13
##$BF3= 200.13
##$BF4= 200.13
##$BF5= 200.13
##$BF6= 200.13
##$BF7= 200.13
##$BF8= 200.13
##$BYTORDA= 1
##$CFDGTYP= 0
##$CFRGTYP= 5
##$CHEMSTR= <none>
##$CNST= (0..31)
1 1 145 1 1 1 1 1 1 1 1 1 1 1 1 1 1 1 1 1 1 1 1 1 1 1 1 1 1 1 1 1 
##$CPDPRG= <>
##$CPDPRG1= <>
##$CPDPRG2= <>
##$CPDPRG3= <>
##$CPDPRG4= <mlev>
##$CPDPRG5= <mlev>
##$CPDPRG6= <mlev>
##$CPDPRG7= <mlev>
##$CPDPRG8= <mlev>
##$CPDPRGB= <>
##$CPDPRGT= <>
##$D= (0..31)
0 1.2 0 0 0 0 0 0 0 0.06 0 0.03 0 0 0 0 0.0002 0 0 0 0 0 0 0 0 0 0 0 0 
0 0 0 
##$DATE= 1725622855
##$DBL= (0..7)
120 120 120 120 120 120 120 120 
##$DBP= (0..7)
150 150 150 150 150 150 150 150 
##$DBP07= 0
##$DBPNAM0= <>
##$DBPNAM1= <>
##$DBPNAM2= <>
##$DBPNAM3= <>
##$DBPNAM4= <>
##$DBPNAM5= <>
##$DBPNAM6= <>
##$DBPNAM7= <>
##$DBPOAL= (0..7)
0.5 0.5 0.5 0.5 0.5 0.5 0.5 0.5 
##$DBPOFFS= (0..7)
0 0 0 0 0 0 0 0 
##$DE= 6
##$DECBNUC= <off>
##$DECIM= 24
##$DECNUC= <off>
##$DECSTAT= 4
##$DIGMOD= 1
##$DIGTYP= 9
##$DL= (0..7)
0 120 120 120 120 120 120 120 
##$DP= (0..7)
150 150 150 150 150 150 150 150 
##$DP07= 0
##$DPNAME0= <>
##$DPNAME1= <>
##$DPNAME2= <>
##$DPNAME3= <>
##$DPNAME4= <>
##$DPNAME5= <>
##$DPNAME6= <>
##$DPNAME7= <>
##$DPOAL= (0..7)
0.5 0.5 0.5 0.5 0.5 0.5 0.5 0.5 
##$DPOFFS= (0..7)
0 0 0 0 0 0 0 0 
##$DQDMODE= 0
##$DR= 18
##$DS= 0
##$DSLIST= <SSSSSSSSSSSSSSS>
$$ [...]
##$SUBNAM2= <"">
##$SUBNAM3= <"">
##$SUBNAM4= <"">
##$SUBNAM5= <"">
##$SUBNAM6= <"">
##$SUBNAM7= <"">
##$SUBNAM8= <"">
##$SUBNAM9= <"">
##$SW= 24.0689170037331
##$SWIBOX= (0..15)
0 0 2 0 0 0 0 0 0 0 0 0 0 0 0 0 
##$SW_h= 4816.95568400771
##$TD= 16384
##$TD0= 1
##$TE= 0
##$TE2= 300
##$TE3= 300
##$TEG= 300
##$TL= (0..7)
0 120 120 120 120 120 120 120 
##$TP= (0..7)
150 150 150 150 150 150 150 150 
##$TP07= 0
##$TPNAME0= <>
##$TPNAME1= <>
##$TPNAME2= <>
##$TPNAME3= <>
##$TPNAME4= <>
##$TPNAME5= <>
##$TPNAME6= <>
##$TPNAME7= <>
##$TPOAL= (0..7)
0.5 0.5 0.5 0.5 0.5 0.5 0.5 0.5 
##$TPOFFS= (0..7)
0 0 0 0 0 0 0 0 
##$TUNHIN= 0
##$TUNHOUT= 0
##$TUNXOUT= 0
##$USERA1= <user>
##$USERA2= <user>
##$USERA3= <user>
##$USERA4= <user>
##$USERA5= <user>
##$V9= 5
##$VALIST= <valist>
##$VCLIST= <CCCCCCCCCCCCCCC>
##$VD= 0
##$VDLIST= <DDDDDDDDDDDDDDD>
##$VPLIST= <PPPPPPPPPPPPPPP>
##$VTLIST= <TTTTTTTTTTTTTTT>
##$WBST= 1024
##$WBSW= 4
##$XGAIN= (0..3)
0 0 0 0 
##$XL= 0
##$YL= 0
##$YMAX_a= 375052
##$YMIN_a= -351893
##$ZGOPTNS= <>
##$ZL1= 120
##$ZL2= 120
##$ZL3= 120
##$ZL4= 120
##$ABSF1= 10
##$ABSF2= 0
##$ABSG= 5
##$ABSL= 3
##$ALPHA= 0
##$AQORDER= 0
##$ASSFAC= 0
##$ASSFACI= 0
##$ASSFACX= 0
##$ASSWID= 0
##$AUNMP= <proc_1d>
##$AZFE= 0.1
##$AZFW= 0.1
##$BCFW= 1
##$BC_mod= 2
##$BYTORDP= 1
##$COROFFS= 0
##$CY= 11.3945322036743
##$DATMOD= 1
##$DC= 2
##$DFILT= <>
##$DTYPP= 0
##$F1P= 15.6554695791079
##$F2P= 12.8336369535428
##$FCOR= 0.5
##$FTSIZE= 0
##$FT_mod= 4
##$GAMMA= 1
##$GB= 0.15
##$INTBC= 1
##$INTSCL= 1
##$ISEN= 128
##$LB= 0.24
##$LEV0= 0
##$LPBIN= 0
##$MAXI= 10000
##$MC2= 0
##$MEAN= 0
##$ME_mod= 0
##$MI= 1.114404
##$NCOEF= 0
##$NC_proc= 0
##$NLEV= 6
##$NOISF1= 3.799351
##$NOISF2= 2.8
##$NSP= 1
##$NTH_PI= 0
##$NZP= 0
##$OFFSET= 15.70392
##$PC= 1
##$PHC0= -25994.14
##$PHC1= 13.78748
##$PH_mod= 1
##$PKNL= yes
##$PPARMOD= 0
##$PSCAL= 0
##$PSIGN= 0
##$REVERSE= no
##$SF= 200.130013532006
##$SI= 16384
##$SIGF1= 3
##$SIGF2= 2
##$SINO= 400
##$SIOLD= 16384
##$SREGLST= <1H.CDCl3>
##$SSB= 0
##$STSI= 0
##$STSR= 0
##$SW_p= 3612.71676300578
##$SYMM= 0
##$S_DEV= 0
##$TDeff= 0
##$TDoff= 0
##$TI= <>
##$TILT= no
##$TM1= 0
##$TM2= 0
##$TOPLEV= 0
##$USERP1= <user>
##$USERP2= <user>
##$USERP3= <user>
##$USERP4= <user>
##$USERP5= <user>
##$WDW= 1
##$XDIM= 8192
##$YMAX_p= 0
##$YMIN_p= 0
$$ End of Bruker specific parameters
$$ ---------------------------------
##NTUPLES= NMR FID
##VAR_NAME=  TIME,          FID/REAL,        FID/IMAG
##SYMBOL=    X,             R,               I
##VAR_TYPE=  INDEPENDENT,   DEPENDENT,       DEPENDENT
##VAR_FORM=  AFFN,          ASDF,            ASDF
##VAR_DIM=   8192,          8192,            8192
##UNITS=     SECONDS,       ARBITRARY UNITS, ARBITRARY UNITS
##FACTOR=    0.0002076,     1,               1
##FIRST=     0,             0,               0
##LAST=      1.7004516,     0,               0
##MIN=       0,             -351893,         0
##MAX=       1.7004516,     375052,          0
$$ Real data points
##PAGE= N=1
##DATA TABLE= (X++(R..R)), XYDATA
0 0 0 0 0 0 0 8 -8 8 -8 8 -16 16 -22 24 -32 40 -48 56 -70 80 -96 112 -131 151 -173 202 -228 263 -298
29 -298 336 -382 430 -482 539 -605 674 -751 835 -928 1029 -1139 1263 -1398 1547 -1712 1897
46 1897 -2105 2338 -2603 2909 -3261 3681 -4182 4793 -5565 6565 -7917 9856 -12858 18129
60 18129 -45270 375052 153606 -289001 169965 203550 -161841 35201 238209 -111060 -162043
71 -162043 56497 -8326 -132537 -66917 -14748 51980 54755 -18466 22934 90569 55567 84849
83 84849 30672 -139893 -77794 68094 -36881 -95619 -15484 -53324 -38825 113076 73514
94 73514 -32550 57993 98438 4501 -17212 -31780 -47453 7909 -33015 -109391 -39532 4440
106 4440 12160 94799 39577 -64732 63669 122206 -19954 -3484 18414 -130147 -54801 89424
118 89424 -92671 -126881 106970 38741 -82118 93051 86172 -51688 80305 93435 -108801
129 -108801 -58634 45917 -54500 -42638 13962 -91517 -43227 113681 35283 -29595 65867
140 65867 35699 -12336 53673 1452 -71909 -4382 -12003 -71361 -13947 -1850 -35492 48866
152 48866 69863 -35038 -4435 89465 34655 -19647 456 -31320 -53042 -12192 -1469 -21156
164 -21156 -35231 -18786 43212 44146 -10752 28620 65075 -8588 -20256 23226 -31567 -46400
176 -46400 22345 -23151 -75995 7533 28200 -7294 50737 34381 -41042 34294 66949 -34701
188 -34701 -18108 26950 -57272 -48205 33534 -26522 -49780 45337 26876 -28121 34089 39692
200 39692 -7055 30234 17828 -48898 -13627 8820 -34598 -8949 3933 -44058 -2581 54376
212 54376 2402 -6280 47976 11196 -24842 23705 9040 -42155 -6503 6704 -39655 -24589
224 -24589 16117 7569 3332 18034 12784 3166 14069 25104 3713 -24907 -13273 -467 -23452
237 -23452 -19415 13958 -7926 -26419 26962 31132 -19421 16340 49642 -16587 -26106 23745 -7479
250 -7479 -35533 5050 179 -32011 -6858 16392 7803 12374 9663 1972 19311 7582 -15156
263 -15156 10359 4032 -39307 -10567 15177 -27482 -13194 34914 -831 -20252 30189 23097
275 23097 -14394 15692 19214 -31142 -15735 16293 -17739 -22767 11823 -3825 -18962 15278
287 15278 23422 -1269 5385 20795 -706 -14388 6403 5259 -19678 -15152 501 -9196 -12662
300 -12662 11272 16977 -4025 1087 19502 6210 -3154 8382 -229 -15139 -10706 -6466 -5447
313 -5447 -2940 -4128 733 8184 2368 3846 19540 11179 -9325 552 5144 -16492 -7850 7516
327 7516 -14213 -15317 8660 699 -3603 19002 11769 -7273 8568 11886 -11072 -2529 9548
340 9548 -16846 -20046 6961 -2115 -12531 11415 12468 -7511 4051 17362 3573 -2306 5384
353 5384 -2251 -14285 -6230 -510 -5966 -3978 -50 -105 3437 7134 8013 8173 3947 -1473 -3203 -1354
369 -1354 -2576 -7344 -5508 -3100 -7819 -2361 8442 6406 2948 6518 4905 191 1947 3191 -3602
384 -3602 -6082 -6206 -9434 -2910 4761 -3629 -602 10475 776 -1767 14174 8313 -9328 -1649 4385
399 4385 -11289 -9496 7151 -2877 -12010 4288 6331 -2506 7440 10612 -665 -678 2842 -2160
413 -2160 -2658 -661 -5741 -7143 -1767 -1540 -554 6465 4319 -987 4119 4738 -31 2222 1337 -4859
429 -4859 -5517 -4319 -2407 -335 1318 -633 -1368 3190 4160 2639 5786 3256 -4836 -3713 1457 -2164
445 -2164 -5726 -332 661 -6914 -2629 9724 3665 -3075 6100 4282 -6839 849 7245 -3997 -6816
460 -6816 974 -3387 -6483 3922 4278 -2623 3067 3278 -2142 3761 5135 -2670 -1125 161 -6287
475 -6287 -2794 3738 -1509 -3972 1899 -179 -1801 6312 5023 -2378 1745 901 -4482 1595 2470 -5213
491 -5213 -2095 841 -4760 -1593 6803 2453 -3719 1802 3604 -2154 1424 5200 -2423 -5994 -1103
506 -1103 970 -1641 -1573 2264 810 -4119 1566 5252 -231 1013 3089 -2869 -3338 1884 -471 -2984
522 -2984 770 -2166 -5575 2867 5123 -2932 1684 5296 -4310 -773 6286 -1343 -3837 2041 -2349
537 -2349 -5312 1072 965 -1582 2346 565 -2847 4162 5205 -2068 1383 1960 -7041 -806 5873 -4558
553 -4558 -5846 2815 -314 -3186 4402 5229 -911 447 2742 -586 -839 925 -432 -1434 -4167 -4051
569 -4051 2133 1875 -582 2447 841 -733 3325 3607 321 -448 -1899 -3114 -66 -533 -3880 615
585 615 3096 -3695 -502 6784 1109 90 5839 -1626 -6014 2300 707 -3913 -669 -2171 -4027
600 -4027 2599 4048 -397 2384 3833 -1884 722 4532 -3295 -2676 2638 -5074 -5632 2434 376 -743
616 -743 3048 34 -1905 4486 4334 -630 505 -629 -4878 -419 1721 -4730 -2281 2318 -1469 681
632 681 4160 1277 2875 2654 -1987 -761 121 -2903 -248 909 -6333 -4204 4838 1895 -1587 4065
648 4065 2164 -2479 3589 3558 -3009 -800 -1081 -3989 -497 -1114 -2935 3571 2958 -3738 1210 6336
664 6336 340 366 3499 -3650 -5529 2271 6 -3637 -115 -2267 -1772 4436 1363 -533 4863 1232
680 1232 -3308 1820 1658 -4559 -719 1518 -5289 -3398 3495 592 317 3982 -1208 -821 4676 1026
696 1026 -1205 737 -3590 -3908 1596 -590 -3021 1731 1796 -1680 1874 3033 -221 2687 1724 -4040
712 -4040 -583 841 -3341 588 1104 -5943 -606 5345 22 -211 3813 -129 -2284 2617 714 -2871
728 -2871 458 -1374 -3486 1030 -376 -1931 4729 1623 -4296 2732 4342 -2345 654 2495 -4028
743 -4028 -3110 2617 -370 -2223 815 -639 -140 3356 -263 -388 4630 -567 -3623 2765 216 -3830
759 -3830 1810 947 -4536 -669 3002 671 460 1449 -1097 78 2633 -1011 -285 1354 -3629 -1999
775 -1999 2726 -2004 -1874 3538 -9 -2652 2146 1391 -343 1951 43 -2781 788 833 -2317 647
791 647 809 -4026 539 3517 -1796 38 3526 -1595 -926 2303 -845 -894 1619 -1266 -2329 1046
807 1046 19 -1615 2430 195 -2873 1942 2974 -1943 1174 1534 -2886 -200 1377 -1496 -502 467
823 467 -1656 169 1585 -926 538 2941 -1332 -2048 2914 80 -3048 1499 -42 -4085 667 1675
839 1675 -971 504 537 -634 1873 1118 -1126 1388 1019 -2843 -719 1801 -2109 -1581 2512 -900
855 -900 -2113 2213 1437 -84 1170 -110 -652 1195 -748 -1673 320 -468 -2540 677 1668 -1593 503
872 503 2988 -415 -707 1949 -19 -463 249 -2182 -1528 -107 -933 -434 1462 -532 -611 2387 1635 -985
890 -985 701 794 -2125 -678 764 -2151 -595 507 -1474 329 1469 -100 1899 1867 -1043 -35
906 -35 1677 -1037 -1790 145 -1082 -2242 559 1046 -928 1039 1769 101 1356 453 -967 874 -279
923 -279 -2423 -876 -341 -1162 -210 1206 275 138 1920 1319 -291 945 -190 -1167 88 -864 -1601 178
941 178 -364 -1006 1085 1397 -116 1097 1537 -346 -436 585 -893 -1442 -522 -1466 -1173 665 69 259
959 259 1515 130 258 1969 438 -579 -6 -13 -1726 -1089 -238 -903 -604 415 579 909 1532 53
977 53 960 1124 -1643 -890 535 -1456 -1440 -64 -260 -586 672 1036 393 459 459 327 222 -349 -1360 -515
997 -515 -627 -1633 45 656 -363 621 1391 530 98 981 232 -388 -918 -707 -772 -507 -172 -794 760
1016 760 667 58 1182 773 -36 968 367 -747 -403 -288 -871 -806 21 -125 -204 717 507 112 965 400
1036 400 268 547 -434 -1100 -268 -374 -1063 112 113 254 247 244 757 476 365 166 -158 -19 -862 -860 -81 -163 -382
1059 -382 624 288 354 529 473 405 -41 -616 -118 -338 -815 -730 -186 142 -214 766 675 51 126 625 -337 -159
1081 -159 132 -602 -539 -120 -510 -255 398 18 104 575 642 -83 -16 -38 -745 -175 34 -872 -110 552 -753
1102 -753 297 651 -99 409 428 272 -186 -116 80 -354 -13 -124 -879 -97 104 -344 502 327 132 242
1122 242 -194 -145 444 138 -675 42 314 2 239 618 -41 -320 581 -75 66 256 -349 -222 427 -456
1142 -456 -303 760 -540 -657 556 414 -199 95 267 -245 57 20 -315 -306 194 -272 -32 547 -446 -9
1162 -9 566 -285 -181 203 -102 -32 343 -405 100 135 25 -312 219 139 -326 10 167 -396 75 111 -483 85
1184 85 261 -229 371 253 233 151 -147 -497 -90 -65 -173 -726 267 -246 -400 1011 79 -983 476 487 -655
1205 -655 174 247 -572 -284 -74 -262 10 324 -69 -313 767 12 -242 482 41 -524 265 -101 -353 467
1225 467 -196 -212 597 -82 115 651 -16 -376 -25 -31 -1175 -359 390 -605 -446 838 -254 66 905 -191
1245 -191 88 587 -276 152 -104 -518 -606 194 -276 -129 660 886 -345 285 919 -479 -92 395 -710
1264 -710 -158 -137 -552 -60 410 -634 438 1001 83 7 602 144 -922 244 -104 -686 -200 -173 -391 242
1284 242 105 -162 859 498 -531 713 -33 -1276 -332 163 -1025 -584 423 101 -209 1253 287 -180
1302 -180 896 82 -476 470 -643 -809 98 -655 -726 348 284 -6 460 580 269 75 107 -645 -300 -12
1322 -12 -422 -409 172 -768 83 582 18 149 983 70 10 220 -605 -753 -133 -532 -994 -162 438 -240 682
1343 682 1118 -351 670 1083 -444 -156 393 -715 -199 -332 -171 -309 75 752 -16 477 434 90 490
1362 490 -6 -1176 -36 72 -967 -416 186 -717 421 910 580 627 332 52 191 -269 -114 -281 169
1381 169 -432 -893 393 -118 -87 1265 404 -271 769 296 -317 -287 -395 -692 -433 -130 -370 36 292 18
1401 18 332 961 -214 36 826 -507 -871 -47 -790 -660 7 -314 -486 738 462 205 983 270 -381
1420 -381 23 415 -1245 -431 552 -947 -202 294 -108 495 991 297 339 375 50 296 -126 -967 -469 196
1440 196 -137 -738 61 481 -456 670 850 -204 692 292 -469 -63 -90 -535 -114 297 -414 -21 656 351
1460 351 388 584 -91 -638 314 15 -838 -209 -342 -350 241 -260 -55 478 591 -137 287 251 -171 -114 91 -558
1482 -558 -448 -11 58 46 447 -330 69 793 -208 -58 512 -58 -206 355 -320 -685 104 339 -352 239
1502 239 175 -243 91 463 -604 -64 176 -268 77 60 -452 -313 292 38 9 255 183 -71 233 216 -454
1523 -454 -165 161 -650 -266 229 257 67 107 -108 141 -63 -249 43 -41 -128 -123 219 352 -53 103 138 256
1545 256 72 -104 -177 363 -203 -444 351 -12 -354 265 383 -80 225 141 -239 -158 -326 -504 -176 459 -347
1566 -347 -329 555 37 -4 476 -353 -261 160 133 -341 -104 103 -100 -305 -100 48 -102 531 225 -102 452
1587 452 90 -116 254 -299 -392 2 -447 -331 440 299 158 236 476 -29 110 349 -54 -247 -203 -558 -190
1608 -190 136 -216 188 449 -91 571 688 -162 -218 189 -272 -249 15 -151 -654 24 163 144 114 272 -249
1629 -249 409 233 -264 204 -155 -544 -340 -217 -231 -238 148 423 341 42 592 379 -53 -185 -329 39 -59 -452
1651 -452 155 151 -60 584 194 270 364 344 439 47 3 -248 -403 -426 -78 -442 159 164 65 472 363 350 228 221 -80
1676 -80 194 -176 -277 -521 -7 -199 -228 285 156 -51 558 358 49 384 -238 -581 -217 -500 -497 -211 -161 -32
1698 -32 231 216 425 134 58 16 -157 -232 -105 -69 -3 -425 -214 500 187 -149 369 -90 20 -165 -37 213
1720 213 -117 121 90 -350 -244 3 319 293 -144 107 228 -258 -97 88 -133 -579 -191 -195 -144 -206 -43 205
1742 205 -121 110 188 257 -37 -368 11 -121 -75 -91 46 -140 14 -50 117 311 -319 74 12 -91 -241 26
1764 26 452 -22 -251 23 -69 -100 214 17 -75 -8 -119 -134 18 -391 133 -270 71 227 273 46 -370 123
1786 123 318 163 34 532 -26 -122 279 -172 -159 166 83 0 -79 92 373 300 -290 -383 -64 -106 -145 -59 163
1809 163 162 35 -92 325 199 32 -296 -47 -394 -591 -26 -237 -347 -40 355 279 -15 260 112 -229 62
1830 62 104 200 -223 -205 -231 -131 -133 -131 63 318 293 234 32 234 49 -75 64 -237 -135 -243 -71 -131 -160 -369
1854 -369 22 302 111 231 -110 -214 -226 -275 -72 -302 -11 66 -369 24 330 371 258 6 206 128 -191 -68
1876 -68 152 -475 -304 28 81 31 55 274 439 116 343 112 -109 -116 -335 -330 -267 -59 177 367 -366 -74 39
1899 39 -7 -282 22 45 -553 -398 53 -293 -265 120 -148 282 5 203 281 805 -118 -137 31 -278 -118 -30
1921 -30 -548 -214 245 350 69 -55 194 101 44 52 -70 -8 -154 -719 -121 -193 -308 -107 569 257 45 415
1943 415 553 92 70 174 -663 -374 -168 -378 110 -307 142 463 -24 66 235 509 -122 -528 -157 23 -244
1964 -244 107 11 -396 185 22 332 382 20 -487 194 -182 -355 -110 -252 -571 116 155 -119 -72 272 -29
1985 -29 -90 270 57 -50 118 -284 -351 -100 -241 -129 267 215 -293 321 335 415 52 442 -235 108 -191 -371
2007 -371 -147 150 -263 -304 498 -109 273 384 -190 -145 215 180 22 -287 -48 -366 -263 346 -133 286 59
2028 59 -80 482 320 -582 -178 264 -367 -4 175 25 194 207 120 -26 269 -196 128 5 -288 -317 327
2049 327 -20 -230 -39 94 -196 -27 195 -222 328 169 -92 -205 140 26 -46 462 -276 -252 220 -60 -124
2070 -124 318 -9 -82 265 144 -449 -94 141 -89 84 351 -161 102 -107 -170 67 437 -95 -194 -29 -236
2091 -236 -284 76 298 -14 465 -178 -176 456 98 -82 309 -274 -314 -183 52 -450 152 508 -368 -204 481
2112 481 -183 -45 185 -57 -143 101 126 -297 59 168 49 129 83 -372 -207 177 -239 46 207 -108 -39 245
2134 245 -605 171 418 47 203 341 -274 298 463 -135 -82 78 -398 -273 289 148 -189 159 -33 -250
2154 -250 245 178 -214 145 -108 -646 116 18 -115 -259 203 -136 -97 589 26 -193 309 374 -18 56 -270 57
2176 57 93 47 110 324 -220 -392 252 481 -107 168 360 -289 -129 -235 -257 70 124 -279 104 302 224 -147
2198 -147 420 118 61 391 -25 -311 -69 191 1 -83 108 -84 242 351 -110 309 392 -352 186 102 -273
2219 -273 -137 87 -298 180 468 71 208 -78 141 -283 -107 17 -275 -138 -68 -378 -89 64 11 343 307
2240 307 237 238 216 17 149 279 104 -206 -136 64 -81 221 205 136 206 -8 225 277 324 -492 -8 157 -506
2263 -506 -269 49 -53 -23 20 309 -95 354 -55 195 -22 -166 -42 -178 -140 -104 140 -220 -102 190 349
2284 349 138 -7 -34 102 -279 -9 -201 -160 -336 -378 -206 350 389 -10 285 102 -8 145 -279 -304 -70 -271
2306 -271 -155 -433 7 184 99 266 -144 462 160 -271 312 -217 -150 -18 -190 -58 -47 34 -46 -106 -171 41
2328 41 71 194 174 -512 -152 -113 -374 406 176 -160 -181 253 345 -67 -26 149 28 -78 -141 -174 -27 -198 -149
2351 -149 -193 186 264 157 62 293 -100 8 201 111 -246 -413 -11 -69 -71 206 183 299 92 42 67 195 -73
2374 -73 132 -20 -34 -101 46 -198 -229 -143 -189 155 -94 -96 -115 69 -197 -76 25 267 -166 -368 5 100 364
2397 364 -31 156 -42 299 44 145 242 -384 -273 111 -34 295 366 16 221 62 133 -116 -198 -40 -283
2418 -283 -290 58 -60 -178 -147 174 -67 193 -19 110 61 1 132 185 -148 -174 -73 -73 -189 35 83 -179 -48
2441 -48 -26 -205 308 193 -280 -265 11 -16 -269 95 252 194 -26 77 -35 -45 -145 -221 -236 -89 95 -206 -46
2464 -46 140 361 84 -128 -86 -131 83 -111 134 6 -192 -58 294 20 207 322 20 303 -44 208 224
2485 224 -180 -85 -41 -62 114 -302 129 159 167 27 111 2 262 12 -101 14 144 -435 -45 117 -223 29
2507 29 -7 171 101 109 386 7 11 -164 -171 -165 -82 -423 -255 -103 59 258 132 172 366 39 -131 113 -15 -234
2531 -234 -128 110 136 145 220 55 -26 119 -36 196 298 -340 -88 29 -201 -485 -29 193 92 13 42 326
2553 326 108 -92 216 180 -8 -415 112 191 -144 -265 396 -104 366 445 101 79 184 194 -249 -43 -28 -410
2575 -410 -140 111 -171 49 341 133 128 281 -104 -189 -177 -209 -106 188 -14 -38 -121 143 -143 226 409 30
2597 30 105 126 85 247 -184 -284 -264 -177 -280 251 212 -178 -16 200 412 480 226 -134 -238 -22 -25 -159 56
2620 56 -156 -313 91 115 34 154 -128 258 240 -73 -52 -10 292 191 203 45 209 -240 224 203 16 328 -197
2643 -197 5 84 -13 73 21 -391 -331 -251 -164 26 230 206 -312 12 120 -83 -17 32 -211 -126 -40 -4 25 283 411
2668 411 133 -72 136 -137 227 -141 -444 -167 125 -326 38 340 -310 28 283 -140 49 -16 -57 -5 563
2689 563 -129 -272 154 -73 -397 446 -179 -222 275 22 -331 123 114 -348 19 -351 -82 -38 270 -347 -14
2710 -14 87 50 -163 -102 46 -49 -20 -40 -303 193 -145 243 -116 125 -97 204 -325 -170 0 -94 -144 133 -137
2733 -137 -436 -124 21 323 90 284 58 -128 102 7 149 -116 -154 -13 329 -270 -455 6 -87 -200 108
2754 108 -47 -127 -15 13 -167 -214 150 -256 83 124 -10 -11 423 -239 237 101 -487 33 -117 -243 -191 -28
2776 -28 -67 -9 257 153 -6 398 215 -193 -439 97 -59 -12 -49 -391 131 362 -81 65 -237 -18 122 -48
2798 -48 -11 -43 -22 -216 -404 215 -34 -63 23 7 -111 231 313 -256 43 171 -28 -312 103 -116 -245 405 54
2821 54 -124 43 -293 -302 210 -66 -297 17 -208 -370 201 78 18 -45 118 -82 62 396 -59 141 -274 -361
2843 -361 30 -25 -464 164 132 -195 246 94 136 84 21 -124 -5 -143 61 -21 -267 123 -86 165 328 -34
2865 -34 -125 167 -278 -223 -15 -195 -284 53 -218 -219 -166 -387 78 -57 107 21 241 -170 -292 -129 -322 -416 -267
2888 -267 -336 -168 380 225 -203 -80 287 -62 111 -83 -267 -283 89 -152 -93 -160 25 -65 29 -1 6 258 225
2911 225 253 -55 225 -159 32 -263 97 193 -113 -31 94 154 82 300 165 -344 121 -228 -551 22 -157 -155
2933 -155 275 -69 303 -69 94 39 -18 163 388 80 296 -34 -46 287 -47 -156 106 -59 43 215 -239
2954 -239 -260 -150 -191 260 84 -76 -326 11 117 231 -25 250 -78 -258 65 -119 -31 -13 -206 -212 165 93
2976 93 36 102 121 -290 21 64 83 -245 -210 48 -233 2 -58 -340 179 -68 -34 183 159 19 -21 -98 -109 143
3000 143 316 90 -213 -98 326 237 191 -457 198 209 167 165 -191 148 56 -173 6 343 61 253 184 -105 174
3023 174 -41 62 134 7 -162 -167 -44 -188 -133 -168 2 340 2 363 178 368 -35 -90 -103 -40 -262 262 77
3046 77 -11 -220 -40 -85 72 65 4 -81 -26 -158 -427 -371 -154 17 -113 169 295 354 -94 -222 4 218 -147
3069 -147 284 -23 -100 -435 12 279 306 -13 260 293 155 205 220 97 -15 61 -167 53 58 -252 -261 -5 89 126
3093 126 -36 -115 98 161 -41 97 -12 -291 99 69 57 251 281 -99 159 242 197 -176 -52 -225 95 -147
3115 -147 -348 -233 13 96 -12 -168 158 298 71 -125 81 11 111 -54 -206 -126 -102 290 201 264 109 282
3137 282 -33 -13 88 45 -331 -110 171 85 178 -222 153 148 101 274 -164 -216 -185 -159 187 -144 39 46 154 67
3161 67 -120 42 -139 370 -73 -135 -51 66 -119 50 -119 34 89 98 -33 14 237 4 326 225 -27 -85 133
3184 133 276 9 89 -69 395 -6 -12 416 -50 240 -119 87 121 -194 29 -86 -199 30 -350 26 -146
3205 -146 -72 169 198 180 -47 163 -86 11 58 -188 -244 212 195 301 101 89 -23 102 -299 66 -129 -34 99
3228 99 -61 -352 160 -83 -164 96 -93 -481 -32 125 55 6 121 57 -378 -42 -169 50 135 220 -53 -264
3250 -264 154 -9 217 69 -141 96 -28 -15 -166 -132 225 27 208 45 57 259 -134 56 135 -159 116
3271 116 -275 -328 32 219 67 194 159 346 -118 226 21 -246 -135 -67 -166 -78 -108 4 -65 39 221 202 -64
3294 -64 -262 147 171 -68 64 161 131 -18 77 409 110 173 196 -72 36 -55 -191 146 -8 -371 130 71 22
3317 22 224 139 44 136 -275 -140 126 137 168 -156 54 51 56 -17 -316 16 -102 174 -57 25 19 -108 145 268 -228
3342 -228 -24 288 -170 44 -13 -110 -207 69 -11 -26 33 -113 -168 161 125 -129 -256 132 -7 124 62 24 -60 126
3366 126 -74 -199 -38 40 -25 143 71 -79 -8 -81 157 302 -5 -66 -34 24 11 -213 -62 -125 34 2 109 -229
3390 -229 341 -189 45 356 -116 50 -31 21 -371 230 -27 -235 237 -168 157 85 150 110 121 283 -173 105
3412 105 -294 -326 67 188 -88 154 26 -280 45 -115 147 -15 297 -218 -351 -66 -59 -77 -97 -279 -50 -47
3434 -47 342 68 216 88 -160 130 389 13 -104 -6 -92 140 -2 69 6 173 54 114 -31 55 -106 88
3456 88 -88 -142 19 77 49 107 -34 -32 340 42 -11 -157 63 -15 55 127 -138 -113 211 161 320 311 170 -41 89
3481 89 73 138 -329 116 -361 -228 -43 -83 32 349 74 34 -26 -113 -99 21 -109 26 88 -141 -19 25 114 205
3505 205 -411 -104 154 22 64 -283 119 -34 30 100 -26 -82 148 219 126 -243 -71 -162 -166 181 -272 -172 130
3528 130 176 171 123 -52 -249 148 234 -126 -3 -187 -61 44 -113 -304 -2 56 -211 -90 137 109 31 178 467
3551 467 -28 -27 -116 -185 236 -238 -68 -38 -171 63 301 -373 87 -28 -275 341 -33 62 -156 -82 -84 -200 235
3574 235 -40 -7 307 397 -234 -227 -87 117 -284 262 17 -14 -162 -261 14 278 -21 293 15 23 -32 -121 -47 -10
3598 -10 29 -61 78 65 94 -69 -8 -114 40 -47 -81 -230 -101 -331 -17 155 -47 -203 -101 387 51 133 279
3621 279 44 77 92 103 -66 -5 -234 -97 -124 -69 80 126 88 60 -77 -12 -139 104 100 -223 -194 -161 -86 -320 114
3646 114 55 -4 213 118 -143 26 18 29 -127 -122 -151 153 113 -323 107 195 454 153 -58 -13 -130 -143 -391 -120
3670 -120 -385 -216 -34 -154 207 200 153 340 -219 -78 -110 -22 47 -190 -127 223 -198 56 -75 -217 -3 -167
3692 -167 -71 160 110 78 -462 95 -178 -9 39 -288 46 -163 -38 138 -126 -179 92 141 186 -368 -52 38 -65
3715 -65 -76 -221 -33 -457 -1 -82 -138 -97 90 -150 -164 -144 -3 -252 29 205 -184 -193 58 183 -13 -193 -20
3738 -20 -204 -39 -140 -219 -243 222 286 -160 320 382 88 -242 0 -217 224 -294 -8 -175 -140 -282 49 -186
3760 -186 -65 190 41 228 436 -9 63 180 9 -154 -134 -22 180 -1 57 295 183 12 72 479 -269
3781 -269 283 113 -236 -10 -44 -31 -53 -116 -33 3 223 210 36 45 -99 40 153 -356 -164 -113 80 -329 301
3804 301 116 -96 -21 40 -132 265 205 194 -279 -22 19 38 248 156 80 -79 -55 -51 -106 13 3 -141 233 -175
3828 -175 162 87 62 -120 -77 -282 262 -123 -147 -124 -44 29 54 140 285 -38 17 -64 -305 222 -21 102 91 297
3852 297 112 -70 -137 -183 -203 -169 64 -115 -120 101 124 318 -116 55 -170 -131 107 -80 61 128 -212 137 114
3875 114 54 73 140 129 2 27 -289 42 -216 -91 228 280 -134 250 -159 -142 134 150 -140 -30 -7 -207 4
3898 4 -31 -308 40 -153 188 -97 -240 104 142 -189 13 -88 223 -134 38 -327 269 61 -70 -63 15 66 275
3921 275 20 -130 -192 -118 -20 146 371 -65 -297 242 -141 142 81 -53 -212 -382 200 -17 236 -228 27
3942 27 130 201 92 33 -27 340 21 -231 44 -44 -77 103 330 -145 -86 33 230 273 41 -152 37 -72 -329
3965 -329 204 34 -11 10 30 154 8 27 39 -251 52 -218 126 114 -101 205 6 106 -119 27 37 -56 -88
3988 -88 -95 -238 240 -76 22 -2 71 0 -95 -184 220 -51 -180 89 38 -38 223 89 -330 -61 -32 59 -415 -306
4012 -306 72 110 -49 -212 44 -38 -157 88 -23 -22 -127 -225 115 -134 -89 92 -36 -45 -243 -214 -163 -2 25 -19
4036 -19 65 -168 -315 58 -22 366 -54 155 -326 -23 137 -62 -81 -305 245 -2 215 88 -1 -363 -266 -105
4058 -105 155 161 -75 -71 -160 121 -456 -256 171 -44 -5 79 35 -51 112 -45 -18 -94 -82 326 290 -72 28 -270
4082 -270 -175 -46 9 26 20 -103 380 10 -154 -77 -24 -264 108 184 -230 89 -104 51 -130 295 66 175 -11
4105 -11 -44 -66 145 57 145 110 20 -141 -13 -219 183 -21 -139 161 69 -57 -61 94 106 -35 -57 -83 -61 24 206
4130 206 127 26 465 -76 183 -149 73 -1 27 -104 -3 253 221 77 117 121 165 454 -126 -187 121 -77 -10
4153 -10 -2 103 360 120 -45 6 -439 332 128 -152 -303 118 -94 -77 -27 -21 180 -4 179 229 151 -50 216
4176 216 177 -94 13 180 92 -331 -91 1 -51 75 -13 36 245 148 -125 35 -157 -166 147 -35 9 91 22 -116
4200 -116 126 58 121 297 74 -45 -125 29 -108 307 -323 45 188 -88 -138 -59 -78 -72 44 -470 -18 14 -47
4223 -47 -188 -225 -51 -79 -124 320 86 -241 70 97 168 -273 -232 -138 -269 137 -92 -43 -553 -78 32 -256 138
4246 138 -208 -270 -86 -223 -320 -244 -245 58 -129 -241 -152 -252 -310 187 -159 187 -46 -152 -197 -130 241 234 14 -320
4270 -320 -383 69 107 188 70 -17 -30 310 39 -109 -17 -13 -93 -223 -78 -61 -15 -85 135 20 100 -112 -92 -12 -333
4295 -333 29 52 -40 147 15 -225 52 74 -267 215 149 -1 94 -66 185 7 143 -23 157 72 319 64
4317 64 -56 1 48 150 -219 -265 -273 83 -52 -245 150 -180 35 99 363 62 124 -46 209 49 18 130 -2
4340 -2 -51 -164 223 -98 -64 -140 323 -152 -142 138 126 -192 52 82 7 88 -28 -39 -158 -145 408 -215 68 -217
4364 -217 242 -106 -78 -349 -131 70 -35 169 -166 -85 -155 -74 -167 236 97 -84 82 177 258 143 -72 -119 -11
4387 -11 63 99 -140 -38 116 264 321 29 -17 46 -66 -366 138 -18 -170 82 136 23 -140 -22 -83 242 -13
4410 -13 284 223 38 -57 137 -116 -39 298 -123 -81 65 -44 94 50 -172 -138 69 -229 288 99 51 140 -39
4433 -39 -326 -206 -165 12 -130 -193 3 407 398 56 186 -58 123 -30 138 -10 -48 55 -50 85 -17 156
4455 156 -4 -223 177 -201 268 180 -171 86 -86 29 -90 186 27 -203 28 41 208 12 -49 70 127
4476 127 20 -137 71 109 16 -59 -87 146 -46 86 -29 -118 -211 183 301 200 10 113 -66 109 38 -132
4498 -132 186 -25 435 35 68 -195 -322 137 -318 175 -198 -7 -38 -376 192 -42 169 268 38 -253 59
4519 59 17 178 275 5 -240 -41 -171 -46 35 56 -383 -139 365 83 -111 3 -216 74 364 -71 -153 -15
4541 -15 43 -123 -79 -146 -249 204 -135 155 265 -95 -110 -83 -199 63 38 106 16 -132 418 128 110 8 -12 -60
4565 -60 212 -141 -142 -16 -81 3 398 120 -67 -110 -190 -403 106 -144 -359 -170 -130 406 -49 107 -250 218 149
4588 149 131 137 42 -57 47 185 177 151 -102 131 -59 345 251 97 286 -47 321 -175 90 -94 -94 -80 -68 59
4612 59 -1 190 -29 -65 89 181 -217 8 -143 116 -100 58 -156 -106 -157 107 56 -429 -124 -41 285 -79 -123
4635 -123 235 471 -75 -276 294 19 -91 188 61 -68 176 194 -56 6 -22 -155 -200 21 49 -30 -1 -122
4657 -122 -220 220 83 -237 133 340 -83 -61 -192 -160 -109 235 2 214 141 278 375 -159 115 -381 116 -81
4679 -81 146 -145 55 -51 26 -21 95 -85 -383 49 -24 -364 -91 -36 345 -70 87 -51 -91 -208 40 368
4701 368 -410 267 76 237 16 153 -47 -198 117 -92 -49 111 145 78 202 -144 0 93 64 77 310 148
4723 148 -133 -109 -115 63 107 -82 6 -212 256 -171 175 139 -174 124 -247 112 171 -209 -15 -244 -2 -145
4745 -145 160 97 -63 330 -106 -176 35 -293 -89 187 138 -79 -159 23 -49 -17 169 75 165 -3 345 -54 60
4768 60 18 164 204 -81 -208 -118 382 -235 138 177 36 -176 -37 -58 307 -132 230 129 68 20 -279 223 308
4791 308 135 96 86 258 51 -35 -187 247 -124 56 -24 -47 -24 -7 -108 140 -80 210 -63 -15 201 82 33
4814 33 -39 161 10 44 -129 -113 -361 -14 -140 35 -68 -5 293 82 79 142 -194 -82 80 51 -278 72 -125
4837 -125 28 314 119 -38 148 47 190 -71 -25 72 -93 -40 146 -51 -29 -22 -251 246 59 -263 17 -38
4859 -38 -140 80 -71 -173 228 129 -120 26 -97 -211 214 37 -175 211 277 484 -65 -181 -161 78 180
4880 180 180 9 158 69 -44 -1 -105 -124 271 -110 -247 -153 91 -15 27 202 -37 -17 203 354 -71 -93 71
4903 71 -18 -210 -108 -240 -165 -98 20 -28 -159 -79 98 199 53 195 -96 -176 363 51 -42 -98 -85 118 -24
4926 -24 109 70 -32 100 133 -79 189 -90 122 16 275 -70 -11 9 -296 -98 313 25 237 211 -114 273
4948 273 122 -199 -60 -72 -105 82 -40 212 338 230 224 193 16 -74 4 -174 54 -155 27 253 -58 1 -24
4971 -24 94 -40 -245 -140 61 -37 -7 189 -297 -5 -75 12 23 93 284 -121 5 -354 71 268 -3 -84 106
4994 106 80 -74 250 -130 226 158 213 68 -48 -236 167 234 16 90 -18 196 47 -108 -55 41 -50 151 48
5017 48 223 212 -151 250 139 -95 114 123 -15 67 -203 118 61 -63 230 -317 -143 -237 -12 16 129 -64 120
5040 120 -65 81 270 -407 61 37 159 -138 178 169 -172 -111 264 273 -72 38 111 96 44 104 -152 -112 128 -316
5064 -316 -24 -31 -134 22 174 -15 -175 127 113 179 -50 140 -295 -52 -75 58 -265 -177 57 -511 364 -116
5086 -116 -71 129 17 -138 -260 -318 162 -102 -376 -64 192 136 -85 35 46 183 -140 -180 12 -35 134 -26
5108 -26 -209 -60 -52 142 4 105 142 215 58 -186 -121 196 170 -149 266 67 -219 -67 338 101 224 118
5130 118 -208 16 -106 -17 -211 160 -147 38 -240 -167 243 88 -312 256 269 192 -124 -14 82 1 -229 153
5152 153 337 1 113 144 109 -88 32 -84 108 -78 -334 171 52 -129 -260 -34 38 328 333 130 -52 -188
5174 -188 -75 242 -71 37 -85 255 -27 -41 371 149 126 -137 95 93 -108 -207 207 11 -43 129 -21 -185
5196 -185 -58 345 69 -1 131 131 -265 -10 64 -5 405 237 -192 133 -78 199 -39 174 -132 -220 179 88
5218 88 99 -281 -263 -24 128 -44 -40 -139 48 138 62 29 -228 -32 86 51 214 -125 -5 -81 -82 -2 -72 106 156
5243 156 -42 -146 -181 111 -184 169 167 50 66 -238 -27 -90 -24 148 41 -18 -105 154 -257 -16 -23 30 -35 -61
5267 -61 -195 -76 -247 252 -89 -79 -142 118 81 12 -227 101 81 -39 133 -41 -26 -106 204 -37 100 403 -74
5290 -74 147 317 -165 72 -165 -53 31 7 87 -60 -15 85 -42 97 189 233 -318 -70 -51 51 54 98 432 101
5314 101 -77 -45 -120 125 -358 -157 85 51 174 5 -104 17 111 191 25 164 42 10 63 -34 -120 -422 -169
5337 -169 -122 4 0 -47 423 -3 15 -168 200 -143 -10 19 -82 -22 193 71 230 59 -335 184 -100 -134 -61
5360 -61 -64 -250 -269 -78 -314 -95 -241 -401 113 282 46 -75 127 -284 128 24 -12 76 -179 -1 119 157
5382 157 56 -280 266 -75 21 361 -60 -10 -29 155 -197 248 43 130 292 35 238 -155 -51 48 172 58
5404 58 8 -91 97 -317 174 185 -93 -26 134 98 -82 31 -55 -238 102 -216 -199 111 -30 -72 175 279 282 -74
5428 -74 263 -97 34 19 27 -66 37 130 -279 -131 304 76 97 113 66 148 326 90 12 49 86 43 90 -8 -131
5453 -131 117 37 400 -241 -42 -84 -262 206 -326 -66 -109 94 -34 -225 153 -135 135 -312 117 252 -30
5474 -30 70 -207 -15 -107 260 99 -244 -33 -234 -8 294 -122 -49 100 145 32 -178 -27 87 75 53 203
5496 203 78 238 -18 58 77 -104 -110 159 -223 160 240 -82 33 -55 151 -16 -121 -21 251 60 163 -9
5518 -9 144 70 -95 219 53 346 -173 -181 257 -92 33 -72 -139 -200 101 -124 89 82 -295 -278 17 165 244 -227
5542 -227 -312 -51 -59 -269 -159 170 52 48 -89 31 176 -137 21 77 -40 -217 109 25 8 83 -127 113 -42
5565 -42 -154 215 138 -23 268 -152 370 -96 -190 52 -51 -25 13 222 265 154 197 231 108 -129 -150 126 240
5588 240 114 229 -12 74 89 -3 -6 39 269 109 10 256 -22 15 54 257 65 -102 -185 -106 -136 115 29 -13 -81
5613 -81 -135 -99 14 54 -213 -57 59 4 -263 -148 -17 -25 168 117 105 185 -7 158 215 142 185 -144 -10 260
5637 260 86 -19 -88 -137 -104 292 -311 -43 -68 -32 -25 -34 -182 67 222 88 60 228 -3 -77 5 52 -172 -66
5661 -66 202 -53 -210 -186 181 305 -190 -149 323 8 -86 27 43 2 92 157 12 150 -81 49 189 64 164
5684 164 81 -190 105 -10 99 -2 48 0 55 -44 -262 33 -80 -2 158 23 -263 6 232 -252 321 -53
5706 -53 152 -135 113 -559 93 -148 -272 112 6 47 -108 -94 217 48 20 149 -105 62 -201 310 -572
5727 -572 -257 -188 -360 -262 159 -187 -168 256 -118 132 103 -46 -15 -239 -287 43 -158 130 -82 -164 184 -220
5749 -220 -343 78 -77 -9 -158 128 -67 102 96 232 141 -15 -19 5 -98 418 198 53 79 7 25 75 23 -55
5773 -55 -137 -8 -34 35 -268 -57 -81 252 164 -130 183 -81 146 2 131 -157 50 374 -153 -30 144 -45
5795 -45 -53 109 135 81 -152 163 -42 238 169 -135 123 -35 -52 0 133 -125 160 61 71 -14 214 -175 197 288
5819 288 61 80 -43 173 -184 -165 271 42 194 357 73 26 -207 85 -135 -25 -33 -39 340 -5 -40 0 179
5842 179 179 -87 -183 77 48 216 -357 -257 63 -355 67 93 -92 -65 -51 379 5 191 9 118 122 -134 -142 81
5866 81 -15 39 80 144 -54 234 21 -182 33 -77 -6 80 134 -158 -107 14 30 -14 32 7 130 -175 -192 245 7
5891 7 290 271 -48 -223 -214 324 -13 -260 -107 -201 205 431 -37 54 25 -100 80 54 -98 -48 391 129 -123
5914 -123 -113 96 316 -102 106 203 267 -51 -229 -13 -100 -303 374 -68 -125 91 201 -98 -207 157 -249 65
5936 65 265 -10 33 -210 -36 88 25 337 -37 -79 95 -60 290 -112 187 -184 -274 42 -40 366 -209 -20
5958 -20 357 34 318 -222 -169 -116 248 -99 -76 -58 -309 -31 332 98 -54 -16 15 40 6 -108 -165 -113 -49 63
5982 63 -235 260 -18 -208 -163 -140 -241 -35 178 -53 -73 20 -224 33 -6 28 8 -313 -378 -325 25 -146 92
6005 92 -172 -32 111 112 139 402 25 166 210 -148 111 166 -1 -279 -154 -167 40 -109 -307 -205 16 40 73
6028 73 128 -166 -82 225 222 -22 -37 -282 -82 -224 -117 -17 74 208 147 67 -9 -110 -36 -56 142 -171 58 149
6052 149 -48 -252 98 -163 -169 -120 -190 27 -183 -133 33 -326 -44 9 -61 12 6 -293 135 -346 -173 -10 -216
6075 -216 112 265 -28 187 -113 5 73 57 -441 24 38 87 210 -51 83 -116 -47 -155 -57 8 275 66
6097 66 -20 -109 189 41 201 66 32 -6 143 -81 -92 145 292 -205 87 -67 328 7 245 56 30 -8 123
6120 123 145 -78 56 -148 -172 150 -21 -94 -286 103 130 15 -227 8 -21 227 -100 188 -105 48 -97 20
6142 20 128 255 -103 -125 88 -112 363 -35 262 4 218 409 116 -91 176 -20 137 -258 -55 99 94
6163 94 74 172 -169 -138 -123 234 -169 -140 -64 -208 55 -84 -173 76 5 150 -27 204 -68 4 268 208 110 -100
6187 -100 3 -121 13 -254 31 83 59 258 -145 122 55 -102 -158 93 -128 111 193 30 118 16 114 261
6209 261 -26 -141 279 -116 280 -111 9 -59 -16 213 -228 -102 1 65 -175 150 -67 -33 103 -22 -110 73
6231 73 -324 -77 -146 168 164 -296 -164 184 -117 -156 -42 -209 275 -73 -145 389 107 21 -117 181 -180 -135 121
6254 121 144 293 -43 -196 118 36 -155 -33 57 35 213 -52 -169 24 -164 282 -164 79 -223 -46 -324
6275 -324 145 337 -108 32 319 -48 73 -48 -77 -158 4 81 -121 222 -338 -247 -29 -136 -89 -76 -210 -268
6297 -268 -31 -258 22 15 163 85 -274 -167 209 -39 -329 184 222 -238 233 -219 -108 -150 28 31 34 -50 164
6320 164 -32 90 -98 -53 92 38 -222 39 24 -226 306 -220 -73 379 -52 148 -55 -40 32 335 -33 -76
6342 -76 -32 -274 352 -38 -95 -77 228 217 180 378 -39 -36 -86 127 123 -85 58 114 130 -61 -1 -238 -55 415 -19
6367 -19 -237 -198 216 325 176 103 -263 135 -152 84 -267 -63 119 415 -43 -133 -191 -139 -80 -234 -41 376
6389 376 -8 -11 302 170 124 90 63 -31 -133 7 236 -35 -16 152 -142 242 61 24 88 -78 -23 -122 207 -480
6413 -480 -297 66 -385 199 5 -211 115 -4 162 91 154 -47 299 37 -4 70 -203 26 307 -286 49
6434 49 190 -252 -11 48 -108 -48 -108 77 -74 -271 90 79 40 94 14 305 143 -351 -37 -45 135 -117 9
6457 9 -319 -6 -329 21 -29 60 -16 -178 62 114 162 315 -118 116 -60 3 23 64 -42 -79 43 -48 -144 -22
6481 -22 -210 171 -44 -52 25 105 -314 30 210 -147 109 -372 59 -2 -179 212 -63 84 64 254 29 -302
6503 -302 -1 -51 239 124 32 45 201 -36 31 -408 76 236 1 195 146 -78 196 -17 -30 -103 71 -262
6525 -262 56 37 -243 162 -97 -286 -289 68 -402 232 -237 -6 126 -329 199 64 -182 -100 -114 -93 148 -363
6547 -363 -71 207 -101 77 -162 -206 -13 -93 71 246 -36 108 -384 -65 -237 100 -37 178 331 -202 -196
6568 -196 320 -122 -179 -41 -179 -164 -86 -111 -134 102 76 148 -65 129 117 -57 -153 21 -31 21 89 131 -22 -65 184
6593 184 208 -41 -31 -147 316 -81 -358 -194 211 -6 -194 272 -120 -6 -44 253 -17 166 -2 87 -85
6614 -85 183 -73 135 53 -88 -92 40 211 194 34 -186 68 -229 -35 -164 18 -129 -70 -98 -123 -180 -1 47
6637 47 -6 -141 132 114 -33 -153 -206 4 -135 65 63 -368 81 54 191 96 21 8 -132 -86 338 -58 -61 -147 -16
6662 -16 50 -231 -342 -19 401 47 -2 254 -247 220 -54 -96 77 80 218 -31 -126 129 -267 -305 -104 -18 -36
6685 -36 77 152 -338 133 5 246 33 -39 95 33 202 -288 -150 42 129 34 96 74 101 36 130 -262 292 168
6709 168 -132 119 -42 -309 -142 29 92 -208 -177 173 -140 -424 -173 123 141 -56 -11 254 159 -110 -155 -329
6731 -329 123 -107 -117 244 -119 184 -47 225 -258 -194 -212 367 94 -13 300 245 140 225 84 -36 42 75
6753 75 283 -322 -44 113 48 -44 27 249 -138 -271 0 -85 -176 245 -115 78 -48 7 36 111 84 158 49 155
6777 155 52 -158 -146 -222 -18 -128 110 -235 -53 -139 125 174 -269 -168 -291 49 -234 303 287 -108 52 75
6799 75 345 -107 206 191 114 -60 -346 188 184 25 76 189 -43 -53 47 139 -10 -150 -147 204 64 -2 -13 4
6823 4 -189 -152 -332 -297 -13 243 28 -2 235 23 4 -102 -138 169 205 -82 -5 -111 -103 69 -168 -19 84 -104
6847 -104 69 39 57 -104 67 -44 -20 -108 171 -79 259 -263 -113 250 -184 233 -337 150 73 39 177 175 -82
6870 -82 -119 -335 200 41 -162 68 152 -283 24 -35 118 -212 -83 242 -278 18 424 -297 -8 113 -192
6891 -192 33 -240 70 -164 162 -191 69 34 -176 -9 -2 -55 53 170 -18 -82 -290 -82 51 205 -149 -11
6913 -11 -204 -56 115 110 175 14 228 268 -151 25 350 294 70 -226 -61 310 -93 114 -331 61 134 180 30
6936 30 -25 -234 -119 -200 -20 -84 -77 -150 -5 298 237 56 99 -137 -97 21 170 112 -234 37 -27 56 67 -143 132
6961 132 -84 78 124 -110 -160 -104 118 171 -45 -114 75 -232 15 -46 -23 -71 -50 -162 -69 51 -17 -35 14 -102
6985 -102 -67 -40 146 85 80 189 -92 -111 -141 -55 -117 115 -44 -177 72 202 -95 325 4 289 -175 -24 244
7008 244 68 -297 59 -115 78 95 -265 243 -13 35 -145 43 136 98 40 183 51 66 -102 -53 97 204
7030 204 -273 16 -148 -33 -423 123 180 277 -273 -163 -143 -388 -8 96 63 -209 -98 -47 347 -253 -5 180
7052 180 79 -45 12 11 245 -54 294 41 248 41 -90 289 -80 -124 40 145 188 -21 168 -1 136 285
7074 285 -110 -49 -217 137 0 169 -38 -72 33 -82 -120 101 -140 -323 43 124 -301 48 -11 -53 -9 25 -173
7097 -173 -247 -143 -185 111 260 -224 -67 -75 -17 40 107 -189 145 185 95 224 -57 -77 121 -115 -13 57 -182 -289
7121 -289 -167 -59 211 151 275 -186 -145 128 -61 -47 115 -126 -40 48 -33 126 165 -62 -179 132 -90 163
7143 163 -200 -273 -31 -246 67 -198 10 142 -2 -32 45 151 56 102 -114 -420 -225 217 365 -247 84 -165
7165 -165 -89 -88 45 130 70 -262 -26 -118 -132 144 75 -52 -51 -227 -53 -334 -8 -55 -257 -304 -34 105 204 -236
7189 -236 21 185 -14 -200 0 28 141 42 50 -115 214 91 -174 -234 34 146 128 -115 169 87 110 -119 103
7212 103 -183 -392 67 56 271 -157 253 238 337 -73 214 -117 241 20 199 -155 81 -275 111 74 -17 99
7234 99 -316 -134 11 289 44 -173 116 175 11 -17 -313 -49 -58 530 -201 -252 -18 -104 180 237 38 78 -44
7257 -44 299 120 -2 315 1 18 46 83 -148 282 -125 139 -89 -236 92 -62 275 6 218 107 40 -53
7279 -53 -130 72 -81 143 -82 -325 271 9 45 -36 -96 97 -177 104 -254 88 172 -100 -264 -117 56 96
7301 96 31 -23 79 -3 268 -88 -1 285 -52 142 -118 -8 15 -192 80 470 138 168 -155 -153 -151 35 6 -122
7325 -122 167 -167 32 -83 -20 182 -188 -272 -128 200 171 -34 -254 -25 -267 -165 -32 95 88 -1 -18 -44 56
7348 56 98 120 254 156 19 66 -222 35 151 39 214 -113 -9 -13 -101 15 -26 19 -23 -120 -22 121 -329 81
7372 81 -226 -120 -35 156 46 -219 254 236 30 226 278 315 -137 -54 -145 -205 66 -209 -2 112 244 92 46
7395 46 118 83 -44 -349 139 226 -105 -9 136 -201 -144 169 4 13 -101 -65 45 -253 -135 75 44 90 341 34
7419 34 161 21 -8 -286 60 -251 -127 130 -177 41 -17 31 -161 -163 132 -28 -314 126 -152 -72 150 160 75
7442 75 -100 84 308 152 -44 133 -452 11 174 -140 12 -235 61 -16 12 248 -216 -23 131 -15 87
7463 87 37 -86 15 -131 -125 239 -101 -275 6 -69 -16 -220 -77 -177 -203 137 -68 -113 -153 -123 -174 -284 -67 32
7487 32 -32 -172 -124 14 -31 58 -235 110 -342 8 52 -62 -84 -192 -65 -117 71 89 -208 146 156 -5 -17 51
7511 51 -48 -174 178 113 -128 -2 171 13 -36 83 -277 12 15 -118 -11 210 288 90 -91 86 245 14
7533 14 -293 -110 60 147 70 157 -106 -54 -146 82 -50 -95 33 -103 136 -117 146 -8 -473 -178 106 -84
7555 -84 119 -39 -59 -88 137 -85 -24 -60 61 195 -167 -146 270 -225 49 -120 -192 -254 -111 -221 30 108 -47
7578 -47 53 -14 57 -548 -134 -125 158 -25 133 131 -61 -17 88 -83 42 20 -15 -49 -98 -8 84 0 -162 -4 29
7603 29 234 -94 166 26 -292 205 55 -104 -130 -193 -161 106 257 398 -59 -10 -51 186 77 24 -178 -32
7625 -32 88 -155 -29 -60 -413 -45 -72 -8 95 -25 -151 154 11 -120 1 145 64 -228 240 445 -37 258
7647 258 -269 -139 -5 43 -56 -180 -20 24 180 -143 -193 28 -107 425 140 -124 52 56 29 369 -229 -33
7669 -33 28 -79 -50 50 214 -43 174 -67 253 67 -8 112 -114 -79 155 118 111 -216 -150 187 207 213 -78 -296
7693 -296 122 248 43 -66 -56 36 391 86 -186 29 -114 -88 30 9 11 -73 -366 29 134 -498 -346 269
7715 269 122 -361 229 -180 -49 166 -80 -18 -12 -20 60 -180 -108 19 -55 142 -242 220 -201 -86 -12 -214 45
7738 45 -60 -112 51 -265 289 -292 115 99 -31 449 42 -294 50 -280 255 -54 -212 -26 -458 51 -22
7759 -22 50 125 144 111 142 -156 83 258 68 19 -400 -75 -36 243 124 118 23 156 -29 183 -75 41 30 224
7783 224 -158 304 -32 29 -150 -52 -88 -147 161 -177 -11 382 120 -15 -134 -53 217 96 38 161 98 -95
7805 -95 178 -209 -37 -131 153 -75 275 -14 175 -20 -10 5 -26 -104 -218 -53 79 199 90 298 93 45
7827 45 102 -28 -223 116 1 162 -31 -162 -44 207 -39 48 -101 -45 78 150 210 -33 -34 -5 -37 122 -116
7850 -116 -97 -39 -11 -75 148 -377 21 -97 107 -113 -4 -132 10 -42 200 -419 131 -313 76 107 -175 69
7872 69 -5 -71 -174 60 -56 132 -87 256 89 119 -54 25 -285 -68 136 141 -73 -1 82 197 -52 418 -179
7895 -179 156 83 -151 49 -346 59 194 422 31 -327 29 -31 27 -131 553 489 155 1 -200 57 -14 211
7917 211 229 85 -53 -292 -202 -99 -33 33 -275 73 -146 -128 -98 -54 40 62 171 -73 -166 -338 -86 62 -121
7940 -121 57 96 19 -63 16 290 57 14 -18 276 -24 113 34 -123 -147 -15 177 -20 -106 -227 219 -110 -152
7963 -152 106 11 65 -36 -236 172 -122 56 -124 22 -124 119 -31 -14 29 -409 -34 -112 -54 181 -272 148
7985 148 -28 100 -208 128 -257 130 21 -28 -108 3 241 -25 256 -196 265 226 87 37 94 178 -24 -67
8007 -67 89 -49 33 -29 42 -314 176 -45 -136 -70 238 53 -97 88 162 43 70 253 196 112 200 104 -144 68
8031 68 26 -76 166 -60 -215 181 -127 -282 66 -21 -93 -39 -123 61 -63 81 -146 29 -92 -94 157 151 71 -298
8055 -298 -24 86 -45 159 -131 -133 202 120 -119 -28 94 109 -282 26 159 -163 -148 117 -84 294 -170 -58
8077 -58 87 -85 33 172 -18 67 -272 57 -417 82 0 61 -117 -61 -89 -60 -94 -192 101 -61 -176 -24 -36
8100 -36 -78 -254 -12 47 15 123 13 66 30 293 25 -191 -73 -53 -87 -28 -95 102 -158 -159 177 -131 -18 -295
8124 -295 89 -12 234 208 82 281 -85 29 -102 81 -318 -261 -13 -240 1 261 360 -158 -127 -42 -144 -140
8146 -140 -31 -269 -126 -126 -304 -183 -33 35 32 468 212 -88 -134 -59 16 -272 22 -205 28 -103 349 -61 -414
8169 -414 -259 59 -65 -66 138 -21 -80 -18 -212 124 78 -143 -45 357 46 -268 276 -120 -227 -183 -124 93
8191I3
$$ Imaginary data points
##PAGE= N=2
##DATA TABLE= (X++(I..I)), XYDATA
0 0 0 0 0 -8 8 -8 8 -16 16 -24 32 -32 45 -56 67 -80 96 -117 136 -160 189 -219 255 -293 339 -386 439
27 439 -499 563 -638 718 -807 904 -1010 1127 -1254 1396 -1549 1719 -1903 2108 -2334 2584
43 2584 -2861 3171 -3517 3909 -4358 4871 -5472 6183 -7037 8090 -9422 11175 -13582 17118
57 17118 -22820 33507 -60280 257988 310492 -351893 63688 244043 -169437 -106537 196103
68 196103 -125661 -233027 57132 58976 -108589 -6032 78461 92167 71023 -5004 -811
79 -811 73752 11123 -23228 -42630 -150703 -91545 90696 10191 -86368 22802 44250 14029
91 14029 121651 87577 -59393 -2362 60548 -51981 -84679 -44779 -45477 322 -265 -63486
103 -63486 10110 87425 53924 73635 38700 -73424 13376 94062 -61676 -93650 -5147 -91670
115 -91670 -58339 112072 -11888 -101191 127000 112577 -78238 49970 102012 -78257 -12175
126 -12175 59436 -127271 -103709 65319 -12799 -52102 43690 -14210 -12096 133898 62877 -61748
138 -61748 25515 31884 -53937 -3823 -11110 -89346 -19610 21404 -40415 5962 52777 5710
150 5710 45254 72775 -32346 -32754 64927 10584 -72634 -35331 -26257 -43180 5081 25796 -623
163 -623 -3364 16557 55979 50752 -16024 -4890 37125 -29050 -59686 1816 -20053 -49265 21930
176 21930 12042 -47861 28284 71783 6032 24450 31954 -47695 -4315 51465 -48232 -59468
188 -59468 20111 -32196 -46168 49587 18243 -34689 51189 52874 -29674 12251 39738 -25671
200 -25671 -12014 3624 -55827 -27687 24301 -16155 -10022 26050 -11056 6467 64220 12358
212 12358 -26440 25372 5891 -45758 -1904 8106 -44662 -14832 22181 -18065 -11330 38171
224 38171 25393 3097 13618 8707 -6176 -960 5540 -13509 -35131 -18329 6430 -7138 -9141
237 -9141 23170 13394 -13144 25295 37559 -19172 -7245 34266 -23056 -47379 13618 2532
249 2532 -36339 4653 18357 -17110 3115 33493 14215 4532 5562 -5707 2856 105 -24373
262 -24373 -6398 4411 -31298 -11137 29786 -5181 -9698 39319 12458 -23915 19780 23914
274 23914 -24859 -7770 11681 -31457 -24308 21184 -3086 -20155 18681 13823 -10638 16847
286 16847 27450 -5709 -8201 9634 -7368 -22795 -1857 4620 -17365 -12639 10267 5783 -2084
299 -2084 16214 20675 -3408 -5802 12655 1574 -15032 -3225 -3899 -17814 -8816 2851 2974 5184
313 5184 4967 6294 11152 5333 372 9701 3056 -18689 -10671 2959 -12965 -10333 11400 -2707
327 -2707 -10334 15710 13441 -1897 13497 9687 -13656 -3069 7320 -14219 -11835 7170 -10450
340 -10450 -17026 13298 11907 -6549 11909 16908 -6956 -2009 12991 -1773 -12685 -3025 -4542
353 -4542 -13722 -3755 6136 428 516 6620 5344 5356 6925 3852 483 -4017 -7866 -7438 -3086 -2486 -4947
370 -4947 -2352 2929 995 3361 12528 7565 -362 1380 872 -4627 -4019 -1705 -5918 -7682 -3215 -2376
386 -2376 2815 9765 2644 61 9713 2942 -5451 6589 4079 -14828 -8421 4347 -7083 -8738
400 -8738 9537 4044 -8768 6217 12693 -1026 2694 7877 -5259 -7427 -516 -3506 -5258 -477
414 -477 -2426 -4058 2789 4929 2702 6465 4907 -2274 392 2274 -3434 -3077 -1859 -5891 -5311 -421
430 -421 1677 3236 3811 1889 471 3379 3789 72 800 -846 -7563 -5754 1619 -482 -4270 950
446 950 3857 -2173 -48 10591 5050 -5879 1170 2990 -8106 -2740 5676 -4045 -8720 1789
460 1789 1840 -3246 5521 7216 -2388 40 3974 -2730 161 3462 -5177 -4726 478 -3874 -1897 5723
476 5723 1071 -3532 2860 3157 -772 4072 4199 -4968 -2416 675 -4670 -572 3429 -3867 -2594 3305
492 3305 -1022 -216 7151 2879 -4843 58 3861 -2442 -1571 3178 -3269 -6427 12 3501 139 -724
508 -724 2704 2224 -2679 1235 5819 -747 -2843 1428 -2847 -4597 1642 1145 -3004 130 890 -2677
524 -2677 3356 6912 -2420 -1499 4589 -3388 -3580 5241 -1486 -6174 1106 137 -4107 2511 4575 -667
540 -667 1519 2325 -2156 1990 4352 -3980 -3002 1317 -5701 -2251 6793 -2088 -5626 4417 3234 -2278
556 -2278 3549 5549 -2354 -2480 1668 -1690 -3028 48 -812 -2067 -2307 -882 3801 4145 -393 1185
572 1185 1391 -1394 1430 1731 -2570 -3032 -2560 -2628 424 1423 -1526 1193 4624 -1207 -1228 6248 1615
589 1615 -3517 1876 -1744 -7766 1023 2475 -3940 -1038 878 -1151 3373 5572 -613 -75 2958
604 2958 -2669 -2389 2690 -3224 -5355 2022 -1747 -4266 4678 4245 -786 2741 1518 -2278 2860 3006
620 3006 -3832 -3345 -1364 -4218 -701 3646 -2015 -1681 4482 1592 438 3950 1138 -516 -138 -3481
636 -3481 -2773 29 -2006 -1166 1565 -3194 -1976 6937 4710 -2366 1784 2501 -3916 214 2273 -4477
652 -4477 -3294 -11 -2594 490 2209 -639 3302 4239 -2812 -614 5318 -374 -3708 700 -2834
667 -2834 -6276 2108 2893 -3177 778 1447 -167 4979 2827 -2386 1710 625 -4999 -333 1376 -4495
683 -4495 -1552 3025 -2595 -2051 5596 3395 -588 2474 -668 -2669 2867 122 -3938 -985 -2209
698 -2209 -3058 2329 1913 -1800 2208 3311 -871 746 2864 -1032 -743 331 -4839 -2391 2219 -1653
714 -1653 -537 2458 -3329 -357 6920 894 -2785 2110 -610 -3892 1001 700 -3571 -815 480
729 480 -2194 1830 2507 -932 3368 2792 -4514 697 4637 -2927 -2269 1777 -3265 -3149 3441 1487
745 1487 -2049 923 1149 -227 2449 612 -2084 2276 -517 -4768 1063 1561 -3857 819 2473 -3385
761 -3385 -315 4533 1131 -962 1055 -808 -908 1940 -1017 -1951 1119 -2180 -1916 3412 -72 -2477
777 -2477 3360 1314 -3212 1964 2064 -1657 184 144 -3231 70 1892 -1677 -203 1785 -2103 37
793 37 4361 -930 -1881 3294 -807 -2458 2336 -273 -1888 1139 -203 -2396 1437 1904 -922 1805
809 1805 1336 -2790 833 3084 -2197 -1134 1715 -2181 -1571 2216 -1001 -906 1297 -661 -402 2172
825 2172 237 -255 2086 -716 -3091 1883 1020 -3238 589 997 -2918 667 3294 -661 -183 1302
841 1302 -442 948 1095 -1272 -370 712 -2289 -1444 2495 -472 -1291 2764 944 -2081 2070 2208
857 2208 -1257 -36 -356 -2042 251 -68 -1807 291 167 -1447 1196 2788 -598 -195 2431 -437
873 -437 -1918 756 -61 -1914 -8 -862 -1310 1123 527 -46 1771 759 -474 1666 1136 -1799 -951
890 -951 463 -2163 -1142 1100 -752 -410 1374 661 318 1807 424 86 1015 -1706 -1408 968 -624
907 -624 -2213 115 355 -1039 1160 2259 -221 144 1449 -828 -606 -144 -1744 -529 -318 -2075 -320
924 -320 1340 246 532 1900 593 -112 1204 694 -1292 -713 -400 -1814 -656 193 -1138 731 962
941 962 -280 1396 1804 223 42 682 -604 -1597 -157 -433 -1472 305 -44 -302 1659 1228 53
958 53 1554 545 -544 296 -447 -1539 -727 -323 -1084 -357 580 777 635 1065 759 383 750 -535 -631
977 -631 156 -1852 -1128 868 -691 -1068 1158 803 268 997 1259 432 -492 133 -804 -806 -595 -1061 -609 516
997 516 -767 362 1660 165 391 1448 44 -338 42 -486 -1244 -818 -502 -328 290 376 -14 779 1061
1016 1061 146 780 547 -1075 -298 -110 -987 -253 111 -489 -204 652 430 274 392 617 -27 287 141
1035 141 -1048 -480 -597 -1214 116 290 -279 535 628 443 354 339 184 -88 -482 -570 -501 -629 -428 -529 272
1056 272 448 -417 783 764 -106 303 -171 -617 -321 -527 -532 -152 -514 -237 308 594 14 437 742 -5 -877
1077 -877 218 -218 -337 293 -488 -702 335 7 29 845 241 -29 324 145 -71 -151 66 -846 -594 128
1097 128 -428 -133 1018 -271 97 613 -110 -207 89 -180 -669 -255 -179 -459 -22 308 -180 -184 494 -159 225
1118 225 301 -383 -205 -179 -362 199 -176 -735 409 399 -228 281 402 -156 -233 297 -16 -82 -19 -150 -379 188
1140 188 82 -306 729 67 -572 393 182 -450 18 9 -629 -104 303 -36 -216 425 144 -142 781 147
1160 147 -507 466 -236 -790 402 188 -358 357 160 -53 71 140 -23 108 224 -612 -158 279 -559 -64
1180 -64 477 -153 179 398 -85 239 473 -6 -114 24 -51 -83 183 -116 -188 22 277 -333 420 265 -973
1201 -973 363 744 -808 16 224 -642 -63 316 423 43 74 -289 -64 46 -307 -248 274 104 -1058 0
1221 0 383 -337 452 478 -224 578 -299 -303 165 -289 -654 -91 207 -624 -92 578 14 -599 885 166 -304
1242 -304 394 -125 -538 364 -272 -352 278 -566 -442 768 -12 -38 279 596 -47 -125 808 -447 -680 290
1262 290 -876 -846 385 374 257 324 -349 236 777 -291 -260 -62 -382 -1071 160 145 -661 -3 534 35
1282 35 277 549 -153 474 -75 -903 -246 -391 -919 -355 396 -123 -311 1247 641 -290 802 620 -664
1301 -664 355 119 -1072 -269 -89 -577 164 54 -101 401 902 -127 -45 597 31 -570 -192 -798 -932
1320 -932 98 -63 -297 453 83 255 1182 -28 -243 604 -277 -836 -66 -531 -422 -207 -14 -202 127
1339 127 992 201 170 866 -650 -158 517 -1165 -860 252 -661 -562 385 294 -120 766 606 104 432 443
1359 443 -357 -141 -114 -1200 -193 430 -528 35 1067 -82 358 919 405 81 83 -233 -436 -339 -242 -31
1379 -31 189 -319 -190 849 859 -177 908 627 -799 279 362 -746 -296 -173 -413 -187 8 66 393
1398 393 760 110 289 740 -79 -300 303 -530 -1084 58 -43 -502 502 96 99 909 935 282 100 -133
1418 -133 -923 -405 147 -1048 -617 504 -141 -45 1126 235 388 1100 -112 -360 68 -445 -619 93 -690
1437 -690 -355 418 140 -96 465 610 -440 280 458 -789 -281 320 -640 -176 -37 -120 -67 405 -138 54
1457 54 849 407 -73 536 -338 -758 -4 27 -664 -188 -165 148 617 466 88 429 192 -322 283 -261 -301
1478 -301 9 273 -512 -334 352 200 -42 477 146 -136 693 -218 -497 670 -500 -484 304 -240 -403 635
1498 635 251 -34 -201 446 -170 -245 16 -353 -646 116 -168 -410 325 -253 125 542 -119 -262 621 495
1518 495 -114 -36 -88 -133 104 277 165 -360 225 121 159 233 -356 209 370 -210 -278 -23 -398 -8 434 170
1540 170 -197 127 454 95 208 -258 -54 -16 176 -524 371 293 -122 319 108 -318 40 36 -294 -184 -58
1561 -58 -63 -112 440 -42 -304 519 288 -373 661 -69 -665 -35 -69 -507 89 -312 203 -125 142 313 4
1582 4 221 296 -27 55 -53 -121 242 -21 -99 95 175 -201 490 366 -75 404 200 145 -583 -25 -284 -423 -50
1605 -50 131 -73 78 179 47 405 -97 469 693 -353 -717 -84 -280 -3 -247 -73 269 74 456 249
1625 249 289 393 -72 57 74 -326 -256 -78 -957 -330 567 302 381 385 425 -148 267 14 -15 -55 -24 -417 -366 39
1649 39 -155 161 377 167 507 249 73 -17 19 -105 -661 -221 -146 -101 -158 52 151 365 335 37 496 148 -23
1672 -23 161 -194 -287 -127 -200 201 -215 -39 292 124 210 122 288 332 64 -640 -171 -261 -503 -422 129 -437 310
1695 310 299 -35 410 396 329 60 -365 -73 -321 -290 -171 59 415 198 -234 480 301 49 -59 116 -170
1716 -170 -112 -164 -431 -336 -398 -177 -346 438 260 514 545 -315 266 336 -433 -599 -110 -29 -402 -50 -265 83
1738 83 -12 228 405 319 -33 124 425 46 -572 -150 172 -330 142 106 -265 -73 378 -253 137 24 -53 -29
1760 -29 -40 -250 52 -79 -146 -366 225 11 -258 608 81 -443 121 -79 261 -164 -99 -144 184 -120 229 390
1782 390 47 -93 -104 304 -229 -62 54 137 -569 26 131 37 131 -299 197 323 -19 248 -128 -130 -44 -271
1804 -271 236 -208 -154 456 -254 52 262 320 -115 47 -422 -59 -393 -506 253 326 -119 -214 -45 363 275 -110
1826 -110 159 -65 -525 -149 -21 -360 -13 183 -5 249 -61 227 242 -121 71 -45 -52 45 -108 -269 -279 38
1848 38 151 155 -77 214 200 283 120 -123 386 -297 -205 -301 -66 -457 -168 200 213 -206 247 131 97 -31 364
1871 364 -309 131 -413 -332 79 -194 -143 268 134 103 394 456 152 -202 -155 67 -686 -15 -187 -88 -148 -94 -75
1894 -75 294 144 140 407 -172 -235 -114 -166 -558 -403 101 300 -323 281 94 225 216 297 106 360 -5 -295 -106
1917 -106 -73 -58 85 100 -150 154 478 263 -284 211 -92 -315 -84 -461 -283 -10 -229 59 112 93 43 521
1939 521 -1 -106 -61 118 -258 -251 -120 -685 -312 7 201 387 201 108 185 604 -31 85 30 -313 -144 -203
1961 -203 -157 -240 -17 189 -358 168 364 69 212 -160 -326 331 314 -385 -197 -74 -398 138 506 449 259
1982 259 405 318 -264 57 140 -123 -288 -583 -397 156 203 -62 180 85 -45 359 331 13 -303 56 -125 -284
2004 -284 121 -224 27 302 -225 -120 451 73 20 294 162 -675 -152 -36 -237 -49 -226 -491 -8 333
2024 333 344 307 412 -245 133 443 -259 -161 150 -255 -157 199 -58 -22 173 308 87 34 132 126 18 -258 -448
2047 -448 55 349 -423 199 148 -406 -12 389 -292 -171 381 -93 -629 42 34 47 17 1 -117 235 -42 -26
2069 -26 431 53 -41 232 311 -191 -218 98 90 169 72 -69 267 238 -42 -65 197 -314 -505 307 -99 -166 459 177
2093 177 -349 3 373 -511 296 -33 -488 -92 269 -246 154 616 171 -156 405 -232 -340 150 -77 -107
2113 -107 431 -334 -302 220 -334 -99 489 129 -150 109 -309 200 -22 154 -423 99 123 -212 -381 -102 -384
2134 -384 -74 15 78 -356 267 -282 -163 146 -14 -268 -183 20 -428 77 632 -333 169 287 14 -34 -131 -82
2156 -82 -181 -86 -389 -92 -20 69 104 177 -125 -337 171 235 -595 -31 41 -354 -40 132 -264 -42 13 169 248 407
2180 407 -208 163 -185 -93 -269 -133 -259 -193 9 -63 99 536 -19 217 343 40 234 -54 -78 -347 -112
2201 -112 -24 -348 30 484 319 -302 479 21 105 258 28 -230 17 -184 -355 -441 -327 -60 547 71 32
2222 32 278 273 50 -44 293 -271 -22 -207 -43 -68 148 -188 125 293 -47 11 130 52 -228 170 -318 -62
2244 -62 -52 176 -412 76 195 -119 133 -57 33 116 114 -92 87 1 -212 -67 181 11 22 124 151 296 270
2267 270 42 -241 165 -440 -318 292 -205 -454 206 -171 60 190 342 173 -230 93 -281 -6 -28 -308
2287 -308 -233 -182 -219 70 180 -1 -160 315 -53 -19 10 -216 -328 -249 12 -281 -129 -158 44 -93 25 -6 12
2310 12 312 49 -225 232 -228 -348 -261 -50 37 327 271 -165 193 436 164 47 131 -64 -248 444 102 -127
2332 -127 5 -446 63 394 159 321 430 -109 -108 -35 -190 -111 -187 -244 -37 91 140 -42 120 -27 90 118 119
2355 119 -487 266 -69 -74 -37 -40 -29 67 59 423 7 -29 448 -67 32 -87 -214 -139 -170 213 -157 226 212 59 97
2380 97 207 127 391 246 164 -80 -160 -184 -39 -17 -150 38 -101 -46 454 236 -380 -289 111 -142 307 -420 -89
2403 -89 35 -101 -77 262 145 -175 294 -45 -134 -31 7 -165 -248 -141 -23 -154 271 354 318 446 -207 -204 32
2426 32 -266 31 -234 141 -251 -52 42 -35 91 10 233 -130 302 96 189 155 -470 -141 9 27 174 -178
2448 -178 181 206 2 296 -249 -162 -165 -405 -92 -171 -75 -32 157 61 245 31 -138 124 -191 62 -2 -99 -108 -62
2472 -62 -18 -97 296 18 380 262 47 32 -97 -13 -404 -2 -92 218 -320 100 -450 226 204 322 227 294 169
2495 169 -89 315 -107 1 60 123 -206 -30 -92 -260 317 49 -7 107 -10 -44 -44 -427 58 -268 -323 343 -377
2518 -377 77 -21 -143 456 26 -158 103 -138 -465 -36 -85 -248 82 -146 -151 199 157 210 -144 252 33 -109
2540 -109 -86 -206 12 -49 -144 -206 287 -166 97 130 458 315 229 192 87 -171 -80 148 -22 -45 -68 -92 303 -128
2564 -128 -85 -106 244 -354 -196 7 -31 -47 -37 0 160 415 99 266 300 25 -50 172 -346 36 -201 -572 -227
2587 -227 269 248 109 21 -1 99 -125 3 -189 -60 -22 -149 22 296 -116 193 8 -112 -168 417 -169 -52
2609 -52 25 -184 -203 -37 -161 -225 -97 -207 -306 157 404 112 106 318 -8 231 130 -223 -317 149 -280 7 199
2632 199 -76 96 -22 -52 -184 87 -131 112 47 -42 -356 162 42 -343 164 92 89 119 287 221 -103 9 -78
2655 -78 -318 201 -168 3 71 219 -4 463 65 21 202 297 -209 285 -67 -120 -127 135 -267 223 282 277 -110
2678 -110 315 262 262 80 -68 -39 -55 -443 -124 330 124 204 354 85 -124 252 -3 112 96 162 -223 133 255
2701 255 65 -283 163 179 117 100 -107 291 111 -113 487 280 -89 157 93 310 -157 -96 121 -429 -333 -22
2723 -22 -168 203 46 -304 122 -323 -132 242 185 -301 -188 7 -62 -132 6 -164 -359 17 194 -216 -83
2744 -83 179 -176 395 344 -286 206 -176 -64 -36 -218 -582 59 264 -244 -267 279 95 -301 190 -290 100
2765 100 12 -206 -207 -211 -205 59 99 141 81 297 435 348 269 39 -341 131 -28 -236 -148 113 30 494 267 -137 -150
2790 -150 551 -102 -63 340 -10 -177 50 235 -382 91 -14 204 -29 164 -293 196 131 -89 250 -12 33
2811 33 -142 -75 106 -239 192 88 161 136 132 -309 173 280 -104 211 -175 -49 79 226 -64 104 239 277
2833 277 187 32 -141 262 -12 -457 -112 -132 -153 -430 131 81 -88 262 117 -118 -10 165 -116 -113 -110 -202 -12
2856 -12 -255 20 -29 -61 -173 -121 165 -262 23 256 -164 -104 -70 -448 -198 -92 -239 57 -45 -133 123 96 16
2879 16 17 43 97 -108 -84 192 -201 -249 -119 -277 229 106 72 224 159 36 -236 7 -296 113 -445 -202 171
2902 171 57 306 -134 190 213 -243 -223 65 -177 181 -61 -251 246 -163 -146 -72 34 57 76 117 -34 79
2924 79 -3 -148 -266 -70 -49 147 263 252 -109 321 -29 -107 -191 351 -154 -203 78 -146 378 -109 -294 70
2946 70 248 123 33 374 218 143 12 -214 -359 -234 49 -54 56 194 -20 -47 -64 68 277 -38 38 123
2968 123 2 -327 106 271 -282 -113 -205 -263 441 144 117 -243 -199 63 -116 -228 -274 -73 115 233 27 -206
2990 -206 269 -146 97 204 47 25 130 -239 -163 180 -230 -200 88 56 -38 -26 -354 119 28 217 55 306
3012 306 -75 -168 -161 31 77 20 -57 174 238 -175 -157 -225 89 -240 -4 -115 73 -125 -153 94 186 200 -31 -130
3036 -130 -221 31 23 -197 -65 -104 191 142 -49 169 28 -160 104 -73 -217 -157 -146 21 -28 40 394 -49 -152
3059 -152 -1 206 -125 166 85 -48 -65 -181 -234 -65 4 -81 352 45 -155 217 278 -129 198 51 -170 -390
3081 -390 143 25 120 156 -187 -56 35 110 -69 -105 26 472 -8 301 255 -54 -220 28 -120 -88 -39 68 140
3104 140 -178 294 53 -169 -91 -228 -101 27 -59 -60 20 243 -197 364 -107 -101 -35 -71 318 -43 -76 48 4 22
3128 22 -2 -100 -17 140 0 -107 135 179 -13 30 -73 -254 270 -160 232 528 63 353 27 -119 77 -227
3150 -227 -16 112 -42 -189 47 -171 -123 170 124 56 99 198 103 -82 -198 -141 -283 -127 -39 -177 94 187 359
3173 359 36 44 -113 -123 117 -65 -17 21 32 -59 -95 46 -211 135 -156 -51 115 237 -74 -99 292 -136 39
3196 39 -97 -102 281 -19 -68 252 89 71 196 -185 12 128 27 -241 -275 -96 -54 -97 -91 43 127 106 121 -81
3220 -81 -140 -33 -273 -100 113 217 208 -62 48 -82 259 -56 165 120 -57 -163 -212 -84 -59 125 105 78 -237
3243 -237 -229 65 -116 -97 83 -100 253 240 12 -176 146 -222 38 -208 33 244 50 -33 185 29 24 50 237
3266 237 166 297 -128 -137 156 130 -257 5 240 -283 236 245 -49 -78 0 -232 -204 13 106 241 111 64 -146 507
3290 507 -216 177 337 -88 103 -282 113 324 -26 313 34 512 33 162 249 -206 -148 -13 197 -202 65
3311 65 93 -336 47 245 -143 -135 374 -90 85 247 242 27 30 -61 133 84 -149 -231 -307 31 190 25 356 -494
3335 -494 -287 259 -421 158 36 197 174 52 190 4 -166 76 -142 25 -116 -272 71 -360 -364 220 7
3356 7 -190 131 -169 75 52 -45 -20 12 154 -293 -51 23 68 -356 123 -55 -151 202 66 57 -55 300 -132 225
3380 225 160 -10 38 70 106 199 -2 -210 -43 150 -304 196 62 -219 -339 265 45 -182 299 351 -36 294
3402 294 -177 -264 341 152 -23 -117 -166 -296 52 -12 -300 228 435 -69 123 -68 -58 -38 121 -160 247 -90
3424 -90 -157 -478 14 -45 -20 244 -29 -253 -17 2 -159 -268 -56 45 -52 -394 -209 -107 212 -254 170 186
3446 186 178 96 83 -98 -205 156 148 -193 126 80 -4 221 39 152 163 108 -85 157 37 -242 126 217 -109 312
3470 312 158 -413 5 -119 64 -5 -41 138 139 -240 -68 -164 -1 -32 -127 49 54 67 341 -20 99 -187 246
3493 246 -124 -286 144 77 83 423 63 -195 106 204 -312 -181 -186 -267 168 -127 -160 46 -21 37 -49 -70 -45 256
3517 256 181 -16 -68 -55 82 7 -173 176 -174 182 103 156 387 116 106 11 236 -176 79 144 -77 32 54
3540 54 -6 -108 86 288 -334 322 -2 74 -24 122 -331 297 -252 -164 175 8 -71 93 79 159 -129 12 341
3563 341 41 -71 24 1 67 -57 -277 66 123 127 219 -129 -39 72 234 -157 -182 -78 137 259 261 294 -51 123
3587 123 -147 -168 -28 126 20 -106 -306 -5 -209 86 -285 -28 50 -107 230 68 303 76 -139 -101 46
3608 46 -95 30 42 -68 -63 73 -8 52 474 -169 -56 -233 286 21 -357 42 13 -210 -121 210 65 99 -23
3631 -23 -214 141 260 -30 -265 59 -85 127 -128 -31 -207 -144 112 14 -46 27 344 292 274 -124 -59 -188 56
3654 56 327 -104 169 84 52 -372 -58 -233 134 221 94 -242 138 -86 -184 242 -223 -18 225 175 35 -125
3676 -125 204 132 39 313 -208 -22 71 90 323 157 120 205 102 -61 -62 184 -41 183 -48 -223 125 42 -115
3699 -115 -210 323 -259 109 33 -34 -94 200 200 -260 34 -241 99 -337 -98 233 -190 -74 -55 -36 -410 -237 76
3722 76 -49 -72 -50 113 71 148 68 275 -63 210 185 -464 131 -294 -41 219 -9 47 37 -330 52 37 265
3745 265 24 123 100 -37 -49 -123 60 129 59 72 67 -190 295 -188 -45 170 37 -53 -307 -101 -245 -102 -36 -245
3769 -245 -130 61 413 -190 -194 -53 -289 -99 2 -73 -294 -1 376 -20 332 34 38 301 -163 -20 329 -83
3791 -83 -9 51 192 51 -136 -10 364 11 342 460 -19 301 140 -50 -141 7 114 -10 -22 -79 81 67
3813 67 41 -72 16 98 114 286 -103 295 6 151 22 -220 220 99 -22 103 -18 206 69 -243 -97 -35
3835 -35 295 -48 -127 -25 -62 80 20 74 -35 269 221 150 48 12 -1 -26 -54 181 168 91 95 93 374 184 113 -158
3861 -158 82 -61 11 -349 5 -138 142 -117 189 421 -2 141 88 -12 0 -61 87 -299 53 -200 -212 -33
3883 -33 -181 -167 4 -7 91 185 -258 239 -216 167 216 -23 56 -45 137 165 316 326 -130 -318 84 -22 -73
3906 -73 80 -315 -153 -86 164 -93 143 -61 44 11 -150 -81 39 25 -183 62 -42 260 92 -18 -5 -171
3928 -171 -92 180 -358 86 -21 46 -178 -178 -109 -74 -93 173 48 263 -57 82 -193 11 458 27 -263 -212 54
3951 54 -236 -364 228 -59 46 176 -42 -87 -160 -88 -117 -132 240 36 311 -114 -177 -61 55 55 117 196 134 -77
3975 -77 74 304 46 -98 -335 267 -142 -125 -49 204 138 -286 117 -35 131 -304 -271 34 -178 425 -197 201
3997 201 376 16 95 150 181 242 188 158 -158 -71 -43 37 143 115 -244 190 83 -66 37 232 -100 -151 39 -156
4021 -156 46 303 -188 86 -131 71 -166 -87 371 -155 -266 21 -7 -3 -127 -104 76 36 27 89 170 116 -94 32
4045 32 -64 -136 32 84 23 -202 44 -82 -110 -165 -50 -141 139 79 60 92 -93 165 -238 -243 -315 271 31 147 230
4070 230 -18 283 -192 -50 -11 -164 62 -130 -105 -293 310 289 -82 -210 128 -221 194 77 -10 -76 -225 102
4092 102 -107 53 -71 -193 -53 39 88 66 -16 -38 -121 -193 -144 -55 47 -324 -8 46 -218 -205 -42 178 188 -77
4116 -77 -80 -169 -109 75 112 -23 -172 9 25 243 477 40 -11 -72 196 -58 67 144 0 55 2 -109 -2 -57
4140 -57 98 121 -29 -52 109 -26 -425 -215 -85 69 -136 -69 287 79 -134 157 102 99 80 -48 78 98 96 -55
4164 -55 -158 48 -64 75 14 -2 188 -114 154 130 439 200 165 -76 -125 -286 245 34 -166 74 -1 138
4186 138 -54 73 -151 -502 391 79 -130 479 87 -60 148 -83 128 -180 414 182 -61 148 66 -156
4206 -156 -287 285 -255 -177 308 247 -257 42 128 -119 76 -30 -12 -139 -2 -118 104 -392 -219 124 -27
4227 -27 -192 178 147 227 65 117 -155 241 -88 -72 -225 73 -127 47 219 -166 219 -358 -167 -126 -254 -93
4249 -93 -48 -91 114 369 18 26 0 -166 -78 -3 278 -80 102 -23 343 136 -206 173 343 -232 -11 -89 -68
4272 -68 -89 115 43 -275 -50 -5 37 121 245 298 84 68 43 160 67 182 159 -127 -119 -193 31 -164 -293 72 87
4297 87 -109 -44 281 60 146 219 97 310 -69 -320 -36 -194 -90 76 59 -48 -364 410 -95 187 288 -158
4319 -158 -68 182 -227 22 -390 -156 -276 125 -2 -203 44 -173 185 -35 -287 80 -83 -21 357 504 56
4340 56 178 56 56 11 198 177 -37 65 42 -24 -314 295 -80 29 216 -5 124 -63 -106 -76 164 -167 -162 -72
4364 -72 -54 125 202 -193 86 -1 80 136 109 193 -79 194 49 26 123 -74 64 -18 148 168 -292 188 -37 327
4388 327 -87 232 -72 -222 112 -65 -310 70 210 40 -73 -35 -130 317 -274 -41 -305 72 102 126 91 -88
4410 -88 -97 264 -69 -212 60 278 41 142 -156 127 79 -255 105 168 102 -27 157 -40 281 119 176 237 -21
4433 -21 -84 -163 -86 -257 -186 -47 81 -106 36 -208 -229 56 -55 -262 -141 -231 111 -141 -31 188 -239 81
4455 81 76 108 211 -144 247 -42 -152 -115 -44 179 -211 51 -80 260 -24 -413 -196 -2 155 1 -35 -10 -81
4478 -81 -172 25 36 -435 -172 -25 -293 -47 191 -23 169 12 39 128 -21 51 100 -457 -140 187 -58 241
4500 241 173 -236 -516 -281 128 -161 379 -102 -31 -31 -303 -240 69 215 -78 -81 -67 62 93 40 179 154 -3 267
4524 267 334 3 -43 183 -133 139 272 -238 -11 271 168 40 -99 28 212 123 -150 -144 -84 -196 -117 31
4546 31 -129 -110 75 86 -53 -240 -12 289 136 175 64 -240 32 -116 -241 -438 -302 -45 180 -52 254
4567 254 152 83 -177 -26 -1 90 -4 145 18 -92 -116 2 -165 168 127 186 -55 -117 39 -54 -2 -117 -7
4590 -7 82 -226 363 50 -277 32 34 71 -59 -84 183 52 -136 -119 -45 38 70 16 -388 -10 -121 35 93 -141
4614 -141 49 -295 -303 8 -325 -210 -168 390 265 70 -126 75 232 -349 -22 261 98 -235 -334 -130 125
4635 125 389 136 31 104 173 -6 -84 -76 308 232 43 30 268 58 -67 -7 131 -226 -158 23 -40 568 237
4658 237 -40 -206 -298 -338 107 254 -70 -204 37 35 80 227 175 -165 -161 106 -119 -460 -75 -281 113 -82 -121
4681 -121 -16 90 -117 95 105 -220 348 259 362 260 -242 -311 -62 -123 -110 -176 -4 35 -57 -118 -174 -26 117
4704 117 -136 117 -15 -161 -179 256 253 95 304 50 131 -172 -105 -156 157 319 -20 110 176 31 -12 -70 -296
4727 -296 52 192 -281 130 59 125 -211 -71 -75 -98 -31 145 -35 103 -54 -165 41 -126 -13 67 156 -21 188
4750 188 122 -209 -54 373 -165 -196 -174 -157 -146 -99 -78 60 329 68 -93 64 152 -157 1 -207 -42 -25 -386
4773 -386 -9 178 97 126 -135 -18 -73 68 -25 86 -333 51 -81 -331 -7 -263 389 -67 -11 93 216 -60
4795 -60 -105 143 -177 117 -114 -195 -223 4 42 260 -113 46 -42 50 63 -94 -90 349 -107 -131 86 159 177 136 157
4820 157 -67 -163 61 -12 -5 -24 89 314 101 16 -247 51 -66 -176 -85 89 -130 0 29 -91 -416 36 -13
4843 -13 -25 -60 18 151 -88 64 80 108 -35 -383 -123 -24 -105 106 -327 82 -286 -310 -46 -335 113 530 134
4866 134 -87 -133 -34 -186 27 -83 154 -216 -513 15 -122 -305 201 -93 -90 -30 34 97 79 93 -158 -110 -176 133
4890 133 -91 140 49 47 -115 -227 135 -95 -281 -110 -116 -96 -219 32 217 -13 -41 -91 182 162 96 137 -217 145
4914 145 -98 -124 -177 -116 88 210 46 -388 137 65 -212 -95 223 29 231 -15 71 -169 88 -82 22 57
4936 57 59 -202 148 155 -129 101 -211 112 -141 23 17 -78 -177 108 -193 -215 179 32 117 83 102 -52 -19 -69 -38
4961 -38 2 68 214 66 -26 -146 -137 -59 124 72 -79 231 -381 -74 27 42 220 137 25 -61 -158 0 94 171 -83
4986 -83 -152 32 21 -212 230 -223 172 -229 54 -192 168 150 469 130 32 81 -12 250 -253 -103 10 -99
5008 -99 230 -272 238 -167 -213 116 -44 -152 -121 -142 -42 -94 -222 -72 -217 227 17 154 -68 125 23 61
5030 61 -240 80 1 -64 -286 395 78 37 -67 20 -6 -259 242 -11 18 -192 -203 -160 76 18 110 185 66 -51
5054 -51 104 -216 309 128 -290 45 204 69 -201 -120 227 -52 -73 44 14 -217 -56 -221 -7 119 -32
5075 -32 -240 133 99 -44 35 -27 -283 17 -55 -131 137 -299 13 198 29 29 -269 -138 -219 102 -9 -10 3 -57
5099 -57 62 3 192 43 248 -13 -126 72 82 40 306 -17 -196 -365 -89 -242 169 7 -247 -188 -216 -187
5121 -187 59 -288 -42 -35 71 -48 -42 -73 157 -226 59 88 15 -172 52 -117 12 -224 -265 -119 -71 238 -120
5144 -120 153 -4 -150 -92 106 130 69 153 -141 311 48 260 141 5 -78 3 -241 296 -354 36 -289 -143
5166 -143 32 129 -50 -237 -104 -42 68 -204 -152 -152 206 296 -127 85 -195 29 -188 -70 178 293 329 189
5188 189 -143 -87 -168 -332 118 277 13 -222 165 28 84 147 60 -87 192 -58 79 -31 58 29 271 -351
5210 -351 -113 34 112 80 15 43 31 -7 -66 -153 -120 283 -291 133 99 166 31 199 38 78 20 214 -49 54
5234 54 163 106 -6 -248 -41 -220 82 -8 -55 -19 242 184 -104 63 352 -403 123 -118 157 -5 134 -10
5256 -10 -48 63 -207 -75 23 -211 106 26 115 -358 -166 149 33 41 -83 190 76 -365 160 -53 -69 181 115
5279 115 111 -393 131 -123 140 -21 -209 -125 189 9 -28 120 -169 166 45 -102 42 -265 -44 -40 -10 -30 -267
5302 -267 -157 -29 -133 97 -74 -150 74 80 158 184 -88 78 35 -37 228 344 98 -188 60 348 30 -28 -147
5325 -147 154 -15 -124 -25 -63 -233 -43 193 209 -30 160 -82 -162 77 214 221 115 120 -382 133 -70 -157 235
5348 235 -12 -193 -31 -125 -72 -268 -180 -89 56 -38 46 -179 -54 17 100 -39 54 95 44 384 -154 37 90 -84
5372 -84 -144 -70 -49 -14 181 167 1 -47 174 -13 -109 167 43 -208 -16 151 78 62 109 -13 -119 -136 141 -142
5396 -142 55 -256 102 6 -35 179 -98 93 -4 158 -4 57 -29 -196 -272 -57 56 130 214 -93 -17 -116 -11
5419 -11 -115 -183 -13 -74 -16 518 192 -250 -116 -74 -193 92 -225 88 -77 -36 -59 108 -13 69 134 166 -63
5442 -63 244 -115 3 214 -199 -17 -101 -176 198 -220 93 27 -60 141 -236 61 -3 546 114 189 6 -95
5464 -95 -25 241 28 -178 290 -109 29 0 211 219 -317 -118 129 96 -7 56 79 -11 -107 54 -2 -3 85 15 -67
5489 -67 60 -58 -98 -238 48 180 125 293 111 29 157 43 146 236 -1 14 48 78 55 -186 -42 -14 -175
5512 -175 -28 -36 155 -280 -41 38 -139 259 183 70 20 -255 -370 -139 -127 -5 -129 -199 -85 -65 -271 115 -262
5535 -262 158 294 -108 -325 156 -122 219 -62 290 -92 297 -22 -174 50 -72 208 -252 -178 14 -131
5555 -131 -117 -285 -167 170 -177 132 -146 139 55 23 -405 -14 45 -320 -45 -41 -43 -230 -74 78 -5 116 347
5578 347 -100 105 -168 71 248 -81 268 100 210 -263 -149 -317 330 -94 -221 242 196 -82 70 24 -145
5599 -145 173 161 100 -78 -114 -22 216 -255 135 50 -186 85 32 -44 -188 -55 -251 53 -82 75 -89 83
5621 83 -36 -111 -102 92 -68 74 -132 -75 -14 -152 201 -77 71 10 235 -74 210 -355 69 -469 -256 70
5643 70 -116 308 -40 145 -81 77 -390 -218 104 -76 204 405 11 288 -306 -18 -113 184 -59 -92 37
5664 37 118 -97 158 -40 -87 -7 181 -211 116 -170 -145 -10 -206 174 60 52 38 285 96 52 72 55 -165 -171
5688 -171 -16 200 179 91 27 185 -255 -56 91 -196 -370 -49 345 39 95 -13 123 254 205 159 -182 -39
5710 -39 25 90 55 259 -168 30 31 -44 -94 -60 -81 483 -273 79 -164 218 -140 -324 234 104 191 156 53 -264
5734 -264 191 -66 -128 -160 27 71 -73 -31 -154 -114 -70 -476 -121 321 133 69 -151 -40 -13 -271 29 300 -113
5757 -113 264 -189 -329 190 6 83 -30 91 -39 -18 382 -117 278 -125 -59 19 196 6 0 114 49 -80
5779 -80 -69 -135 54 245 83 37 13 59 219 106 163 205 127 163 206 -156 308 -7 91 78 -147 -96 -118 -215 232
5804 232 223 -365 219 -249 -142 484 -190 -161 78 115 -120 -159 -119 -90 -3 35 60 246 -50 -40 -192 86 -111 32
5828 32 104 115 44 -173 210 162 63 -6 22 -34 19 142 157 173 -4 59 37 -39 -97 -50 365 148 376 177 6 -11
5854 -11 94 -341 196 -388 152 -112 -28 -163 -78 -123 -123 30 -49 353 -169 143 323 17 55 -107 -1 109 51
5877 51 -98 -164 -93 -36 -46 169 112 -110 180 32 393 163 204 217 24 25 35 -151 -271 -10 57 -113 70 125
5901 125 144 -300 85 188 47 -164 -66 17 -164 -28 -133 -197 -303 7 114 248 -89 -6 165 193 -21 -212
5923 -212 -168 -112 -194 -25 54 -339 -115 -149 72 171 -15 -94 264 -117 -58 144 271 -6 50 153 -20 6 167
5946 167 77 3 -28 166 376 -1 -5 101 35 199 -50 151 -333 137 267 250 336 -108 -61 127 124 177 91 -218
5970 -218 58 -165 85 425 -5 194 17 107 59 -246 25 -10 -61 -60 -3 -141 123 227 130 -162 -219 287 -71
5993 -71 -273 270 -40 -39 -86 32 213 169 116 -95 -64 8 -82 159 305 -213 -96 17 120 -213 -134 154 60 98
6017 98 143 363 -64 -171 176 -150 -35 110 298 38 -121 -56 145 -4 39 145 -16 279 80 260 -30
6038 -30 194 -107 -146 -141 -187 -107 -115 193 -69 -176 -46 8 -2 -48 -123 -5 275 -8 -239 -111 -135 112 -5 247
6062 247 366 2 3 -46 23 254 168 166 -81 -145 -36 254 -54 197 -20 81 -149 -172 87 -325 64 -19 198
6085 198 -94 -101 52 68 320 52 173 -98 132 176 11 243 13 -165 -195 -196 27 299 131 -268 -75 -12 141
6108 141 181 -119 54 92 -164 181 1 18 377 -119 -345 -417 20 208 298 -28 -116 212 -114 5 -80 64
6130 64 193 87 52 -107 263 -51 222 -257 44 -16 -170 96 -11 -14 69 129 -111 -220 -170 -136 50 -137 -33
6153 -33 -27 421 -70 -31 34 -79 -78 172 318 10 98 219 283 55 318 -91 129 84 26 -114 184 -187 -190 20
6177 20 320 -237 141 62 -190 -58 -25 -99 -157 88 -3 78 -154 13 150 78 24 66 122 -181 -139 167 -94 54
6201 54 169 -215 225 196 119 -104 -112 132 -321 108 -143 153 -142 208 -2 -178 70 -103 -22 69 -64 135
6223 135 -3 -66 33 -10 -178 194 190 -65 -17 91 -4 130 115 108 -282 -389 26 49 95 130 133 149 -24 -81 -61 -298
6249 -298 119 187 0 28 -31 106 205 263 35 97 119 43 191 103 311 313 1 119 -18 -196 -74 191 -16 -104
6273 -104 29 -69 37 7 79 -61 154 283 -196 -3 -19 5 -423 -27 97 141 -33 301 -221 8 -125 -331
6295 -331 126 187 -80 -238 66 -187 137 -174 81 -236 90 -39 -265 73 -77 -32 258 123 -13 181 -166
6316 -166 -215 76 -42 -55 31 -100 -85 93 -78 -72 197 -82 -57 226 20 -74 -309 -40 48 186 57 136 172 80
6340 80 194 227 -290 -244 229 40 -75 10 -26 154 -239 -285 178 32 -5 -136 -10 -3 -76 -121 -132 -7 -142 -56
6364 -56 -173 -99 0 -41 -52 -136 -381 199 146 8 125 111 -242 -213 -5 -81 -274 64 -80 70 -96 59 236
6387 236 143 -366 443 -79 15 167 -104 16 77 413 -88 208 134 125 -12 119 145 -183 -94 127 73 -47 120
6410 120 -439 -261 -123 -161 85 41 -111 133 381 -7 267 -161 -36 -212 -124 -220 -127 -130 -51 -55 179 84 -122 -326
6434 -326 -248 -148 273 111 -165 98 308 -120 -368 31 -19 253 -117 -1 -26 57 -153 74 -20 119 17 -146
6456 -146 27 -117 -183 382 -180 44 -131 14 60 90 -304 249 -102 -225 390 249 -24 77 296 -242 93
6477 93 -68 -3 60 326 197 -91 219 129 64 -264 168 -333 241 -237 30 -248 -50 23 129 90 223 246 198
6500 198 -93 -80 7 45 248 -126 -24 -292 217 146 118 -123 -413 275 151 337 231 -35 -23 208 -41 -8
6522 -8 61 314 -41 180 190 6 1 -211 -390 101 118 -126 -177 -155 182 -61 -67 380 16 76 -134 204 -206 368
6546 368 -16 -148 -148 -54 -155 -118 -19 -62 -208 -114 -28 -185 15 -400 18 -74 -160 154 155 101 -264 -332 127 -62 -129
6571 -129 48 -81 -39 147 50 272 195 40 -1 -144 285 -89 -194 -257 -158 41 -300 226 -235 32 279 381
6593 381 -139 20 -213 71 75 168 116 65 112 167 103 -242 22 463 244 60 -24 -319 31 -142 -71 -45 118 -63
6617 -63 154 -65 -25 -328 81 -200 -88 -152 35 19 201 240 110 3 -54 -386 223 230 -299 -491 -237 -12 -23
6640 -23 -100 -148 126 -424 256 -52 -8 -345 105 145 9 -106 133 -105 -126 -1 127 191 -307 -69 -93 -74 -179
6663 -179 -357 22 -217 -235 217 -61 4 63 348 223 63 -169 49 -129 -104 248 191 -299 -206 173 -299 99
6685 99 81 65 96 88 202 125 -10 96 -124 19 181 74 29 -112 191 85 -28 -104 -148 -141 265 377 -253 -192
6709 -192 -181 162 -388 -15 46 -184 144 -45 -198 -184 8 -14 30 -37 -48 75 -65 -67 93 250 -118 -190 -382
6732 -382 -356 96 149 83 -68 18 -63 147 114 200 12 -259 -119 58 -128 226 145 -300 -55 -137 20 221 232
6755 232 -171 59 -107 99 249 126 71 -235 12 -21 -96 -79 189 -107 -67 5 126 75 150 235 463 151 -224
6778 -224 69 51 38 -170 78 187 -49 -63 304 165 60 12 58 -76 169 148 312 172 256 199 -21 -144 -2
6801 -2 222 181 -239 15 -96 396 -148 -146 -47 -207 -19 -313 211 -102 -18 -38 47 -55 72 108 129 -210 283 -186
6825 -186 7 318 -55 -14 204 415 106 -144 123 -111 77 -184 -19 -194 -65 59 -255 -48 -5 -24 14
6846 14 4 -81 66 19 152 132 108 51 173 -14 -62 167 -19 -118 -231 478 37 -53 -110 -142 277 64 -109 11
6870 11 -217 114 27 183 52 -6 60 51 11 -251 -136 -39 3 -146 -255 173 -56 185 88 207 83 44 103 18
6894 18 322 -161 -61 217 -128 -211 -241 145 15 -72 -176 -150 -66 -99 -124 -64 -14 11 143 55 -69 -110 -178 -266 60
6919 60 -70 -18 -138 -205 27 65 306 -25 96 -158 98 64 -258 113 -10 -90 235 470 -157 -40 -170 347
6941 347 103 133 118 -207 69 -8 -242 -2 126 -284 212 115 289 -73 64 51 102 118 16 -104 -96 108 -72
6964 -72 -263 91 181 -179 -82 97 182 95 -52 319 32 39 149 88 -34 -448 -129 165 -76 85 -184 -48 120
6987 120 -117 -89 67 -173 53 -13 -38 -141 -174 -128 -24 -164 -27 11 32 294 8 70 4 61 -38 226 124 -63
7011 -63 78 46 -3 38 86 127 0 4 36 13 20 -154 61 192 8 -110 -146 -163 287 49 -45 -24 -440 -66 94
7036 94 -69 29 174 150 -14 -192 -155 90 3 -124 -46 230 3 104 -86 183 -24 76 -87 66 60 115 -122
7059 -122 -241 -254 -67 -12 107 26 170 213 -157 2 49 176 7 -143 -18 226 -49 -44 263 44 120 100 39
7082 39 -273 248 -47 213 99 -168 89 -173 -256 -20 -27 63 5 -28 -286 3 -120 -6 -40 -36 168 171 5 5 -238
7107 -238 66 93 -137 -167 -42 -188 -121 -89 -215 206 59 -306 133 -97 -229 -109 51 -44 52 31 16 26 5
7130 5 -129 -14 55 -26 17 80 -316 79 107 -145 -169 56 -58 148 189 -254 -72 129 -262 -136 322 -66 199
7153 199 198 92 34 52 -167 -129 -181 33 -90 -156 -146 109 -311 -184 177 -118 -93 177 74 78 19 49 3 -159 61
7178 61 208 0 -216 3 7 34 8 -29 -48 146 145 85 -251 123 -97 4 2 112 -38 -30 121 74 -65 107 281
7203 281 -59 25 -21 305 68 -173 -177 72 27 -289 146 188 155 -180 -239 168 177 104 31 72 63 -15 8 -256 149 -41
7229 -41 -103 -157 -45 49 -121 -172 -151 183 162 -187 122 113 81 -342 168 -309 -54 -49 43 -152 -183 -37 36 100 -90
7254 -90 128 18 -176 -276 251 -73 -166 2 -309 -156 -313 11 -44 -34 -216 260 56 219 -68 -245 -92
7275 -92 -6 -41 -159 89 26 -156 91 -81 126 -42 -30 41 171 19 267 -230 -18 86 -98 -161 43 94 -84
7298 -84 105 -15 142 151 -39 -65 22 96 13 90 -202 173 -88 207 247 -86 -22 72 263 -4 -121 -180 114 -64
7322 -64 101 -71 70 149 -170 -68 158 -92 164 -189 70 181 -337 -312 -126 181 -183 -27 -25 73 -57 -113
7344 -113 -101 -263 -119 23 -383 -226 49 182 175 72 -220 -35 -187 -135 -17 -158 -161 -90 -81 167 65 229 200
7367 200 137 138 324 -109 -66 -47 -140 186 50 155 -45 189 135 175 70 -163 291 -48 -69 35 571 74 -135
7390 -135 93 100 -66 36 -100 179 -21 -43 220 -9 199 23 221 137 -85 -450 -105 372 -130 58 128 -43
7412 -43 14 32 128 -55 240 53 276 -33 24 44 -229 90 97 -80 192 6 34 191 65 -180 35 287 63
7435 63 -217 163 68 -18 -188 -176 64 109 58 -353 16 -77 -15 -63 -58 65 34 295 102 -59 -175 -124 54 -174
7459 -174 87 125 -164 -81 -260 70 148 -33 123 30 -88 -95 192 133 54 -65 79 -149 -262 75 18 166 155
7482 155 90 -88 2 59 -95 101 -2 -109 178 -212 -361 -156 -35 -15 34 195 72 124 126 85 61 -67 -9 133
7506 133 148 -6 40 8 288 83 -233 143 -5 13 -170 -102 62 -83 121 -57 359 76 -60 -259 -146 125
7528 125 -182 -43 125 351 -33 190 -247 46 -143 -346 173 200 -47 28 -140 131 -64 52 -94 -30 20
7549 20 -103 -104 111 -82 287 88 38 -48 39 141 -221 -240 -419 218 -127 -211 -45 -211 -299 -165 83 -112 92
7572 92 34 263 249 273 -176 -192 79 -38 -29 73 100 124 239 192 286 133 -34 -52 -142 54 192 118 -81 304 -4
7597 -4 402 -111 111 111 -90 -37 -139 -73 222 -69 104 40 187 20 26 -132 206 284 -11 85 121 104 194 82 -78
7622 -78 70 -95 -179 -193 -192 -214 -139 31 23 69 -79 81 -193 -196 -40 7 -52 -234 65 -203 -291 4 -95 -55 -373 307
7648 307 195 4 -376 -12 39 -20 -158 100 73 9 111 8 -146 -127 96 100 53 -91 75 -116 18 102 -17
7671 -17 -65 -50 -46 -102 94 111 105 159 -33 84 -19 -9 -66 143 170 -187 171 208 154 129 -157 52 -103 81 32 146
7697 146 -63 130 -19 287 168 149 -169 40 -228 -117 325 -85 -125 123 -121 -45 -44 93 -200 163 -10 -82
7719 -82 -60 -267 67 17 197 -199 -26 -62 -145 -48 -166 63 -74 157 -8 -57 31 40 217 63 -18 -69 54 -307
7743 -307 45 -199 -320 155 -46 245 -79 92 -70 60 -52 -310 68 -143 -254 -67 107 70 -96 -199
7763 -199 -166 53 -94 -283 141 -126 -198 -272 167 196 243 91 98 12 -165 77 -87 -61 -125 243 -68 -98 -63 58
7787 58 -49 -182 -31 -48 -4 -6 279 72 165 15 41 181 23 -21 -4 134 -266 -17 213 86 39 158 55
7810 55 19 174 117 -96 269 77 -13 -81 -307 162 240 338 -10 38 -257 -10 0 117 -59 147 -138 -226 34
7833 34 -16 130 126 -121 111 -10 118 173 -291 -79 144 35 -4 -204 -339 -190 191 335 -300 -88 -28 144
7855 144 -7 70 349 273 -94 -12 25 60 -209 -353 40 73 -106 -160 -88 -100 243 297 190 128 129 150 -48 123 -41
7880 -41 124 -167 105 188 -144 -92 69 51 233 463 76 -460 66 26 -237 -16 -170 -2 -228 25 -77 18
7902 18 64 -248 -137 47 39 -62 -91 -64 82 75 -52 -49 -132 162 87 65 -195 -40 -61 104 81 6 -57 145 100 -120
7928 -120 132 -138 -171 261 60 -251 -44 60 495 190 186 22 87 48 133 -209 -37 -64 118 -130 -374 110
7950 110 198 138 -122 -219 -81 50 180 303 247 -56 -67 -6 -187 -253 -18 -107 -280 -360 -44 -41 -31 233 -135 75
7974 75 61 166 109 -49 -499 27 216 129 331 -350 5 -34 -138 -220 84 194 13 298 -6 21 49 -189 -24
7997 -24 -56 261 -7 10 89 -169 122 166 140 217 82 -196 168 -135 17 -192 77 -114 16 55 142 362 184
8020 184 108 112 50 -35 53 139 -137 -303 143 -214 -237 50 -91 53 171 -29 -7 -122 -370 65 94 -102 62
8043 62 -1 -281 22 -125 72 306 5 38 -57 -63 -10 39 50 -249 383 -49 90 108 232 -228 -281 -76 -194 110
8067 110 103 290 21 -225 -1 -146 7 290 119 21 -181 212 -249 -104 -180 98 -25 177 -161 -9 294
8088 294 -57 -2 -182 3 -200 -55 48 -14 -161 -95 110 147 287 -9 -89 -199 -142 16 2 189 -84 41
8110 41 25 100 331 -39 -10 230 52 8 -113 -161 164 -222 124 102 103 -340 139 -266 -16 -201 -187 27 -10 -26
8134 -26 163 6 -248 155 130 209 -75 -106 -192 -45 -137 214 -59 -21 67 62 -14 39 192 -66 -245 -339 62 145 -256
8159 -256 26 -106 -6 430 83 192 -383 -264 -122 80 110 189 267 238 -105 -74 51 190 -239 -132 -33 -312
8181 -312 318 282 158 -94 28 174 -6 -65 163 -337
8191c37
##END NTUPLES=NMR FID
##END=
