##TITLE=1H_LR-691-H1-C2
 CDCl3
 8 sc, 
 11.9.2024
##JCAMPDX= 6.0         $$ Bruker NMR JCAMP-DX V2.0
##DATA TYPE= NMR FID
##DATA CLASS= NTUPLES
##ORIGIN= UXNMR, Bruker Analytische Messtechnik GmbH
##OWNER= root
$$ XWIN-NMR		Version 3.5
$$ Wed Sep 11 13:50:04 2024 Russian Standard Time (UT+4h)  she@DPX200
##.OBSERVE FREQUENCY= 200.1318
##.OBSERVE NUCLEUS= ^1H
##.DELAY= (6, 6)
##.ACQUISITION MODE= SIMULTANEOUS
##.ACQUISITION SCHEME= undefined
##.AVERAGES= 8
##.DIGITISER RES= 18
##SPECTROMETER/DATA SYSTEM= spect
##.PULSE SEQUENCE= zg30
##.SOLVENT NAME= CDCl3
##.SHIFT REFERENCE= (INTERNAL, CDCl3, 0, 15.7039)
##AUDIT TRAIL= $$ (NUMBER, WHEN, WHO, WHERE, WHAT)
$$ ##TITLE= Audit trail, XWIN-NMR		Version 3.5
$$ ##JCAMPDX= 5.01
$$ ##ORIGIN= Bruker BioSpin GmbH
$$ ##OWNER= she
$$ F:/spectra/data/she/nmr/H-F/1/audita.txt
$$ ##AUDIT TRAIL=  $$ (NUMBER, WHEN, WHO, WHERE, WHAT)
(   1,<2024-09-11 13:48:45.48 +0400>,<she>,<DPX200>,
      <created by zg, POWCHK disabled, PULCHK disabled
       configuration hash MD5:
       00 E9 B6 7A A2 85 ED C7 34 08 36 98 17 FE 4E 26
       data hash MD5: 16K
       1C 90 1C 21 32 CA C5 FE 5F 21 CF B9 19 D2 E3 30>)
$$ ##END=
$$ 
$$ hash MD5
$$ B9 A5 77 EC 40 14 1F 82 CD 74 F0 53 C4 42 92 AC
##$RELAX= 
##$RELAX= 
##$RELAX= 
##$RELAX= 
##$RELAX= 
##$RELAX= 
$$ Bruker specific parameters
$$ --------------------------
##$DU= <F:/spectra>
##$EXPNO= 1
##$NAME= <H-F>
##$PROCNO= 1
##$TYPE= <nmr>
##$USER= <she>
##$AMP= (0..31)
100 100 100 100 100 100 100 100 100 100 100 100 100 100 100 100 100 100 
100 100 100 100 100 100 100 100 100 100 100 100 100 100 
##$AQSEQ= 0
##$AQ_mod= 1
##$AUNM= <au_zg>
##$AUTOPOS= <>
##$BF1= 200.13
##$BF2= 200.13
##$BF3= 200.13
##$BF4= 200.13
##$BF5= 200.13
##$BF6= 200.13
##$BF7= 200.13
##$BF8= 200.13
##$BYTORDA= 1
##$CFDGTYP= 0
##$CFRGTYP= 5
##$CHEMSTR= <none>
##$CNST= (0..31)
1 1 145 1 1 1 1 1 1 1 1 1 1 1 1 1 1 1 1 1 1 1 1 1 1 1 1 1 1 1 1 1 
##$CPDPRG= <>
##$CPDPRG1= <>
##$CPDPRG2= <>
##$CPDPRG3= <>
##$CPDPRG4= <mlev>
##$CPDPRG5= <mlev>
##$CPDPRG6= <mlev>
##$CPDPRG7= <mlev>
##$CPDPRG8= <mlev>
##$CPDPRGB= <>
##$CPDPRGT= <>
##$D= (0..31)
0 1.2 0 0 0 0 0 0 0 0.06 0 0.03 0 0 0 0 0.0002 0 0 0 0 0 0 0 0 0 0 0 0 
0 0 0 
##$DATE= 1726048124
##$DBL= (0..7)
120 120 120 120 120 120 120 120 
##$DBP= (0..7)
150 150 150 150 150 150 150 150 
##$DBP07= 0
##$DBPNAM0= <>
##$DBPNAM1= <>
##$DBPNAM2= <>
##$DBPNAM3= <>
##$DBPNAM4= <>
##$DBPNAM5= <>
##$DBPNAM6= <>
##$DBPNAM7= <>
##$DBPOAL= (0..7)
0.5 0.5 0.5 0.5 0.5 0.5 0.5 0.5 
##$DBPOFFS= (0..7)
0 0 0 0 0 0 0 0 
##$DE= 6
##$DECBNUC= <off>
##$DECIM= 24
##$DECNUC= <off>
##$DECSTAT= 4
##$DIGMOD= 1
##$DIGTYP= 9
##$DL= (0..7)
0 120 120 120 120 120 120 120 
##$DP= (0..7)
150 150 150 150 150 150 150 150 
##$DP07= 0
##$DPNAME0= <>
##$DPNAME1= <>
##$DPNAME2= <>
##$DPNAME3= <>
##$DPNAME4= <>
##$DPNAME5= <>
##$DPNAME6= <>
##$DPNAME7= <>
##$DPOAL= (0..7)
0.5 0.5 0.5 0.5 0.5 0.5 0.5 0.5 
##$DPOFFS= (0..7)
0 0 0 0 0 0 0 0 
##$DQDMODE= 0
##$DR= 18
##$DS= 0
##$DSLIST= <SSSSSSSSSSSSSSS>
$$ [...]
##$SUBNAM2= <"">
##$SUBNAM3= <"">
##$SUBNAM4= <"">
##$SUBNAM5= <"">
##$SUBNAM6= <"">
##$SUBNAM7= <"">
##$SUBNAM8= <"">
##$SUBNAM9= <"">
##$SW= 24.0689170037331
##$SWIBOX= (0..15)
0 0 2 0 0 0 0 0 0 0 0 0 0 0 0 0 
##$SW_h= 4816.95568400771
##$TD= 16384
##$TD0= 1
##$TE= 0
##$TE2= 300
##$TE3= 300
##$TEG= 300
##$TL= (0..7)
0 120 120 120 120 120 120 120 
##$TP= (0..7)
150 150 150 150 150 150 150 150 
##$TP07= 0
##$TPNAME0= <>
##$TPNAME1= <>
##$TPNAME2= <>
##$TPNAME3= <>
##$TPNAME4= <>
##$TPNAME5= <>
##$TPNAME6= <>
##$TPNAME7= <>
##$TPOAL= (0..7)
0.5 0.5 0.5 0.5 0.5 0.5 0.5 0.5 
##$TPOFFS= (0..7)
0 0 0 0 0 0 0 0 
##$TUNHIN= 0
##$TUNHOUT= 0
##$TUNXOUT= 0
##$USERA1= <user>
##$USERA2= <user>
##$USERA3= <user>
##$USERA4= <user>
##$USERA5= <user>
##$V9= 5
##$VALIST= <valist>
##$VCLIST= <CCCCCCCCCCCCCCC>
##$VD= 0
##$VDLIST= <DDDDDDDDDDDDDDD>
##$VPLIST= <PPPPPPPPPPPPPPP>
##$VTLIST= <TTTTTTTTTTTTTTT>
##$WBST= 1024
##$WBSW= 4
##$XGAIN= (0..3)
0 0 0 0 
##$XL= 0
##$YL= 0
##$YMAX_a= 72142
##$YMIN_a= -51471
##$ZGOPTNS= <>
##$ZL1= 120
##$ZL2= 120
##$ZL3= 120
##$ZL4= 120
##$ABSF1= 10
##$ABSF2= 0
##$ABSG= 5
##$ABSL= 3
##$ALPHA= 0
##$AQORDER= 0
##$ASSFAC= 0
##$ASSFACI= 0
##$ASSFACX= 0
##$ASSWID= 0
##$AUNMP= <proc_1d>
##$AZFE= 0.1
##$AZFW= 0.1
##$BCFW= 1
##$BC_mod= 2
##$BYTORDP= 1
##$COROFFS= 0
##$CY= 11.3945322036743
##$DATMOD= 1
##$DC= 2
##$DFILT= <>
##$DTYPP= 0
##$F1P= 15.6554695791079
##$F2P= 12.8336369535428
##$FCOR= 0.5
##$FTSIZE= 0
##$FT_mod= 4
##$GAMMA= 1
##$GB= 0.15
##$INTBC= 1
##$INTSCL= 1
##$ISEN= 128
##$LB= 0.24
##$LEV0= 0
##$LPBIN= 0
##$MAXI= 10000
##$MC2= 0
##$MEAN= 0
##$ME_mod= 0
##$MI= 1.114404
##$NCOEF= 0
##$NC_proc= 0
##$NLEV= 6
##$NOISF1= 3.799351
##$NOISF2= 2.8
##$NSP= 1
##$NTH_PI= 0
##$NZP= 0
##$OFFSET= 15.70392
##$PC= 1
##$PHC0= -26002.21
##$PHC1= 20.38748
##$PH_mod= 1
##$PKNL= yes
##$PPARMOD= 0
##$PSCAL= 0
##$PSIGN= 0
##$REVERSE= no
##$SF= 200.130013532006
##$SI= 16384
##$SIGF1= 3
##$SIGF2= 2
##$SINO= 400
##$SIOLD= 16384
##$SREGLST= <1H.CDCl3>
##$SSB= 0
##$STSI= 0
##$STSR= 0
##$SW_p= 3612.71676300578
##$SYMM= 0
##$S_DEV= 0
##$TDeff= 0
##$TDoff= 0
##$TI= <>
##$TILT= no
##$TM1= 0
##$TM2= 0
##$TOPLEV= 0
##$USERP1= <user>
##$USERP2= <user>
##$USERP3= <user>
##$USERP4= <user>
##$USERP5= <user>
##$WDW= 1
##$XDIM= 8192
##$YMAX_p= 0
##$YMIN_p= 0
$$ End of Bruker specific parameters
$$ ---------------------------------
##NTUPLES= NMR FID
##VAR_NAME=  TIME,          FID/REAL,        FID/IMAG
##SYMBOL=    X,             R,               I
##VAR_TYPE=  INDEPENDENT,   DEPENDENT,       DEPENDENT
##VAR_FORM=  AFFN,          ASDF,            ASDF
##VAR_DIM=   8192,          8192,            8192
##UNITS=     SECONDS,       ARBITRARY UNITS, ARBITRARY UNITS
##FACTOR=    0.0002076,     1,               1
##FIRST=     0,             0,               0
##LAST=      1.7004516,     0,               0
##MIN=       0,             -51471,          0
##MAX=       1.7004516,     72142,           0
$$ Real data points
##PAGE= N=1
##DATA TABLE= (X++(R..R)), XYDATA
0 0 0 0 0 0 0 0 0 0 0 0 0 1 -7 8 -8 8 -8 12 -16 16 -20 24 -26 32 -37 42 -48 55 -62 70 -78 90 -101 112 -127
35 -127 142 -157 173 -193 214 -237 263 -291 322 -356 394 -439 488 -544 608 -683 771 -876 1006
54 1006 -1171 1387 -1682 2118 -2826 4235 -16749 64783 34211 -37487 43016 43772 -32660 -7819
68 -7819 43745 -7191 -31790 770 -8021 -35758 -9762 10694 1739 2946 15618 14768 10900 11899
82 11899 10948 -4905 -15553 -9367 -6607 -14157 -11741 -3770 -2735 -2186 12330 21559 10137 4953 11092
97 11092 462 -10391 -2779 -3489 -15892 -13488 -4736 -7188 -3244 15847 15133 -1386 7283 18472
111 18472 -1199 -7553 9870 -4905 -28535 -6578 8620 -16224 -8806 21378 3019 -10546
123 -10546 19223 16866 -6692 5370 7604 -16079 -10067 2920 -8661 -8878 2527 -2529 -2947 10748
137 10748 8895 3024 7773 1765 -3755 2707 -3329 -9038 -386 -3733 -11978 394 8582 -1731
151 -1731 403 12199 3313 -5108 7390 6856 -7446 -4150 372 -7476 -4990 1131 -933 -657 2590
166 2590 2082 2610 6163 3425 -939 1300 308 -6398 -2674 1807 -3561 -5873 1286 2644 -2436 1711
182 1711 8913 786 -5122 5882 4074 -7443 -187 4234 -7771 -5506 4384 -599 -3446 4011
196 4011 3422 -1650 2239 3819 -592 1190 -168 -4562 18 347 -4806 734 2676 -3707 133 5233
212 5233 -22 -531 4605 -6 -4084 1997 945 -5051 761 2221 -5517 -439 5384 -2196 -1127
227 -1127 5316 123 -3548 2847 2635 -3854 -474 2433 -3073 -2189 2684 21 -1945 1046 766 -869
243 -869 -146 1631 1058 -1747 111 1945 -1264 -1160 1966 -33 -2438 -173 1242 -1078 -575 1569
259 1569 250 -1041 587 1198 591 -243 -538 990 -322 -2687 1166 1711 -3598 -1028 3057 -1437
275 -1437 -2110 4053 2261 -3274 1112 3803 -3098 -2488 2945 -1941 -3895 1505 446 -1687 1554 1630
291 1630 -86 1206 1183 -187 835 401 -2776 -1192 631 -2434 -1023 2029 -714 -664 2680 1067
307 1067 416 1730 367 -967 -485 -796 -1612 -1089 -447 -1594 -238 1736 893 1554 2442 956 -185
324 -185 691 -341 -1216 -1707 -1161 -1131 -1854 -212 1932 752 323 2788 1206 -212 853 1199 -2158 -2433
342 -2433 89 -1512 -2578 1099 566 -705 2002 1784 653 2350 836 -970 -456 -1072 -2001 -1087 292
359 292 -1827 -375 1757 -104 92 3565 952 -1363 1991 18 -2833 -596 -75 -2227 -1735 797
375 797 402 8 1585 1883 697 1205 28 -249 819 -1800 -2223 -271 -1143 -1491 1112 1165 297 734
393 734 1611 1042 324 148 -29 -1379 -1766 -833 -361 -359 -763 902 944 -186 1588 1963 -414 -95 605 -1452
413 -1452 -1432 -228 -696 -587 -315 -214 770 1278 655 -116 1589 137 -1952 651 610 -2363 -581 922
431 922 -1149 -710 1947 1025 -169 1067 940 -573 -119 29 -922 -680 -452 -1010 523 383 -317 1247
449 1247 451 -392 929 692 -883 -279 501 -973 -1344 49 375 -622 639 1039 355 349 210 99 251
468 251 -847 -710 226 -717 -1010 362 395 -133 778 1043 448 263 351 -234 -809 -497 -641 -630 164 -757 249
489 249 1737 -404 178 1851 -146 -892 913 482 -1726 -896 720 -1006 -621 1100 769 198 513
506 513 1071 636 4 -812 244 10 -1808 -641 617 -764 -626 1242 894 26 719 906 -657 -323
524 -323 306 -1079 -834 -213 -553 -170 181 -1 964 844 197 628 699 -465 -492 -294 -599 -754 -338 200
544 200 -546 493 1158 211 694 659 -83 640 -465 -967 132 -554 -1160 -26 342 -497 177 1534 702
563 702 -360 889 818 -1077 -490 -278 -1148 -595 -368 -466 407 -90 474 1197 277 67 692 452 -1099 -549
583 -549 291 -1139 -1084 605 -207 -607 1021 759 -99 646 612 226 -247 -642 -425 -434 -1121 -609 266 175 -136
604 -136 861 1033 -168 367 1099 -159 -886 -71 -636 -737 -794 -190 269 322 -45 704 1164 68 -48 506
624 506 619 -1354 -614 553 -1374 -894 653 -96 54 894 970 571 611 76 136 -341 -996 -837 -60 -718
644 -718 -875 718 712 -456 1465 1102 -234 478 546 -552 -854 -543 -711 -628 -419 -187 755 497 709 615
664 615 1123 325 -118 564 -527 -1445 -362 -576 -1211 200 536 211 765 823 821 344 370 -39 -506 -781 -814
685 -814 -831 -310 -624 -182 1005 418 418 1588 537 -239 238 -105 -1050 -875 -410 -432 -409 288 588 969 931
706 931 449 899 679 -746 -596 -47 -1690 -978 285 -814 -657 619 839 341 1080 1202 569 -269 -182
725 -182 -688 -615 -1174 -1040 13 454 -28 1155 1532 -14 342 1028 -230 -726 -505 -697 -997 -790 -232
744 -232 124 323 563 1200 621 465 315 865 -452 -1544 -384 -262 -1320 -207 535 412 440 934 1057
763 1057 223 276 168 -399 -730 -958 -615 -367 -716 -567 961 507 77 1449 872 -64 -42 374 -780 -935
783 -935 -554 -252 -644 -75 560 491 867 784 753 804 -189 -350 -183 -1111 -1011 -186 -508 -552 413 980 250 630
805 630 667 570 -372 179 -405 -879 -897 -501 -466 -36 -207 800 953 116 692 349 205 -477 -95 -66 -778 -488
827 -488 93 -286 -50 1064 804 302 338 -51 38 10 -744 -347 -437 -953 -493 52 -122 49 491 612 -19
848 -19 517 528 -202 -530 -16 -493 -544 -470 -516 488 86 -79 917 896 -30 145 646 -394 -902 -193 -202 -1017
870 -1017 -143 242 -189 471 535 465 565 182 -306 337 -431 -808 -465 147 -588 -67 446 37 -68 756 498
891 498 -226 516 451 -481 -412 -192 -384 -305 -194 26 315 125 -46 648 431 134 -10 81 -943 -793 74
912 74 -271 -570 154 86 -42 424 514 263 78 -163 -72 -47 -365 -89 -164 -378 -585 185 922 17 552 1029
934 1029 190 -383 365 -176 -444 -326 -453 -337 -183 -90 406 171 234 57 104 154 -264 -159 214 -937 -367
955 -367 238 -470 23 582 399 -172 292 574 382 -192 -95 -26 -401 -706 -254 22 -287 -23 439 615 -296
976 -296 651 509 -464 -328 -80 -378 -548 -119 -230 -267 -165 377 631 263 345 58 238 -280 -639 272 -358
997 -358 -520 -143 1 -188 168 484 580 268 192 329 -300 -253 -100 -223 -101 -641 -401 338 -141 -13 986
1018 986 310 -52 327 416 -91 -315 -215 -497 -624 14 23 -199 16 413 426 435 185 -84 235 -397 -596 -211
1040 -211 -639 -558 164 90 145 212 758 253 -83 331 -10 -249 -346 -303 -425 -10 -263 113 511 112 510 893
1062 893 -219 110 586 -228 -619 -427 68 -327 -313 102 -5 153 570 732 603 25 -259 -16 -225 -792
1082 -792 -176 -146 -611 -368 134 50 280 414 252 65 3 49 -245 -333 -227 -793 -181 -404 27 402 342 263
1104 263 899 224 -195 -311 -243 -63 -527 -111 -248 -62 240 138 359 315 130 241 158 -405 -452 166 -639
1125 -639 -223 47 166 139 48 645 246 168 430 230 -466 -113 96 60 -316 -523 -136 131 -342 257 431
1146 431 442 356 -71 -53 -197 -341 -189 -439 -662 155 -193 42 449 328 544 112 198 354 -200 -453 -287
1167 -287 -241 -260 -264 -118 375 -284 336 573 81 38 369 -96 -505 -546 -610 -360 -442 -28 379 479 220 355 666
1190 666 674 -175 275 72 -560 -184 -185 -404 -249 -40 178 121 381 2 469 -2 -220 97 -257 -344 -147 10
1212 10 -317 -211 272 435 311 324 286 -81 -83 -116 -291 -268 -285 -78 162 -196 613 373 187 128 253 456 -220
1235 -220 -545 -20 -279 -918 -116 -247 -196 214 172 313 67 427 7 57 -52 64 -98 -297 -359 -238 201
1256 201 -216 -253 683 192 156 329 99 191 302 -294 -209 -317 -350 -232 -408 133 348 526 266 -13 365 461
1278 461 -381 -172 -51 -373 -251 -156 -206 -127 295 180 419 414 136 316 74 -318 -34 -15 -325 -497 230 192
1300 192 38 189 519 544 167 241 -68 220 -298 -161 -104 -770 216 -21 -49 156 620 263 -39 18 464 -172
1322 -172 -310 -18 -432 -88 -36 331 -140 104 4 488 508 -45 261 251 -14 -348 -134 -294 -451 -40 101
1343 101 167 408 589 424 235 -7 264 -103 -165 -359 -256 -409 -391 -117 -44 -60 237 39 237 44 -74 -151
1365 -151 -367 -254 176 -282 -80 47 193 305 304 423 408 316 -60 -16 -292 -384 -446 -271 -205 -388 49 375 255
1388 255 233 128 254 7 -488 -76 -456 -492 -24 50 -219 189 20 242 126 46 365 8 -307 -294 -222 -573
1410 -573 -233 -96 174 -205 163 399 223 276 284 6 -57 -138 -108 -154 -399 -162 -79 -68 16 577 209 206 124 -115
1434 -115 -236 -199 -471 -466 -658 -25 207 -63 -14 515 270 307 -3 5 218 -132 -405 162 -662 -492 -63 297
1456 297 297 -205 468 366 -56 356 87 -445 -18 -604 -248 -393 -695 54 33 -176 369 562 338 284 52
1477 52 211 -297 -324 -115 -538 -474 -138 187 224 111 126 546 235 -79 -126 -102 -454 -492 138 -232 -145 41 366
1500 366 157 171 490 -29 201 210 -143 -184 -302 -332 -80 -180 280 97 276 453 212 235 -165 -27 93 68
1522 68 -550 -469 -155 -142 87 -55 -56 368 -22 195 41 -49 -197 -100 -177 -313 -314 -3 -27 -193 128 321 -175 469
1546 469 249 173 -140 -143 -299 -111 -351 -116 -165 -282 46 222 429 142 206 -25 -222 92 -196 -151 -526 -182
1568 -182 -16 -36 179 295 121 224 80 70 -212 -21 -185 -188 -27 -507 -75 624 -67 284 172 342 170
1589 170 -66 -41 -156 -20 -160 -18 -312 -76 38 44 52 422 319 -79 -275 202 70 -160 -92 -24 -191 -252 -92
1612 -92 97 367 65 563 220 -86 287 -39 124 46 -318 82 -17 21 198 326 -161 329 378 147 242 -173
1634 -173 -34 -459 -272 -334 -16 -255 100 465 96 -30 15 284 -133 -57 67 -252 -498 -41 -237 -314 115
1655 115 76 -149 107 392 206 -178 32 -121 22 -17 -253 -183 -26 -30 -187 296 89 -4 46 -6 114 -174 -160
1678 -160 -131 -32 -226 -29 -429 -103 89 275 82 187 92 125 -92 12 190 -439 -319 117 -4 176 252 148
1700 148 192 226 340 -7 -69 -522 -164 -183 -298 -372 -169 230 -151 46 12 327 183 230 -53 120 -260 16
1722 16 -373 -84 77 -529 -100 137 -54 56 549 -134 162 2 -337 44 -45 -491 -58 198 406 37 -168
1743 -168 177 312 -162 46 389 -213 -279 -146 -225 -141 40 134 -47 176 46 239 228 -31 324 -91 -117 -325
1765 -325 -469 45 186 -501 118 354 136 236 -42 207 -178 -126 -68 -472 60 -116 -43 -20 -115 180 276 219
1787 219 429 18 -12 -343 41 -45 -277 -80 -297 -227 231 210 361 -105 29 40 -140 -191 -1 -124 -433 -146
1809 -146 -253 -280 1 68 280 90 135 258 202 -47 257 -157 20 -165 97 -21 -152 286 168 440 180
1830 180 129 62 -137 -162 -168 -86 -148 -216 347 424 -198 222 524 204 -119 359 -1 -240 -13 -109 -476 -88 11 -30
1854 -30 -14 -16 46 264 139 327 15 -97 -126 -123 -327 -170 140 244 475 -361 93 164 -19 -40 -130 188 -144 -209
1878 -209 145 -193 -101 40 -53 306 70 213 404 81 43 19 -117 -365 -255 -183 -346 43 143 -9 342 393
1900 393 173 -61 212 75 33 243 -225 144 -114 -130 -61 278 153 1 273 126 -101 105 24 38 -194 151
1922 151 174 15 -6 264 175 217 -154 -18 293 -320 360 216 -271 -207 -196 -31 6 -32 31 75 91 100 22 76 153
1947 153 -514 140 -117 -141 21 80 97 81 -49 -62 261 -35 74 55 -73 -258 -194 -204 -306 -141 -320 313 -71
1970 -71 314 288 372 91 -111 -493 -48 -189 -258 67 -2 49 -141 202 252 413 267 243 150 144 113 -544 -117 -183
1994 -183 -321 -109 97 -39 198 -7 152 -70 265 278 -58 -189 259 -328 169 -177 -33 -96 -6 173 -50
2015 -50 216 145 162 -448 -231 -195 -218 -294 -139 -156 -132 -81 151 115 82 36 -319 50 77 -28 -236 76 -249 63
2039 63 169 142 60 362 274 164 77 157 -157 46 -187 -262 5 -221 144 111 -34 -7 518 317 229 -16 -176
2062 -176 -29 -148 -377 -238 84 -138 -64 257 65 253 95 -268 -79 -183 -362 -107 -218 -226 -31 -267 -19
2083 -19 93 53 258 258 189 14 -108 -326 -181 -139 31 21 56 100 111 175 93 73 429 -228 -91 -76 24 -143 319
2108 319 -19 -263 63 139 -60 216 241 238 135 68 38 -360 199 -145 74 -114 224 35 220 226 -331 -72 272
2131 272 -113 -349 -82 -214 -85 -279 -139 -178 195 70 -12 115 115 22 42 68 -293 -237 -65 -472 111 158 -201
2154 -201 545 48 86 85 138 91 -96 30 -34 61 -228 347 -4 122 -38 17 448 96 90 49 -8 99 -317 -372
2178 -372 -155 57 21 360 301 92 190 -80 127 -72 -45 -27 -154 -145 -176 22 -42 396 -163 170 17 28 91 -28
2202 -28 199 -519 -212 -345 209 54 -221 -155 -83 -227 -142 212 -57 -92 20 -4 -2 -422 85 46 -189 154 -67
2225 -67 565 23 253 351 74 16 -26 -132 -12 -390 -490 -122 -184 -44 67 -95 352 301 103 -12 310 77
2247 77 -418 -8 -14 -76 -52 -92 62 263 336 204 212 176 -176 -146 47 134 -150 -83 -44 89 -55 272 287 -172 300
2272 300 33 -95 -62 -382 -450 -145 -34 53 -238 207 -21 185 -313 2 62 -81 93 -241 239 95 -338
2293 -338 134 -70 199 -134 98 232 280 -30 93 -45 -35 -115 -359 -119 -219 84 251 -87 20 300 -54
2314 -54 87 69 119 -46 -416 -281 -288 -65 -247 210 -104 334 145 264 265 -221 -314 -221 -39 -22 23 -19 320 358
2338 358 198 -95 101 -49 288 -232 157 9 -127 -377 -160 -170 19 -30 -46 216 199 161 -215 279 -174 -36
2360 -36 -187 -501 -147 -18 -168 7 -21 -125 306 200 89 188 -38 -215 -137 -349 13 -32 -208 138 -104 -99
2382 -99 337 113 128 92 9 -31 83 -201 -196 -185 -114 -331 58 -81 25 -147 -19 -142 81 -113 65 -95 -308
2405 -308 -175 -149 -122 -293 -11 111 142 22 28 -195 30 5 -67 -142 -353 287 13 317 64 146 64 235 186 78
2429 78 33 22 -6 -288 58 22 -309 -274 292 -98 23 -50 -31 85 -56 -148 37 -177 181 -171 14 -183 168
2452 168 -47 65 -3 -70 371 -114 168 -458 -120 36 -106 -47 -199 -324 183 -93 238 41 202 146 -143
2473 -143 -73 -283 -109 -169 -85 -255 -341 18 -251 23 51 -31 -225 -176 42 17 -222 -248 27 -17 -178 -195 -130 186
2497 186 -24 312 -56 54 -308 -214 252 -31 -368 -214 -41 -108 -37 41 -145 158 -309 74 16 62 41 -70
2519 -70 96 21 161 -137 11 77 -141 463 -97 -8 180 73 151 75 -4 -222 -117 -46 -123 20 -36 -57 430 104
2543 104 -263 156 129 -199 -138 -154 128 -115 -180 -106 275 255 -242 91 64 -13 -179 87 185 -185 -147 64 -19 89
2567 89 45 93 -106 -71 96 -100 -121 28 -249 -281 265 324 -63 -70 169 28 58 264 348 97 -237 108 23 39
2591 39 269 -72 -120 328 33 72 287 314 -39 -28 -190 -52 -20 -131 -171 -16 59 -4 141 305 136 39 100 -63
2615 -63 43 112 125 283 106 29 369 -385 -7 186 -18 -18 6 -38 252 -29 -3 -176 -136 -148 -285 -160 86 -74
2639 -74 267 439 -108 186 -111 -84 -290 5 102 117 100 -205 233 252 139 189 -108 92 -186 240 -85 -33 165
2662 165 -349 122 96 238 52 -222 35 36 -85 -181 -252 220 -27 270 313 -86 195 116 228 -154 159 257 -29
2685 -29 118 -45 90 318 11 -165 235 15 -122 109 -57 300 51 68 124 -159 -21 -366 120 182 -205
2706 -205 79 -15 -242 -80 75 -64 -58 225 -269 46 244 -86 -76 -165 -430 -153 -80 182 318 -82 113 204
2728 204 111 -81 -156 0 -69 122 -260 -264 18 133 -184 251 124 231 59 -94 221 -85 117 -46 50 -293
2750 -293 120 56 -183 200 238 -14 -193 16 35 37 70 37 -110 18 22 173 74 -111 -43 244 169 31 73 -32
2774 -32 -14 -230 -333 54 -157 4 389 241 211 241 25 -150 -195 -305 76 -51 -191 -191 174 -11 -121 -96 308
2797 308 148 124 -120 -4 -243 67 -125 -420 180 36 -171 -96 86 103 291 -123 -78 -174 -86 61 101 40 -98
2820 -98 -88 -119 -17 -335 -13 137 93 -227 189 251 -377 -120 -342 139 -1 256 99 168 77 431 0 171
2842 171 113 146 -344 -191 -128 -95 82 53 -237 221 -51 -110 -21 187 214 -158 294 210 96 -45 -137 35 154
2865 154 -133 197 27 136 46 -43 178 188 -170 -137 -264 19 -63 -104 -39 0 233 408 -291 158 -23 76 23
2888 23 146 -78 -147 237 54 127 -102 71 349 225 175 -160 -197 -280 12 25 -41 -280 247 100 60 -154 284
2911 284 243 -124 116 -292 -250 -293 -129 -171 -26 -247 -81 -149 59 -65 71 183 -239 -307 158 66 -82 -65 98
2934 98 82 -14 -129 -25 7 469 -120 -128 91 -128 69 33 -269 -561 -8 -241 14 -6 -77 96 264 -21 -307
2957 -307 -172 210 -6 307 -106 -33 131 91 206 -123 33 16 88 137 164 -215 -143 26 -85 -257 127 -201
2979 -201 75 9 -253 370 -29 -164 174 -128 -37 -145 121 -1 121 194 -120 56 332 -63 -149 202 -316
3000 -316 -56 -434 -119 180 -110 136 -28 92 226 -161 545 89 -84 272 -19 95 -74 44 -66 290
3020 290 -177 -178 416 342 285 -85 -113 -23 -353 -134 -375 -318 -69 -190 -331 59 -161 -147 -218 343 42 -115 119
3043 119 -99 -57 57 -193 -115 146 293 82 160 288 -51 129 -174 -69 -251 -21 33 -41 -10 -24 -188 277
3065 277 251 37 126 -102 1 54 -81 -42 -29 -177 -120 -284 -269 -103 37 62 -30 36 220 1 -68 34 -356 -153
3089 -153 -166 141 94 -131 -145 -179 308 295 212 -22 -80 -131 -204 -322 -166 -43 -54 10 258 124 134 176 154 -213 166
3114 166 304 -61 15 -102 118 318 119 -139 166 237 157 141 -127 -20 2 -62 37 -450 -6 60 13 101 132 5
3138 5 -29 -41 -7 -137 86 66 136 -307 -37 -52 -39 18 9 59 6 14 95 55 70 -136 -176 -152 59 121 244 42 125 208
3166 208 -141 29 -85 -54 122 477 -168 -5 147 60 -78 -33 -205 187 -281 -225 151 77 458 83 160 -161
3188 -161 86 -35 121 -215 -179 -144 -179 -24 148 -252 15 59 -43 60 -80 64 -51 -193 -143 105 276 217
3210 217 -67 -146 264 -80 -257 -239 17 -265 -35 21 195 218 -385 247 -134 48 202 0 -50 -40 -375 112
3232 112 -84 181 -248 243 69 241 -7 168 33 9 98 201 14 -95 -114 179 -6 54 214 301 106 -108
3254 -108 -121 -331 -31 58 -58 32 71 107 -53 240 -42 -209 -198 -19 -106 -57 135 -263 -301 -41 73 -122 45
3277 45 69 137 -12 -103 163 1 14 -125 111 -56 20 287 -23 116 -247 83 -8 120 209 211 202 89 -191 239
3301 239 -110 -274 49 -28 -229 -17 224 256 -211 -195 193 -314 -38 -154 -63 -160 215 -110 200 -306 33 142
3323 142 108 143 -136 112 192 -166 -82 -230 269 238 -23 -143 -123 -155 97 19 -14 99 -9 -164 -331 149 -273
3346 -273 -132 230 371 -331 347 71 118 -155 238 -116 -95 -182 22 -145 -47 134 49 41 -115 100 30 -34 -54
3369 -54 -46 -101 52 -191 28 -61 -290 -34 25 217 -69 167 -7 95 -60 -187 -146 216 88 -138 87 46 -209
3392 -209 -109 126 265 -20 299 203 -67 383 -26 62 -53 -22 353 169 -53 -15 -225 -50 96 -180 -74
3413 -74 -254 99 -19 -1 -21 -13 176 -105 125 78 125 45 161 -60 175 -179 -134 -174 -27 -135 26 200 89
3436 89 -35 230 165 442 272 99 -98 320 -213 6 87 64 1 9 213 150 72 -96 190 32 121 98 -53 36
3460 36 -190 6 -115 -250 -2 237 -15 127 -243 -150 -36 73 -268 -34 83 -50 -4 169 155 -10 145
3481 145 148 -161 117 14 -120 47 -334 158 -298 -115 64 128 74 -56 166 146 -145 -8 -241 -146 -82 -216
3503 -216 -226 84 62 -269 377 72 258 140 -110 -87 -255 64 -311 -259 90 -117 10 54 150 229 28 -103
3525 -103 -78 17 -225 87 35 47 2 -113 -41 118 215 -170 125 62 97 66 -327 -102 -206 96 -30 15 360 -127
3549 -127 -261 -182 87 39 -22 55 40 -320 -70 -197 -134 132 223 -220 -16 -150 -113 -2 -144 -147 -45 -67 55 -201
3573 -201 41 -119 -76 -63 240 190 -251 -28 -177 -184 -152 140 -132 -47 158 127 -40 360 -172 -8 -50 147 -202
3596 -202 116 26 -207 -162 23 -310 -22 -192 -69 276 197 101 4 52 -199 57 143 233 -12 -38 130 -316 -142
3619 -142 163 10 195 160 345 -265 -45 -155 148 -12 105 -150 -106 114 -162 131 -33 -65 -99 141 56 -213
3641 -213 130 -136 121 -100 -85 -220 17 216 220 133 -156 49 -76 80 67 -253 -190 13 -93 175 -308 56
3663 56 28 46 -30 147 158 -268 208 43 -237 -272 -100 -91 26 -126 48 -40 183 132 -51 122 48 73 -164 137
3687 137 318 -255 -70 -22 236 5 -144 90 -140 -143 -20 -139 -21 -107 -102 294 -83 194 375 -134 98 100 179
3710 179 -10 -38 35 134 -12 98 -56 -153 -94 266 -3 45 236 -232 -125 33 152 0 41 -124 10 120
3732 120 -42 156 62 14 104 186 270 114 -280 39 175 -300 -253 111 162 -238 145 119 -56 -201 337 -208 10
3755 10 -267 30 70 75 -238 120 127 37 306 -143 -315 -91 -61 -221 -8 -84 207 100 -219 -55 240 23 108
3778 108 72 170 -58 -181 14 -90 -82 -169 205 -247 -243 -25 -18 173 -136 -42 186 -30 -36 -115 36 112 229 94 -262
3803 -262 140 230 -30 33 -141 144 133 -21 421 -144 47 136 -38 -52 75 -74 -161 223 118 34 -14 -14 -222
3826 -222 -94 -87 -96 161 51 57 122 48 354 123 44 -101 50 -16 -120 100 -57 -31 107 109 72 249 196 50 149
3851 149 114 140 96 23 63 27 119 -105 122 114 -238 -50 283 -39 170 -158 391 58 9 55 -78 44 -192 -45
3875 -45 -87 -10 -110 -296 230 -85 79 32 97 127 -151 -162 -194 -374 64 -69 -42 119 121 246 25 -65 -139 -123 -124
3900 -124 61 -275 29 -190 162 90 78 -283 -59 -148 23 -94 -34 128 -213 87 240 -55 169 -31 -302
3921 -302 -126 -271 -171 -164 -174 151 -173 -192 153 -39 -152 132 81 -5 162 156 -225 198 23 -79 -281 288 194
3944 194 -188 183 126 293 404 326 -206 -6 -120 157 -41 1 0 131 -44 -135 -184 -278 49 61 -62 212 5
3967 5 -28 64 -204 172 35 114 -7 -140 320 -220 195 199 149 8 -432 -45 190 196 -255 197 -139 -48 16 41
3991 41 186 118 77 -23 -159 11 148 -10 -186 -86 63 63 -242 138 52 -82 205 -53 -91 -109 123 40 -14
4014 -14 97 112 -92 -137 -34 55 186 255 -39 179 163 27 137 -46 42 -136 380 -45 105 -56 -95 -55 -133
4037 -133 17 -113 100 130 -402 170 117 -169 41 96 316 185 25 -257 152 -44 -131 77 -19 174 -126 -202
4059 -202 -179 39 137 -103 -399 -55 419 -115 -61 -189 -284 101 125 79 39 173 20 139 344 335 112 -62 -125
4082 -125 190 73 125 -135 -88 348 -177 49 -77 18 -221 199 -216 -139 59 112 -212 -414 -9 373 61 -38
4104 -38 -225 -32 -38 105 -153 -31 -30 -245 -270 -81 -196 86 -315 -252 166 51 55 109 14 173 320 -104 127 263
4128 263 -270 -143 29 -95 -331 452 199 -198 343 -72 75 219 -62 217 48 344 77 -259 169 -112
4148 -112 -226 10 121 -189 -54 37 58 -34 244 -37 -471 258 81 169 36 19 57 295 -239 -149 -94 115 75
4171 75 -274 155 103 -174 87 262 -51 3 -229 96 6 248 -271 190 21 157 219 -124 165 -283 242 -30
4193 -30 -101 50 -98 64 -106 -194 40 -36 131 -44 56 -126 203 144 116 307 -169 -205 154 -50 51 -103
4215 -103 210 248 62 -100 188 -17 -140 -17 -477 -20 -37 61 10 -452 -279 -66 235 -176 20 366 -58
4236 -58 -58 -10 -134 -74 -192 -179 -92 -157 -27 144 212 23 86 -49 -41 -369 -51 -174 52 46 0 -80 -24 253 68 -162
4262 -162 -366 -87 -57 422 -84 89 -169 -299 47 210 -92 100 7 -138 65 16 128 13 4 14 -107 28
4284 28 227 114 -162 37 8 91 -40 68 112 -40 116 -183 157 -138 -42 60 -63 -219 63 228 -107 -145
4306 -145 -5 177 -62 179 -304 17 -140 -26 -228 18 75 113 124 -51 -104 142 36 45 -89 -87 -44 -9 -21 342
4330 342 -136 -193 -31 -204 -66 118 -26 291 26 -173 -49 -299 -49 -65 -161 178 47 14 303 29 108 -86
4352 -86 80 -192 -3 -100 125 47 -88 113 95 157 -41 284 -180 -169 -16 -108 -29 166 95 -108 -61 76 -17 -159
4376 -159 130 -32 -10 170 73 -1 3 -103 -219 207 102 -135 -129 150 142 126 -17 18 -253 84 209 -17 33 -2
4400 -2 110 150 -182 -225 60 87 79 -149 -6 95 -61 273 -61 188 -94 -474 -4 -32 -65 308 305 91 152 69
4424 69 161 181 543 30 -267 -54 105 24 29 198 62 87 138 128 -157 111 110 -197 -5 317 -135 214 -14 -8
4448 -8 8 -98 -35 2 -15 38 11 -8 -26 -15 -48 -185 -21 63 88 -155 -26 64 214 -6 -309 -28 -144 283 -79
4473 -79 -16 -284 -145 57 -20 143 -305 -12 -161 -45 14 36 53 -123 344 61 -74 -112 -311 -32 -211 -76
4495 -76 79 48 61 201 -112 78 -253 -18 92 -336 -61 314 -427 -126 72 -99 -114 58 -173 14 -3 -20
4517 -20 -157 228 240 244 92 -243 -170 -163 -9 157 130 -190 -179 59 146 -191 226 96 136 115 -208 118 387 84
4541 84 -113 186 -49 113 254 218 -76 75 -46 -316 325 115 97 157 -179 47 31 82 -266 167 288 65
4563 65 -3 172 -274 272 6 -49 -233 -54 22 -107 168 -82 -364 -155 -199 80 -174 -57 99 44 109 99 -28
4586 -28 45 -96 -17 157 -127 131 277 -46 -70 61 78 -128 184 72 -204 72 124 -105 -144 44 178 106 -84
4609 -84 39 -240 -260 -99 -276 -177 -34 -45 298 -17 136 -145 127 105 6 -7 -82 -213 -452 29 148 54 -169
4632 -169 223 62 -377 -49 188 -10 -96 -83 92 356 -170 112 191 -127 -134 268 -35 -53 -174 81 67 -25 127
4655 127 94 41 -58 70 -183 -204 87 -175 -219 -100 104 66 -212 159 -338 -80 114 49 102 -150 -68 192 125
4678 125 65 -199 -117 -294 144 -61 -381 302 28 143 231 54 122 -25 -221 12 56 -149 216 -43 157 29
4700 29 -255 10 -114 -192 184 -177 0 75 -150 212 -237 -19 291 51 248 32 188 -256 -9 6 -48 -139
4722 -139 73 19 -237 -176 -179 -115 -93 24 98 240 -65 101 120 178 -19 73 -33 -97 -39 28 37 -344 119 207 171 130
4748 130 -93 139 -235 -66 -231 60 -78 -78 151 -117 -84 107 294 -101 67 38 168 -49 134 4 -5 -48
4770 -48 -93 132 29 9 88 14 132 -33 89 -245 58 -148 234 -41 -12 -163 -160 -225 -183 22 100 192 -16 -59
4794 -59 -128 -118 -108 -115 -161 278 27 46 105 -22 305 -318 -43 -233 -247 131 -140 136 -113 168 21 288 190 -142
4818 -142 177 -22 -93 109 36 76 227 -190 281 25 -70 173 -36 -180 66 -120 -196 348 253 -90 140 3
4840 3 140 -277 -21 58 -76 91 14 58 -181 218 -78 88 2 -154 27 -303 -158 -80 -332 -180 209 2
4862 2 -18 -166 -260 102 174 143 -88 81 -98 -102 136 144 115 -9 256 17 47 -199 176 -208 -105 -119 -59 -263 129
4887 129 159 8 -78 -111 84 -50 190 -146 -352 -156 -115 -1 -195 236 114 135 8 2 62 -215 56 234 -219
4910 -219 -1 -21 -134 -44 8 67 154 278 131 -181 -8 116 -365 -55 -131 157 39 3 -64 234 189 -10 -271
4933 -271 92 -269 162 -64 74 -157 -145 161 -217 -56 48 204 -64 -273 89 -34 -175 250 134 -73
4953 -73 -176 175 -191 -156 -43 -270 -182 -95 69 171 -297 160 -10 -227 -34 27 -23 -92 76 -144 160 119 205
4976 205 3 103 -103 -359 -83 -242 -32 -28 229 14 59 121 172 32 159 -196 36 54 195 -367 82 -26
4998 -26 44 -54 41 221 -142 -63 -246 99 206 -46 55 -79 -124 -42 -140 -276 -278 49 -15 -133 -158 -77 190 38
5022 38 78 -7 39 18 -304 -92 -192 -71 20 308 48 282 72 -41 32 98 106 138 53 -83 -78 -126 -37 230 -12
5047 -12 -118 -153 278 187 -290 153 231 -132 -72 -131 -38 142 186 72 -330 -62 89 -158 -226 -140 -65 89 -126 -12
5071 -12 66 107 105 136 -202 -128 -23 -192 -127 151 -34 -69 161 22 -56 101 317 -35 -56 29 -71 56 -315 -62
5095 -62 86 48 159 24 49 257 252 -228 -114 138 -154 -24 -118 -229 27 170 8 80 -291 -121 -7 -117
5117 -117 56 107 -130 -289 -112 -287 75 138 -450 116 200 -228 374 171 -48 87 257 68 48 -389 238
5138 238 56 -266 -47 -207 -18 -105 -248 64 -66 151 149 -61 -41 -126 123 9 -85 -234 34 63 69 109 0
5161 0 -57 -136 311 -90 91 222 -52 -110 -177 -67 142 32 -146 -33 -158 253 12 -194 -128 -79 60 -337 5
5184 5 86 -21 53 123 35 -107 -129 171 -348 5 -116 -178 8 -361 -107 32 -114 -253 90 -127 66 152 -80
5207 -80 20 -36 -86 1 -206 -167 -219 13 85 -72 -295 111 -314 112 -21 -4 -153 -148 -43 42 -346 288 -27 -157
5231 -157 -90 46 -156 106 -98 -12 -139 110 91 -74 346 -173 -117 -177 203 -105 58 -100 -79 -191 -304 77
5253 77 -225 70 -37 -114 110 31 -26 326 407 297 -194 -45 312 -6 11 -199 197 284 37 30 -125 -21 -238
5276 -238 -316 -220 -153 -65 -43 78 -70 18 -75 -37 117 -23 75 -73 172 368 49 212 19 106 12 -115 -20 -497
5300 -497 128 165 353 0 -213 -220 -117 -2 102 109 -111 11 -256 -195 -254 4 -160 56 -36 71 158 150 -92 -204
5324 -204 -95 -119 -189 -346 136 -43 22 129 37 36 177 -12 66 -82 225 -6 83 -107 16 173 114 -29 -100
5347 -100 43 -43 58 54 -21 159 -75 -219 82 227 -51 4 99 144 -144 74 -34 115 243 74 28 22 398
5370 398 85 -13 -79 -27 -93 219 94 -113 -8 -41 -3 155 -192 2 59 48 298 273 98 134 196 22 -13 79
5394 79 -120 -163 149 -272 -57 146 71 -153 248 65 -35 -48 383 87 75 97 81 132 203 141 56 99 -8 -80
5418 -80 116 118 79 -22 -272 198 -26 14 51 62 -253 -83 220 8 259 -152 82 -33 -94 -154 -126 -124 141 -166
5442 -166 -133 196 6 170 123 -104 349 -354 253 195 141 -458 -196 -23 -198 266 203 -318 -160 -212 49 -78
5464 -78 76 -73 165 -14 37 23 275 -27 -113 133 -18 -162 1 338 -76 -57 -58 307 -70 -47 42 46 -207 236
5488 236 -161 205 100 -61 -153 -85 145 225 117 -224 -248 -144 283 104 13 86 -52 -134 -261 -70 -42 77 64
5511 64 -139 135 -149 -30 105 -293 -161 277 -155 214 49 39 7 -118 13 219 103 -119 170 -42 92
5532 92 -192 -25 204 213 200 217 -81 93 -137 -325 52 -30 2 -31 50 104 87 17 -218 -192 -52 -58 450 -61 159
5557 159 177 236 249 217 -23 -57 184 -2 166 10 -98 165 170 4 30 45 -145 -144 -236 92 -88 -60 145 -159
5581 -159 -17 88 49 -163 -86 -97 -91 -177 97 196 -31 114 78 36 -186 -148 334 -97 1 178 -8 -225 234 -32
5605 -32 -123 -10 -142 147 -11 17 -344 208 -77 -183 -132 -64 -38 218 -61 -1 -42 -130 -229 -171 115 -70 148 -62
5629 -62 -117 165 207 -87 -167 94 146 126 -208 -142 -41 44 -29 -20 109 -142 -36 -29 -94 371 201 161 -118 -161 -448
5654 -448 -197 -45 128 147 -37 -300 247 155 -106 53 190 154 42 2 -8 90 98 109 96 77 136 24 -343 78
5678 78 -276 -20 93 -30 -206 -58 68 162 -4 -91 -96 -198 -3 -297 184 -328 71 221 -40 -214 -210 142
5700 142 19 150 28 15 -22 -4 -76 -61 -267 -54 -224 -80 69 -17 -96 43 -20 26 148 151 -166 -203 139 -83
5724 -83 168 -50 203 -71 -339 56 36 -136 -186 -60 -86 -100 123 -214 49 72 29 -45 -36 157 -173 72 121 119
5748 119 -257 -89 -93 -186 166 62 223 222 210 -202 -263 -249 12 224 -44 109 135 64 -150 5 111 -154 -10
5771 -10 262 3 320 90 221 109 -108 -238 15 77 154 -116 -46 -117 303 -96 -62 291 -132 62 84 -74
5793 -74 211 86 -64 -217 25 132 -201 -21 -61 -146 -159 -217 22 -206 140 -522 78 168 -7 -151 -116 213
5815 213 56 163 -114 146 -104 52 -81 -41 209 280 -170 -96 219 144 365 205 50 -71 74 155 -78 58
5837 58 -104 28 -97 -157 -158 -80 89 -135 -114 70 -55 23 -323 28 -18 -1 -379 144 238 183 -131 -28 58 -296
5861 -296 -227 -198 81 -377 -82 -23 -91 143 -4 357 232 297 123 52 23 31 53 -42 -86 -71 157 139 -57 -138 -271
5886 -271 193 35 -42 187 32 -100 -239 0 103 52 127 -23 -184 -144 5 260 133 67 165 -114 -62 -370
5908 -370 5 126 -98 -259 321 -81 98 50 -407 87 -169 8 101 -127 -277 162 -19 -59 -143 144 -23
5929 -23 76 -55 69 -175 264 -31 35 -15 -182 -265 90 -94 214 175 160 36 -244 79 29 -294 102 23 95
5952 95 -44 -44 48 -108 175 116 113 110 -57 261 381 -108 43 99 108 184 93 -83 -126 -69 76 167 41 144 -59 -120
5978 -120 188 -2 -18 -116 41 111 151 -247 -85 66 -73 -80 224 9 191 -72 167 45 -8 -3 -94 158 -144
6001 -144 142 90 203 -21 -88 -266 45 -94 -113 135 88 -298 228 72 388 -154 56 188 45 -257 -100
6022 -100 269 94 -69 18 -83 63 55 3 206 50 194 111 -63 318 81 -297 81 -7 68 196 -385 -57
6044 -57 71 -94 66 -8 -205 143 -77 -72 130 102 54 102 -9 -60 -182 -41 30 -143 63 225 -184 29 -332
6067 -332 137 -42 -160 140 -63 287 -85 5 -146 -97 -117 -176 229 131 -112 179 217 -105 233 -53 346 223
6089 223 209 147 -36 66 -6 121 31 8 3 203 89 -1 374 174 -95 -166 217 57 -100 315 46 28 153
6112 153 77 -83 -72 71 20 -46 -146 71 71 -24 -185 -127 20 96 151 -231 -6 222 -53 -105 246 4 -307 -102
6136 -102 266 -258 126 97 -19 303 -143 119 -123 -6 -209 -56 -196 94 -90 522 -117 -32 -48 -32 -20 75
6158 75 74 272 159 27 -155 1 -33 -166 168 -211 41 -48 249 6 -134 253 44 -95 -127 49 -393 -121
6180 -121 103 53 -351 23 13 -5 86 -70 228 -169 -167 -42 -299 -81 -122 231 -321 65 52 -44 90 236 -188
6203 -188 14 107 -52 19 -170 124 113 10 -112 28 -115 66 -121 29 -45 12 -42 -388 -52 -150 -191 69 -189
6226 -189 -103 -59 294 -375 -253 -165 -121 144 228 -16 65 137 -112 67 -27 12 70 4 -190 -136 12 -91 137 60
6250 60 -24 79 188 257 -14 -106 -41 399 -252 -118 7 183 -292 -135 -22 109 385 100 53 185 -104 106
6272 106 -143 -198 -7 -5 43 -220 175 91 226 -33 -85 25 -6 125 -122 -181 -311 60 -224 29 -292 -303 -314
6295 -314 -248 3 126 -162 -98 -335 -163 -59 346 15 -101 36 -59 95 -18 42 114 31 -113 95 109 174 -176
6318 -176 38 129 105 168 -121 101 208 152 193 124 -122 136 -233 40 44 39 -505 -42 -5 64 58 297 -156 -104 483
6343 483 129 189 58 -130 -130 -82 94 115 18 -87 203 251 -52 -110 -340 264 200 13 31 230 62 -53 -12 319
6367 319 135 222 -153 -277 -11 201 -39 -18 47 72 -184 -270 -13 0 -166 -54 211 89 -106 83 -63 214
6389 214 265 107 -219 -99 51 -9 -154 -154 147 77 52 -118 171 17 -81 69 -121 255 -42 -365 23 -297
6411 -297 84 115 151 49 151 9 -7 296 250 -68 145 32 -97 137 122 85 379 11 148 102 -361 22
6433 22 21 183 -272 369 29 124 79 95 136 -48 151 -215 -228 -191 -276 37 -240 123 71 -23 -15 126 241 92 134
6458 134 -311 -7 99 -83 -395 25 12 -6 9 109 -205 -295 60 -235 -8 -25 168 124 30 -27 -143 143 19
6481 19 -178 -29 -161 43 104 212 42 -326 -110 180 -113 -16 -49 134 96 52 -390 -80 80 308 -267 204
6503 204 -52 299 -111 48 -226 -125 -174 -40 -134 117 -138 -121 338 -161 375 119 -33 -14 221 -361 169
6524 169 -99 78 228 176 142 -249 67 193 -211 -302 33 321 51 -61 -171 240 -50 -43 172 -191 -228 -79
6546 -79 156 26 -148 59 -82 85 223 65 122 -367 -194 301 -24 -322 -205 42 299 -118 -42 -321 171
6567 171 -10 -100 -317 -213 -124 -2 229 -238 156 221 286 -291 -432 -311 -155 120 -110 84 161 228 -96 -227
6589 -227 44 -276 110 83 1 -16 -203 -48 -7 -497 34 -59 272 -191 72 33 -22 51 -106 -34 -77 -335 135
6612 135 213 213 -21 -127 -199 -186 -106 -108 -47 -61 18 195 120 23 -312 -4 67 -59 137 63 -202 -55 177 -222 78
6637 78 55 42 198 190 31 -48 -300 -55 -112 218 -203 -107 58 54 59 -236 262 -43 -30 -195 -33 -383 41 169
6661 169 112 -33 -47 -74 107 -70 -203 -50 -31 73 -245 373 213 -13 69 -94 257 -60 -25 64 36 -392 -116
6684 -116 361 234 10 -80 46 -28 -51 -252 -185 63 -69 239 -167 154 -248 301 -83 -27 37 -9 -74 2 13
6707 13 90 -30 9 113 100 251 -199 -64 115 145 -199 141 -192 -116 275 -217 77 -40 -139 -33 -205 133
6729 133 160 56 -258 -259 125 83 -198 203 -221 -143 -100 280 -324 32 26 -216 223 -295 63 -350 0 164 -19
6752 -19 -131 432 -115 112 372 182 88 189 76 -2 -79 -24 -21 -625 -16 109 -47 9 114 51 -259 23 -13
6775 -13 78 -318 -6 154 -327 -34 74 91 181 88 95 -135 -13 117 -52 -17 -154 28 -25 56 208 -73 265
6798 265 309 -93 113 -216 -19 -124 -132 233 -62 -18 -54 139 -84 -10 9 -118 131 -223 -176 -220 -47 -49 63 -27
6822 -27 121 -29 173 105 91 120 -3 -171 -187 -105 -397 -10 -317 -292 -282 -69 -239 -120 122 256 8 16 -41 115
6846 115 -79 62 -11 21 226 234 44 -69 -65 127 160 -139 -15 233 -97 66 52 -82 -203 -273 -141 234 -145
6869 -145 2 75 95 23 -97 148 -50 155 121 276 87 -77 113 39 -387 -85 -7 -164 238 293 -41 276
6891 276 -228 -94 181 147 107 41 -101 -72 278 -42 145 20 -299 22 -317 -215 -162 229 207 224 300 52 -44
6914 -44 189 44 178 -173 80 409 -87 25 -46 209 -10 49 95 47 16 127 48 -15 37 -210 120 -49 249
6937 249 34 -20 -76 -44 171 -350 147 -46 349 198 269 -276 -237 21 -319 40 -213 -30 -383 -53 266 -44
6959 -44 39 37 -118 -163 115 -208 137 10 -147 231 -112 84 -125 -214 -7 29 212 -24 135 305 58 -215
6981 -215 -205 10 173 1 -36 93 -184 -194 75 146 48 -51 30 -230 114 -18 222 -155 -238 -88 35 -190 -29
7004 -29 207 -70 40 49 -81 128 125 29 104 -124 -166 -10 134 -103 248 -106 111 -186 -103 -48 252 97 33 -6
7028 -6 -146 31 -42 -47 -222 -140 43 -405 110 -44 -104 8 -7 -83 107 -120 66 -206 453 18 173 -97 242
7051 242 274 274 286 -136 -140 -68 487 140 -112 -187 -337 -32 -88 12 -293 -127 -26 67 39 -128 75 -4 8 205
7075 205 -74 -62 -16 38 -137 -71 -111 259 182 -118 -134 22 260 -104 -84 -214 5 140 21 193 119 220 10
7098 10 -77 61 -300 90 -68 151 13 -15 -10 295 -67 72 -245 -42 -189 -76 105 -35 259 168 -78 -77 -98
7121 -98 275 130 -58 -191 165 293 -160 362 -240 -43 257 59 -44 114 426 45 329 28 396 65
7141 65 -128 327 110 -136 -77 241 -18 16 141 96 182 98 94 -347 269 -197 82 -59 320 -155 -210 197 67
7164 67 142 79 33 -98 17 -31 4 -165 -179 97 -122 -170 -37 -47 104 170 -53 55 -154 6 -135 -141 -7 -21
7188 -21 186 63 -72 18 -69 47 122 -192 119 188 8 25 55 -159 -153 -38 92 67 -8 -43 -5 -33 -16 -90 107
7213 107 38 -244 -128 -189 80 -242 131 380 -210 -24 27 113 167 -26 96 -157 -11 55 120 -187 -162 66 -160
7236 -160 -23 120 120 -110 -64 -13 -154 87 -136 9 39 -159 -83 -129 -29 156 108 51 -163 73 -148 36 -38
7259 -38 -280 -16 -36 -250 200 -230 93 253 -125 -4 26 55 -59 51 -104 -63 -85 132 263 -40 -269 -78
7281 -78 -45 215 -66 -269 -17 66 -150 41 216 -70 -200 -40 12 -290 -147 -140 -67 -422 156 -79 0 197 84
7304 84 180 34 -16 -130 81 50 -63 40 -31 -132 -178 118 0 -26 -52 -46 285 -78 -214 98 -205 75 -55
7327 -55 -217 139 -24 -265 33 268 137 38 209 -234 142 -68 -22 -69 -225 -398 204 105 -131 102 -109 -248
7349 -248 -18 -49 -54 -1 40 15 -28 259 -35 145 112 111 -77 -111 29 -217 68 53 342 134 38 34 -196 -65 145
7374 145 -4 91 -91 192 312 -2 215 -96 310 -112 -188 -54 166 -21 -3 -105 -122 37 32 353 -96 101
7396 101 -5 60 -78 -81 117 90 31 -111 -220 -288 170 74 3 39 -40 151 -60 54 -46 81 123 68 14 143
7420 143 -352 -10 -17 52 -176 111 -224 -114 33 68 -221 -365 -215 289 -229 -304 92 218 168 -104 -94 120
7442 120 126 96 -319 -87 -74 57 6 -34 41 183 7 236 102 -4 -279 -40 243 -164 210 -152 51 -46 30
7465 30 368 -43 41 42 -69 122 134 79 -252 -28 -143 337 -88 -329 -216 255 92 -92 16 -32 151 86 385
7488 385 -214 -88 99 92 -275 -43 -100 -188 -46 -161 -53 257 146 157 38 -228 -34 24 -69 -14 288 -174 44
7511 44 -45 264 10 -180 -118 -29 -41 -140 -63 149 -60 -259 -123 -94 7 -117 -317 -68 -170 -14 12 129 136 29
7535 29 78 63 -161 -77 47 -67 -117 -35 -219 -41 -25 -223 25 -320 -39 196 80 -70 -68 -262 -78 17 -156
7558 -156 48 81 136 164 -28 -23 65 -104 96 241 -226 11 -154 -12 -48 154 -115 60 -187 -25 113 172 -112
7581 -112 94 35 82 -219 181 -168 -250 148 -439 -174 -177 -227 216 110 117 122 -191 -374 -5 -100 -126 36 -32 202
7605 202 29 -58 67 79 -87 -162 -196 -126 123 -22 243 -155 12 112 120 129 -210 -127 317 -152 117 -95 -225
7628 -225 -151 223 -69 283 186 77 -31 33 23 63 228 248 -27 -90 234 -63 121 -67 48 32 410 -195 -12
7651 -12 37 -394 147 114 -198 -366 190 162 130 20 137 -38 248 -5 -90 212 -148 -132 -73 185 -136 -356 235
7674 235 169 119 142 80 156 -352 -8 64 195 -143 103 -41 -62 155 -121 -206 255 491 274 -82 -165 -205 178
7697 178 -14 125 54 145 132 172 51 -105 -215 -208 -75 -126 -40 104 -37 10 -87 -98 -132 330 2 32 -167 -168 119
7722 119 135 217 -263 122 3 454 94 -209 -131 -72 -87 -20 -4 291 -229 -229 122 34 260 -209 316 -84 125
7745 125 -253 -135 52 -253 156 -69 183 -79 -343 202 116 -87 -74 145 -134 -110 167 258 -17 50 171 -233
7767 -233 -113 -160 100 45 -66 173 -17 -234 -122 -146 -32 -88 44 -69 413 -89 -323 -56 -123 -235 116 184
7789 184 304 115 238 138 7 2 5 13 -63 54 7 104 -134 90 -123 -16 2 -389 -70 38 228 -242 -151 -25
7813 -25 -34 222 109 137 -262 75 133 204 -40 -78 -145 -150 105 0 40 36 112 88 46 -85 -171 95 200 -73 -67 -1 121
7840 121 -290 221 -14 10 289 -32 133 55 -17 115 41 -113 -201 -220 48 -13 -228 -18 118 -170 -314 95
7862 95 -44 13 25 135 88 -178 134 -191 -203 155 -95 -169 -50 -26 93 286 -183 -204 223 79 -84 18 84
7885 84 6 -122 167 -29 -67 -28 -98 148 -90 -11 50 -127 -130 -102 1 21 -13 -58 146 303 -98 -73 -76 84 295
7910 295 -90 109 207 -47 64 56 -96 -41 106 349 236 -150 -109 -17 -26 104 161 204 131 162 146 3 252 -10
7934 -10 -92 -479 166 -28 -253 -85 -36 20 70 180 65 221 58 42 -154 -149 137 242 -119 115 68 132 113 -74
7958 -74 -14 -237 265 17 311 163 -293 108 110 -34 -117 195 -90 28 -101 238 166 -136 166 10 7 -229 81
7981 81 -107 203 -182 37 160 71 58 -3 -149 -74 191 -259 214 -187 -28 -209 39 -168 32 24 -109 114
8003 114 -41 -318 -69 55 78 270 -41 -25 -32 -100 70 -105 -102 -81 -339 213 -232 37 -29 108 -73 -109 10
8026 10 -331 -262 265 -205 -195 43 135 -169 69 398 -132 56 3 -213 191 78 123 -15 -79 133 170 -185 -350
8049 -350 6 -227 136 79 170 335 -65 -154 -84 171 -25 -188 -17 390 287 -167 320 6 92 14 -314 -239
8071 -239 -234 -265 -256 272 -72 313 -43 109 255 40 125 54 136 -109 75 6 -162 210 -108 66 -307 -45 89
8094 89 -122 91 -290 -133 -6 -243 -237 217 245 390 128 343 245 -45 -207 97 60 -135 -104 -80 -185 -30 -76
8117 -76 196 -261 -85 -59 296 -35 349 93 -17 227 -23 -38 -78 -71 135 -22 193 160 -35 -228 140 -60
8139 -60 -212 259 -29 -128 -83 27 -160 121 108 -198 84 175 -25 53 -289 -176 -32 135 -181 7 -330 -144
8161 -144 173 155 69 -142 -2 -170 125 -179 101 112 128 -33 262 -228 24 215 -102 -159 -199 37 -95 -174
8183 -174 -84 -14 246 128 236 -44 63 64
8191F4
$$ Imaginary data points
##PAGE= N=2
##DATA TABLE= (X++(I..I)), XYDATA
0 0 0 0 0 0 0 0 0 0 8 -8 8 -8 8 -16 16 -16 24 -24 32 -39 41 -49 57 -66 79 -88 103 -114 129 -146 167 -185
32 -185 208 -232 259 -289 321 -359 399 -441 489 -540 600 -663 734 -815 905 -1008 1127 -1265
50 -1265 1429 -1625 1866 -2171 2570 -3118 3920 -5208 7621 -13694 62626 72142 -51471 17927
64 17927 37662 -40316 -34027 35387 -10559 -45253 -3728 8431 -20921 4982 29991 14785
76 14785 4163 14724 9423 -752 -4452 -5875 -16863 -21028 -9617 640 -4111 -713 9259 10884
90 10884 8179 15225 17723 1715 -9839 -2962 -7827 -18041 -7906 -1440 -9719 -5476 7725 8561
104 8561 7240 17887 14871 -5603 -3537 8929 -7917 -18518 -41 -4121 -23900 -2748 20276
117 20276 -1384 -4574 24500 11066 -13161 10903 14528 -15958 -9379 2787 -16175 -12648 7827
130 7827 -205 -5237 8719 6487 1012 11142 8766 -3215 -914 -2746 -9367 -2724 -2277 -8926 87
145 87 2883 -5034 4597 14158 1835 -1925 8655 1949 -9684 590 4046 -10471 -8339 2569
159 2569 -2746 -2848 5990 3970 830 3760 3326 1561 2651 -3 -4792 -3209 -1052 -5907 -2935 3659
175 3659 -383 -3495 3932 5794 -339 737 6657 -135 -7575 1710 3280 -8547 -3480 5437 -4810
190 -4810 -5076 6989 4086 -3139 3535 4113 -2645 -9 3048 -2522 -2287 -475 -4236 -624 2424 -2401
206 -2401 897 4598 -1682 -526 5312 534 -3072 1914 20 -5013 110 1799 -4461 -153 3809
221 3809 -2941 -643 6288 -440 -2556 4126 530 -4405 1331 2777 -4124 -1897 3023 -1737 -2487
236 -2487 3197 1106 -2296 1126 1537 -761 -21 1102 766 -1886 -749 1602 -857 -1733 2084 299
252 299 -2249 120 1889 -358 -1009 1410 662 -1250 586 1364 -233 -855 -926 164 16 -2340 539
269 539 2525 -2391 -1133 4109 321 -2446 3272 2402 -4139 -890 3620 -2864 -3583 2742 -339 -3851
285 -3851 2386 2553 -1181 1292 2137 -546 504 199 -1356 -618 -172 -2536 -1326 1565 -585 -355 3016
302 3016 836 -627 2466 1497 -1186 110 -742 -2342 -1209 -546 -995 -14 1007 420 879 2263 1484
319 1484 -121 1458 -408 -1900 -508 -868 -1326 -1054 -613 330 153 1005 2813 1273 -329 1254 359
336 359 -2112 -1121 -33 -2374 -2402 557 362 -944 2213 2651 68 864 1804 -469 -46 -491 -2523 -1705
354 -1705 -645 -1379 -88 788 -93 244 2738 1224 -402 2563 307 -3250 -237 74 -2932 -1158
370 -1158 1110 -941 -629 2275 2131 593 914 1287 -432 -727 -1057 -1368 -468 -1322 -1693 819 643 -365
388 -365 1894 2060 -71 112 693 -31 -1354 -1069 -397 -1032 -1053 206 521 567 427 1113 1564 40 495
407 495 1120 -1533 -1615 -107 -1186 -1007 435 231 95 490 772 575 906 265 -657 114 -287 -2123 -413
426 -413 757 -1804 -223 2239 -116 -317 1657 1195 -1169 -237 308 -875 -1214 51 -865 -495 623
443 623 158 465 952 29 997 476 -1067 -180 464 -1499 -1141 316 -300 -650 934 1251 -589 36 1212
462 1212 248 -206 -102 -782 -456 -565 -840 507 69 -606 902 1158 -40 846 809 -280 -869 -127 -509
481 -509 -920 -6 -10 119 650 141 473 1596 -114 -926 1046 -454 -1790 22 162 -1325 -726 1227
499 1227 47 -626 1241 1386 -516 -102 640 -458 -166 -688 -606 -244 -856 -87 1182 209 -259 1350
517 1350 693 -856 -403 796 -1242 -1199 331 -312 -1035 234 453 511 745 260 441 867 -464 -293 -10
536 -10 -1005 -1046 -258 -211 -322 163 1150 233 362 858 136 404 110 -791 -488 -231 -1128 74 132 -636 582
557 582 1201 242 270 958 480 -880 163 427 -1568 -843 241 -614 9 629 401 883 543 286 956
576 956 -51 -928 -334 -367 -1415 -1101 683 46 -777 1165 1111 -307 772 1163 -406 -496 -27 -494 -817
595 -817 -1320 -643 -16 -243 31 908 921 55 512 1044 -409 -928 69 -368 -1410 -236 -382 -527 133 294
615 294 712 1003 269 618 921 -165 -786 -144 -324 -1235 -753 663 -637 -704 1345 667 247 1311 859
634 859 -323 -470 -694 -750 -718 -978 -392 335 64 227 946 1160 -143 527 1114 -624 -823 204 -996
653 -996 -1139 -384 -245 -83 381 451 861 826 329 160 274 -509 -779 -316 -483 -1280 -47 375 -750 517
673 517 1251 536 489 663 -273 -248 -398 -837 -811 -656 -483 -143 305 567 706 1590 408 -308 982 -256
693 -256 -1339 -899 -546 -1152 -611 381 306 466 769 1244 476 636 238 -160 -390 -975 -1105 -96 -570 -680
713 -680 731 707 187 1230 1077 -54 -16 -146 -915 -756 -990 -308 -339 -231 118 714 1160 169 874 1203
733 1203 -136 -736 276 -1091 -1474 -795 -124 -278 -107 940 903 318 799 868 367 -440 -735 -527 -690
752 -690 -1023 -380 501 -502 460 1616 693 366 516 477 -672 -435 -446 -1083 -490 -595 -243 395 644 273
772 273 1215 1187 -63 364 420 -904 -910 -445 -709 -896 -184 465 56 607 937 508 464 167 -310 -191 -755
793 -755 -931 -348 -494 -469 289 501 425 818 896 145 -277 -8 -90 -1110 -463 -48 -667 -460 279 100 765
814 765 369 494 862 331 -489 447 -463 -858 -702 -81 -589 -549 933 714 145 681 732 181 -107 -103 -562
835 -562 -259 -1224 -293 172 -368 129 819 630 148 533 605 -373 -346 324 -564 -667 -17 -517 -240 348 303
856 303 750 663 22 592 134 -340 -474 -190 -492 -763 -248 122 -443 17 787 201 245 715 96 -239 -311
877 -311 -336 12 -621 -388 42 676 38 354 683 373 37 646 330 -872 -449 161 -620 -145 -45 -364
897 -364 129 334 472 747 208 98 229 -56 -376 -479 45 -710 -705 535 145 -541 590 453 35 585
917 585 118 -85 -36 -199 -411 -332 -504 -34 136 135 116 332 719 -2 -98 587 -1 -664 -164 -238 -467 -188 150
940 150 712 318 138 608 281 108 80 170 -213 -490 -130 115 -477 -178 543 260 -79 1126 180 -261 211
961 211 -204 -170 -275 -596 -177 -404 -313 -37 362 388 84 398 633 -346 101 130 -415 -800 68 -58 -495 151
983 151 439 624 199 277 563 53 -377 -151 -268 -359 -557 -61 -58 -443 122 746 87 379 279 203 -113 115
1005 115 -188 -296 -537 -312 -152 -135 0 325 738 157 -123 638 98 -542 -259 15 -338 -680 -172 -407
1025 -407 221 72 419 544 253 498 -44 162 -329 -586 -234 -479 -690 437 -434 -205 181 591 -120 363
1045 363 381 249 -263 -227 -145 -673 -565 -399 120 168 198 344 647 199 307 538 -267 -759 -317 233 -491 -174
1067 -174 250 17 84 528 188 86 430 164 4 -303 -562 -288 -281 -422 39 336 -88 243 406 510 279
1088 279 178 302 -58 -326 -381 -453 -307 -47 35 277 131 268 725 330 -193 512 66 -214 -726 -132 -191
1109 -191 -345 -235 271 316 266 689 252 51 299 -141 127 -383 -551 -1 -106 -254 338 594 292 339 294
1130 294 277 183 -330 -73 -484 -470 -514 -404 218 21 -191 518 193 277 378 92 -238 -41 -277 -522 -164 98
1152 98 108 -151 338 530 278 574 190 88 -117 -103 5 -297 -497 -324 269 158 156 642 411 -78 238 234
1174 234 -345 -144 -9 -207 -572 -50 -126 -202 246 131 576 251 67 317 -82 -328 -302 -210 -7 -312 -257 300
1196 300 -238 -168 488 212 -26 524 -150 -337 -273 -539 -321 -374 -264 60 343 187 196 483 381 -206 241 16
1218 16 -371 -261 -200 -124 -118 -234 -287 130 405 332 11 123 236 44 -347 -140 -328 -17 -235 -301 291 50 123
1241 123 321 306 128 179 216 -132 -257 -376 -200 -179 -196 -204 265 162 -262 216 591 185 -74 329 -160 -103 -195
1264 -195 -27 -187 109 -160 291 172 235 259 172 90 -249 8 204 -480 -313 -94 -221 -124 520 177 83 606
1286 606 189 237 230 -29 110 -342 -13 130 -20 -80 -27 123 369 -73 360 859 -113 -432 -204 -85 -191 -338
1308 -338 -80 87 13 -74 183 185 129 101 386 -76 12 -123 -233 -407 10 16 -317 -28 16 134 71 219 208 -37
1332 -37 -228 -510 -408 -478 -109 -79 344 62 102 731 136 -186 273 167 -180 -329 -426 -258 -381 -332 -382 -225
1354 -225 -16 375 29 463 159 14 -47 -343 -133 -16 -570 -367 -33 -155 243 721 187 326 189 179 57
1375 57 -362 -387 -85 -396 -471 -126 -133 318 132 414 331 75 56 314 -505 -370 -30 -366 -73 -292 312 195
1397 195 20 706 396 226 -173 -123 37 -234 -147 -323 27 -186 179 205 342 315 456 297 255 3 -45 -72
1419 -72 -494 -531 -325 12 31 -19 321 385 88 424 261 -368 16 -44 6 -444 -291 112 217 110 334 199
1441 199 249 470 363 16 75 -477 93 -297 -341 -198 -310 14 352 280 502 247 400 158 -286 -315 -3 -333
1463 -333 -265 -161 -117 146 122 311 -39 139 112 -2 -101 -223 -16 -285 -389 -197 -16 -118 -10 571 286 559
1485 559 295 35 -123 -164 -322 -147 51 -332 291 -26 -203 -133 327 511 64 151 295 -88 -313 -158 -644
1506 -644 -50 -64 -184 117 212 -179 578 257 68 122 -100 -358 -111 -348 -417 -156 60 146 220 12 174 200
1528 200 232 86 -269 85 -238 -191 -210 46 -453 109 157 360 196 348 38 8 -10 -218 -489 -385 -279 -308
1550 -308 288 -329 340 470 227 217 363 40 21 -361 -292 -131 -504 64 -63 -106 120 336 197 308 -53
1571 -53 270 -116 -209 -160 -250 -123 -84 -306 -68 -41 388 352 10 13 106 87 -232 -384 -241 -315 -261 -81 45 107 36
1596 36 190 210 452 255 157 56 -19 -195 21 -262 -290 105 -283 28 -47 111 170 251 289 161 -112 -494 -19
1619 -19 -368 -44 124 -52 183 -79 61 236 -276 49 172 -188 39 -65 -138 -166 -270 114 431 264 473
1640 473 247 137 128 1 159 -214 -181 -195 4 165 26 103 203 285 264 395 53 -503 22 -134 -372 -128
1662 -128 19 69 -125 178 89 134 -12 436 28 182 60 -329 98 -186 -151 66 -484 -93 -275 307 219 228
1684 228 232 338 136 -340 -314 -498 -363 -84 -237 -244 55 36 -383 -191 252 71 82 179 -158 -323 -180 -308 -182
1707 -182 42 86 304 547 421 35 426 -184 -46 -97 -296 70 -61 206 86 136 202 290 406 385 0 44
1729 44 67 -201 -68 -125 -491 113 109 -240 -369 23 290 215 150 242 3 -392 -315 -315 -199 -122 -220 18 -10 -83 125
1754 125 458 214 -92 3 -307 11 -208 -215 -444 -237 -23 -57 200 451 140 35 84 -62 -102 -160 -127 -25 10
1777 10 -231 258 -5 -105 15 333 280 -192 210 153 -191 69 -261 -173 -50 1 78 246 -208 194 356 235
1799 235 -225 -131 -112 -248 144 -207 -177 -253 101 -252 -113 456 -102 213 173 -375 -65 -251 -455 -301 -106 -2
1821 -2 -118 170 121 80 212 271 -71 29 262 227 -22 -202 -350 -94 -49 -20 171 397 77 204 85 83 -250
1844 -250 102 -60 -48 -100 221 -240 191 395 -176 271 188 124 200 -75 21 -16 9 -318 -295 26 -286 -56 56
1867 56 9 -120 467 311 -99 -40 -126 -129 -246 -93 -48 194 -34 109 322 97 235 69 49 45 -65 -330 -79
1890 -79 -133 34 -89 182 339 -83 86 299 -8 -338 -404 -122 9 -138 25 -283 -63 151 -204 -54 71
1911 71 -135 11 299 107 -219 -139 -345 -183 133 -59 99 -42 289 135 248 354 -24 8 -24 -198 -166 32
1933 32 -165 -74 -23 -184 -101 59 92 135 -58 441 100 -57 -74 -48 32 -243 -107 291 127 88 310 213 44 -7
1957 -7 20 -99 -71 -376 -275 -324 -8 -8 -179 0 227 231 -28 -35 64 -149 -42 -51 -451 213 17 342 -100 177 77
1982 77 392 93 179 -83 -204 66 -89 -400 -51 141 -219 13 324 250 -48 281 162 -186 135 -80 -270
2003 -270 -326 86 48 -129 48 163 -36 -164 -37 84 -7 207 4 40 -196 76 64 -198 -85 -118 293 -63
2025 -63 150 174 -119 14 -41 47 -493 -161 -404 -285 49 51 262 419 209 63 10 -106 0 -326 -150 -233 -133
2048 -133 -237 139 -191 195 200 83 -90 -196 28 -367 -57 75 -161 -254 83 -166 30 17 40 213 234 279
2070 279 -173 -193 41 -88 -228 135 -373 -124 -36 282 70 185 75 190 112 -3 -36 -49 -219 -114 -178 29
2092 29 -245 154 198 -61 146 484 -40 250 -46 -308 -9 -135 -230 -72 239 259 -13 260 29 -70 -136 -188
2114 -188 -73 -223 -438 -235 -157 2 168 30 58 274 359 -279 142 185 -169 -359 -519 -266 131 -38 511
2135 511 -22 45 169 316 -84 232 133 69 59 137 -339 -97 -145 -104 13 112 217 245 252 177 -173 86 6 -332
2159 -332 31 -232 -82 -341 197 144 105 181 264 217 -27 50 -296 30 92 -167 -283 -60 27 92 137 64 15 134
2183 134 435 -285 64 92 -274 109 -213 -9 145 -94 -30 238 280 -296 -78 233 -51 -27 -170 -183 -19 -53
2205 -53 -43 138 211 104 123 -44 45 -81 92 26 71 47 -184 36 -167 116 -242 200 322 333 -147 -32 132
2228 132 -67 -82 -322 -102 41 -39 -205 -82 77 242 233 82 24 -119 -140 -273 -39 379 57 -35 -191 -275 170
2251 170 70 137 121 -47 328 21 -183 -199 -137 -359 75 52 -24 -69 200 16 193 244 304 63 -27 -108 -236 39
2275 39 -292 13 -372 31 215 197 354 -206 1 -76 -5 -112 5 -269 -120 224 -243 -13 41 165 61 272
2297 272 -85 58 -243 -153 -60 283 -37 -39 -41 27 62 208 380 56 41 3 -94 -7 -421 45 -216 -49 388 162
2321 162 -180 130 154 -86 307 -15 140 124 -195 182 -447 -63 -13 93 240 212 79 70 -145 60 202 -66
2343 -66 -128 -238 -12 -100 215 86 -127 -115 118 36 53 188 -5 -267 402 -39 -25 -252 134 -5 -87 -153 -178
2366 -178 62 312 -142 137 42 -120 -214 -44 -69 -450 -219 84 92 199 151 372 14 -55 100 -332 -159 -23
2388 -23 -217 -55 52 -376 132 240 227 245 -49 96 -346 -264 -46 -257 -146 -250 -11 93 37 105 48 -58
2410 -58 35 -10 9 58 -192 -138 -370 220 166 101 153 -233 24 231 151 -168 -214 -194 -237 314 -154 -94 -224 69 200
2435 200 239 424 21 -46 48 138 -128 -195 -127 -64 -226 -240 -134 -136 247 122 384 267 -40 254 -184 89 -105
2458 -105 86 -115 104 265 359 187 -327 -400 -47 140 110 292 140 -247 -279 -478 94 52 -2 -89 242 27
2480 27 209 -26 105 -105 65 -274 -331 32 171 -243 -323 130 182 89 42 336 -109 -91 142 -75 68 55 126
2503 126 141 149 61 129 192 434 22 -6 95 -117 -191 97 3 -267 -28 94 29 -143 154 436 343 -58 150 -94
2527 -94 -9 91 -182 -22 219 52 65 -41 272 -36 270 208 -6 75 -67 -157 -41 102 -92 -136 -153 -102 97
2550 97 140 362 115 -213 156 -148 -88 -191 29 27 -261 -80 43 275 1 93 -22 -105 -63 292 -122 -193 -274
2573 -274 -215 149 72 278 -280 182 117 183 51 -35 85 -34 29 166 -19 -220 -388 173 58 -89 131 -6
2595 -6 126 20 -292 -123 -291 -225 145 257 142 -48 204 382 316 62 380 93 -90 94 -26 -443 -29
2616 -29 -71 72 213 -38 92 33 73 391 -178 -118 -245 -323 -274 -207 67 -261 -54 -206 -10 -138 190 47 4
2639 4 -215 -52 -26 -171 -132 -151 77 -10 -30 199 -7 -17 82 -158 -71 232 -73 59 -248 -83 -299 -56 -191
2662 -191 -78 135 299 -184 164 33 91 150 -202 -118 -231 -4 68 11 -13 -122 222 -5 147 -13 -143 2
2684 2 -107 33 134 71 -157 -62 48 2 -34 149 50 -62 61 -234 -93 -244 59 36 14 -222 115 -168 -187
2707 -187 273 -120 30 -71 -131 36 -259 -140 -57 -80 -123 13 56 275 -25 22 -1 57 87 146 -164 -139 -188 -5
2731 -5 252 108 -141 8 68 134 -149 -76 -123 -117 174 174 -15 -142 -97 -89 -372 5 94 108 304 -305 -204 -261 -90
2756 -90 3 208 -305 -238 -53 -129 8 158 -63 171 380 -229 42 37 38 32 124 -47 29 133 202 115 -78 -120 76
2781 76 118 158 274 -200 115 -398 -202 -249 36 452 79 79 158 -94 253 150 -136 21 -84 161 463 302
2803 302 7 5 64 165 134 -52 -31 163 23 -106 67 -61 -197 -12 -91 112 -36 -102 -46 50 64 162 -91 -99
2827 -99 -173 -149 -64 52 256 177 -116 90 -278 136 316 209 -178 -178 -214 8 -19 216 155 294 101 30 41 -136
2851 -136 199 -11 -8 -87 -67 -216 -174 309 -293 -67 -147 88 94 -98 92 136 -114 -211 -36 -165 -120 -341 -79 122
2875 122 259 92 -11 -13 -15 39 7 97 -232 -101 -268 -77 -101 75 233 61 0 124 -94 119 187 -272 74
2898 74 -225 -239 -192 -197 208 41 20 -490 157 101 73 125 165 191 255 67 -249 -20 27 -49 40 140 -261 -46 -93
2923 -93 95 152 177 183 -167 30 20 -116 93 259 10 -74 237 156 66 115 -149 -239 -9 -246 -245 -117 -330 485
2947 485 231 77 230 42 193 47 -280 72 -12 46 41 124 -190 71 346 121 -79 -93 118 111 -102 -142 -178
2970 -178 -44 -275 278 -32 -183 -2 152 358 55 106 -159 65 247 -111 250 -34 -265 72 -152 -247 -3
2991 -3 -164 -39 34 22 7 -13 -334 -198 274 86 -129 -104 -31 -77 467 -91 198 127 -60 26 180 -346 -53 224
3015 224 -58 573 32 5 254 95 83 43 -3 -43 -1 -303 81 -91 -89 187 134 68 -41 115 228 564 22
3038 22 -276 -40 -148 -73 287 118 -297 183 -103 29 140 -125 -14 74 -205 -254 -80 -30 112 -222 64 115
3060 115 82 -19 -68 19 272 -191 -188 -84 -113 -239 8 194 -45 98 257 -29 29 245 107 37 121 188 -82
3083 -82 -268 -32 148 262 -147 182 7 187 99 -176 86 28 -124 15 -13 -173 30 -89 -76 -34 -41 12 -116
3106 -116 31 372 177 99 -20 -214 80 22 -319 239 411 23 -75 -72 -53 51 14 85 188 -59 -132 -98 205
3129 205 -209 -12 296 76 3 24 85 240 -373 176 -17 27 -451 -250 79 291 -29 15 -90 223 176 97
3151 97 191 120 -39 -223 187 -329 -126 205 360 -1 -57 187 114 180 -154 289 -23 -116 -98 106 176 9 116
3174 116 326 -105 128 163 -137 270 -78 -52 -160 -181 -169 104 -3 47 11 -31 51 8 22 -282 -289 -342 -209 -36
3198 -36 -171 62 -448 41 359 10 -69 -72 -132 -96 37 166 78 -225 102 24 106 -146 -54 -33 42 -70 -105 76
3222 76 60 -78 -102 69 -253 -99 53 122 -143 51 -51 175 -69 180 212 -76 -196 -87 -296 203 -233 293
3244 293 237 35 -90 185 -28 75 108 213 -349 107 -73 -180 -92 -59 -301 83 326 223 138 57 6 324
3266 324 53 -99 -173 -344 -172 -190 48 245 -58 80 240 7 -384 73 19 -85 -60 170 35 24 -87 11
3288 11 111 -82 -202 59 -256 -211 35 -68 184 -251 -97 -77 -87 150 46 29 -89 109 20 -12 -148 -127 -95
3311 -95 -27 346 -319 8 -56 43 516 -29 233 -85 -301 -30 -235 -32 80 79 -180 149 -140 -42 75 97 90
3334 90 -148 151 34 -80 12 52 -206 14 -100 167 267 -165 -95 151 -367 -104 -83 -68 -128 218 -3 -7 -67
3357 -67 11 11 -20 -179 -228 348 56 96 -94 -117 -8 -101 -92 -121 -188 26 299 37 -265 94 274 -46 323 -310
3381 -310 -43 17 44 26 -263 245 145 -89 -17 114 -26 95 -24 26 138 -122 -36 -1 -43 -227 -128 -309 -183
3404 -183 -28 73 -98 -173 -149 303 -40 -315 -326 36 90 162 15 -195 -48 -81 -203 -306 25 169 14 -169
3426 -169 -321 82 246 -264 -111 333 -235 -37 -162 -91 212 -245 64 113 -47 -306 -24 162 -41 375 119
3447 119 128 129 51 118 -283 63 -136 -61 -149 -222 -152 77 -26 -86 68 108 -66 204 88 -10 145 205 294 -31 88
3472 88 -101 110 431 0 247 -255 390 -60 88 60 -65 -128 -198 30 -146 113 197 80 30 124 -35 207
3494 207 160 -156 225 183 -213 -39 2 182 301 -55 115 -125 -37 48 -285 207 128 -63 -26 25 -141 265 -208
3517 -208 80 -108 -236 -6 -88 22 74 -36 155 237 -28 32 -231 -32 12 137 -195 17 160 46 56 237
3539 237 -43 -108 -328 -209 -32 81 91 -121 26 -304 -149 -265 11 187 -192 123 -174 12 -110 93 104
3560 104 28 -107 195 127 -27 -54 3 28 64 -26 34 79 387 308 43 -24 13 10 122 -57 -273 41 -176 195 -91
3585 -91 -41 281 157 -274 35 70 -158 -68 25 49 -76 283 213 -21 259 -293 169 147 -118 -250 27 35 -446
3608 -446 -182 74 107 213 -58 23 -81 112 44 -164 77 38 -169 28 -1 68 -40 58 364 -62 124 189 151
3631 151 -112 50 -237 -63 37 -18 48 -202 50 210 49 201 90 -115 89 194 -322 16 208 -191 -119
3652 -119 -143 341 14 -424 2 121 147 -136 401 221 -116 94 -92 7 152 -171 42 13 -45 46 -94 -13
3674 -13 -26 70 183 71 225 410 -59 76 -56 -15 -96 -62 -73 36 465 -224 -111 -100 127 95 -134 -19 -149
3697 -149 -237 -191 44 98 232 -4 284 -41 165 82 -120 195 -42 165 216 -181 -215 270 -116 208 72 148
3719 148 160 46 -122 -250 -9 -11 -265 36 -106 -14 146 15 82 123 154 -245 373 130 -163 -287 75 -117
3741 -117 -155 155 28 -155 -55 -25 237 -65 230 166 34 48 85 -40 314 -318 -123 -197 69 -75 -154 -132 8
3764 8 -18 80 -213 48 253 -171 281 -162 -297 138 -63 -21 178 -25 -143 107 75 -114 -117 20 -238 81 -8
3787 -8 37 -45 180 140 262 -289 93 -126 -60 -227 -60 84 -18 -61 145 46 -244 -94 -179 -267 233 -68 61
3810 61 -58 -227 50 56 -263 330 52 195 -75 -313 -157 22 -123 -354 -132 -168 218 126 -233 -36 37 78
3832 78 238 26 9 209 -83 -84 -262 65 105 -18 54 38 209 292 -237 490 107 108 -226 -114 -23 44 -46 -226
3856 -226 -63 -352 -39 48 332 192 294 131 140 -59 -43 -131 77 52 202 -241 -161 -46 -74 172 103 -192 65
3879 65 52 79 36 -218 18 -387 -234 147 -71 51 -49 -82 5 45 27 -48 -224 -82 -177 -276 -128 -357 258 -128
3903 -128 82 -229 18 174 -60 -136 -21 13 -115 -22 -44 103 47 -71 -60 62 114 103 -74 207 140 -172 -70
3926 -70 293 -44 58 -143 260 185 29 -82 292 -105 146 198 -163 -118 -207 28 33 36 -27 -103 -451 26 -10 -31
3950 -31 -38 58 -47 55 78 159 -95 -228 72 -98 -218 -221 20 -190 315 -1 7 -7 -110 310 -22 56 142 306
3974 306 253 216 2 -291 -119 -385 -55 12 -61 -47 -152 -93 275 -124 -106 185 220 119 -220 -107 -285 17 -245
3997 -245 -285 77 -41 26 45 3 -27 170 150 -7 24 162 -107 -16 125 27 -161 76 84 -14 90 458 58 94
4021 94 74 129 -132 -61 -33 -314 67 -17 174 -147 -86 -131 -253 -25 32 -94 50 -273 32 242 -224 -164 33
4044 33 125 -80 284 318 -39 265 134 -395 171 -221 -42 68 233 78 -35 -27 2 -174 18 -235 66 -139
4066 -139 -24 -133 -152 -163 -93 96 218 128 -92 139 81 12 -138 240 -71 -233 -48 -244 145 231 285 -108 -74
4089 -74 -310 191 199 -81 -1 -77 -96 -113 80 -165 -47 78 229 -185 -91 -209 -211 -287 -166 -165 -2 -64 -41 196 140
4114 140 179 -80 53 -117 4 -57 127 136 -50 -81 -83 -119 193 -95 53 -8 30 21 -37 419 28 123 -395 106 -249
4139 -249 -283 -31 -143 25 -266 -469 27 65 261 158 -97 -506 -192 -7 42 -258 -265 306 -199 -8 97 -124
4161 -124 39 -183 -167 -64 -195 -189 -128 28 -303 101 280 448 13 -116 -55 -10 -9 130 54 26 104 123 -200 128
4185 128 39 79 204 -102 255 136 -29 -9 33 -80 -131 64 -127 96 -58 -17 -99 56 -272 35 115 85 100
4208 100 -12 100 -112 58 -72 -131 -44 31 178 76 198 -112 110 237 -277 25 291 45 -141 -83 -56 111
4230 111 -30 115 -403 -311 168 42 31 -38 23 -7 -121 -72 21 -89 -19 321 429 120 285 -58 -89 -163 41
4253 41 -184 -156 -144 235 175 10 -7 355 202 73 -140 -378 364 227 136 -140 -57 -61 -269 122 -18 -259 -20
4276 -20 50 267 110 -173 39 58 154 -189 -146 -125 -166 384 -47 73 -21 -32 -70 -246 -193 37 -156 112 31 -6
4300 -6 82 313 137 200 131 77 -98 -226 326 146 -200 142 -73 2 -125 -147 -185 325 -83 88 -30 16 131
4323 131 306 -5 -143 15 -102 -151 117 187 358 -36 -28 -239 103 87 -30 -319 155 131 25 -133 399 354
4345 354 -39 84 83 -124 -40 24 -62 -282 -137 -240 -213 -93 -88 256 55 81 -80 156 97 -282 -134 -190 -45 156
4369 156 -43 174 -162 -157 -142 44 68 -42 224 -2 134 27 -142 67 -27 208 212 95 269 -268 136 8
4391 8 131 -59 209 -41 -192 24 350 -166 51 -119 -271 227 1 61 -146 123 17 32 103 223 -155 -262
4413 -262 34 64 180 66 -104 61 194 125 -148 189 -149 103 -214 121 112 118 -12 125 70 198 85 -148
4435 -148 45 -53 -90 47 -242 -188 -121 81 18 72 142 154 132 -323 -112 -133 -210 -30 -22 -103 -5 91 -60 62 -68
4460 -68 -330 159 -45 227 260 -228 187 64 -3 -349 -23 -139 -76 -68 -32 -111 210 14 -137 148 -105 34 33
4483 33 293 156 148 3 66 -65 98 -181 -87 -170 75 -407 100 38 215 -52 190 -69 158 101 -282 17 103
4506 103 -188 18 -30 -42 76 -90 -29 -244 58 89 279 -25 -86 -98 -257 96 114 -200 223 7 150 0
4528 0 0 -102 235 -307 107 288 -240 21 108 -5 156 -146 -151 58 166 82 110 -184 30 -233 118 -146 -45
4551 -45 -125 35 110 16 172 316 -98 -83 118 157 181 106 132 -84 -106 -7 -50 -10 -3 -74 -95 32 144 118 -83 -243
4577 -243 88 -117 -43 -159 -174 44 7 -35 205 127 -76 -69 -41 -92 -19 267 49 57 219 -51 81 -148 150 -58
4601 -58 -270 -1 -216 -20 -23 -119 -307 -3 36 -182 -35 -110 -122 -140 111 5 -24 -15 197 1 -205 -31 -146 70
4625 70 -294 269 -123 -86 173 162 -203 -49 46 -156 -29 10 -13 -131 -220 381 -89 -155 -139 -314 -270 -191 -31 -34
4649 -34 19 -66 29 175 70 229 211 300 297 -108 -42 -385 -95 68 68 -126 -193 -279 52 -68 256 59 6 22 -96
4674 -96 18 107 12 196 -30 -313 -177 133 -71 80 -164 95 -58 103 -130 261 72 -311 95 -113 200
4695 200 11 93 -62 44 212 -153 -146 -58 168 -68 -254 -93 292 135 -28 -203 -132 -367 127 -155 204 127
4717 127 99 36 -380 -10 229 147 4 -38 84 181 -103 1 -30 246 -20 -172 -138 -3 47 301 77 176 -249
4740 -249 64 -273 -163 178 -202 -79 -161 -17 -6 -105 -134 -167 -172 164 -53 214 -146 -379 56 63 -92 -80 -318
4763 -318 278 39 -283 -11 -191 -93 226 65 200 -46 6 4 122 -227 -303 72 219 131 262 105 146 4
4785 4 -311 9 180 198 39 -258 -146 259 175 -21 -1 -46 69 356 -165 71 346 63 -420 -254 -155 174
4807 174 -44 -486 29 129 77 193 13 -14 478 220 24 59 49 80 -179 101 -39 -137 17 -255 165 317
4829 317 -108 0 -26 -50 -81 -91 -207 165 75 112 -154 -178 290 -156 213 125 24 -144 225 16 -91 -208 226
4852 226 -33 -230 -115 52 173 -144 98 -113 225 -239 -4 96 -102 138 -117 -86 -375 29 73 -57 -3
4873 -3 280 -105 -18 -5 175 -253 12 -149 63 169 66 9 99 3 98 -221 -178 126 -91 -383 -38 -162 -126
4896 -126 179 149 173 43 403 99 66 239 79 80 127 25 88 -116 288 169 14 97 -8 49 -43 -33 205 -79
4920 -79 70 -195 -281 225 69 109 -283 -126 -170 -52 -33 106 98 120 -183 -31 11 -175 122 -163 -211 13 462
4943 462 -87 -14 157 64 -24 94 -115 208 94 160 -215 -25 -154 149 -106 177 81 61 311 -8 223 282
4965 282 63 -160 101 88 -94 19 -27 110 172 210 51 -152 -192 11 9 78 -12 -43 130 -127 87 220 9
4988 9 -124 242 52 152 -292 168 5 -171 220 29 -123 59 -87 161 -111 85 159 -63 -187 -74 -102
5009 -102 -114 -66 -46 -22 238 -33 95 58 -271 90 -21 -296 -45 -197 -31 -79 -29 -112 274 216 186 93 -120 -86
5033 -86 -191 -44 -180 -130 16 164 -387 41 -20 107 46 52 -145 -154 242 -14 -21 131 -269 8 84 45 240 103
5057 103 15 120 180 44 -77 311 283 14 430 28 51 -103 -31 71 -49 49 398 -133 -133 331 112 299 -77
5080 -77 -69 -31 65 188 307 282 200 87 -220 -139 -2 -137 -81 69 47 -141 21 104 -86 64 105 158 92 -92 -103
5105 -103 -41 343 -74 -61 -32 -97 30 18 -49 108 -75 -40 -366 -44 177 -206 175 -49 282 86 40 -24 33
5128 33 -194 20 452 -182 117 268 -139 86 50 123 -56 55 -314 208 -186 -232 73 -313 -169 -337 -218
5149 -218 63 -297 -74 117 -228 269 -129 23 169 144 53 -35 -70 37 -5 -46 -13 45 56 137 113 -212 -79 -81
5173 -81 64 64 -37 -235 212 -275 -48 -55 -133 -28 -98 -249 -46 156 -173 49 -125 54 -194 102 121 -170 4
5196 4 -123 -102 -161 129 -25 424 -206 -174 -15 -56 310 37 -143 -291 -13 142 11 -98 141 159 410 -2
5218 -2 194 -64 67 66 115 48 106 249 -23 116 -76 -85 -83 -42 -18 31 179 -28 -296 108 62 104 40 -98 -54 -56 -50
5245 -50 48 102 -247 52 -60 -282 -74 264 63 75 -21 231 173 60 -157 -134 13 -188 58 -27 -142 -120 72
5268 72 0 227 -123 45 172 286 -39 -104 -45 -112 -207 243 50 13 -75 24 -344 -109 86 -83 -93 -20 -139 32
5292 32 -27 110 107 68 232 143 130 312 -240 -18 -232 154 -49 -54 -103 43 170 -199 -262 107 99 -76 -51 119 -24
5317 -24 135 -12 -41 -84 -60 -47 41 -140 -48 -112 6 -140 -45 75 -144 -338 -181 15 -264 48 -97 -83 -17 27
5341 27 90 -103 56 -76 229 -42 32 77 -50 52 -448 -22 112 -144 178 197 233 54 63 -180 67 -115 -7
5364 -7 -19 51 -151 57 -81 12 196 -219 -196 255 62 137 -166 -195 -251 -180 183 17 117 66 242 -62 -41 -120
5388 -120 -122 -132 -141 33 208 -80 -182 -228 -176 82 175 -89 35 21 59 21 34 -67 -185 76 -168 121 93 -35
5412 -35 38 81 61 270 -189 347 90 -75 -40 -143 -146 170 86 -162 414 390 -1 244 335 44 -47 -170 229 -176
5436 -176 -7 -57 57 349 255 6 -123 18 41 -230 149 -60 72 -80 174 -234 -132 50 105 -75 74
5457 74 -215 7 -86 89 -320 -138 23 245 83 109 -141 -276 15 54 232 -19 -121 264 190 -457 131 -64
5479 -64 -127 -188 40 154 233 52 -7 34 -181 -66 244 -43 140 166 142 238 15 27 -33 -375 319 -12 -309 223
5503 223 -287 -3 -264 7 -50 -53 31 -283 -182 -184 -181 -178 235 -94 -221 -194 -214 52 22 187 33 204 444 -259
5527 -259 21 95 -4 7 4 -227 44 -167 -166 -135 -257 68 297 -245 320 -175 33 33 -106 134 -8 107 66 -274
5551 -274 67 -112 -73 134 66 -16 255 68 -54 -138 103 68 39 4 -217 285 116 -114 -99 -181 -37 67 -135
5574 -135 124 50 52 -303 119 -82 230 251 -79 117 233 57 -28 -122 -44 -19 -4 157 49 -29 11 216 151 179
5598 179 -180 -65 -90 -42 15 -149 -177 5 29 -36 208 6 -164 -45 119 18 195 -110 -64 143 -229 -394
5620 -394 154 156 -181 113 -64 -1 44 -255 -90 89 -66 378 65 -237 6 13 -146 -90 -82 56 191 4 271
5643 271 -145 27 5 4 -133 3 70 49 -81 103 75 -38 172 -155 -401 45 -33 101 187 103 183 13 40 22
5667 22 -34 -211 -19 73 -139 31 200 189 -67 21 -13 -357 252 -89 44 38 -23 -18 34 137 -89 217 -148 -202
5691 -202 180 27 40 -337 18 141 -22 232 -244 -78 -239 -88 45 -108 -131 -284 -119 182 246 178 17
5712 17 186 -17 -26 287 303 -178 -45 29 63 64 218 102 146 -148 119 96 -270 -86 -129 -49 201 48 81 319
5736 319 -446 31 -111 -41 -93 315 -71 -8 -82 52 -10 333 -13 -54 -50 174 -211 -22 -83 212 -10 90 -25
5759 -25 -4 -83 101 -147 119 94 -45 -94 -291 -183 -200 97 165 -73 -10 33 -337 209 86 -219 16 355 1
5782 1 -33 142 53 57 76 112 62 311 165 -112 -22 245 138 204 -47 38 201 -220 -144 73 -78 -1 -236 7 53
5807 53 -267 -3 44 -403 189 -12 -253 100 19 -47 -202 -137 37 215 -172 -243 -184 125 177 182 -228 -55 1 234
5831 234 -45 101 -36 117 -93 -42 199 25 198 -122 163 -295 193 90 -163 48 98 -82 -210 103 -108
5852 -108 29 176 -139 369 -30 151 188 -52 -45 123 16 -229 -83 26 535 -202 157 114 241 41 -119
5873 -119 165 -257 -134 -14 102 -118 -82 100 125 118 8 321 -9 -193 -127 102 -17 37 -4 275 44 99 113
5896 113 252 -19 -180 73 38 -299 298 81 49 50 -410 -162 108 -96 -175 317 -25 2 125 24 34 266
5918 266 -201 -124 84 132 -235 -41 -16 -70 -153 51 164 -160 167 100 10 136 219 165 -68 -162 86 59 -157 -91
5942 -91 26 15 -14 29 92 76 -89 -126 -82 -79 -2 375 -31 -18 -107 290 -78 -41 -134 -238 -123 257 -76 -57 259
5967 259 169 277 -203 221 1 192 -367 113 -233 169 -49 -84 -419 -119 -123 -166 17 6 -38 16 11 -56 -294 -76
5991 -76 -31 -49 -63 -249 -22 136 -192 66 -145 -57 69 339 244 -39 -149 -397 -52 61 -194 257 15 -141
6013 -141 208 154 43 -234 -41 116 76 -350 -25 -231 -3 127 392 -76 -18 -69 -80 -92 53 -190 40 -182
6035 -182 113 -65 90 137 -34 23 -27 282 234 89 224 -5 -60 70 72 -85 -38 -37 -265 36 -106 -80 -81 40
6059 40 110 142 121 -45 8 -259 153 322 356 182 -7 153 157 -69 26 -46 -233 -98 -153 109 -105 -374 364 -6
6083 -6 100 -164 111 -114 81 -82 -228 -8 -10 10 -28 46 94 53 -55 -133 -145 39 141 -180 30 -123 44 88
6107 88 53 93 97 -83 -92 -79 48 11 -96 -94 137 32 237 -237 93 26 -108 134 102 279 -211 74 -87 54
6131 54 110 340 35 -93 -164 -225 151 63 24 -60 50 -131 -323 106 71 72 -46 54 110 11 256 103 -69 -176
6155 -176 -325 113 -173 -32 10 -218 -104 -242 -73 127 66 -199 -9 -154 -108 -19 -32 -244 66 -134 -32 358
6177 358 106 -221 78 184 61 -121 135 -285 -78 -41 255 16 -308 324 2 263 -85 -44 -108 -225 33
6198 33 -245 33 -102 -134 -114 -247 36 -219 199 -153 157 58 -10 229 263 131 168 0 -29 -396 141 -73 -340
6221 -340 289 16 -236 -116 291 115 -266 163 -279 23 4 -22 -66 -17 -139 3 222 104 -246 186 -147
6242 -147 -230 240 369 -327 -31 -128 -49 188 27 199 60 89 156 72 68 -136 77 70 -41 250 -22 -55 -134 45
6266 45 92 -247 -29 -92 450 -131 -3 182 21 -109 -148 45 181 210 260 158 -69 210 -108 -140 -143 33 -172
6289 -172 -236 -100 100 10 -29 -27 -204 174 -133 -33 -140 -372 -84 -321 -31 -188 -223 76 -123 178 -216 -56
6311 -56 268 -19 81 -63 -186 26 6 -3 -234 -23 -56 152 139 115 -65 101 125 -286 -245 -310 -16 230 325 88
6335 88 77 212 33 -274 282 -312 -193 142 -46 -69 25 43 -293 -116 -1 138 39 -15 78 181 46 -74 -15
6358 -15 -119 -8 82 -88 -45 -9 -205 -173 -260 -197 278 144 155 -125 110 -185 116 58 -25 161 117 159 15 -79
6382 -79 -79 21 149 -324 310 -79 -98 -37 -62 -1 295 -51 146 -175 -226 208 14 -57 152 9 49 -105 156
6405 156 -35 -92 232 240 18 -264 -49 -116 -34 -278 -331 -67 247 -85 53 96 70 -25 -63 202 -59 371 -187
6428 -187 276 -139 44 -150 -154 13 422 -16 -348 302 48 168 189 59 140 -104 -22 105 -24 348 -95 87
6450 87 -55 -530 2 -349 -440 69 -195 12 -62 90 -37 320 -27 62 56 238 266 109 -6 -5 99 -219 -167
6473 -167 66 -49 -45 101 -49 81 13 86 -157 -111 -306 -113 75 184 72 135 -239 16 -94 -70 -168 -265 -193
6496 -193 -63 314 73 -70 -109 81 -23 109 111 125 -77 79 -114 188 -47 -130 247 -303 -231 -120 1 73
6518 73 285 -5 -38 147 -116 148 46 -164 -325 -15 101 -342 -191 -21 198 199 184 -201 66 -187 143 -180
6540 -180 -173 255 -312 -30 -181 134 -60 235 -133 -81 86 74 -37 53 -200 88 170 7 -221 -27 171 -22
6562 -22 -138 103 131 -40 281 212 -57 -140 150 -31 -21 166 78 152 -37 26 216 -106 256 -113 185 185 -194
6585 -194 128 -100 150 -189 -40 178 81 -44 90 -198 -221 47 38 -15 8 -63 -269 -79 253 -300 -111 135
6607 135 -106 167 153 109 -71 -209 -130 92 178 -252 -136 -240 78 202 -286 -14 -34 138 -61 55 -186 149
6629 149 -179 -77 90 -94 37 -78 72 216 355 198 -2 -111 -127 114 -131 -190 198 -7 248 125 -92
6650 -92 -9 322 188 1 -107 22 -36 -147 -61 -84 -304 139 -45 145 -171 25 210 -133 260 148 -52 -292
6672 -292 -47 -214 67 -238 137 41 191 -76 211 155 22 -189 43 340 101 79 -444 -22 94 124 13
6693 13 16 -10 48 157 -23 -135 156 -189 -101 -13 -380 -64 110 222 -161 71 143 -238 -263 -261 96 -39 -210 -80
6717 -80 50 50 134 125 252 -186 -20 354 -246 -128 97 -223 9 221 4 81 236 259 -57 58 -154 92 -85
6740 -85 -68 -164 16 -354 407 100 -198 -256 -30 -7 90 110 61 365 -326 130 -212 117 -135 294 273 227 21
6763 21 150 198 17 140 -362 -153 3 -81 -234 -97 279 36 142 38 26 -76 86 -144 -216 184 -46 100
6785 100 -146 93 -146 -156 120 144 -191 -18 -100 -17 -104 240 -144 -85 -165 -233 210 119 152 7 -390 132 -170
6808 -170 99 211 -26 -122 -313 -75 65 181 -293 -29 -134 -60 -57 -139 -43 57 -202 148 -36 168 142 202 215
6831 215 44 -41 -22 178 44 -103 -67 96 -1 -191 247 -39 -15 20 30 115 -280 166 335 219 -73 55 105
6854 105 1 -51 -64 -199 -227 89 33 122 -183 -155 151 -68 23 -106 100 33 -145 -133 -90 -16 151 254 46 -135
6878 -135 242 -358 -203 -43 -36 -402 -128 109 -86 74 245 -112 -66 164 -23 275 -34 -35 -111 303 -21 63
6900 63 -123 -134 139 67 14 -18 -326 -41 231 116 -189 20 -52 -186 103 -56 290 343 34 295 104 -40
6922 -40 -17 40 201 22 -133 -102 143 244 -36 -13 440 92 196 -176 20 175 -69 155 -77 -189 -115 -261
6944 -261 -88 -61 -87 301 -22 -111 202 -190 197 -101 -198 -92 -77 2 -103 -100 -69 -30 -168 384 -286 172 -12
6967 -12 307 -45 -228 -219 -30 32 -67 174 101 -75 69 95 0 -123 -27 -77 -133 67 -31 72 94 29 -257 -9 261
6992 261 383 31 -300 58 105 -119 -143 370 -48 -233 -253 25 -95 67 114 57 126 150 -100 -23 69 193 53
7015 53 -265 -82 52 15 -242 -148 284 147 88 63 215 306 -362 251 -246 -158 -257 -182 -409 9 374 -31 -97
7038 -97 -46 137 -46 300 -10 8 302 25 140 -58 169 28 -50 -19 -40 -75 176 192 -91 -282 226 15 -141
7061 -141 21 343 -237 90 -48 50 84 310 -81 109 19 180 217 114 -108 55 -391 -77 -198 -14 132
7082 132 75 -5 -239 48 -72 5 -83 328 -67 -114 -129 96 -30 204 14 -117 -38 -1 98 138 -254 -155 -60 230
7106 230 -53 -11 -330 231 99 -162 -312 -16 33 -69 53 178 -9 -122 87 303 -117 -16 17 -210 -116
7127 -116 -47 -38 -350 76 -43 -73 83 68 217 161 -130 -155 32 -18 17 252 240 -77 51 -57 127 36 99 401
7151 401 -224 -34 -228 159 84 16 -114 235 165 -7 216 -11 196 -177 -130 28 131 124 -96 170 -110 388
7173 388 208 158 -77 -88 -300 -16 16 70 119 -154 47 -202 212 1 -9 -105 76 -20 201 122 73 74 110 -10
7197 -10 -15 56 -173 42 -137 -173 -70 163 -106 -136 206 32 11 75 203 12 134 107 -279 28 67 -190 139
7220 139 -416 -238 175 -21 -125 207 149 -81 127 -46 -100 305 77 218 -59 203 81 111 -187 -107 45
7241 45 81 -128 -25 304 277 317 132 118 -1 -58 11 -14 55 -374 -128 -324 92 168 -159 -298 41 -132 126
7264 126 34 139 242 -187 -210 296 12 -70 118 187 108 69 210 1 -37 63 -160 193 215 -158 110 -308 85
7287 85 149 238 174 -116 124 63 82 33 -117 200 76 -8 57 -133 290 110 -163 -221 -270 -17 97 295 -209 6
7311 6 140 -85 192 -40 -161 -36 216 80 -135 -10 -48 152 144 137 39 3 -40 39 -141 -70 -246 124 -56 70
7335 70 65 35 302 48 -69 -182 -124 -115 216 225 -14 -299 134 27 -64 106 -85 15 -156 343 99 319 146
7358 146 161 45 -21 107 47 -50 86 13 -143 38 117 250 44 55 5 5 3 152 -174 230 31 50 88 -62 -62
7383 -62 -154 -211 114 -16 -199 -109 -97 134 -99 -58 76 -212 287 -225 -197 87 30 -21 -185 52 265 -9 -309
7406 -309 190 -263 -235 27 279 86 -199 217 159 -162 -32 286 -177 140 86 51 -201 -173 273 193 124 -91
7428 -91 -57 -229 137 -342 10 -56 -208 258 -115 183 -104 63 -295 -177 -141 140 108 -94 -98 359 -11 339
7450 339 147 -112 -234 -285 43 145 131 106 421 -10 337 82 -135 77 33 214 -209 -183 -98 51 367 194
7472 194 -17 -162 -121 -79 -24 -115 -220 100 -24 262 70 88 92 67 97 202 37 -195 75 5 -272 -133 262
7495 262 126 162 105 223 45 256 321 49 164 58 -73 49 -138 -53 3 198 -93 70 -258 -98 -158 142
7517 142 12 -119 -34 -150 -5 4 -88 280 -15 -539 169 147 -95 -33 88 16 231 175 -121 -112 12 51 91 220
7541 220 290 -151 10 170 -335 -350 169 91 -111 264 -17 11 -32 -239 -274 126 62 287 -23 -105 98 33 100
7564 100 -76 -340 300 -257 -86 -45 12 15 154 -87 183 197 221 280 192 13 18 -316 -77 -22 -241 26 13 99
7588 99 -158 -336 -166 -191 173 -125 -144 -64 -382 299 79 16 -91 33 -75 123 16 -11 94 -89 -64 125
7610 125 -113 80 -100 131 56 -8 107 35 -115 189 450 210 527 -41 20 9 114 287 -60 -90 -88 -261 178
7633 178 -39 341 -352 -269 -310 -31 58 -81 236 101 13 88 -58 -143 -27 63 8 -206 1 48 -53 15 289
7656 289 105 -8 -190 -84 -57 244 266 96 -136 267 -13 -153 -104 104 49 38 191 17 -115 -86 144 -185
7678 -185 -88 113 134 42 -125 -11 283 -16 149 162 79 -185 58 -115 116 31 -130 -260 -32 35 -123 84
7700 84 -192 299 313 -43 -28 -35 301 -94 277 80 -42 305 7 181 -127 67 164 214 -41 -23 74 -107 -89
7723 -89 -323 106 -77 -187 229 134 222 159 134 32 326 21 121 8 -100 -181 121 35 -178 -77 -43 -157 -127
7746 -127 24 41 38 -48 18 -377 -151 -51 224 254 17 -152 58 -92 -120 120 86 24 -285 -260 -24 -48 -344 128
7770 128 74 -215 6 -415 155 115 22 208 -36 133 -30 11 51 154 97 190 -102 117 220 30 177 292
7792 292 125 48 174 -57 -166 216 -60 -32 215 -149 70 89 -135 129 -76 -204 170 151 24 -50 -275 33
7814 33 217 -129 150 -184 200 138 -159 1 -146 135 -123 105 -20 -110 -57 -188 103 -132 91 21 -213 -259
7836 -259 180 169 -176 -170 -129 -26 -21 -100 190 -29 -78 232 26 -73 -118 -123 -136 36 265 -63 23 115 276 254 -204
7861 -204 -334 -24 35 170 215 301 -277 -216 -60 123 -141 -14 86 -108 98 25 -71 4 -71 -54 -300 -98 72
7884 72 -3 62 108 90 102 60 -95 309 40 48 -80 -259 -39 66 139 -221 391 58 -194 -126 253 -136 266 -88
7908 -88 -405 208 224 254 -6 189 172 -128 -79 66 256 130 85 96 -34 -9 -122 0 -36 -12 29 -241 -384 128
7932 128 85 182 -3 227 173 -282 210 52 71 38 273 -48 -96 96 139 -3 -184 1 -282 246 -110 89
7954 89 158 -24 164 9 -6 150 -39 -69 21 -126 94 -202 -141 -13 -54 200 -102 41 -35 -10 255 -193 -218
7977 -218 -264 170 -29 69 275 -52 72 206 -53 -183 183 116 -80 -219 28 -247 59 -335 156 -203 116
7998 116 258 -94 106 292 147 25 196 20 126 101 -148 17 -89 120 -244 -299 -213 63 23 -53 124 91
8020 91 100 51 -21 142 210 -145 -96 -203 -68 -202 6 165 -197 -178 -433 83 158 108 90 138 -175 96 51 -235
8044 -235 369 -59 -147 -67 285 -9 -18 91 2 61 -49 287 -163 107 -178 -49 86 360 127 18 141 -132
8066 -132 -207 -413 274 -82 185 -79 212 206 266 90 -137 -141 92 304 -242 -202 119 124 61 86 -24 117 -8 -196
8090 -196 -1 111 -219 9 -12 -139 -250 -87 57 386 174 139 -227 79 119 73 93 118 -205 106 397 106
8112 106 42 15 -332 97 54 -330 4 -92 11 -135 -7 -170 -135 45 55 429 101 -115 29 227 122 104
8134 104 238 -183 7 -90 97 -90 58 196 106 -108 -181 120 281 124 -90 194 -81 87 -227 -156 -34
8155 -34 -147 242 -129 -140 100 72 36 47 -239 -32 -342 206 -257 -74 -20 -14 -24 -6 101 -110 -153 217 -154 26
8179 26 -53 -102 -316 -215 127 238 76 -73 -218 -249 -84 -25
8191b5
##END NTUPLES=NMR FID
##END=
