##TITLE=1H_LR-691-H1-C1
 CDCl3
 8 sc, 
 10.9.2024
##JCAMPDX= 6.0         $$ Bruker NMR JCAMP-DX V2.0
##DATA TYPE= NMR FID
##DATA CLASS= NTUPLES
##ORIGIN= UXNMR, Bruker Analytische Messtechnik GmbH
##OWNER= root
$$ XWIN-NMR		Version 3.5
$$ Tue Sep 10 16:27:24 2024 Russian Standard Time (UT+4h)  she@DPX200
##.OBSERVE FREQUENCY= 200.1318
##.OBSERVE NUCLEUS= ^1H
##.DELAY= (6, 6)
##.ACQUISITION MODE= SIMULTANEOUS
##.ACQUISITION SCHEME= undefined
##.AVERAGES= 8
##.DIGITISER RES= 18
##SPECTROMETER/DATA SYSTEM= spect
##.PULSE SEQUENCE= zg30
##.SOLVENT NAME= CDCl3
##.SHIFT REFERENCE= (INTERNAL, CDCl3, 0, 15.7039)
##AUDIT TRAIL= $$ (NUMBER, WHEN, WHO, WHERE, WHAT)
$$ ##TITLE= Audit trail, XWIN-NMR		Version 3.5
$$ ##JCAMPDX= 5.01
$$ ##ORIGIN= Bruker BioSpin GmbH
$$ ##OWNER= she
$$ F:/spectra/data/she/nmr/H-F/1/audita.txt
$$ ##AUDIT TRAIL=  $$ (NUMBER, WHEN, WHO, WHERE, WHAT)
(   1,<2024-09-10 16:26:17.40 +0400>,<she>,<DPX200>,
      <created by zg, POWCHK disabled, PULCHK disabled
       configuration hash MD5:
       00 E9 B6 7A A2 85 ED C7 34 08 36 98 17 FE 4E 26
       data hash MD5: 16K
       97 0A EE F4 E5 D1 30 47 0B 0D 02 3C 71 A7 C1 CA>)
$$ ##END=
$$ 
$$ hash MD5
$$ 0F 74 CD 38 C7 76 E6 84 90 8A 59 DA 5F D8 9C 46
##$RELAX= 
##$RELAX= 
##$RELAX= 
##$RELAX= 
##$RELAX= 
##$RELAX= 
$$ Bruker specific parameters
$$ --------------------------
##$DU= <F:/spectra>
##$EXPNO= 1
##$NAME= <H-F>
##$PROCNO= 1
##$TYPE= <nmr>
##$USER= <she>
##$AMP= (0..31)
100 100 100 100 100 100 100 100 100 100 100 100 100 100 100 100 100 100 
100 100 100 100 100 100 100 100 100 100 100 100 100 100 
##$AQSEQ= 0
##$AQ_mod= 1
##$AUNM= <au_zg>
##$AUTOPOS= <>
##$BF1= 200.13
##$BF2= 200.13
##$BF3= 200.13
##$BF4= 200.13
##$BF5= 200.13
##$BF6= 200.13
##$BF7= 200.13
##$BF8= 200.13
##$BYTORDA= 1
##$CFDGTYP= 0
##$CFRGTYP= 5
##$CHEMSTR= <none>
##$CNST= (0..31)
1 1 145 1 1 1 1 1 1 1 1 1 1 1 1 1 1 1 1 1 1 1 1 1 1 1 1 1 1 1 1 1 
##$CPDPRG= <>
##$CPDPRG1= <>
##$CPDPRG2= <>
##$CPDPRG3= <>
##$CPDPRG4= <mlev>
##$CPDPRG5= <mlev>
##$CPDPRG6= <mlev>
##$CPDPRG7= <mlev>
##$CPDPRG8= <mlev>
##$CPDPRGB= <>
##$CPDPRGT= <>
##$D= (0..31)
0 1.2 0 0 0 0 0 0 0 0.06 0 0.03 0 0 0 0 0.0002 0 0 0 0 0 0 0 0 0 0 0 0 
0 0 0 
##$DATE= 1725971176
##$DBL= (0..7)
120 120 120 120 120 120 120 120 
##$DBP= (0..7)
150 150 150 150 150 150 150 150 
##$DBP07= 0
##$DBPNAM0= <>
##$DBPNAM1= <>
##$DBPNAM2= <>
##$DBPNAM3= <>
##$DBPNAM4= <>
##$DBPNAM5= <>
##$DBPNAM6= <>
##$DBPNAM7= <>
##$DBPOAL= (0..7)
0.5 0.5 0.5 0.5 0.5 0.5 0.5 0.5 
##$DBPOFFS= (0..7)
0 0 0 0 0 0 0 0 
##$DE= 6
##$DECBNUC= <off>
##$DECIM= 24
##$DECNUC= <off>
##$DECSTAT= 4
##$DIGMOD= 1
##$DIGTYP= 9
##$DL= (0..7)
0 120 120 120 120 120 120 120 
##$DP= (0..7)
150 150 150 150 150 150 150 150 
##$DP07= 0
##$DPNAME0= <>
##$DPNAME1= <>
##$DPNAME2= <>
##$DPNAME3= <>
##$DPNAME4= <>
##$DPNAME5= <>
##$DPNAME6= <>
##$DPNAME7= <>
##$DPOAL= (0..7)
0.5 0.5 0.5 0.5 0.5 0.5 0.5 0.5 
##$DPOFFS= (0..7)
0 0 0 0 0 0 0 0 
##$DQDMODE= 0
##$DR= 18
##$DS= 0
##$DSLIST= <SSSSSSSSSSSSSSS>
$$ [...]
##$SUBNAM2= <"">
##$SUBNAM3= <"">
##$SUBNAM4= <"">
##$SUBNAM5= <"">
##$SUBNAM6= <"">
##$SUBNAM7= <"">
##$SUBNAM8= <"">
##$SUBNAM9= <"">
##$SW= 24.0689170037331
##$SWIBOX= (0..15)
0 0 2 0 0 0 0 0 0 0 0 0 0 0 0 0 
##$SW_h= 4816.95568400771
##$TD= 16384
##$TD0= 1
##$TE= 0
##$TE2= 300
##$TE3= 300
##$TEG= 300
##$TL= (0..7)
0 120 120 120 120 120 120 120 
##$TP= (0..7)
150 150 150 150 150 150 150 150 
##$TP07= 0
##$TPNAME0= <>
##$TPNAME1= <>
##$TPNAME2= <>
##$TPNAME3= <>
##$TPNAME4= <>
##$TPNAME5= <>
##$TPNAME6= <>
##$TPNAME7= <>
##$TPOAL= (0..7)
0.5 0.5 0.5 0.5 0.5 0.5 0.5 0.5 
##$TPOFFS= (0..7)
0 0 0 0 0 0 0 0 
##$TUNHIN= 0
##$TUNHOUT= 0
##$TUNXOUT= 0
##$USERA1= <user>
##$USERA2= <user>
##$USERA3= <user>
##$USERA4= <user>
##$USERA5= <user>
##$V9= 5
##$VALIST= <valist>
##$VCLIST= <CCCCCCCCCCCCCCC>
##$VD= 0
##$VDLIST= <DDDDDDDDDDDDDDD>
##$VPLIST= <PPPPPPPPPPPPPPP>
##$VTLIST= <TTTTTTTTTTTTTTT>
##$WBST= 1024
##$WBSW= 4
##$XGAIN= (0..3)
0 0 0 0 
##$XL= 0
##$YL= 0
##$YMAX_a= 194956
##$YMIN_a= -157161
##$ZGOPTNS= <>
##$ZL1= 120
##$ZL2= 120
##$ZL3= 120
##$ZL4= 120
##$ABSF1= 10
##$ABSF2= 0
##$ABSG= 5
##$ABSL= 3
##$ALPHA= 0
##$AQORDER= 0
##$ASSFAC= 0
##$ASSFACI= 0
##$ASSFACX= 0
##$ASSWID= 0
##$AUNMP= <proc_1d>
##$AZFE= 0.1
##$AZFW= 0.1
##$BCFW= 1
##$BC_mod= 2
##$BYTORDP= 1
##$COROFFS= 0
##$CY= 11.3945322036743
##$DATMOD= 1
##$DC= 2
##$DFILT= <>
##$DTYPP= 0
##$F1P= 15.6554695791079
##$F2P= 12.8336369535428
##$FCOR= 0.5
##$FTSIZE= 0
##$FT_mod= 4
##$GAMMA= 1
##$GB= 0.15
##$INTBC= 1
##$INTSCL= 1
##$ISEN= 128
##$LB= 0.24
##$LEV0= 0
##$LPBIN= 0
##$MAXI= 10000
##$MC2= 0
##$MEAN= 0
##$ME_mod= 0
##$MI= 1.114404
##$NCOEF= 0
##$NC_proc= 0
##$NLEV= 6
##$NOISF1= 3.799351
##$NOISF2= 2.8
##$NSP= 1
##$NTH_PI= 0
##$NZP= 0
##$OFFSET= 15.70392
##$PC= 1
##$PHC0= -26003.27
##$PHC1= 22.18748
##$PH_mod= 1
##$PKNL= yes
##$PPARMOD= 0
##$PSCAL= 0
##$PSIGN= 0
##$REVERSE= no
##$SF= 200.130013532006
##$SI= 16384
##$SIGF1= 3
##$SIGF2= 2
##$SINO= 400
##$SIOLD= 16384
##$SREGLST= <1H.CDCl3>
##$SSB= 0
##$STSI= 0
##$STSR= 0
##$SW_p= 3612.71676300578
##$SYMM= 0
##$S_DEV= 0
##$TDeff= 0
##$TDoff= 0
##$TI= <>
##$TILT= no
##$TM1= 0
##$TM2= 0
##$TOPLEV= 0
##$USERP1= <user>
##$USERP2= <user>
##$USERP3= <user>
##$USERP4= <user>
##$USERP5= <user>
##$WDW= 1
##$XDIM= 8192
##$YMAX_p= 0
##$YMIN_p= 0
$$ End of Bruker specific parameters
$$ ---------------------------------
##NTUPLES= NMR FID
##VAR_NAME=  TIME,          FID/REAL,        FID/IMAG
##SYMBOL=    X,             R,               I
##VAR_TYPE=  INDEPENDENT,   DEPENDENT,       DEPENDENT
##VAR_FORM=  AFFN,          ASDF,            ASDF
##VAR_DIM=   8192,          8192,            8192
##UNITS=     SECONDS,       ARBITRARY UNITS, ARBITRARY UNITS
##FACTOR=    0.0002076,     1,               1
##FIRST=     0,             0,               0
##LAST=      1.7004516,     0,               0
##MIN=       0,             -157161,         0
##MAX=       1.7004516,     194956,          0
$$ Real data points
##PAGE= N=1
##DATA TABLE= (X++(R..R)), XYDATA
0 0 0 0 0 0 0 0 0 0 0 8 -8 8 -9 16 -16 24 -28 32 -40 47 -55 64 -75 87 -100 116 -132 149 -171 194 -220 244
32 244 -276 309 -344 385 -429 478 -531 588 -653 722 -800 884 -979 1084 -1203 1336 -1489
49 -1489 1662 -1862 2099 -2383 2730 -3163 3723 -4480 5558 -7219 10155 -28448 194956 60713
63 60713 -114806 143728 118879 -63879 -16395 103780 -18512 -126460 -2186 7508 -110857
74 -110857 4050 53877 -21077 16632 30689 19279 40739 18473 37395 -6382 -62461 1969
86 1969 -10486 -45635 -1211 -21497 -20390 -2148 7854 65365 24301 -6697 58182 -1187 -35322
99 -35322 20691 -12766 -38478 -32304 -27408 -7220 -26250 26845 60410 -28658 17216 75238 -16764
112 -16764 -4444 41076 -22920 -63323 -27093 19492 -34635 -48705 61840 9621 -50579 70387
124 70387 46259 -23330 38906 10991 -36750 -11987 -10968 -15105 -26283 -11035 -324 -23481
136 -23481 28795 38177 -11075 36109 20404 -23373 24661 -6638 -30727 7875 -30416 -32716
148 -32716 4446 912 7376 2283 22636 24955 -19895 28133 34874 -38563 -460 5315 -42039
161 -42039 -5867 -1191 -11855 3215 -5322 14791 13271 5623 32363 -2437 -7259 17543 -27713
174 -27713 -11575 13147 -28290 -12752 1670 -4680 10324 2494 22757 16102 -20435 24726 13516
187 13516 -32680 13278 540 -34226 -2151 -1832 -2958 1535 890 17699 -2645 2658 25601
200 25601 -9886 2098 9596 -28424 3746 2182 -26565 11858 500 -15599 14386 5501 6216
213 6216 8666 35 10328 -10042 -3657 11340 -23749 555 10874 -30814 8714 17966 -17492
226 -17492 11029 14123 -3752 652 1213 12722 -9230 -16601 17590 -13129 -18517 19268 -6415
239 -6415 -6444 10980 -4246 9135 1878 -2789 15922 -11193 -6488 11885 -14345 -723 4482 -11543
253 -11543 6193 -3536 -2133 13724 -7385 4789 9344 -10790 7414 271 -7136 7684 -11946
266 -11946 -1146 7602 -15692 10139 7454 -15483 12380 5048 -8814 7475 1273 1217 -5563 -5760
280 -5760 12919 -12912 -7795 19736 -14476 -6671 18149 -8317 1041 8506 -4546 4734 -3870
293 -3870 -81 5429 -10773 3442 -551 -11211 10824 -4026 -4447 14296 -9454 1135 12057
306 12057 -9887 5821 3831 -10240 4971 -4177 -2915 3668 -7465 6192 -593 -7754 14324
319 14324 -3424 -4855 13654 -8139 -2777 6286 -7620 3444 -3621 -5376 8455 -9271 498
332 498 12059 -8763 4404 6721 -6763 5485 -1734 -1478 4054 -10678 2766 1756 -9720 9988
346 9988 -1704 -5762 12636 -6117 -201 11234 -7997 703 2415 -6712 2871 -4648 280 3172
360 3172 -9259 7754 2837 -7984 13043 -1687 -6697 11473 -7261 -3950 7036 -7964 -50
373 -50 -62 -3870 5520 -4124 3291 6168 -8548 7676 3016 -9113 8833 -3811 -7004 7087 -7583
388 -7583 -457 5541 -6451 5091 860 -3085 8253 -3657 1340 4837 -9410 3986 439 -8104
402 -8104 6524 -3459 -3122 7024 -5637 4825 4332 -7124 8119 -1551 -6621 8309 -5359 -3250
416 -3250 4089 -6252 2565 898 -2267 6769 -4891 1619 6490 -9034 5521 3612 -10444 6045
430 6045 -672 -6814 5993 -2931 -201 3065 -4029 5505 -553 -2931 7033 -5776 -455 5116 -8755
445 -8755 4304 2093 -7890 6713 -1803 -3832 7745 -4007 601 3873 -5167 3581 -1304 -2839
459 -2839 5190 -6414 1103 4647 -7879 5895 2608 -6969 6385 -1970 -2638 6108 -5235 2011
473 2011 2179 -6771 5575 -663 -4206 5984 -4133 -409 3339 -4453 5019 -1111 -3921 7029
487 7029 -5391 -1111 7836 -7941 1492 4342 -6153 3556 31 -2092 3990 -4029 1908 2332 -5038
502 -5038 6196 -1060 -4561 6412 -4695 -694 5034 -6666 2969 1736 -6035 5567 -496 -2977
516 -2977 4973 -2787 960 1723 -3450 4805 -3019 -2857 6205 -6078 -32 5697 -6368 3333 2495
531 2495 -4606 5550 -1351 -1764 4315 -4722 1412 1418 -5326 4214 -1593 -2464 5139 -3827 1985 3528
547 3528 -5061 5243 -231 -5363 6005 -3527 -3124 4373 -4605 485 2131 -2739 4311 -1439 -593
562 -593 5147 -4632 2393 2640 -6469 3823 -968 -4904 5409 -3251 -785 4989 -4362 2390 2663
577 2663 -3153 3671 -1731 -1720 2117 -4778 1912 497 -5631 5322 -1299 -2954 6878 -3115 -4
592 -4 4982 -4471 1634 460 -3975 2966 -2836 -1194 3788 -4227 2509 2176 -3140 4747 -1516 -2079
608 -2079 5123 -5184 34 2703 -6491 2391 923 -3635 4493 -1279 -94 4092 -3234 2797 409
623 409 -3860 4016 -3488 -2230 3965 -5536 1146 3102 -5054 4303 1492 -2790 4990 -2135 -1023
638 -1023 2810 -4337 1525 -187 -3713 3426 -2953 -254 4488 -4116 3138 2798 -4737 4341 -498
653 -498 -3852 3443 -3215 -1292 2013 -3847 2150 488 -2088 4394 -1805 -80 3374 -4193 2337
668 2337 185 -4992 3809 -1890 -2969 4589 -2999 542 3434 -2892 3127 169 -2475 3206 -3065
683 -3065 -712 1734 -4465 2516 791 -3689 4738 -1082 -1194 4872 -3525 816 2257 -3896 2464
698 2464 -610 -3243 2966 -2885 339 2455 -3131 3246 77 -2626 4675 -2597 -1434 3797 -4741
713 -4741 1034 1580 -4178 3038 -75 -2029 3752 -2314 770 2389 -3246 2452 -917 -3402 3727
728 3727 -2889 -205 3364 -3946 2200 1755 -3491 3654 -899 -2067 3677 -2677 16 1744 -3137
743 -3137 2412 -788 -1908 4051 -2416 298 3046 -3933 2277 1134 -3647 3396 -1740 -2392 3129
758 3129 -3061 849 2097 -2463 3048 -432 -1344 3451 -3213 282 2252 -4149 2104 -191 -3195
773 -3195 3740 -1817 -1122 3784 -2893 1003 1798 -2839 1988 -1327 -1659 2822 -2646 632 1836 -3402
789 -3402 2935 293 -1967 3985 -2584 -724 2734 -4166 1162 957 -3158 2456 -1007 -1017 2936 -2104
805 -2104 1215 1425 -3418 2726 -678 -2371 3290 -2983 -426 2664 -3451 2377 1359 -2372 3047
820 3047 -743 -972 2232 -2848 950 782 -3185 2432 -866 -1426 3476 -2459 959 2372 -3549 2526
836 2526 749 -3495 2432 -1381 -1649 2191 -2825 873 1038 -2302 2754 -897 -455 3242 -3174 832
852 832 1387 -3646 2523 -285 -2990 2993 -1795 -550 2858 -2476 1697 1099 -2098 2438 -1550 -1038
868 -1038 2174 -3170 544 1235 -3056 2867 -342 -2037 3320 -1696 -182 2240 -2876 1487 172
883 172 -2513 2233 -1374 -439 2278 -2595 1720 1254 -2501 3453 -997 -2166 3352 -2475 -330 1975
899 1975 -3197 1837 402 -2022 2944 -926 -474 1874 -1963 1540 218 -2473 2592 -1867 -1324 2970
915 2970 -2487 848 2305 -2579 2325 352 -2145 2645 -1454 -1002 1453 -2416 852 363 -2167 3150
931 3150 -1303 -598 2934 -2768 1018 1468 -2752 2070 -660 -2146 2354 -1970 -447 1923 -2273 1776
947 1776 64 -1520 2808 -1725 -201 2113 -3200 1091 1212 -2782 2337 -637 -1662 2904 -1648
962 -1648 -106 1757 -2564 1574 -114 -1863 2143 -1831 -184 1776 -2800 1623 1090 -2156 2905
977 2905 -961 -1081 2708 -2164 -1 1330 -2567 1558 73 -1100 2087 -1512 530 1891 -2383
992 -2383 1820 484 -2392 2346 -1757 -927 2331 -2418 527 1530 -1842 2153 -68 -1007 2216 -1607
1008 -1607 143 1314 -2476 1858 -102 -1787 2736 -1549 -512 2621 -2257 1145 1393 -2585 1564
1023 1564 -688 -1499 1801 -2090 289 1221 -2128 2081 -426 -1299 2592 -1869 -17 1964 -2959 1382
1039 1382 431 -2796 2271 -415 -771 2236 -1798 733 1164 -2156 1875 -556 -1520 2214 -2008 224
1055 224 1374 -2650 1948 564 -1866 2644 -704 -696 2218 -1868 406 437 -1945 1614 -358 -1304 2183
1072 2183 -1797 545 1537 -2558 1906 98 -2115 2235 -1239 -771 1833 -2361 656 768 -1643 2294
1088 2294 -612 -547 1723 -1825 870 1034 -2366 1359 -467 -2000 2411 -1731 -176 2274 -1759 1452
1104 1452 670 -1800 1670 -995 -775 1576 -1948 1053 900 -1999 1610 -588 -1027 2750 -1692 141
1120 141 1937 -2128 1327 428 -2023 1735 -1137 -729 1848 -1379 1074 789 -1641 2132 -707 -963
1136 -963 2146 -2235 59 1257 -2290 1280 53 -1558 2291 -741 -556 1528 -1695 758 547 -1892
1152 -1892 1693 -1148 -700 2006 -1932 519 1418 -2078 1989 386 -1483 2044 -1198 -629 1399 -2076
1168 -2076 693 498 -1366 1816 -893 -134 1935 -1762 1233 1043 -2224 1545 -428 -1536 1898 -2039
1184 -2039 -315 1424 -1610 1209 463 -1548 1716 -957 -417 1568 -2125 762 378 -1706 1775 -384
1200 -384 -942 2293 -1077 276 1360 -1977 836 -265 -1332 1524 -986 -544 1507 -2211 961 526
1216 526 -1290 2096 -1000 -367 1665 -1795 139 918 -2172 1151 25 -1126 2155 -738 64 1420
1232 1420 -1461 1057 -165 -1156 1603 -1259 -671 1483 -2037 785 1216 -1576 1726 -9 -836 1622
1248 1622 -1429 102 910 -1971 1153 -269 -1385 1868 -1190 122 1742 -1469 1155 622 -1629
1263 -1629 1736 -623 -1301 1496 -1306 210 1142 -1614 1536 219 -839 1899 -1004 71 1194
1278 1194 -2013 884 -21 -2101 1662 -582 -660 1833 -1339 677 1294 -1368 1433 -143 -950 1259
1294 1259 -1648 -166 524 -1861 1351 411 -1199 2171 -664 -499 1784 -1486 183 575 -1737 1271
1310 1271 -453 -767 1565 -1187 616 1346 -1358 1637 -74 -1045 1384 -1338 -729 1448 -1537 781
1326 781 449 -1600 1891 -229 -526 1659 -1112 486 777 -1634 1026 -556 -1354 1519 -1259 62
1342 62 1405 -1761 1163 762 -1291 1632 -374 -535 1372 -1550 400 612 -1702 1149 -266 -561
1358 -561 1665 -1133 583 1304 -1710 945 159 -1721 1371 -854 -533 1336 -1356 826 605 -964
1374 -964 1312 -367 -232 1263 -1547 99 663 -1629 960 -406 -1203 1783 -676 -265 1513 -1246
1390 -1246 854 163 -1284 678 -657 -815 1026 -1336 666 560 -1464 1666 19 -463 1617 -990
1406 -990 -44 959 -1429 738 205 -1077 1199 -597 -134 1528 -1018 865 495 -1427 1269 -747
1422 -747 -870 1348 -1429 41 989 -1332 1046 136 -1045 1623 -743 -319 1076 -975 149 -22
1438 -22 -1433 1129 -342 -899 1638 -1108 536 1033 -1389 1081 -271 -947 1464 -1051 -161 872
1454 872 -1164 928 449 -922 1295 -778 -386 1374 -1399 228 629 -1460 1456 -38 -861 1506
1470 1506 -853 233 892 -977 839 254 -905 1288 -470 -212 984 -1526 379 583 -967 1569
1486 1569 -68 -719 1600 -1066 200 853 -1298 683 -10 -673 789 -1066 -46 1071 -1159 1094
1502 1094 477 -1345 1461 -352 -734 1417 -833 227 667 -847 947 -35 -635 1240 -641 58
1518 58 745 -1490 740 167 -1014 1105 -528 -51 1146 -971 345 1009 -1263 981 -110 -813 987
1535 987 -742 250 1003 -1268 266 -100 -973 1505 -679 -208 1008 -1061 662 461 -1336 761 -572
1552 -572 -750 1322 -969 216 693 -869 897 -38 -843 1196 -897 -280 677 -1430 350 436 -1286
1569 -1286 855 -217 -268 1406 -822 517 598 -930 1128 -400 -757 1057 -1021 198 998 -991
1585 -991 707 468 -868 1242 -679 -472 1008 -1300 33 301 -1027 914 -85 -422 1169 -866
1601 -866 59 799 -1160 1128 -159 -883 943 -473 -461 1166 -906 532 609 -729 1132 9 -589
1618 -589 1041 -1052 50 327 -1135 716 -9 -640 1032 -1037 -25 1139 -989 605 129 -935
1634 -935 998 -555 -490 825 -809 122 467 -704 947 -234 -609 1080 -775 -20 641 -972 564
1651 564 178 -943 669 -179 -362 1095 -708 446 173 -1079 814 -316 -498 1018 -962 143
1667 143 611 -824 575 -82 -337 1143 -375 -284 873 -949 555 122 -972 685 -535 -668 971
1684 971 -695 86 642 -1139 833 -105 -732 876 -777 -68 749 -1069 572 505 -419 943 -264
1701 -264 -229 539 -677 108 54 -1473 569 -401 -755 1469 -539 272 633 -877 672 -265 -691 718
1719 718 -511 -129 270 -1018 387 13 -803 832 -132 -149 1287 -515 352 670 -765 760 -251
1736 -251 -737 851 -394 -207 622 -788 499 264 -860 758 -277 -123 917 -793 210 173 -819
1753 -819 811 125 -520 940 -409 -47 463 -710 316 -77 -508 964 -602 -5 1027 -844 415
1770 415 554 -820 1083 -8 -228 585 -771 97 327 -917 641 -98 -553 948 -624 -24 707
1787 707 -633 218 143 -1129 603 -558 -828 899 -987 82 429 -598 597 -307 -461 656 -813
1804 -813 -241 846 -964 251 -206 -613 709 -352 -267 1235 -615 343 387 -801 399 -52 -605 617
1822 617 -817 86 690 -708 552 237 -321 982 -272 -165 866 -1061 -79 234 -779 396 -303
1839 -303 -476 888 -744 64 472 -997 654 -307 -417 835 -559 -448 332 -855 291 169 -611
1856 -611 1014 37 -253 538 -774 140 589 -782 635 -253 -509 981 -355 -62 584 -832 675
1873 675 325 -495 696 -8 -463 634 -561 83 398 -662 691 272 -116 760 -363 120 249 -875
1891 -875 368 -245 -557 494 -381 -90 880 -639 136 232 -494 779 -328 -279 781 -592 58 567
1909 567 -742 738 24 -198 835 -298 105 567 -415 347 98 -402 749 -316 -282 706 -356 397
1927 397 302 -648 673 -37 -362 693 -302 -300 720 -1002 306 299 -126 644 -421 -391 622 -383 -8
1946 -8 199 -620 381 -315 -441 842 -280 0 427 -405 454 262 -550 827 -667 -240 268 -897 12
1965 12 -19 -576 406 -41 -73 600 -377 122 422 -691 556 -158 -498 814 -131 226 580 -634 436
1984 436 476 -438 601 -253 -323 822 -893 72 357 -636 550 32 -352 377 -234 132 251 -377 242
2003 242 108 -621 498 -373 -266 123 -695 423 387 -272 443 -51 -574 522 -238 19 526 -613 139
2022 139 178 -280 541 -506 125 502 -656 246 180 -411 375 -213 -393 534 -385 335 237 -681 243 132
2042 132 -726 299 -282 -49 420 -532 278 18 -526 296 -19 -304 367 -160 162 283 -513 508 45
2061 45 -575 544 -399 148 253 -328 207 -231 -277 594 -308 -102 385 -465 146 328 -930 566 159 -561
2081 -561 589 -597 414 390 -493 522 -70 -519 378 -260 120 447 -564 65 140 -307 461 -214 -398
2100 -398 780 -366 -157 362 -811 368 70 -264 517 -495 90 399 -615 532 470 -232 439 -92
2118 -92 -267 555 -675 -182 23 -366 633 42 -189 263 -183 -137 65 -396 86 212 -549 428 -55 -328
2138 -328 149 -230 534 281 -194 414 -450 -252 542 -619 215 23 -599 470 197 -86 298 -135 247
2157 247 593 -344 130 299 -538 264 -76 -301 465 -638 176 220 -287 399 -48 -471 344 -401 64 202
2177 202 -411 122 267 -285 144 -279 -373 604 -241 204 139 -508 277 -59 -242 234 -301 236 515 -721
2197 -721 316 279 -86 465 -113 41 418 -585 408 119 -477 172 38 -198 558 -93 37 233 -525 139
2217 139 -129 -215 572 -306 41 520 -382 270 206 -315 420 71 -484 375 -561 50 422 -430 269 -177 -222
2238 -222 533 -449 184 181 -407 360 118 -493 220 -406 -289 281 -342 -157 87 -420 279 -112 -342 430 -296
2259 -296 292 220 -480 189 -91 -353 500 -225 161 259 -306 8 80 -185 631 -346 14 381 -169 141 341
2280 341 -301 225 -13 -101 276 -196 -5 388 -251 -38 -116 -396 513 -66 -205 558 -503 293 434 -525
2300 -525 207 25 -234 358 -347 192 219 -320 341 10 -231 540 -440 -48 169 -645 -87 347 -501 6
2320 6 -43 -247 353 -295 -5 660 -466 394 -56 -173 567 -241 45 372 -282 199 122 -605 88 7 -298
2341 -298 330 -470 89 -114 -446 342 -477 -412 271 -315 -23 82 -524 223 224 -160 382 -609 -275 519 -300
2362 -300 142 195 -313 433 187 -149 375 -366 61 -94 -466 167 8 -148 294 -270 -233 460 -390 299 551
2383 551 -507 404 -301 -58 460 -341 200 119 -473 -19 -157 -138 351 -261 363 108 -472 111 280 -432
2403 -432 301 28 -249 614 -319 89 443 -305 668 3 -309 254 -447 288 101 -465 22 79 -132 555
2423 555 -229 65 165 -437 293 339 -10 295 -110 -296 481 -519 270 140 -57 222 219 -422 298 -128 -24
2444 -24 484 -700 -78 -168 -470 385 -209 -48 395 -267 50 259 -486 452 -67 -213 475 -425 93 -71
2464 -71 -77 242 -18 -130 282 -397 -76 192 -335 108 205 -109 54 -358 -74 49 -158 -167 320 -421 251 -3
2486 -3 -183 367 -454 -151 149 -336 405 14 -217 363 -184 -218 238 -465 108 407 -138 361 -181 -441 222
2507 222 -432 129 314 -275 395 -62 -185 564 -240 -319 223 -298 -78 98 -257 249 -213 -42 573 -216
2527 -216 -118 210 -357 -7 123 -164 154 -181 -4 294 -476 214 216 -48 337 -251 -437 139 -588 -113 157
2548 157 -654 418 -102 -324 228 -164 -353 66 -161 111 109 -455 220 -33 -60 289 -246 -89 434 -46 175
2569 175 227 -83 14 -208 -200 -37 -482 52 73 -184 315 -127 44 363 -200 231 93 -359 20 -172 -30 587
2591 587 2 -151 125 -288 236 -31 -65 108 -173 16 276 -198 29 203 -90 221 10 -61 366 -203 -105
2612 -105 -113 -28 153 -274 -402 302 -232 -236 365 -595 191 55 -200 327 -151 -122 63 -256 -224 -15 -245 240
2634 240 -45 -89 276 -188 140 212 -248 202 -234 -241 320 -309 -142 68 -692 92 276 -287 182 -56 142
2655 142 29 -117 149 209 -432 408 -37 -56 7 -209 115 436 -128 -161 51 -257 -165 -137 -193 450 69 233
2677 233 115 -303 145 -316 62 130 85 -230 145 -311 -7 72 -448 383 -200 -35 440 13 -22 303 -38
2698 -38 49 -136 -39 166 -400 121 114 -99 -152 334 -10 379 -143 -459 133 -183 116 413 -183 350 -65 -269
2720 -269 218 -166 -147 217 -272 207 -110 -187 374 -170 -92 266 -399 -57 -28 -129 312 27 -76 234 -157
2741 -157 -16 198 -213 31 225 -24 441 -126 -137 33 30 249 -64 -345 62 -193 -201 -28 -445 74 16 -191
2763 -191 -183 75 -312 316 -297 -136 432 -412 394 -88 -109 90 -83 -287 233 -3 213 -16 -280 639 5
2784 5 -235 151 -14 148 229 -303 31 55 -233 295 77 -143 136 -464 190 -122 -72 161 -1 -158 404 -332
2806 -332 288 184 -114 -23 -111 8 162 -240 -83 141 -287 59 44 -183 383 -441 -43 304 -267 125 223
2827 223 63 191 129 -237 65 -302 -78 175 94 143 2 80 294 52 -115 -16 -295 165 -89 -170 188 144
2849 144 -358 156 47 178 372 222 105 78 -183 181 64 22 145 -53 -82 146 -247 187 105 -106 662
2870 662 -166 33 41 28 120 -157 -149 266 -253 158 -160 -248 100 55 -493 180 -109 11 197 -42 72 86 -210
2893 -210 271 232 80 148 -199 92 188 -341 -9 -205 -205 142 -173 96 93 -320 -11 -343 -91 328 -59 -75 140
2916 140 -359 -128 249 -261 55 -26 -167 65 -16 68 392 -238 -232 -96 -121 134 -141 -72 183 65 -202 104
2938 104 -218 138 56 -268 256 -269 214 -32 -189 320 53 -140 490 -93 12 323 -360 -23 315 -102
2958 -102 308 -356 105 -40 -250 -228 216 -53 -131 -194 -123 364 -68 -129 -94 -376 268 25 -414 490 36 31 94
2981 94 93 -58 333 -45 202 297 -182 40 76 87 329 -71 213 199 -225 83 -31 -84 149 -210 39 125 -148
3004 -148 252 84 -181 510 58 33 275 -26 81 -46 -135 15 -252 66 270 -156 -58 -77 -191 5 -237
3025 -237 -97 229 -283 -238 319 -233 228 -199 -178 191 -6 -19 29 165 -110 39 -254 -10 -249 -2 117
3046 117 -311 73 156 -202 346 262 -204 154 -83 54 8 -56 170 -78 -63 388 -108 201 124 -204 156 198
3068 198 -44 -36 278 -165 -263 -502 -244 108 30 189 90 -58 184 297 227 233 -300 78 10 -390 60 84 31 -155
3092 -155 -47 4 392 56 5 -305 -5 246 -241 -130 -188 -39 149 140 105 333 54 -111 201 -219 186 89
3114 89 -137 89 -50 47 217 153 -157 201 -106 -23 75 128 101 -327 161 57 -220 175 -96 73 492 -238
3136 -238 126 122 -193 151 -20 -140 95 109 280 345 -202 51 111 -25 113 299 -69 437 119 -87 350 -272
3158 -272 118 73 -129 -219 -210 52 128 38 73 67 -167 330 -250 -146 112 -8 -203 -60 -70 -37 152 8 277 183
3182 183 50 4 -244 -71 28 -204 151 -471 83 -55 142 55 50 21 -95 185 -55 -121 -2 -70 43 -169 -56
3205 -56 227 23 -97 -113 8 122 -262 -212 4 -74 53 149 29 10 -13 56 117 -158 -59 -71 -40 -79 -5 -64 245
3230 245 -46 200 162 97 214 37 -77 -19 -213 119 -55 -231 391 105 242 45 -114 -58 328 12 -59 277
3252 277 -10 118 308 105 126 -272 -50 -50 -147 63 415 -54 -73 -200 -91 105 -430 -48 70 -120 320 2
3274 2 -167 70 60 -7 -198 42 -137 27 -514 69 -123 173 -2 -11 63 171 -341 129 71 241 213 376 -19
3297 -19 1 -48 -189 -95 120 247 54 171 158 -126 -16 16 -1 -44 -122 2 64 131 -24 593 -204 -29 -191 -1
3321 -1 -122 55 -288 63 34 -55 -97 36 170 119 -84 450 -326 1 -19 -209 -296 -83 -197 -186 -78 7 136
3344 136 -291 72 41 -91 130 58 124 -72 -386 174 137 194 262 -166 -154 -90 -183 -25 220 -210 -55 114 4
3367 4 291 -106 -159 91 71 64 -62 -223 237 -74 101 184 -155 245 -86 -79 172 -457 28 169 232 419 54
3390 54 -102 293 -188 -52 254 108 191 158 119 -93 75 3 310 302 -40 35 -269 -9 -81 297 -156 66 -217
3413 -217 -204 -157 10 -125 -82 103 94 -103 29 -132 0 283 79 -174 7 59 170 125 223 25 178 -85 166
3436 166 -274 30 -247 -61 268 -188 -3 -40 -215 -157 -144 -100 103 197 -116 225 -79 78 73 32 -131 149 87
3459 87 155 -43 -188 -16 179 38 253 -294 -270 -294 -26 290 65 -9 152 117 219 88 -135 281 118 30
3481 30 -161 -7 -34 49 120 122 -298 -63 302 161 92 234 -140 -117 207 -158 77 87 42 2 -172 116 54 -31
3505 -31 75 340 227 217 11 -160 -244 -4 104 73 217 -107 136 -241 -256 12 332 190 -148 133 -28 115
3527 115 -6 -200 159 -69 -317 182 117 60 -422 -130 26 221 -105 428 109 -259 56 -429 -185 270 -115
3548 -115 -125 127 158 -281 58 -57 -152 212 308 354 -50 66 137 -206 114 -108 -69 108 -351 -42 -56 -180 -129
3571 -129 -337 -200 53 104 0 31 -334 124 231 41 388 -328 154 462 -304 90 -199 113 12 96 46
3592 46 286 149 -297 -10 -21 309 -93 -109 58 80 -7 -41 -160 31 -19 -114 -145 348 350 11 16 -80 -111 21 215
3617 215 -40 44 229 -111 141 104 -159 217 -89 -22 84 -100 -322 -24 41 -345 109 145 -285 -139 -102 3
3639 3 -101 35 -12 -211 120 -198 118 76 119 -241 240 7 43 230 -47 45 57 -33 -52 -235 3 60 -60 -41
3663 -41 118 339 -6 -264 68 -271 35 -133 212 365 -198 219 229 -124 -528 86 177 -50 175 277 -198
3684 -198 197 -47 -112 -179 -2 -132 -65 -180 1 -218 179 174 -109 159 -355 98 187 -97 45 196 -51 -280
3706 -280 130 -116 -3 -65 159 -18 282 -59 -140 -120 142 -140 -193 276 -246 24 -166 95 -68 192 -21
3727 -21 -61 -73 148 132 -422 26 102 439 57 -6 -115 334 -17 -121 90 -229 -282 54 -84 172 111 95 -105
3750 -105 217 27 47 -107 -2 13 144 26 -109 -172 -91 33 -199 -209 -8 210 -336 -272 267 145 -197 394
3772 394 -246 -60 9 -26 334 -15 -97 2 -165 238 180 -211 54 148 51 -166 -270 94 -59 -85 73 47 -113
3795 -113 -127 -190 -52 -183 -112 209 136 -17 118 174 -80 5 101 -66 -75 -169 70 -176 -561 -1 113 80 -13 184
3819 184 85 -34 -73 -35 188 -117 -68 -71 -1 40 -6 150 -99 73 -71 -52 7 31 -46 -54 -7 67 -325 -258 -88 283
3845 283 -146 122 93 -87 488 16 181 340 107 137 135 -267 35 -89 -145 19 -210 7 91 119 221 286 172
3868 172 112 -159 153 303 30 189 64 0 -99 113 130 -52 -265 186 -268 -197 38 -91 -92 163 8 243
3890 243 27 -20 249 40 110 104 12 128 150 -36 -86 -20 -275 -157 136 74 -154 -141 -110 103 -75 -66 -66 -160 230
3915 230 -181 -354 56 116 226 245 -129 -12 -109 -74 -166 -136 169 -175 113 -89 -10 -173 221 126 69 -443 230
3938 230 191 242 -18 -60 7 -28 140 38 -42 26 -141 85 62 -54 145 97 119 -5 80 -260 228 -28 182 22
3962 22 -262 6 141 -39 186 350 136 170 192 130 101 2 322 -18 -54 168 24 111 106 18 -139 13 -57 -196
3986 -196 -7 269 72 51 122 -158 4 238 -176 286 -265 105 132 -32 188 -350 66 -135 8 -182 35
4007 35 13 109 -12 -132 39 57 -9 141 -34 -329 -54 199 108 193 185 -94 262 -71 90 -102 -5 133 -89
4030 -89 37 -200 -161 78 -120 67 120 -315 -23 -213 157 21 42 32 99 160 -135 -192 -108 226 215 -6 238
4053 238 -11 187 55 -78 230 -220 2 72 -58 -245 -97 241 -210 10 -110 -231 -159 -111 71 109 -194
4074 -194 -187 79 -22 21 100 130 367 -338 56 -333 -42 115 -5 53 205 -170 275 72 209 -44 -125 119
4096 119 28 74 192 -40 -162 -39 24 14 -43 138 -30 -88 7 251 -160 94 -13 -82 -88 241 -15 43 57 -294
4120 -294 -31 -91 -69 160 16 121 -88 104 -311 -87 -60 -94 -217 -67 129 -26 -9 -193 -38 1 -170 -75
4142 -75 2 -223 -252 52 -132 193 -162 9 367 -290 -69 -7 -311 31 -152 131 -72 -168 -51 130 7 77
4164 77 -162 -16 112 -188 118 193 -151 339 35 -468 358 -13 124 -68 -131 78 19 89 5 135 -20 90
4186 90 -280 -151 29 -176 78 -11 64 -20 96 19 133 -5 80 8 -183 -113 -184 99 111 -149 -144 214 108 98
4210 98 -4 -60 247 9 148 -14 -322 -222 29 -147 -51 473 372 198 293 -70 -133 -51 -55 62 -215 100 -227
4233 -227 108 62 -38 117 121 -59 -217 -112 -28 195 148 -65 -85 -212 84 -99 -45 10 -309 -24 139 -111 -280
4256 -280 209 16 3 -194 -65 -164 12 71 210 -129 69 22 -86 23 -223 -109 -298 109 58 -9 -50 -304
4278 -304 474 153 -40 113 -113 132 -359 28 -230 11 -141 33 160 62 -117 9 30 14 -110 22 -12
4299 -12 -230 222 -366 134 -449 66 -150 -279 97 -257 -30 -38 301 -289 21 329 85 219 -1 100 -145
4320 -145 364 2 258 95 -46 60 -346 -185 -127 49 -269 -104 45 -63 -6 -176 269 228 -181 94 -117
4341 -117 7 -96 -96 33 -58 69 91 253 -127 266 -112 -141 -38 -263 100 -131 -183 -40 38 73 148 82 -340
4364 -340 -117 -7 -70 63 -16 -3 127 -53 -124 -146 142 -379 86 -125 -292 -237 403 46 -105 111 -139 180
4386 180 -73 -167 -103 -209 99 204 60 -16 21 -341 -2 -23 264 -3 -256 84 137 -29 356 43 141 94 358
4409 358 -137 -7 166 -134 -83 -284 -164 115 52 94 -161 -86 225 -48 10 267 80 186 200 -91 160 27
4431 27 -150 -196 96 175 17 244 288 145 -330 -83 286 -293 -10 -8 -440 110 4 240 -16 -221 116 -22
4453 -22 212 0 -54 -228 -141 24 -48 -182 331 -122 -118 -207 -204 -164 173 63 -26 -2 480 210 31 -199 -84 136
4477 136 196 -265 -50 -21 -49 -32 -93 -92 -143 40 117 44 125 -42 -122 -131 -219 377 145 391 -51 137 -151 258 87
4502 87 330 -63 -9 50 -176 -126 158 -12 155 40 399 -107 -125 204 -126 475 204 301 -359 -206 -188 163
4524 163 178 79 -129 -191 88 -50 130 12 166 -97 -129 -117 -37 172 58 159 -219 -262 43 -147 -94 -207 16
4547 16 341 -332 -165 -66 190 238 -85 -106 -291 -241 25 94 -184 21 125 -99 -35 -76 116 66 -61 -215 110
4570 110 13 55 -141 -79 -169 -36 -172 -142 -20 -258 -232 -216 -347 308 -2 85 -5 236 219 -120 81 262 188 -29
4594 -29 -18 110 137 -50 -115 -247 -67 -101 -324 15 -146 234 96 -71 -181 -3 98 -89 302 184 358 99
4616 99 113 -87 -65 173 285 29 -158 175 132 -147 -94 -30 -25 -12 132 -245 -299 61 156 213 49 -96 -81 -98 14
4641 14 167 318 170 47 -318 -241 26 -121 10 -364 -116 -15 -61 -29 -540 128 -3 -59 -4 109 -69 -216
4663 -216 46 -57 -50 -48 -205 -195 72 -54 -195 65 79 -105 44 254 -176 40 117 -44 37 184 -209 3 -22
4686 -22 -226 -100 99 256 116 -102 -161 189 197 136 -236 -118 21 -28 -70 111 74 266 -2 -347 101 -122 241
4709 241 -162 44 83 383 67 74 -145 110 74 16 163 -182 134 199 -121 24 117 -213 15 -58 -21 396 87
4732 87 33 163 -9 100 74 -286 -232 -40 112 56 -37 128 -23 28 6 -252 -2 -158 -95 67 119 -27 63 -192
4756 -192 -19 71 336 60 -147 -259 144 113 -14 -265 19 441 -256 -157 -3 -118 78 169 -109 257 34
4777 34 -160 96 -152 133 -52 -268 -139 81 -188 -194 -142 90 -115 112 34 -76 139 -114 -41 4 80 155 2
4800 2 -21 -73 -173 99 -179 231 176 -105 -135 51 -175 196 207 -152 -54 -33 235 9 93 127 60 89 9 240 -86
4825 -86 -103 7 6 -373 52 101 -68 69 -213 136 -13 -144 -262 -160 214 -264 244 -130 -96 -171 -26 3 -109
4848 -109 -241 165 -18 221 -4 -70 71 -218 281 120 121 209 -72 -73 119 -208 5 -72 239 254 218 -99 -206
4871 -206 -158 -178 -230 90 78 209 -12 191 4 252 101 196 -281 260 325 -186 -181 -42 74 -150 -170 453 -267
4894 -267 -23 -96 93 -120 -12 -360 83 -69 -95 81 249 -235 46 -321 -142 -176 -2 66 356 36 -50 141
4916 141 -233 198 163 185 -238 -217 -55 -134 -312 235 107 -29 -385 -110 -6 -175 -55 -184 -65 -28 -194 -191
4938 -191 -193 -173 -109 -41 203 189 68 130 29 -137 -32 154 -80 421 -279 43 -64 59 145 121 320 -36 202
4961 202 -62 -47 -105 102 -250 -119 23 -258 -210 -8 -207 107 -195 -393 -237 131 113 403 -207 30 -23 17
4983 17 32 -44 -161 -89 -103 140 -176 -17 25 -183 -48 -77 192 -189 189 -9 -34 162 84 -39 -107 90 -353
5006 -353 -57 14 255 75 -24 136 -145 39 -301 29 204 -34 241 -141 26 -60 11 -179 -282 350 284 55
5028 55 6 119 56 60 -131 -216 31 -14 163 126 46 165 58 232 -16 125 83 -125 -228 -50 108 359 -124
5051 -124 3 -347 35 174 -220 -196 -9 -17 24 -136 168 13 -96 -107 -38 232 -145 -86 105 62 -199 -21 144
5074 144 203 198 -76 151 66 -31 -165 -163 -46 76 -197 -190 -16 112 14 -29 1 -85 236 -213 23 -102 63 144 120
5099 120 214 66 177 -80 340 -493 -375 150 -115 -39 35 -315 -222 210 -18 -129 -231 -172 233 -98 -212 2
5121 2 97 -148 -108 -140 109 -72 -15 -319 110 -87 130 -113 107 315 -36 -27 -140 -86 -3 -48 91 168 -188 103
5145 103 197 9 -37 -67 246 284 -100 67 -32 -381 92 -157 -134 -232 91 -33 -305 -11 304 -35 -317 -22
5167 -22 -193 -356 -116 -39 -125 115 -101 -42 -126 -25 -157 -171 248 97 -16 -55 94 357 -32 113 62 -134 -7
5190 -7 -143 116 -29 384 115 69 167 -127 -179 45 122 28 -121 261 23 124 -37 -223 463 191 28 127 -193
5213 -193 -47 -15 -68 -173 188 31 15 -90 24 -56 105 -47 -240 233 -38 -405 48 -53 -163 222 122
5234 122 -114 168 33 38 -97 -79 -2 -87 -15 190 19 222 66 136 -111 -135 -413 -190 137 68 86 88 205 95
5258 95 -155 -281 -22 -103 29 68 101 32 176 20 -218 -349 74 209 33 42 111 83 26 79 169 -158 11 181
5282 181 99 71 38 -246 -283 233 -12 -57 -46 -150 122 -132 -100 -126 -52 67 -216 -31 -21 98 -208 193 134 -168
5306 -168 6 36 -484 89 150 -169 151 -131 -158 -76 -51 159 370 -49 -100 80 197 -50 -143 75 231 138 117
5329 117 -138 -5 102 91 210 38 -189 13 -122 29 -151 224 196 -22 97 -168 83 71 -202 -75 -32
5350 -32 -112 73 -21 -78 -229 -199 35 -200 99 -158 122 382 -172 -338 -115 -83 -398 51 -129 63 153 126 33
5373 33 180 -238 89 -24 -389 15 85 -175 -39 -117 -60 171 8 -82 17 296 -30 31 -195 170 90 -93 7
5396 7 -236 -51 -57 -122 -95 -90 125 -41 157 -208 13 -120 -240 210 184 125 -25 39 57 -131 237 96 238 -110
5420 -110 -34 -80 34 84 132 -53 -33 5 229 106 -76 -147 -205 106 -289 -17 88 205 -82 98 1 219 -74
5443 -74 -18 146 -139 67 -36 218 -164 -444 -132 -35 -207 174 200 -9 -277 64 236 201 -35 53 10 -304
5465 -304 6 327 -160 -48 63 141 -243 -86 -75 350 -185 -340 -89 -3 -148 -45 -1 -265 -427 -225 -212 -209
5487 -209 53 30 -153 -214 -31 45 133 -345 -114 -65 135 114 15 -21 -104 -83 -29 23 -129 -96 162 5 -36 120 134
5512 134 161 71 -2 67 -7 -121 -35 -202 -30 61 90 -66 190 -39 39 9 -130 108 7 -83 300 98 376 27
5536 27 38 -55 92 -80 -134 -344 -147 115 -54 47 22 105 -36 42 254 250 38 42 -316 -13 204 212 -57 -119 26
5561 26 140 -253 -27 -321 -59 135 -26 93 -308 -4 -272 -157 130 -107 109 107 18 42 -222 201 51 190
5583 190 -29 12 55 134 -99 216 176 32 198 0 85 -103 133 112 254 -268 -111 133 223 85 396 160
5605 160 -83 -179 -254 93 -36 56 -188 -445 86 -22 -226 -30 88 197 -213 141 263 232 -367 173 -185
5626 -185 308 -136 55 -14 -91 140 -319 62 -47 8 -196 -222 23 131 -55 72 -90 84 -228 -75 142
5647 142 98 65 137 10 124 196 103 102 -109 47 23 -164 -20 165 304 44 -65 -30 -140 328 142 85 -252
5670 -252 -351 -265 -13 106 238 -237 270 -140 -284 -306 -206 33 198 -142 -300 -196 -15 97 -33 -134 56
5691 56 227 -63 115 211 90 -58 -311 -17 -69 71 206 -19 7 -223 -24 86 -122 -87 15 182 306 244
5713 244 13 -40 -219 29 -123 -123 23 132 131 46 255 -15 68 -127 -8 -101 -173 59 278 186 42 42 -188 132
5737 132 110 102 42 -199 -57 -47 -198 -112 -371 -30 137 2 179 81 26 302 117 -50 8 260 134 -65 -191
5760 -191 152 128 77 62 299 -40 31 111 2 -292 -83 55 209 -309 -7 2 178 -224 -132 87 -155 200 161
5783 161 -299 -269 165 -136 74 -97 214 51 87 63 71 31 -307 -17 -86 -46 71 -53 -284 -245 105 46 155
5806 155 -14 -40 299 -35 -165 -440 80 8 255 -95 48 -142 -161 -103 -154 -75 82 74 147 6 -241 -399 54
5829 54 -329 -14 153 -184 56 -273 -102 100 212 116 100 -116 -24 -77 237 283 -48 -202 188 -66 -267 140
5851 140 -61 52 -129 -122 82 182 49 -53 163 -63 -195 -71 -262 -127 30 -80 -110 149 -14 -239 -222
5872 -222 -293 -63 -67 -118 -84 138 -11 296 177 191 63 -30 -294 -120 -203 117 -176 -153 -87 26 -191 -202 -53 211
5896 211 -230 -161 -36 -83 51 56 9 -1 108 -33 -161 -22 82 223 -177 -179 -186 109 124 96 -156 -145 261 -141
5920 -141 247 53 -12 28 378 -205 -112 -41 77 -97 -381 -10 307 42 129 285 246 122 84 -283 -71 1 -155
5943 -155 -17 86 -150 146 54 -114 -138 -78 42 -35 89 -217 160 -36 173 -326 -39 149 70 -61 96 173
5965 173 95 103 31 -52 251 -51 -138 -57 94 -255 -285 106 38 42 -28 183 -139 118 -193 152 25 8 -226 463
5989 463 56 57 -207 62 -96 -11 -20 59 -110 19 -257 -120 -190 26 72 -80 -92 230 -74 -249 33 -26 -82 -67
6013 -67 300 -14 57 71 82 -56 198 -214 -12 -65 274 -246 182 -274 153 272 41 95 309 -32 -294 -171
6035 -171 -24 -221 3 56 -11 -194 -163 -78 158 93 130 -9 -126 -194 -64 -190 -3 -320 -29 -223 -67 100
6057 100 246 -106 182 -114 -52 194 99 38 -41 -166 50 -131 108 4 27 150 -99 79 251 -173 125 -322
6079 -322 -24 -298 -39 -118 -136 -71 -116 -18 29 -48 29 129 49 -127 270 -30 -334 268 108 -239 98 -150 -72
6102 -72 -90 92 196 -26 -65 -57 147 -83 8 374 234 14 -27 -96 -8 60 49 39 16 22 70 -5 -5 -161 -101 -178 -52
6129 -52 96 243 -1 16 2 -22 -233 64 165 25 232 6 245 101 220 -16 -194 78 -176 -198 89 -296
6151 -296 23 277 92 82 167 -63 -81 -143 -54 -5 -108 37 -10 284 -22 -90 276 248 213 354 -221 12 233
6174 233 90 23 71 247 146 -142 57 73 183 77 -22 -174 201 -320 9 -67 -205 174 -33 90 110 -397
6196 -397 -278 -6 -232 -19 154 -157 37 223 -223 252 209 168 -106 -206 -142 -100 -185 283 133 -61 135 -103
6218 -103 180 339 -140 -44 141 40 113 122 31 -384 -5 38 345 -382 157 -34 153 -69 -361 -34 -79 -204
6240 -204 91 59 -292 14 291 -81 -114 27 34 -220 -122 145 -309 104 -92 85 88 61 -162 17 312 291 15
6263 15 -34 25 138 165 -31 28 102 239 103 -229 -67 -204 -280 -3 30 -177 -13 -48 -95 -69 -146 104 257 84
6287 84 80 -96 178 185 -59 39 350 238 -22 -99 442 -185 23 -4 -91 1 149 137 -92 -14 62 10 69 28 -274
6312 -274 85 213 35 -176 83 -32 -337 -469 117 76 117 -76 2 19 179 3 161 87 -112 -49 57 14
6334 14 298 -246 71 44 178 248 252 -121 2 -88 -89 219 19 142 -116 -88 -39 115 -54 -116 -260 29 -163 256
6358 256 207 30 198 54 -15 157 174 45 252 96 90 -186 38 -186 279 -104 6 0 286 -78 18 365 -129
6381 -129 -75 141 28 143 27 -17 50 -83 20 96 8 -134 130 174 58 78 287 -178 -42 -12 -360 -12 226
6404 226 119 -133 -212 94 -159 64 239 9 13 92 115 -178 11 -68 -312 -72 -45 18 -229 -207 104 40 205
6427 205 -247 -106 -168 -90 269 22 384 251 118 -82 -133 129 33 -62 13 -33 -129 110 -50 -125 91 -193 -76
6450 -76 80 -75 -8 44 -6 -113 167 -177 -134 39 -65 103 -30 12 138 -262 -11 -5 -99 -238 71 169 -131
6473 -131 -366 62 202 277 -3 -354 57 114 224 136 72 206 -97 -13 56 174 73 96 3 -237 -191 113 -16
6496 -16 157 -97 -63 87 -97 -247 -35 -74 332 17 113 -131 333 0 104 318 266 138 172 -86 163 95
6518 95 -142 151 -42 -89 -306 -142 -136 484 -98 -12 12 -240 202 -20 119 -179 -71 -19 -229 169 -214 15
6540 15 -5 -110 117 78 12 -340 -231 249 94 5 -61 -41 142 -54 -124 282 85 -21 101 -177 65 -267 -284
6563 -284 -262 51 184 -64 112 -44 -260 -93 7 -31 46 -321 62 222 -155 177 66 -31 180 -84 -266
6584 -266 51 -37 277 -70 -29 358 106 149 -50 175 -208 144 39 -111 96 -198 -90 246 -252 -162 134
6605 134 245 160 76 -10 -54 408 -319 -127 -300 97 116 -4 -78 -17 184 -20 145 -62 -43 -273 -114 114 -54
6628 -54 -168 340 194 48 -102 188 -9 148 -13 85 -80 -198 200 3 -17 246 54 181 121 -165 -2
6649 -2 -89 -142 -133 1 -132 -148 -81 222 254 307 -108 -53 208 56 30 180 -1 -128 -174 -344 150 68 -291 150 152
6674 152 -74 -429 -113 231 -154 281 3 332 -33 386 -327 -215 -57 -113 -9 -148 -443 -323 14 -77 -152
6695 -152 -168 16 -3 -142 -94 -43 105 178 90 -30 -57 1 -130 478 -52 285 354 414 -136 70 91 -145 102 -9
6719 -9 251 59 -175 35 96 -57 -21 26 -295 -183 49 139 -59 -136 17 73 -59 47 -49 70 15 -50 -12 154
6743 154 194 94 65 48 -6 -210 -116 42 41 37 -153 321 364 116 110 -162 47 311 81 105 73 60 128 122 -9 263
6769 263 85 -344 118 48 143 -169 -31 -238 -26 10 -96 182 -134 -193 53 -161 -20 176 103 -6 -33 -33 -80
6792 -80 -109 210 -116 -99 -333 198 252 -4 182 55 82 -95 -34 114 134 44 192 -135 280 271 -130 83 -162
6815 -162 -84 61 -20 -6 -47 176 181 -9 -85 105 227 -36 -25 43 -106 81 14 -421 -210 126 114 29 47 351
6839 351 -82 -326 28 17 231 -275 -45 -147 235 -186 256 5 -183 -75 38 -221 -198 17 71 4 251
6860 251 -198 162 177 43 9 57 -20 58 143 -48 77 -85 304 91 -76 -127 -26 -215 56 18 -137 -31 56
6883 56 61 -13 -240 73 88 32 22 79 15 282 -251 -297 76 38 189 -144 296 -61 98 -131 -189 144 -80 137
6907 137 -151 -177 -178 260 -303 173 -20 182 -2 -78 -234 -8 313 118 -47 -146 246 305 -190 -408 -139 98
6929 98 -50 -26 92 -27 -166 -41 -204 -195 -58 57 -129 -11 225 92 -207 -103 347 -33 142 50 -49 310
6951 310 211 35 -28 -42 -19 284 22 292 97 -124 137 -150 -17 -286 2 -56 33 166 228 0 92 45 2
6974 2 124 -95 -290 -240 -72 -73 -47 -31 -48 311 -391 103 172 -5 70 294 -55 -140 -168 -40 -125 -265 -163 -258 34
6999 34 -246 159 -9 -17 107 -108 -179 -77 -45 353 -295 -127 -23 165 130 -2 -127 268 203 -19 56 74 52
7022 52 -276 -223 -106 -115 -58 67 96 -31 -194 -124 25 -171 364 124 151 57 91 -199 -67 140 -381 164 -73
7045 -73 10 186 -121 308 88 179 -99 60 -16 -44 -20 65 -106 -134 -25 -47 -50 -128 55 63 -78 -139 132 238 351
7070 351 -171 114 81 36 219 -174 -16 -10 -365 -278 -4 -164 210 201 228 -3 -50 -83 -249 22 -60 -62 -48 -153 385
7095 385 12 -34 -155 -439 -223 -71 13 -226 80 -83 2 -31 -139 114 175 145 -133 -105 103 -279 -392 -223
7117 -223 337 -37 164 102 -71 106 -301 -30 97 229 -132 99 57 33 130 -275 342 -27 255 89 91 234
7139 234 331 -191 -163 -251 -80 -119 59 -96 -185 -63 -333 126 151 -221 -31 -142 -268 156 -130 -39 -29 -221 77
7162 77 -68 3 73 125 -162 -138 -20 -80 25 -72 283 -106 9 62 83 267 59 295 -253 -271 61 40 -159 -27
7186 -27 150 45 285 -18 -86 -197 -1 -40 -75 -57 133 -148 -76 -119 380 -270 -63 -50 12 -52 -79 -18 83 47
7210 47 -35 -73 -161 -332 132 272 11 -30 -214 -313 -154 -95 -3 -156 -171 -152 -211 -25 276 36 -23 -125 169 -74
7234 -74 146 126 -174 241 1 183 50 -93 -141 130 -70 -8 66 62 -112 -103 -6 394 11 -82 21 28 53 -77 -204
7259 -204 99 -45 30 -374 351 159 -45 -434 -350 -25 -135 -3 12 -75 2 -172 125 90 -148 206 -37 86
7281 86 -127 43 -56 67 -151 -238 -64 -332 48 309 18 -87 -117 -106 -96 96 141 -104 205 128 89 12 -277
7304 -277 -97 56 -266 239 -122 -52 -151 121 170 168 331 85 -107 -177 283 -97 244 -123 -103 -83 -9 101 -33
7327 -33 109 278 101 64 -145 100 -226 -134 -14 87 171 -5 -252 -34 -202 96 101 -23 126 -217 26 54
7349 54 -342 177 -51 69 -138 79 -10 -245 109 -199 360 -96 -263 214 186 -97 -41 -158 35 -104 4
7370 4 -37 208 27 -105 -121 120 -13 -110 275 -33 95 285 -57 62 -108 -289 -153 121 -158 23 -160 13
7392 13 -35 34 24 -218 63 -52 179 -87 -223 -95 149 144 22 -91 101 125 -441 128 91 -27 -28 -33 5 42 213
7417 213 2 -253 282 53 -230 142 -84 -3 -176 103 44 122 -31 -95 -210 -133 13 -97 -148 111 -134 41
7439 41 190 13 60 -250 -153 -98 348 418 183 -146 299 -298 -313 190 184 -14 104 -124 -69 -241 -214 5 -101
7462 -101 121 -164 1 -25 121 -149 136 104 -54 80 191 -132 6 228 -395 -3 -37 -3 -210 -90 259
7483 259 289 72 -45 2 -149 -83 -236 41 -306 -211 -24 -14 123 -188 -138 -144 210 198 -241 -237 -312 -120 126 -87
7507 -87 -105 -86 -67 54 76 103 -203 -286 -83 -98 -71 -22 315 185 -233 409 141 -223 183 -221 -49 -166 -150 147
7531 147 122 32 -138 160 31 223 -137 132 41 24 126 270 71 -231 -213 -76 -38 -146 296 69 -181 74
7553 74 150 135 95 274 -83 3 -123 47 90 -177 -16 -99 56 -18 8 -311 219 -27 40 -124 156 -374 111
7576 111 4 -99 -23 108 91 -138 22 104 -183 -184 -372 100 63 89 141 -35 171 139 -201 -56 210 141 1
7599 1 -300 -184 -175 16 321 -84 -34 -13 -155 -123 -96 255 140 -139 -131 -47 363 31 -106 -50 -8 400 -83 18
7623 18 -276 98 -54 -87 -322 57 -72 -22 -117 -362 -231 -48 -301 -241 -224 181 -113 -10 75 -49 -13 -303 278
7646 278 -150 138 -237 422 149 -269 -47 196 -293 218 137 90 -178 80 72 -49 118 125 206 -155 -18 383
7668 383 -339 -21 -98 -181 93 26 -1 32 24 97 -267 -94 -19 -116 21 -147 -128 -219 -306 -108 -44 335 162 27 -18
7693 -18 263 82 80 -16 129 44 71 174 147 130 35 138 124 -191 179 -39 28 -333 37 202 -82 -51 41 -27 -74
7718 -74 145 80 46 161 -257 156 189 -90 68 -323 183 151 -81 32 -66 115 -6 -351 388 -88 -497 1
7740 1 418 50 -177 -172 127 -250 -72 -78 66 -61 72 33 -135 105 -31 323 -119 201 -2 103 348 -13
7762 -13 50 -54 350 172 -43 -87 136 94 -59 89 -363 135 382 -44 142 57 175 -28 92 257 -60 32
7784 32 21 -147 -99 169 347 -43 -13 10 -180 -3 -33 0 -324 40 -162 121 -149 15 -111 132 -42 144
7806 144 -1 45 -135 -81 217 188 -13 -204 -158 -296 182 24 83 285 -47 230 88 -224 466 41 -28 268
7828 268 116 -313 77 -33 -238 -111 -195 1 196 240 180 -107 -336 -307 -81 -260 -96 239 -482 48 -179
7849 -179 -19 -120 55 227 -49 -158 -141 -25 39 126 83 -189 -206 -163 -58 276 48 90 37 -336 -56 -67 231
7872 231 -6 -248 16 -70 -46 219 -5 180 -287 -8 67 250 112 54 -84 153 0 179 -161 -117 154 -35
7894 -35 -78 97 215 -92 -268 219 -37 -160 188 -63 47 -311 -173 0 231 -202 95 14 -141 -239 -85
7915 -85 -295 34 41 -384 -28 112 -11 258 281 205 85 -80 -26 -71 175 -327 -30 53 52 113 -189 257 -151 91
7939 91 85 -67 -316 -221 79 -52 -260 -86 16 -134 -155 268 132 -72 -70 340 274 144 3 278 21 -131 117
7962 117 -392 -10 70 -52 -237 -158 88 71 16 124 207 -53 155 -174 40 6 200 94 -125 38 243 164
7984 164 99 49 94 172 -182 263 45 82 -119 -257 -267 251 -36 -124 142 -8 383 -111 296 11 -238 98
8006 98 -6 89 42 101 -151 158 114 -122 43 103 28 -54 -118 -71 57 165 -92 -276 13 -208 -256 288 -56 106
8030 106 100 -180 -61 -179 -161 -35 48 171 -58 -193 -273 -9 -214 84 -151 -13 -112 118 -95 -309 -99 47
8052 47 387 128 24 -26 88 -139 -8 -72 62 39 -117 -273 95 -44 63 110 -189 275 4 -56 127 -156
8074 -156 -81 146 14 -226 131 76 52 219 -132 -177 231 -429 122 180 210 -167 20 -221 -81 11 42 -209 -1
8097 -1 -92 -112 -111 -35 191 -37 -45 -126 -51 40 -42 -11 -271 -21 -72 47 -243 -51 -58 3 -342 -171 327 -153 50 118
8123 118 99 165 86 16 -21 -39 17 187 -69 -395 -163 161 -18 -43 -90 -249 -111 16 -33 301 153 -82 83
8146 83 -160 5 226 -25 91 13 331 5 224 173 94 209 -93 -32 -122 -247 285 304 -48 -368 -136 71
8168 71 19 -80 235 124 -18 -75 -67 396 -275 23 -167 -310 54 -151 -70 161 -126 49 -159 71 -4 64 -276
8191b76
$$ Imaginary data points
##PAGE= N=2
##DATA TABLE= (X++(I..I)), XYDATA
0 0 0 0 0 0 8 -8 8 -8 8 -16 16 -24 24 -32 40 -48 56 -71 80 -96 112 -130 152 -175 200 -228 260 -298 336
29 336 -379 426 -479 537 -600 669 -746 829 -920 1022 -1132 1253 -1387 1536 -1700 1884
45 1884 -2090 2322 -2588 2892 -3248 3670 -4177 4799 -5587 6622 -8042 10122 -13462 19694
59 19694 -35203 148890 173831 -157161 86192 109738 -110025 -87980 63879 -31786 -137743
70 -137743 -14642 69249 -58528 16255 106852 1884 329 45077 1931 14582 -7968 -17119
82 -17119 -26700 -73462 -11139 20913 -33969 11390 18813 -1200 31463 28893 48614 22573 -41819
95 -41819 13673 -7702 -67810 611 -4258 -43882 -10580 2533 23855 18108 29007 64297 -17778
108 -17778 -20601 58764 -26213 -53202 18182 -30019 -64946 -9854 38442 7061 -27281 61802
120 61802 48018 -51314 42541 57167 -55917 -7077 5194 -57329 -19353 1973 -6946 -4513
132 -4513 3647 24609 4632 24916 47255 -17536 -301 16714 -43394 -5178 508 -43027 4011
145 4011 -3945 -22161 27662 23353 11960 12116 11232 18691 -21902 -3988 26728 -46217 -28253 18578
159 18578 -31012 -5349 24820 -1946 12413 10176 11772 18660 -4372 10646 -6387 -30610 6400
172 6400 -18374 -23124 21658 -12501 -11794 22929 7063 14108 10204 7297 12016 -25671 -265 16317
186 16317 -39054 -4816 14326 -31054 1504 19478 1764 10456 5141 12604 3525 -9696 16256
199 16256 -9378 -18926 8707 -22484 -7252 17908 -18415 8087 18807 -13766 13857 13433 -3533
212 -3533 5128 -6901 -1009 -6922 -13429 10567 -13352 -9188 21573 -17179 881 31616 -13597
225 -13597 153 18740 -10183 -5181 -83 2604 -5446 -20311 12828 2121 -21116 20819 7556
238 7556 -13192 14777 465 163 6449 -9684 7289 -5748 -16060 12764 -6566 -8036 12534
251 12534 -7355 2931 7194 -4863 12993 -2220 -6279 10686 -11046 -1747 5822 -11868 4541
264 4541 -3073 -6814 13505 -8196 1796 15887 -14485 4377 12135 -13085 3225 3479 -5540 -2351
278 -2351 -6554 9659 -2411 -13084 19573 -3209 -14721 21174 -1994 -8459 10958 -5955 -1755
291 -1755 652 -5398 5658 -6884 -2181 7378 -9644 7722 5628 -9351 12775 -2782 -8643
304 -8643 13683 -8133 -4226 8290 -11501 1133 3287 -5920 6796 -3012 1477 6735 -8549
317 -8549 9371 3375 -12482 10676 -3214 -11034 8949 -5338 -1769 3759 -6694 8394 -905
330 -905 -4818 13759 -5477 -4059 9787 -8568 -392 2220 -6762 3975 -6285 -1513 8993 -7973
344 -7973 5819 6287 -9062 9983 214 -8665 10471 -6266 -6781 6053 -6521 726 1657 -2579
358 -2579 6617 -5083 2512 9030 -9712 6280 3990 -12721 7441 -1427 -9772 8912 -3809
371 -3809 -3891 6209 -3026 4860 826 -1715 7659 -7344 -107 7120 -11445 3282 2794 -11116 7166
386 7166 -356 -4617 9911 -3957 767 5758 -5594 4994 -835 -5619 5657 -7489 -1266 6172
400 6172 -8289 4341 3179 -6004 7707 -1367 -1234 7062 -7903 1886 3408 -10323 5602 409
414 409 -7156 6380 -2531 -245 5321 -3514 4650 -877 -4039 7318 -7010 -1726 7665 -10485
428 -10485 1402 5892 -8071 5057 2005 -3851 5170 -2784 1518 2890 -5910 4672 -1948 -5530
442 -5530 6745 -5584 -551 7226 -7724 3598 3933 -7061 7169 165 -4576 5034 -4812 59
456 59 2488 -5219 4138 -2027 -3010 7663 -5548 576 7075 -7629 2994 2806 -6333 5274 -2236
471 -2236 -3025 5032 -5837 2207 3828 -6547 4813 289 -4065 5048 -3093 987 2822 -6190 5157
486 5157 -556 -5664 8473 -4340 -4104 7195 -5376 74 3468 -4284 3358 -1179 -1556 4266 -4810
501 -4810 2338 3211 -7286 4563 -104 -5085 6310 -3817 -1644 5724 -5694 2486 3280 -5678
515 -5678 4316 -387 -2799 3284 -3527 1958 544 -5292 5927 -1696 -3540 7663 -4061 -979
529 -979 5958 -5187 1829 1643 -5067 3824 -2564 -2199 4268 -4507 1852 2808 -4392 5049 -473 -2186
545 -2186 5119 -4934 835 3261 -7080 3555 1011 -5872 5674 -1178 -1794 5153 -2281 1900
559 1900 1162 -3316 4352 -2904 -2433 4686 -6038 247 3809 -5441 4714 1021 -3722 6003 -2420
574 -2420 -1512 4692 -4347 841 667 -4141 2857 -2328 -569 3976 -4692 3191 3424 -5076 5549 -158
590 -158 -4924 4952 -3375 -2275 3230 -4271 1565 651 -3052 4388 -1292 -291 4413 -3915 1962 1702
606 1702 -4909 4071 -2396 -3717 5153 -3935 -282 4828 -3912 3154 1585 -2927 3883 -1973 -945
621 -945 2445 -5128 1479 281 -4465 4546 -1485 -1531 5801 -3792 1031 4312 -4649 2399 264 -3969
637 -3969 3305 -2842 -972 2668 -3649 2696 988 -2444 5207 -2497 -957 4568 -5008 676 2292
652 2292 -5469 2599 59 -3031 4156 -1618 606 3346 -2812 2681 269 -2978 3457 -3053 -1421
667 -1421 2838 -4740 2047 2338 -4096 4258 43 -2545 4537 -2194 21 2227 -4381 1841 -738
682 -738 -3170 3543 -2857 168 3801 -3877 3105 1848 -3920 4047 -1483 -2805 3661 -3693 15
697 15 2468 -3769 2565 492 -1806 3653 -2035 536 2670 -4157 2289 86 -4273 3794 -2135 -1779
713 -1779 4361 -3231 1419 3135 -3587 2765 -4 -2306 3173 -2840 483 1618 -3997 2859 -158
728 -158 -2901 4340 -1962 -635 3947 -3730 1098 1422 -4532 2897 -654 -2395 3389 -2538 494 2455
744 2455 -2923 3336 -73 -2472 4188 -2878 -539 2887 -4294 1773 1315 -3565 3258 -405 -1268 3550
760 3550 -2412 826 1196 -3204 2690 -1199 -1919 3371 -3024 236 2919 -3350 3003 1089 -3473 3722
776 3722 -1299 -2104 3076 -2780 30 1416 -3039 3041 -493 -1415 3301 -2691 781 2183 -3343 2570
792 2570 -268 -3471 3522 -2300 -1370 3512 -2947 1154 2021 -2792 2914 -629 -1466 2729 -3324 716
808 716 1553 -3276 2805 -265 -2388 4100 -1582 -341 3355 -3046 1203 1157 -2941 2084 -1380 -1255
824 -1255 2171 -2713 1123 1512 -2797 3070 -517 -1842 3560 -2862 -147 2603 -3908 1421 1136 -3063
840 -3063 2675 -980 -922 2652 -2156 1210 1325 -2500 2550 -1251 -1639 2749 -2916 523 2509 -3518
856 -3518 2651 663 -2135 3214 -1358 -1082 2379 -2723 782 474 -2598 2553 -1371 -710 3278 -2637
872 -2637 1378 2162 -3482 2856 204 -2689 2658 -2241 -920 2179 -2581 1308 773 -1726 2970 -1242
888 -1242 -506 2503 -2975 1209 786 -3825 2417 -287 -2104 3212 -1784 -199 2428 -2428 1484 877
904 877 -2105 1954 -1754 -710 1878 -2812 1433 688 -2619 3137 -463 -1161 3533 -2261 283 2016
920 2016 -2743 1255 259 -2401 2217 -1303 6 1711 -2426 2045 552 -2302 2938 -1141 -1550 2350
936 2350 -2879 393 1373 -2660 1745 73 -1805 2599 -1318 7 1701 -2577 1448 -450 -2291
951 -2291 2583 -1751 -1106 2895 -2715 949 1505 -2748 2315 190 -1647 2331 -1992 -192 1561 -2066
967 -2066 1308 -102 -1449 2696 -1357 -78 2333 -2548 1354 889 -2754 2200 -909 -1737 2345 -1755
983 -1755 -96 1679 -2008 1745 38 -1423 2516 -1948 -30 1474 -2776 1280 123 -2392 2456
998 2456 -842 -1143 2671 -1760 348 1470 -2311 1390 -433 -1611 1804 -1894 408 1606 -2412
1013 -2412 1822 237 -1947 2908 -1108 -863 2227 -2246 715 1078 -2369 1429 -457 -736 2638 -1406
1029 -1406 401 1322 -2217 1660 -361 -1752 2527 -2058 -763 1980 -2325 1177 1433 -1976 2097
1044 2097 -308 -734 2021 -1878 172 1418 -2201 1723 -141 -1257 2605 -1796 48 1909 -2355
1059 -2355 1433 917 -2338 1705 -859 -1087 1644 -1742 825 1242 -2082 1972 -257 -868 2445 -2251
1075 -2251 239 1473 -2289 1398 266 -2131 2012 -978 -401 2396 -1818 1019 792 -1810 1655
1090 1655 -807 -948 1809 -1978 341 1334 -2297 2138 70 -1608 2610 -1281 -400 1700 -1797 668
1106 668 494 -1829 1847 -753 -600 1644 -1802 779 1217 -1993 2061 -407 -1813 2085 -1730 -225
1122 -225 1498 -2340 984 354 -1473 2090 -706 -318 1896 -1527 635 425 -2367 2035 -624 -1558
1138 -1558 2173 -1613 495 1903 -1927 1867 447 -1707 1773 -957 -724 1516 -1980 725 443
1153 443 -1477 2085 -919 -870 2466 -1533 566 1447 -2131 992 -40 -1768 1779 -847 -392 1876
1169 1876 -1645 1463 547 -1483 1685 -740 -750 1914 -2004 167 950 -2325 1645 -203 -1175 2493
1185 2493 -958 -258 1307 -1870 1106 269 -1446 1532 -1331 -448 1584 -1941 939 1046 -1971 1704
1201 1704 -366 -1084 1752 -1533 -47 1131 -1998 1170 298 -866 1661 -879 119 1744 -1721 1096
1217 1096 332 -1886 1819 -1109 -1126 1856 -1440 24 1349 -1374 1704 371 -1263 1666 -1310 -72
1233 -72 956 -1719 995 112 -1757 1771 -573 -276 1909 -1501 418 1016 -1631 1507 -269 -1246
1249 -1246 1478 -1205 -166 983 -1393 1225 175 -1316 1927 -847 -445 1608 -2053 656 579 -1675
1265 -1675 1519 -236 -843 1643 -1080 656 1268 -1762 1259 -225 -1416 1269 -1472 -126 1454
1280 1454 -1652 902 618 -1600 1898 -429 -568 1806 -1426 279 973 -1310 877 -673 -1034 1687
1296 1687 -995 277 1567 -1564 1276 658 -1440 1647 -653 -983 1278 -1366 546 680 -1387 1387
1312 1387 56 -634 1404 -1173 -51 999 -1938 856 -55 -1330 1835 -874 -315 1669 -1220 607
1328 607 804 -1185 1161 -146 -688 1336 -1514 125 666 -1730 1605 30 -1057 2132 -948 -271
1344 -271 1710 -1501 674 318 -1759 930 -631 -786 1415 -1257 706 949 -1100 1749 -436 -968
1360 -968 1325 -1701 -262 1104 -1786 1029 646 -1372 1625 -358 -387 1542 -1096 406 641 -1355
1376 -1355 980 -788 -821 1527 -1444 261 806 -1453 1289 141 -1474 1695 -1225 -567 888 -1236
1392 -1236 334 106 -1143 1112 -290 -187 1840 -1581 534 790 -1719 1206 -170 -1356 1196 -976
1408 -976 -235 1342 -1165 770 661 -1235 1304 -318 11 1236 -1745 638 149 -1727 964 -162
1424 -162 -831 1527 -1030 123 1288 -1077 752 -77 -1382 1062 -977 -479 991 -1177 894 548
1440 548 -1195 1620 -291 -381 1500 -1346 38 759 -1537 866 -44 -1026 1357 -483 299 1034 -1111
1457 -1111 855 378 -1114 1333 -817 -830 1433 -1487 -38 866 -1079 1244 319 -580 1321 -727
1473 -727 -70 835 -1158 601 8 -1004 1149 -803 -108 1494 -1109 414 749 -1288 1060 -335
1489 -335 -1089 1217 -980 -62 630 -794 994 6 -466 1230 -792 -186 1168 -1264 424 502 -1239
1506 -1239 1040 -410 -614 1194 -941 512 1012 -1274 788 -160 -803 1441 -972 -17 860 -1432
1522 -1432 805 315 -911 1290 -388 -522 1470 -973 117 560 -1405 751 -387 -692 1197 -621
1538 -621 235 829 -1073 932 309 -988 1068 -605 -607 1051 -1495 340 318 -1182 1018 -136 -624
1555 -624 1399 -716 255 368 -1065 822 -256 -890 1045 -856 -183 1247 -818 679 492 -891
1571 -891 1143 -242 -783 1003 -964 190 230 -1066 862 -154 -449 1171 -495 -180 921 -1023
1587 -1023 346 257 -1365 1150 -749 -646 1269 -798 126 492 -537 864 -402 -728 1271 -951
1603 -951 9 875 -1163 790 12 -897 1214 -479 -96 1023 -1020 556 590 -1018 702 -584 -474
1620 -474 870 -1084 129 667 -1187 960 48 -970 1073 -606 -634 721 -1221 643 129 -980
1636 -980 613 -262 -263 1127 -718 186 564 -1165 998 -346 -909 919 -946 -125 978 -1042 720
1653 720 140 -435 929 -124 -235 866 -849 426 66 -804 474 -444 -866 990 -673 30 727
1670 727 -995 728 428 -803 916 -699 -382 649 -731 545 64 -871 880 -88 -473 1036 -787
1687 -787 69 720 -1293 630 -19 -773 1019 -695 -52 724 -754 616 -3 -828 577 -593 -367
1704 -367 629 -997 711 339 -907 624 34 -551 825 -307 105 703 -840 239 170 -861 841
1721 841 -521 -249 1005 -979 410 251 -840 912 -37 -849 771 -598 -254 406 -1105 614 155
1738 155 -594 1047 -493 -189 753 -990 367 498 -779 878 -382 -375 703 -747 309 1016 -676
1755 -676 667 77 -398 786 -671 -336 233 -664 437 222 -370 873 -353 -368 1165 -603 113 620
1773 620 -991 717 -218 -668 824 -415 106 748 -780 321 -26 -543 934 -637 -171 777 -834
1790 -834 404 387 -634 614 -93 -428 793 -581 49 568 -941 335 -83 -651 786 -495 -223
1807 -223 658 -757 592 291 -598 898 -50 -370 856 -257 85 93 -856 578 -66 -738 756 -612
1825 -612 159 459 -986 349 -49 -540 494 -321 -435 1036 -585 332 321 -477 574 -191 -340 621
1843 621 -647 -36 501 -896 396 -176 -728 969 -634 -433 613 -708 146 550 -793 175 -267
1860 -267 -492 372 -867 36 260 -494 711 50 -441 646 -505 -63 526 -958 128 103 -396 370
1878 370 -155 -10 966 -242 444 476 -442 642 -341 -537 597 -674 -192 536 -827 477 110 -497
1896 -497 664 -71 -540 537 -432 162 92 -712 670 -212 -339 503 -540 130 663 -568 742 197
1914 197 -408 303 -419 -404 309 -695 101 119 -774 386 -55 -145 529 -651 300 423 -1006 424 -136
1933 -136 -434 634 -434 -164 585 -382 403 -32 -573 757 -414 -11 422 -1081 131 213 -949 714
1951 714 -34 -277 861 -425 143 1018 -561 259 -11 -536 540 -291 -39 557 -343 339 208 -724 499
1970 499 50 -346 315 -764 42 299 -953 173 145 -616 732 -283 -81 391 -598 319 -46 -670 429
1989 429 -248 -417 998 -746 340 210 -898 598 -212 -573 360 -41 56 467 -1039 340 111 -477
2007 -477 681 -120 6 1026 -769 320 444 -842 590 -285 -434 543 -326 165 337 -629 475 126
2025 126 -476 815 -359 -253 686 -528 179 126 -733 693 63 -405 439 -265 -108 444 -739 333
2043 333 20 -469 457 -313 -235 533 -422 260 400 -565 626 -34 119 694 -606 245 356 -697 401
2062 401 200 -495 727 -112 15 294 -608 -66 103 -328 494 -343 -240 875 -423 121 241 -634 408
2081 408 -34 -359 645 -550 -144 410 -489 395 -43 -531 574 -279 74 584 -442 194 391 -257 287
2100 287 -163 -425 273 -628 -229 292 -184 285 16 -140 507 -429 -43 589 -637 103 93 -828 350 -151
2120 -151 -283 805 -439 260 357 -297 294 -96 -288 606 -530 -127 418 -309 214 -3 -178 944 -108
2139 -108 -519 318 -585 160 127 -546 266 1 -418 430 -331 -102 578 -259 271 10 -446 140 -14 -319
2159 -319 200 -627 211 127 -299 252 -85 -168 567 -455 33 360 -825 147 -134 -271 608 -97 27 270
2179 270 -447 241 165 -927 423 105 -79 270 -421 246 141 -515 251 -105 73 486 -460 18 431 -674
2199 -674 208 108 -557 109 -154 -380 360 -276 101 142 -622 377 -255 -219 502 -533 95 774 -489 187
2219 187 -122 -331 535 -117 -102 244 -340 356 52 -743 260 -219 -172 312 -534 224 298 -131 439 -192 -365
2240 -365 501 59 164 563 -365 -8 -248 -345 114 -26 88 655 -354 93 309 -580 803 -160 -149 246
2260 246 -442 -137 363 -324 277 205 -479 300 -142 98 424 -318 -35 -167 -498 515 148 -190 413 -447
2280 -447 249 136 -311 511 227 -302 442 -317 -182 344 -402 359 397 -291 505 -50 -18 387 -529 99 274
2301 274 -309 165 -354 -393 787 -183 -238 791 -185 298 -89 -638 182 -262 -16 395 -579 8 398 -449
2321 -449 619 23 -85 584 -122 231 424 -173 -1 226 -228 332 -495 -221 217 -772 99 59 -641 205
2341 205 -162 -448 397 -301 286 341 -326 189 122 140 495 -156 275 59 -903 176 91 -449 377 -347 -34
2362 -34 438 -224 -19 143 -223 203 -18 45 602 -152 2 240 -422 266 33 -168 586 -274 -150 298 -350
2383 -350 -145 205 -392 130 -316 -357 448 -47 278 284 -344 323 23 -48 374 -89 -279 403 -345 198 -83
2404 -83 -313 584 109 -408 325 -250 56 528 -587 241 -152 -335 270 -108 291 29 -532 447 332 -55
2424 -55 431 118 -188 124 -418 151 367 -448 301 -137 -267 377 -249 -90 304 -401 219 2 -160 172
2444 172 -327 85 214 -252 39 19 -315 312 -246 -197 488 -122 68 -11 -451 201 24 -448 321 -230 -7
2465 -7 121 -50 701 322 -253 334 -144 -191 533 -329 163 -46 -425 418 -232 -132 489 -491 144 218 -732
2486 -732 -46 -102 -193 541 -274 -194 455 -182 237 100 -589 149 -51 -327 304 -397 82 18 -156 304 137
2507 137 -196 478 33 -177 115 -108 120 -56 -376 199 -207 -301 185 -293 110 351 20 262 -162 -399
2527 -399 411 -455 -221 221 -437 50 71 -461 124 -191 -196 45 -319 -185 152 -523 219 -68 -463 172 -367
2548 -367 -144 189 -410 -147 15 -205 570 -269 -215 524 -524 151 131 -411 720 -163 160 355 -323 -122
2568 -122 84 -284 71 -221 -162 217 -109 -286 455 -239 -163 124 -344 107 -133 -165 285 -507 122 193 -326
2589 -326 318 136 -171 268 -264 95 291 -76 96 80 -298 300 -273 -26 418 -331 299 257 -111 440 -132
2610 -132 -185 377 -226 -118 128 -193 88 -53 -282 356 -21 502 364 -312 -1 147 -220 18 -43 -149 113
2631 113 -173 24 -45 -208 275 167 -194 164 -64 10 60 -207 -59 149 -368 -145 -1 76 632 -176 114
2652 114 265 -154 231 192 187 75 -126 -17 270 -561 68 132 -484 121 -69 81 -40 47 -112 13 -54 30
2674 30 -121 -253 322 -110 -61 128 -442 151 91 -177 257 -157 -432 156 -91 680 265 -155 200 30 -397
2695 -397 370 -467 146 231 -278 334 -157 100 360 -168 232 558 -359 121 -284 -63 136 -290 -112 132
2715 132 -155 -76 188 -220 44 -84 -87 197 -475 190 76 -80 291 -195 -90 24 33 -224 0 -34 252 256 -174
2738 -174 392 -185 -76 116 -220 66 216 -530 143 -212 -413 603 -129 -45 86 -91 319 -144 -130 91
2758 91 -171 69 283 -195 -362 -60 -242 127 -126 -190 37 -137 415 83 -210 189 130 -584 68 -70 165
2779 165 357 -161 421 393 -429 17 -66 -192 341 -122 117 -64 -351 45 -158 -413 51 3 -20 -150 -368
2800 -368 -184 255 -6 235 -60 -190 59 -205 -100 87 -196 290 41 -273 -70 -418 50 158 -271 70
2820 70 131 110 306 37 -113 90 -203 34 37 -338 79 98 -25 149 -122 -233 325 111 105 90 -61 173 -103
2843 -103 -233 150 -390 338 30 -283 220 -112 -451 61 49 16 36 -108 405 190 88 -25 -71 -14 220 105
2865 105 443 233 -139 -11 -58 -239 -12 -339 202 254 -178 31 262 -250 9 104 -190 323 86 -45 130
2886 130 -173 130 68 -163 64 -297 -99 225 -113 -309 9 -161 575 -224 76 307 -355 116 -1 32 98
2907 98 -447 -82 103 -435 -85 112 -639 140 -1 10 268 7 148 101 2 -57 85 -16 386 -259 -222 264
2929 264 -225 -12 208 -272 22 80 -82 312 94 -197 383 36 49 -94 -73 12 350 82 116 -28 -58 -60 -68
2952 -68 38 -125 -174 67 28 -97 89 -98 254 9 -58 244 -244 -132 254 -230 73 -231 134 232 -44 -198
2974 -198 164 -17 207 -38 -189 339 -179 66 49 -174 102 87 -274 -204 141 -58 134 -192 74 46 -135
2995 -135 -37 -35 98 727 -37 93 -158 -91 43 97 38 -196 -24 -149 134 -92 21 -232 -366 -154 112 -46
3017 -46 187 146 242 142 70 45 -19 -316 62 -164 -153 396 38 -77 146 -134 46 233 -135 58 -41 -189 400
3040 400 -72 49 247 -82 63 165 -303 184 183 138 70 -226 -28 -188 -331 356 -88 308 113 -350 -110
3061 -110 34 -16 158 261 243 221 -206 148 168 -140 -44 0 15 234 -117 172 -116 -228 450 332 -218 64
3083 64 -303 -78 180 -235 201 38 -75 -55 30 -78 38 -74 -21 109 -157 -57 -206 -302 38 -79 143 -60
3105 -60 -328 367 -34 -182 221 -71 -9 359 -123 -119 90 -159 338 245 -99 192 -94 -195 181 -289 210 -173
3127 -173 -25 317 -258 6 53 -107 88 113 -325 356 -170 98 38 -138 -52 -35 234 95 50 -35 88 -133
3149 -133 18 0 -240 -125 111 -184 -242 280 54 10 11 114 121 90 208 199 -210 83 -45 -268 197 -173 12
3172 12 -164 -98 -57 -27 66 212 -310 84 3 -72 133 53 35 50 75 170 67 45 166 -261 -302 122 -42 -43 -25 220
3198 220 111 0 203 -205 -216 226 68 -140 68 -154 -7 22 -4 -197 116 -50 -99 179 -148 152 -303
3219 -303 -185 85 52 -215 531 -348 62 -189 -282 415 66 -99 415 307 -266 -38 -436 59 -162 34 156
3240 156 -432 54 92 -10 43 -51 -211 194 66 -306 3 -55 126 -36 -511 139 68 107 271 77 336 243
3262 243 -110 -134 -21 125 60 282 190 -41 -118 -231 166 334 -27 55 -172 443 21 -153 171 -126 119 85
3284 85 97 -91 274 188 -66 -245 -91 191 10 -215 -157 -76 -147 -9 138 -108 -248 291 -101 5 48 -106
3306 -106 -452 161 -8 64 120 -429 181 182 -258 279 -158 23 177 -105 111 90 149 236 -193 -114 345 -101 353
3329 353 -65 13 -32 87 137 -104 -363 -193 -35 288 1 -135 -175 39 -240 123 -20 -320 83 55 -78 200
3351 200 37 -19 31 93 -44 -111 -75 204 178 -388 139 130 -190 -104 -184 -103 96 -158 22 -363 -55 222 -203 -53
3375 -53 288 -24 416 -247 -108 -277 20 -385 20 47 -88 146 104 37 -289 96 130 -163 -219 -17 -281 -70
3397 -70 29 35 -225 -26 -190 297 -114 -7 123 254 -97 -61 -97 -33 -145 -9 37 -111 134 150 -13 123 193
3420 193 173 49 63 155 55 -142 237 -25 -73 246 109 22 272 -100 49 -11 9 -18 -119 36 315 -254 114
3443 114 -361 -123 192 43 -133 416 -104 -172 89 29 28 90 -131 43 -36 19 136 -19 45 -34 -29 -114 -139 -51 -126
3468 -126 -452 295 96 -387 411 57 -80 245 -209 -103 -42 47 52 43 -23 38 -182 -121 163 19 114 52 311 -6
3492 -6 -74 -149 -69 -290 169 23 -330 434 -26 -237 16 -26 151 29 101 -221 -113 -191 94 117 -8 84 -26
3515 -26 -4 -96 51 -80 53 76 163 -45 17 51 -194 64 -93 48 38 226 -23 -39 23 50 -175 -42 101 104
3539 104 -248 96 -155 9 92 -65 -11 91 -383 78 -278 -77 232 -139 36 -256 9 509 61 61 164
3560 164 -458 94 -69 -251 -114 142 281 -57 -430 -28 -214 242 303 130 161 217 31 63 360 -87 -199
3581 -199 -268 114 160 83 -274 293 -188 -171 99 50 66 -495 -65 157 19 -121 296 -108 160 -230 47 143
3603 143 136 59 -34 -254 50 151 115 51 51 295 -105 -143 168 -160 -310 -11 -21 44 79 -131 81 31 -229 104
3627 104 274 118 -79 224 183 -89 -178 52 41 -303 154 3 110 -301 -350 -182 162 170 187 175 -175 132 -246
3650 -246 -139 267 334 -139 239 241 245 -140 144 418 -43 10 88 12 150 -280 -208 2 -18 -40 325 -21 223 -248
3674 -248 151 -36 171 -37 91 -158 45 230 -114 214 21 -73 128 -187 -342 -9 -439 -44 -85 101 194
3695 194 -12 83 177 107 388 253 -141 113 229 -61 24 37 73 229 -398 201 219 352 -2 -207 -373 -163
3717 -163 -67 -8 37 -69 122 100 -266 -19 -94 -44 49 -309 9 -22 229 -210 248 82 -45 -120 153 148 -205 3
3741 3 64 207 -303 120 -222 -20 -128 -15 181 -82 -2 15 29 77 70 -65 -82 -23 75 137 -94 161 -35 -203
3765 -203 -124 -79 174 -188 32 378 7 106 110 -219 44 165 -163 56 34 -27 1 472 4 -581 -333 166 42
3788 42 -1 79 -127 106 241 5 205 -170 -10 246 -105 227 150 -302 -184 7 -204 87 -121 180 -138
3809 -138 -243 319 -31 -145 76 -89 -160 169 -133 -13 210 -136 96 -197 26 20 -276 191 163 -4 -239
3830 -239 112 31 85 4 158 126 124 227 221 28 46 -40 -8 180 -171 -26 -407 -241 -215 -341 -74 141 -25 11
3854 11 346 -346 63 108 17 -28 -138 -158 25 54 54 -93 80 -55 -39 -50 139 86 -293 32 -31 -179 -58 -103
3878 -103 -366 -164 -295 214 -22 282 218 -161 60 444 -245 -307 235 -54 193 9 -100 -296 -12 191 47
3899 47 -33 85 -58 -121 -181 -147 304 -66 -366 -106 -55 21 311 -222 -4 357 9 -29 -127 -50 -225 -474 -132
3922 -132 1 222 246 -151 -146 44 -299 -128 66 -283 408 -273 -29 76 -197 -295 126 108 93 -95 236 267
3944 267 -110 256 152 -226 252 154 -18 12 -336 -36 -216 379 -77 -114 -357 -13 95 50 -130 -64 -215 113
3966 113 -152 296 250 101 414 -285 -24 29 -28 -266 171 229 -153 39 -130 121 42 -62 60 -250 49 -67
3988 -67 -87 89 2 -348 169 -49 69 299 256 -56 -276 88 -90 -234 107 221 -364 162 -194 -94 -2 57
4010 57 -190 -20 -75 83 226 -51 -23 -191 -156 229 135 -7 -154 124 192 -221 133 -50 142 -226 230 -546
4032 -546 -101 -194 52 423 -68 58 -57 -285 -18 -32 -214 -10 155 -189 85 -212 -334 251 -373 -305 136
4053 136 -7 260 1 -164 -91 -21 414 84 -188 -193 206 -210 33 -99 -123 61 98 54 66 -29 -217 42 13
4076 13 177 213 -35 288 -247 -21 384 245 252 -365 -47 -147 -167 60 -6 -20 88 -171 -58 332 156 172 -47
4099 -47 -97 102 52 -38 147 -25 -179 250 19 -93 186 -16 -173 -92 -31 340 151 -206 -121 245 -112 -106 130
4122 130 -243 185 56 135 -254 -280 186 -136 110 -20 345 -147 -200 438 29 -99 180 -202 68 -88 110
4143 110 -35 22 77 43 222 -146 -125 -83 -142 99 -154 -55 208 -259 132 -61 -206 -13 45 -149 76 90 132
4166 132 -17 75 2 -168 -73 -59 -307 154 344 -15 62 -178 155 -107 198 -184 -211 -74 -167 -82 74 -161 -46
4189 -46 -9 -23 55 68 47 -30 -187 -76 -124 -94 -1 -6 318 231 244 38 343 -147 -159 -72 266 -52 31 11 30 2 -83
4216 -83 91 41 10 -42 32 -350 318 -16 25 -12 87 -216 98 62 -75 163 359 45 -47 -102 -53 8 -203 16
4240 16 -116 133 -59 -29 -255 9 3 -35 16 -32 16 -281 78 227 35 222 416 346 -187 -261 152 -53 107
4263 107 -50 -166 188 -82 26 -12 -33 -78 128 101 170 62 -246 6 109 -223 289 109 -55 -174 61 -197
4285 -197 -207 198 220 59 -135 46 -200 87 -188 84 8 140 -137 297 -95 -166 -24 -38 -9 73 -220 -207 249
4308 249 32 88 -40 290 92 111 187 56 -1 -211 450 -13 -433 -446 166 142 176 99 72 18 -65 -66 -109 -173 -250
4333 -250 264 -192 -29 109 -277 -85 355 106 -440 89 -48 -133 -42 -179 -104 -308 108 -222 -188 -198 -83 -218
4355 -218 -145 -61 -92 -223 -281 -117 -48 226 110 -202 169 -41 -62 241 -180 -94 -142 -149 -8 9 -70 4 89 61 241
4380 241 -207 115 132 -263 125 -1 6 -2 146 13 174 98 -117 -93 -106 160 -46 -157 -27 169 28 329 124
4403 124 -126 49 -96 48 -82 -1 302 280 27 158 -76 -65 270 138 138 -96 -457 -108 126 13 174 -44
4425 -44 -196 41 203 -183 -112 -84 71 -264 9 42 -184 -249 227 -277 193 -226 141 -88 -183 -106 -182 118 -75
4448 -75 135 192 183 -51 124 168 -113 349 -177 70 -181 189 -21 -86 21 200 1 50 169 -135 107 25 -264
4471 -264 -404 -50 -214 49 -183 -167 157 -158 190 147 -164 44 -71 -49 -63 131 -177 57 -103 52 278
4492 278 268 246 -136 -32 -82 -142 431 -16 21 132 -64 -108 304 -186 9 92 -72 216 33 139 -60 -49 -11
4515 -11 -115 190 114 -15 67 178 -198 23 154 -14 38 71 10 -52 327 158 -53 -137 -82 -117 71 51 68 179
4539 179 78 -37 61 160 -52 -172 15 251 124 -204 -196 -455 -134 -26 411 -111 209 -115 109 169 -120 -278
4561 -278 -293 64 -61 96 -182 76 48 204 142 -89 124 -123 -283 80 196 -49 -77 -51 4 101 -196 -329
4583 -329 -34 84 131 14 -34 -131 112 154 258 -10 -31 -14 12 292 -10 40 297 -91 143 -109 97 201 -169
4606 -169 -162 -198 -131 -22 99 62 48 -24 120 -210 -125 23 236 -30 83 88 222 -95 111 139 -189 -168 72 -53
4630 -53 -93 19 83 -201 -55 -22 2 130 -146 -223 43 -341 -267 18 148 -186 303 -43 -139 319 55 -45 -339
4653 -339 -2 -54 -141 170 -195 69 -82 98 -53 -169 -12 5 -5 60 -42 -97 -416 -152 -25 156 -141 100
4675 100 -95 6 68 27 -76 -105 -44 -40 24 -218 75 40 -29 22 116 -143 -243 116 -289 33 37 195 15 -119
4699 -119 -193 337 218 -88 80 40 207 -268 -88 158 11 142 350 107 87 -143 178 183 7 84 -137 -114
4721 -114 -45 -110 148 49 -176 -90 -9 138 65 42 -94 -31 -218 -481 78 97 64 -228 70 -88 -98 19 91 -199
4745 -199 -66 189 -35 -120 -76 198 122 37 69 205 29 180 108 -5 -12 75 -286 -149 17 -17 31 -81 -29 -256
4769 -256 137 17 10 77 81 -186 -41 -282 -80 225 -59 218 -157 -146 -21 142 32 36 -88 -73 -166 -17 27 26
4793 26 -140 165 -172 -119 -42 -74 88 -225 -140 7 200 -16 11 -20 123 -90 93 33 -298 -57 -59 -240 -133
4816 -133 54 139 89 -149 120 -43 -272 93 -31 45 -50 -32 119 -260 -81 192 154 353 -35 83 -40 -329
4838 -329 24 -107 -77 -172 81 177 -28 -18 -124 14 -113 -91 -22 68 272 -56 65 189 -89 319 -38 -321
4860 -321 -276 -95 54 70 -402 -261 102 13 273 -69 -151 2 -48 177 -108 91 90 -395 105 -199 223 -94
4882 -94 9 73 -67 125 -16 -42 87 91 188 -85 186 -39 109 -37 22 -149 -103 -18 -45 149 -122 28 -187
4905 -187 59 106 -168 -220 -372 180 253 -64 -224 -156 91 58 81 -150 -38 44 -37 -333 -142 100 1 354 -130
4928 -130 70 195 -35 145 154 31 -277 -34 -269 -103 -106 46 -274 -102 -38 42 270 184 3 -22 -246 28 116
4951 116 56 183 -164 -346 -144 -31 78 117 -20 -86 -258 -154 192 215 -54 -122 74 -101 75 107 -67 -128
4973 -128 11 -20 29 185 115 -61 33 235 -193 17 -131 97 -122 94 -236 -272 152 -229 -178 -191 -93 69 -41
4996 -41 32 87 213 108 345 -140 -75 126 82 15 0 -16 -253 -83 -170 129 111 -87 43 101 152 -54 29 29 103
5021 103 10 127 -70 254 -48 -112 -45 -233 -76 -250 196 229 -19 -3 -131 -304 275 5 -7 108 147 51 -33
5044 -33 -83 -108 16 -3 284 331 248 -6 -123 34 35 19 -182 -15 -124 192 16 434 164 -133 -9 -66 59
5067 59 126 -79 -39 -249 -227 87 -28 64 106 -142 5 176 -126 128 -47 -66 -50 -398 -339 -139 -117 -204 156 37
5091 37 -181 75 -5 -43 -53 35 -53 -159 -32 -14 -239 73 62 367 57 -183 -148 -63 156 133 110 -158 -59 12 -89
5116 -89 185 34 163 -29 -12 108 -130 82 172 -175 -280 44 -254 -154 -62 99 114 -283 -66 -118 -291 -164
5138 -164 -53 -172 -123 -6 -203 171 25 -188 -42 -32 -88 -238 197 -13 -94 196 255 -132 144 -152 19 10
5160 10 -61 228 -218 21 211 44 435 226 96 27 252 97 186 199 24 152 72 123 -85 -192 -14 21 -147
5183 -147 -55 -202 -35 117 90 -48 49 -169 73 3 -9 145 -3 -5 50 9 -39 68 -33 282 -253 -62 390
5206 390 222 495 160 37 51 46 329 -244 126 -177 20 -134 -43 -25 -397 307 13 108 -122 103 -146 7
5228 7 67 164 -130 81 -80 -10 159 -221 295 92 299 169 -91 131 33 13 150 152 -177 -123 -92 -222 161 21
5252 21 196 35 -49 240 -54 117 -54 -107 34 158 108 110 214 -30 -46 -212 69 72 107 -92 161 459 -85
5275 -85 163 181 -201 -163 225 27 122 192 -29 62 277 85 -132 30 52 44 -99 70 -123 -169 96 -55 55
5298 55 -86 119 -200 28 77 48 -169 -113 -136 52 211 86 -236 -74 -63 68 -410 -78 -347 134 -156 -52
5320 -52 310 4 -82 183 -147 -235 150 114 -18 199 187 17 -432 206 270 -45 44 -185 170 -53 -206 151
5342 151 -42 -71 61 -96 55 228 -163 -140 -18 9 -333 -194 287 106 -139 -275 -4 -84 -105 90 -120 22
5364 22 -17 -300 73 -41 -235 62 -338 132 -141 -165 -207 -105 319 78 -442 -105 -102 -91 -201 57 -27 56 -45
5387 -45 -49 -118 44 283 91 9 92 97 76 219 16 -67 90 -57 110 55 37 -129 -123 149 -23 -106 -78 68 272
5412 272 109 -271 -73 -71 45 -9 7 240 159 -171 196 -6 -119 234 191 122 -184 235 69 4 -66 -118 3
5435 3 -187 199 -86 -182 -27 -115 203 -150 -67 76 -328 -84 242 -26 -189 11 -90 14 52 94 -64 46
5457 46 10 -13 120 102 51 193 35 114 -217 147 -230 146 -182 158 198 38 -75 -122 80 -273 83 34 -31
5480 -31 186 -18 178 141 4 85 196 108 -135 -99 96 236 -12 56 1 43 -61 119 -25 13 -206 -52 -232
5503 -232 -55 -314 37 -13 244 78 -91 144 -12 57 -84 -122 -286 142 -247 -296 8 -130 -98 144 178 -22
5525 -22 -245 -42 81 -101 -120 155 156 -113 192 -45 -5 48 196 174 95 43 67 87 7 -148 35 90 -196 39
5549 39 -271 -31 -130 -110 1 -165 42 -112 -52 -101 -67 43 -179 184 -63 149 180 190 133 -70 -160 227 277 219
5573 219 -65 -117 51 -74 -38 -123 -22 211 -125 160 -94 -282 42 -103 -22 -180 -66 248 -147 -15 109
5594 109 176 -193 -47 -186 90 57 -158 -119 -251 99 136 26 246 -60 -152 -26 -214 -58 -69 142 90 -274
5616 -274 -52 -68 48 327 -110 -58 135 -27 18 143 315 197 -10 -127 83 186 -272 -311 -61 -134 -139 468
5638 468 -165 -146 343 86 -191 -31 7 -209 252 94 -137 55 -37 -82 -11 -52 -118 99 -61 17 -134 232 -13
5661 -13 -25 19 -147 -159 -253 -122 -30 -11 114 132 -76 -64 -227 31 -197 93 101 -80 -202 40 -85 108 0 -187
5685 -187 -1 -92 189 94 225 449 240 -196 9 123 2 -184 -90 -217 6 -31 -111 48 -400 -45 -300 -389
5707 -389 -89 -226 -120 -49 -126 6 61 45 -43 -56 318 34 -154 -4 124 -158 195 -12 68 -118 21 262
5729 262 109 28 107 -88 101 -130 -40 -25 100 22 219 -208 -75 58 79 148 -142 117 52 105 76 261 179 119
5753 119 -128 213 207 -25 55 -62 119 153 -76 187 161 44 -12 275 -185 3 114 160 41 -63 76 -67
5775 -67 -111 -212 -137 14 -217 -164 8 179 122 133 -157 240 -76 -132 251 85 -120 197 180 -71 18 -217 295
5798 295 -64 30 -25 -34 -55 457 195 226 78 -76 -152 -433 119 30 5 42 -195 252 130 42 6 115 197 12
5822 12 73 -68 36 141 -140 142 -241 -125 -16 -110 3 310 25 419 -80 89 44 58 153 -273 340 243
5844 243 120 -214 -307 0 -378 -41 25 -115 -83 -7 54 -174 -108 -24 140 27 180 -25 210 -30 85 -58
5866 -58 -226 -59 80 -201 -21 -139 -347 44 158 -135 -287 88 362 104 98 175 -258 -68 -13 35 48 -52
5888 -52 14 76 49 228 -123 51 -57 -89 69 73 78 -19 34 -204 -155 78 -15 21 -50 -99 -212 93 312 -295 -34
5913 -34 -192 -286 166 -151 117 186 125 -296 2 -84 -68 -24 53 32 292 -9 121 129 -396 -6 -2 235 54 253
5937 253 -281 -200 113 267 468 28 138 78 -172 -131 -399 -40 219 315 289 73 -6 -210 135 -100 224 150
5959 150 -46 324 38 42 67 59 -48 91 -85 162 10 -165 -53 -163 77 -272 -242 -116 27 -331 -285 -18
5981 -18 101 210 33 -417 27 99 -76 137 -90 22 122 226 75 29 -306 -125 20 -59 -37 115 72 29
6003 29 -100 46 238 79 53 -43 -108 -188 -21 -61 205 289 -20 -47 84 -224 -28 139 -46 48 21 166 81 -14
6027 -14 53 134 -78 74 -263 154 -82 -131 -66 -98 40 237 368 -82 95 92 57 -211 19 65 -120 -136 -100 115
6051 115 -40 -99 267 -454 -274 -30 -71 68 -24 -110 -124 26 -248 -87 -143 -32 -151 7 179 155 -38 15 23
6074 23 -172 26 236 96 81 11 -230 267 77 215 112 -32 112 -51 -187 -139 163 155 -185 109 -68 169
6096 169 -344 77 -218 -210 -150 21 -275 -4 34 -312 -309 -26 187 116 -4 2 141 -16 -202 110 -24 -9 145
6119 145 -200 -231 -123 274 -97 -270 -77 -148 -179 58 175 -86 -195 87 18 -239 -44 251 85 170 -117 -59
6141 -59 -206 51 198 -6 3 67 -129 260 -64 84 -71 -17 -83 33 -15 39 409 -28 -44 -7 -47 -95 -245 143
6165 143 -91 -4 -36 44 -136 -176 120 -266 160 -328 -12 -236 -42 53 -23 -343 -92 0 -183 177 116 56 -15
6188 -15 -44 -80 177 -444 -5 -185 -109 74 233 130 57 146 -16 74 -176 -262 -211 -159 328 99 32 45 -21 -41 329
6213 329 36 77 -91 175 141 221 121 -252 259 206 -225 87 -42 191 -27 -370 -71 -30 -104 -204 87 -8
6235 -8 62 -6 376 162 95 57 -187 125 96 104 174 33 -201 -14 -54 5 -290 -33 -37 23 288 -164 -161 140 -97 -113
6261 -113 181 66 104 -32 21 -13 1 -289 -327 -62 81 119 56 24 76 -79 138 111 -198 31 30 -63 2 11 -123
6286 -123 66 141 133 9 18 132 79 288 58 270 52 -67 37 102 -30 256 112 184 449 296 14 272 102
6309 102 25 -69 -6 8 -53 39 -154 204 -91 324 104 330 136 141 -29 104 -103 -15 -85 -39 -41 -86 -126 -46 -263
6334 -263 243 104 -29 52 13 -277 74 -17 220 137 182 -131 -144 -292 -43 89 -172 -25 -22 30 45 113 125 -51
6358 -51 -9 15 279 -91 -49 79 -1 104 121 28 0 135 128 8 -92 199 -219 -28 314 39 -196 333 92
6381 92 -66 -69 343 117 1 -193 123 -79 81 52 192 40 -33 182 -165 -78 -225 -29 -181 -28 48 -91
6403 -91 203 287 76 182 125 -51 -31 131 -214 -5 83 -168 163 121 -50 89 -219 -99 -183 187 178 469 143
6426 143 143 55 -106 -196 -273 -75 98 -168 213 219 -35 279 -3 307 81 -17 -160 -203 -134 315 -116 239 -39
6449 -39 79 50 49 158 27 76 -87 90 -34 33 265 -19 133 -130 57 -24 -125 -165 -26 34 -158 -122 82
6472 82 -132 -170 -224 -123 66 109 99 -15 16 107 152 162 -110 17 -20 64 -167 321 161 -139 -102 -70 -182 -31
6496 -31 -32 314 -353 240 73 -233 89 80 -52 27 332 223 7 -105 214 53 81 162 -244 -111 162 -1 -26
6519 -26 192 100 -89 364 335 3 50 -111 -81 -139 -30 -135 75 215 -227 31 -135 -105 122 -48 101 -246
6541 -246 -40 -109 313 61 149 100 -31 19 -27 -49 239 -66 -135 -42 199 302 431 154 13 -210 -222 -186 53
6564 53 218 -293 122 49 43 310 94 -181 -24 103 99 -9 -200 -158 -135 102 183 -112 237 107 -309 -217 -127 -65
6588 -65 -130 177 110 86 -68 -154 -75 115 2 -202 -5 -45 -78 -261 -8 -240 14 67 -46 -160 289 31 -122
6611 -122 -91 46 -103 -234 -5 319 23 33 17 64 -11 70 -11 251 234 -195 121 -15 -10 114 -32 -84 -33 -339
6635 -339 135 -11 162 -105 -50 -91 -76 -103 60 219 81 -34 61 -417 -392 -6 -105 -99 4 89 -65 99 -105
6658 -105 199 -110 -105 -137 -51 -118 61 -77 101 -178 -138 -252 91 -269 -108 -61 24 -128 -112 -13 22 -70 -34 196
6682 196 -98 129 -48 92 -173 -161 -93 60 223 32 -40 26 116 74 -14 263 353 -209 -21 -169 316 11 -297
6705 -297 150 85 182 -235 391 154 64 275 314 52 361 -34 -129 340 -249 -70 250 203 -264 164 -114 159
6727 159 -23 -22 -13 -297 255 165 168 290 -199 25 -20 235 -10 120 109 -480 34 153 -207 240 152 288 174
6750 174 -215 26 -21 -141 67 -236 -70 -169 168 53 276 92 -131 40 27 -255 -69 428 -25 -292 15
6771 15 -53 19 -152 -71 101 0 279 53 -23 -38 -39 29 -80 181 -195 144 -173 -260 5 -22 -4 -128 202 -31
6795 -31 -334 80 212 166 19 -5 39 -55 -110 3 -102 200 -135 -34 -212 0 -16 -6 -38 -155 71 -74 5
6818 5 -1 310 134 -56 42 131 173 -58 113 62 -275 -89 192 -20 -282 56 194 192 99 -65 -147 -2 66 -10 31
6843 31 32 31 -352 119 86 -228 167 377 306 -87 -41 21 -93 -337 56 46 71 67 240 -215 25 291 117 70 214
6868 214 384 -72 79 -141 154 386 174 -293 -51 -84 -6 -225 -111 23 -250 -13 140 -87 50 230 -114
6889 -114 -246 -159 -57 -101 73 -49 -107 -66 -102 246 58 -330 173 -38 -51 -24 -43 250 -25 -154 -266 109 -217
6912 -217 -153 217 55 39 -119 -481 -49 -73 338 87 83 85 -28 48 -94 77 -17 -8 5 12 -137 83 114 -225 195
6937 195 39 25 -71 -152 -152 67 26 48 -150 -18 -101 174 -76 -74 238 192 -147 15 79 321 -69 -157 -30 81
6961 81 -124 -50 247 5 -56 142 -154 -149 -92 -15 177 171 -246 13 126 145 198 -88 417 250 1 135 -144 -180
6985 -180 -56 -16 42 194 75 -196 51 -169 -253 110 34 -117 -159 -145 -103 -35 -147 -68 -188 -140 -142 -58 378 399 82
7010 82 131 -7 -110 277 -150 -133 239 14 -309 -455 181 -80 -45 -58 -68 -114 176 29 -82 229 105 91 -118
7033 -118 109 -30 37 10 50 -190 -417 104 -70 -72 63 -225 374 92 -83 -92 113 201 -245 342 275 141 121
7056 121 100 -201 -154 15 -65 220 122 -29 -49 226 243 -6 16 -62 -130 -45 -114 -125 -181 -28 323 77 54 -163 150
7081 150 51 20 -44 -338 -416 129 227 -21 289 82 -42 -38 225 -85 198 -62 51 -58 57 -116 140 46 28
7104 28 -39 65 -189 -246 64 -282 -12 -224 -55 -110 -231 -91 -179 -120 -15 -2 151 294 -16 -176 -80 -32 121
7127 121 -97 156 -5 316 -96 -142 -126 -69 199 -129 6 106 125 42 24 -27 -49 -131 211 196 412 -15 121
7150 121 96 -333 -153 17 72 -170 12 -72 -82 -111 172 18 -264 -82 275 118 -59 -270 -104 98 -202 -261
7172 -261 64 -186 175 137 87 -159 -118 -9 71 -56 -1 -362 -348 -94 87 115 -125 288 -60 -30 -66 -30 -22 -78
7196 -78 73 126 187 107 73 -117 -21 192 -193 179 184 -114 -109 -125 328 8 -207 -111 117 -223 136 45 -91 -117 147
7221 147 -304 -42 129 -9 -19 112 -336 -48 92 -261 185 -158 49 -105 237 134 126 -82 81 -3 -67 121
7243 121 -123 141 -156 159 -191 136 211 -280 -71 -216 -224 432 -120 85 133 160 -8 3 -183 229 -108 70
7265 70 200 28 -177 -42 108 -160 40 -35 112 209 -75 66 78 -73 -9 77 30 -47 34 -5 65 75 82 10 -38
7290 -38 -45 -29 128 -39 208 201 26 -31 35 129 126 82 -121 92 358 -77 -48 211 162 14 -50 -2 -199 6 -29 -318
7316 -318 160 -21 -65 58 274 174 -84 31 54 -231 35 -19 -152 80 139 81 118 -439 -64 20 -150 9
7338 9 149 -195 -9 -23 -175 26 2 22 -90 19 31 75 -128 -76 156 36 15 88 27 -107 -74 -229 -137 -234 -143
7363 -143 -139 -157 -155 73 -64 42 199 -208 -22 46 43 -23 57 83 8 -180 151 -168 -4 157 40 18 -170 -114 -28
7388 -28 -12 -116 -35 -86 40 -4 119 163 92 -134 277 -7 -286 -100 338 -76 82 -27 224 80 -23 0 131
7411 131 17 26 69 -387 78 -55 -227 31 310 211 -357 120 -15 -38 175 -50 -23 89 -6 -58 -345 116 13
7434 13 -14 -206 -299 106 66 153 156 97 -285 205 137 33 34 111 -72 -150 5 209 -148 25 -164 -21 46 -320 64
7459 64 108 -113 155 -175 -107 -18 -34 -183 -151 -340 147 118 -67 -155 -117 -59 -59 -87 -113 -64 -133 67 139 74 -68 35
7485 35 -70 -1 -360 135 494 106 -50 -121 -212 246 105 60 -26 34 244 96 -49 -346 -100 241 111 -24
7507 -24 -149 -194 286 -141 81 -8 70 -230 -149 -62 191 29 -118 21 57 -69 -153 -2 51 198 -135 -168 -179 45
7531 45 -78 -169 -17 -162 79 -36 -126 -245 -104 -290 178 -118 48 -212 253 -80 85 56 -251 241 -138
7552 -138 -175 -127 -290 -26 183 27 -191 116 206 2 131 115 40 294 -99 -137 -160 87 40 -177 13 152 113
7575 113 91 -65 298 148 83 -253 -168 116 -108 165 97 6 52 74 -39 99 -12 -20 202 -12 128 124 -2 140
7599 140 48 18 -20 -56 -93 -84 -443 -35 155 -134 292 -134 5 -15 -1 -144 -122 290 233 262 2 -128 29 52
7623 52 296 -426 -106 -4 99 -42 -69 -23 -24 59 -111 35 258 -172 111 3 -147 388 -370 50 146 -47
7645 -47 1 84 -64 -185 -293 -15 -186 1 23 -23 250 66 310 -170 -61 39 96 131 313 -51 -2 -132 -27
7668 -27 13 -72 85 197 -155 114 -74 130 197 54 -77 -263 -33 108 249 -407 205 27 -38 -161 -125 -169
7690 -169 122 143 -229 -61 -140 166 -156 -125 25 -66 -62 78 -83 248 -77 -148 509 223 -264 262 -59 149
7712 149 -106 137 -3 139 218 -138 -136 52 77 -88 116 60 -51 151 -138 -176 -211 -57 -321 74 -26 133
7734 133 34 229 96 236 -34 -3 191 -243 -112 11 -65 -226 -384 -9 87 -94 -305 -16 37 105 -20 65
7756 65 -131 -156 74 -33 73 -166 17 -21 -222 121 -189 -102 -24 -276 -154 16 -124 -163 -210 -3 167 -17
7778 -17 72 -20 83 83 -170 227 -29 3 362 33 162 106 154 -208 -16 51 -100 -458 -4 -245 -79 21 102
7801 102 -189 98 264 -342 165 -56 -70 179 -215 201 -49 34 -181 -67 264 227 271 17 22 256 66 -60
7823 -60 -254 -273 396 118 29 174 -102 -147 -53 -363 59 271 -17 -190 52 -156 -120 162 118 -164 108 -16
7845 -16 280 50 29 -33 -361 -329 71 -220 -385 71 25 -100 -25 -207 59 -38 -199 102 58 -62 -78 10 -20 -354
7869 -354 25 113 10 144 84 13 -124 70 -188 -67 142 -96 -161 -248 3 -148 9 -167 -32 -42 35 -197
7891 -197 -289 -54 -162 56 -85 -30 -149 -105 190 110 -222 -144 14 -47 181 22 -45 -146 -189 306 -137 -607 101
7914 101 -50 -19 74 57 106 133 43 195 102 -353 218 -126 -333 -201 -289 -94 -165 -225 72 150 -30 337 268 63
7938 63 43 140 121 -225 -58 -165 -299 -149 47 -99 -75 56 314 -27 -12 281 43 220 167 -79 35 207
7960 207 -85 -5 99 288 162 61 9 171 -95 70 -56 -202 -106 47 174 135 19 -44 -159 -136 450 -380
7982 -380 -261 51 -209 135 463 -305 -61 -220 -54 -152 72 -40 -168 138 375 74 106 7 -125 152 316
8003 316 -150 26 132 -37 -148 -158 -71 61 17 -168 -39 -141 -163 -238 -29 -21 -16 262 262 85 -91 -37 -92 115
8027 115 -174 -222 27 70 332 -123 -58 65 -62 -152 -62 -82 -137 167 39 8 -108 144 52 129 -18 -61 184 136
8051 136 -2 -33 -155 -70 199 -96 154 -54 75 -71 204 346 276 194 132 244 -148 205 34 -102 -42 -201
8073 -201 195 -293 -234 -45 12 -204 290 161 -108 -123 -133 198 60 213 -36 -103 -538 -40 -24 146 23 123
8095 123 289 5 105 -63 -200 -278 -110 2 188 74 -103 115 153 -58 -198 -1 56 -122 -42 169 -170
8116 -170 -214 -182 114 107 204 -147 -113 16 157 -45 191 -81 9 -10 -2 -46 5 -192 141 -20 -126 73 -90 -75
8140 -75 -238 -102 86 223 -250 -155 -47 168 -347 -6 -416 -255 -267 -6 65 -137 -66 -139 -112 52 141 -181 -53
8163 -53 -134 97 -180 -308 251 -49 -35 -197 -56 -101 153 76 96 253 -135 21 -69 111 169 -169 -241 70 -275
8186 -275 213 -275 -172 138 91
8191I1
##END NTUPLES=NMR FID
##END=
