##TITLE=1H_LR-690-2GK
 DMSO-d5, 8 sc, 
 22.10.2019
##JCAMPDX= 6.0         $$ Bruker NMR JCAMP-DX V2.0
##DATA TYPE= NMR FID
##DATA CLASS= NTUPLES
##ORIGIN= UXNMR, Bruker Analytische Messtechnik GmbH
##OWNER= root
$$ XWIN-NMR		Version 3.5
$$ Tue Oct 22 15:16:28 2019 Russian Standard Time (UT+4h)  she@DPX200
##.OBSERVE FREQUENCY= 200.1315
##.OBSERVE NUCLEUS= ^1H
##.DELAY= (6, 6)
##.ACQUISITION MODE= SIMULTANEOUS
##.ACQUISITION SCHEME= undefined
##.AVERAGES= 8
##.DIGITISER RES= 18
##SPECTROMETER/DATA SYSTEM= spect
##.PULSE SEQUENCE= zg30
##.SOLVENT NAME= DMSO
##.SHIFT REFERENCE= (INTERNAL, DMSO, 0, 15.7039)
##AUDIT TRAIL= $$ (NUMBER, WHEN, WHO, WHERE, WHAT)
$$ ##TITLE= Audit trail, XWIN-NMR		Version 3.5
$$ ##JCAMPDX= 5.01
$$ ##ORIGIN= Bruker BioSpin GmbH
$$ ##OWNER= she
$$ F:/spectra/data/she/nmr/H-F/1/audita.txt
$$ ##AUDIT TRAIL=  $$ (NUMBER, WHEN, WHO, WHERE, WHAT)
(   1,<2019-10-22 15:14:50.39 +0400>,<she>,<DPX200>,
      <created by zg, POWCHK disabled, PULCHK disabled
       configuration hash MD5:
       00 E9 B6 7A A2 85 ED C7 34 08 36 98 17 FE 4E 26
       data hash MD5: 16K
       CF A3 8F FD 43 1E EC F7 35 95 AB 88 5D DB 89 FA>)
$$ ##END=
$$ 
$$ hash MD5
$$ 2A 2C EC AB CC 4D D8 05 1A 4B 84 04 6F 60 0E 31
##$RELAX= 
##$RELAX= 
##$RELAX= 
##$RELAX= 
##$RELAX= 
##$RELAX= 
$$ Bruker specific parameters
$$ --------------------------
##$DU= <F:/spectra>
##$EXPNO= 1
##$NAME= <H-F>
##$PROCNO= 1
##$TYPE= <nmr>
##$USER= <she>
##$AMP= (0..31)
100 100 100 100 100 100 100 100 100 100 100 100 100 100 100 100 100 100 
100 100 100 100 100 100 100 100 100 100 100 100 100 100 
##$AQSEQ= 0
##$AQ_mod= 1
##$AUNM= <au_zg>
##$AUTOPOS= <>
##$BF1= 200.13
##$BF2= 200.13
##$BF3= 200.13
##$BF4= 200.13
##$BF5= 200.13
##$BF6= 200.13
##$BF7= 200.13
##$BF8= 200.13
##$BYTORDA= 1
##$CFDGTYP= 0
##$CFRGTYP= 5
##$CHEMSTR= <none>
##$CNST= (0..31)
1 1 145 1 1 1 1 1 1 1 1 1 1 1 1 1 1 1 1 1 1 1 1 1 1 1 1 1 1 1 1 1 
##$CPDPRG= <>
##$CPDPRG1= <>
##$CPDPRG2= <>
##$CPDPRG3= <>
##$CPDPRG4= <mlev>
##$CPDPRG5= <mlev>
##$CPDPRG6= <mlev>
##$CPDPRG7= <mlev>
##$CPDPRG8= <mlev>
##$CPDPRGB= <>
##$CPDPRGT= <>
##$D= (0..31)
0 1.2 0 0 0 0 0 0 0 0.06 0 0.03 0 0 0 0 0.0002 0 0 0 0 0 0 0 0 0 0 0 0 
0 0 0 
##$DATE= 1571742889
##$DBL= (0..7)
120 120 120 120 120 120 120 120 
##$DBP= (0..7)
150 150 150 150 150 150 150 150 
##$DBP07= 0
##$DBPNAM0= <>
##$DBPNAM1= <>
##$DBPNAM2= <>
##$DBPNAM3= <>
##$DBPNAM4= <>
##$DBPNAM5= <>
##$DBPNAM6= <>
##$DBPNAM7= <>
##$DBPOAL= (0..7)
0.5 0.5 0.5 0.5 0.5 0.5 0.5 0.5 
##$DBPOFFS= (0..7)
0 0 0 0 0 0 0 0 
##$DE= 6
##$DECBNUC= <off>
##$DECIM= 24
##$DECNUC= <off>
##$DECSTAT= 4
##$DIGMOD= 1
##$DIGTYP= 9
##$DL= (0..7)
0 120 120 120 120 120 120 120 
##$DP= (0..7)
150 150 150 150 150 150 150 150 
##$DP07= 0
##$DPNAME0= <>
##$DPNAME1= <>
##$DPNAME2= <>
##$DPNAME3= <>
##$DPNAME4= <>
##$DPNAME5= <>
##$DPNAME6= <>
##$DPNAME7= <>
##$DPOAL= (0..7)
0.5 0.5 0.5 0.5 0.5 0.5 0.5 0.5 
##$DPOFFS= (0..7)
0 0 0 0 0 0 0 0 
##$DQDMODE= 0
##$DR= 18
##$DS= 0
##$DSLIST= <SSSSSSSSSSSSSSS>
$$ [...]
##$SUBNAM2= <"">
##$SUBNAM3= <"">
##$SUBNAM4= <"">
##$SUBNAM5= <"">
##$SUBNAM6= <"">
##$SUBNAM7= <"">
##$SUBNAM8= <"">
##$SUBNAM9= <"">
##$SW= 24.0689530833862
##$SWIBOX= (0..15)
0 0 2 0 0 0 0 0 0 0 0 0 0 0 0 0 
##$SW_h= 4816.95568400771
##$TD= 16384
##$TD0= 1
##$TE= 0
##$TE2= 300
##$TE3= 300
##$TEG= 300
##$TL= (0..7)
0 120 120 120 120 120 120 120 
##$TP= (0..7)
150 150 150 150 150 150 150 150 
##$TP07= 0
##$TPNAME0= <>
##$TPNAME1= <>
##$TPNAME2= <>
##$TPNAME3= <>
##$TPNAME4= <>
##$TPNAME5= <>
##$TPNAME6= <>
##$TPNAME7= <>
##$TPOAL= (0..7)
0.5 0.5 0.5 0.5 0.5 0.5 0.5 0.5 
##$TPOFFS= (0..7)
0 0 0 0 0 0 0 0 
##$TUNHIN= 0
##$TUNHOUT= 0
##$TUNXOUT= 0
##$USERA1= <user>
##$USERA2= <user>
##$USERA3= <user>
##$USERA4= <user>
##$USERA5= <user>
##$V9= 5
##$VALIST= <valist>
##$VCLIST= <CCCCCCCCCCCCCCC>
##$VD= 0
##$VDLIST= <DDDDDDDDDDDDDDD>
##$VPLIST= <PPPPPPPPPPPPPPP>
##$VTLIST= <TTTTTTTTTTTTTTT>
##$WBST= 1024
##$WBSW= 4
##$XGAIN= (0..3)
0 0 0 0 
##$XL= 0
##$YL= 0
##$YMAX_a= 227030
##$YMIN_a= -283960
##$ZGOPTNS= <>
##$ZL1= 120
##$ZL2= 120
##$ZL3= 120
##$ZL4= 120
##$ABSF1= 10
##$ABSF2= 0
##$ABSG= 5
##$ABSL= 3
##$ALPHA= 0
##$AQORDER= 0
##$ASSFAC= 0
##$ASSFACI= 0
##$ASSFACX= 0
##$ASSWID= 0
##$AUNMP= <proc_1d>
##$AZFE= 0.1
##$AZFW= 0.1
##$BCFW= 1
##$BC_mod= 2
##$BYTORDP= 1
##$COROFFS= 0
##$CY= 11.3945322036743
##$DATMOD= 1
##$DC= 2
##$DFILT= <>
##$DTYPP= 0
##$F1P= 20.1720416913024
##$F2P= 0.152960286110954
##$FCOR= 0.5
##$FTSIZE= 0
##$FT_mod= 4
##$GAMMA= 1
##$GB= 0.15
##$INTBC= 1
##$INTSCL= 1
##$ISEN= 128
##$LB= 0.24
##$LEV0= 0
##$LPBIN= 0
##$MAXI= 10000
##$MC2= 0
##$MEAN= 0
##$ME_mod= 0
##$MI= 1.114404
##$NCOEF= 0
##$NC_proc= 0
##$NLEV= 6
##$NOISF1= 3.799351
##$NOISF2= 2.8
##$NSP= 1
##$NTH_PI= 0
##$NZP= 0
##$OFFSET= 15.70392
##$PC= 1
##$PHC0= -9562.159
##$PHC1= 1.800857
##$PH_mod= 1
##$PKNL= yes
##$PPARMOD= 0
##$PSCAL= 0
##$PSIGN= 0
##$REVERSE= no
##$SF= 200.130013532006
##$SI= 16384
##$SIGF1= 3
##$SIGF2= 2
##$SINO= 400
##$SIOLD= 16384
##$SREGLST= <1H.CDCl3>
##$SSB= 0
##$STSI= 0
##$STSR= 0
##$SW_p= 3612.71676300578
##$SYMM= 0
##$S_DEV= 0
##$TDeff= 0
##$TDoff= 0
##$TI= <>
##$TILT= no
##$TM1= 0
##$TM2= 0
##$TOPLEV= 0
##$USERP1= <user>
##$USERP2= <user>
##$USERP3= <user>
##$USERP4= <user>
##$USERP5= <user>
##$WDW= 1
##$XDIM= 8192
##$YMAX_p= 0
##$YMIN_p= 0
$$ End of Bruker specific parameters
$$ ---------------------------------
##NTUPLES= NMR FID
##VAR_NAME=  TIME,          FID/REAL,        FID/IMAG
##SYMBOL=    X,             R,               I
##VAR_TYPE=  INDEPENDENT,   DEPENDENT,       DEPENDENT
##VAR_FORM=  AFFN,          ASDF,            ASDF
##VAR_DIM=   8192,          8192,            8192
##UNITS=     SECONDS,       ARBITRARY UNITS, ARBITRARY UNITS
##FACTOR=    0.0002076,     1,               1
##FIRST=     0,             0,               0
##LAST=      1.7004516,     0,               0
##MIN=       0,             -283960,         0
##MAX=       1.7004516,     227030,          0
$$ Real data points
##PAGE= N=1
##DATA TABLE= (X++(R..R)), XYDATA
$$ plain form
0 0 0 0 0 0 1 0 8 -8 8 -14 16 -17 24 -32 40 -48 56 -64 78 -93 107 -126 145 -167 191 -223 250 -287 324
29 324 -365 412 -464 520 -580 650 -723 804 -893 991 -1100 1218 -1348 1492 -1653 1829 -2032
46 -2032 2256 -2512 2808 -3151 3555 -4041 4635 -5385 6366 -7705 9662 -12801 18681 -33581
60 -33581 153982 227030 -61847 -98176 90 178830 212280 137655 6671 -22758 35486
71 35486 127678 133645 65790 -32110 -68426 -33103 52186 90908 37881 -77810 -136695 -88761
83 -88761 16595 62471 8737 -96477 -149826 -117098 -44506 -17180 -49599 -92540 -93480 -60827
95 -60827 -30199 -29310 -52941 -84831 -96347 -70569 -17469 23138 16796 -30066 -70914 -57882 4867
108 4867 59800 57735 14288 -13577 2681 37469 49445 35258 24151 38084 66881 84828
$$ packed form
0@%%%%JjQj6J6k2L0l3M1n6P2q8J04j20J42j71K00k33K71l12L58m14M73n37O11
29C24o89P77q76R84j100J230j373J527j697J884k091K318k566K840l145L482l861
46b032M288m768N320n959O706p596Q676j0020J1751j4071J7367k2463L1482n2262
60c3581J87563P3048k88877l6329R8266J78740L3450p4625j30984k9429N8244
71C5486R2192N967o7855r7900l6316L5323Q5289L8722n3027j15691n8885M7934
83h8761J05356M5876n3734j05214n3349L2728P2592K7326l2419m2941r40L2653
95f0827L0628Q89k3631l1890j1516K5778N3100M0607o342m6862m0848J3032O2749
108D867N4933k065m3447k7865J6258L4788J1976j4187j1107J3933K8797J7947
$$ plain form
120 84828 77233 52439 27668 13636 16508 38426 69602 83912 63710 24504 2809 13356
132 13356 32842 31176 8482 -9992 -5454 10318 11343 -8412 -26156 -24756 -12150 -8600 -18590
145 -18590 -31602 -41632 -51431 -57908 -49038 -24267 -1220 -1672 -27866 -56604 -61248 -44503 -29809
158 -29809 -29367 -29704 -15050 5116 9645 -5932 -24382 -27549 -14503 1143 11355 17262 21591 20714
172 20714 10129 1088 8236 29842 44057 36603 18980 12081 18182 24577 21590 17050 22938 36786
186 36786 42564 29875 8664 -2196 0 4751 6305 11296 20524 21403 5279 -15981 -23865 -12597
200 -12597 2785 4029 -8072 -19311 -17762 -12182 -15843 -24968 -24502 -9762 3437 678 -13477 -26005
214 -26005 -30517 -28797 -23833 -12901 4474 18103 14346 -5589 -22601 -22295 -9602 -446 -567 1247
$$ packed form
120H4828p595k4794k4771j4032K872K1918L1176J4310k0202l9206k1695J0547
132A3356J9486j666k2694j8474M538J5772J025j9755j7744J400J2606L550r990
145a8590j3012j0030r799o477Q870K4771K3047m52k6194k8738m644J6745J4694
158b9809M42l37J4654K0166M529j5577j8450l167J3046J5646J0212N907M329q77
172B0714j0585r041P148K1606J4215p454j7623o899O101O395k987m540N888J3848
186C6786N778j2689k1211j0860K196M751J554M991R228Q79j6124k1260p884J1268
200a2597J5382J244j2101j1239J549N580l661r125M66J4740J3199k759j4155j2528
214b6005m512J720M964J0932J7375J3629l757j9935j7012L06J2693R156j21J814
$$ plain form
228 1247 11095 19717 16200 3119 -5905 -1830 9377 14335 11850 8326 7659 6118 1024 1105 11608
243 11608 25599 26475 10559 -9409 -15404 -6929 2253 3793 3686 10007 18798 16138 -269 -18404
257 -18404 -23564 -14732 -2936 4261 8345 9646 5075 -6916 -17358 -15781 -2470 8231 5416 -4709
271 -4709 -8707 -4465 -382 -3276 -6393 -999 11125 16444 8416 -6251 -14541 -12815 -5353 1466 8607
286 8607 17176 18340 7795 -8408 -16295 -9714 1699 6034 1925 -680 3137 6809 805 -8975
300 -8975 -12476 -3721 6781 7136 -1627 -10675 -13410 -11707 -8374 -1511 8319 14306 8447 -6040 -17806
315 -17806 -18305 -9744 -2144 898 4977 12253 16300 9333 -5654 -14641 -10968 529 9335 11376 10173
330 10173 9112 6095 949 -1464 3479 12422 15564 8358 -1928 -4917 5 4512 4579 4763 9619
$$ packed form
228A247R848Q622l517j3081r024M075J1207M958k485l524o67j541n094Q1J0503
243A1608J3991Q76j5916j9968n995Q475R182J540j07O321Q791k660j6407j8135
257a8404n160Q832J1796P197M084J301m571j1991j0442J577J3311J0701k815j0125
271d709l998M242M083k894l117N394J2124N319q028j4667q290J726P462O819P141
286H607Q569J164j0545j6203p887O581J1413M335m109k605L817L672o004r780
300h975l501Q755J0502L55q763r048k735J703L333O863R830N987n859j4487j1766
315a7806m99Q561P600L042M079P276M047o967j4987q987L673J1497Q806K041j203
330A0173j061l017n146k413M943Q943L142p206j0286k989M922M507O7J84M856
$$ plain form
345 9619 15300 12118 -1037 -14921 -18403 -10414 -516 5944 8399 7695 1928 -7894 -17353 -18202 -10796
360 -10796 -3428 -1969 -4642 -5560 -4762 -5366 -10570 -13552 -8694 478 4862 -737 -10149 -14808 -11758 -4753
376 -4753 1147 6467 11618 12892 5686 -5491 -11525 -7122 2633 9257 11833 13807 16174 14919 6753
391 6753 -2250 -3825 3753 13337 16035 11467 6134 3987 3183 2766 4641 9277 11862 8299 -455 -8695
407 -8695 -10202 -5943 -1757 310 3755 6653 5243 -3967 -16777 -23807 -19217 -8878 -1751 207 -721
422 -721 -2544 -6747 -13477 -17674 -15050 -6671 -808 -1681 -5923 -7166 -5359 -3545 -3404 -1897 4106 8739
438 8739 7072 -615 -7635 -7167 -61 8539 14289 16742 16934 13162 5257 -2591 -3876 2131 10364 14813
454 14813 15538 14107 11731 6748 530 -3151 492 7183 10071 6151 -876 -4133 -3423 -2366 -1928 -5
$$ packed form
345I619N681l182j3155j3884l482P989R898O460K455p04n767r822r459q49P406
360a0796P368J459k673r18P98o04n204k982M858R172M384n599r412m659L050P005
376d753N900N320N151J274p206j1177o034M403R755O624K576J974K367j255q166
391F753r003j575P578R584K698m568n333k147q04m17J875M636K585l563q754q240
407h695j507M259M186K067L445K898j410r210j2810p030M590J0339P127J958r28
422g21j823m203o730m197K624Q379N863q73m242j243J807J814J41J507O003M633
438H739j667p687p020M68P106Q600N750K453J92l772p905p848j285O007Q233M449
454A4813P25j431k376m983o218l681L643O691K888l920p027l257P10J057M38J923
$$ plain form
470 -5 2683 2744 -3262 -13378 -19376 -16657 -9447 -3304 -309 288 -1010 -5341 -13388 -19707 -19480 -11695 -2807
487 -2807 1766 1288 -737 -3007 -5109 -7315 -6518 -1400 4567 6311 2873 -893 -1413 1516 5521 8377
503 8377 11459 13981 12675 6823 -973 -3508 1366 8777 14295 15829 15462 12857 7179 -882 -6257
518 -6257 -4407 2938 9268 9851 5851 1483 -1145 -3005 -5411 -5484 -2559 66 -1281 -6455 -10902 -11843
534 -11843 -9085 -5247 -2808 -1230 -1201 -4171 -11057 -17453 -18014 -11443 -2877 2662 3435 1775 -937 -5444
550 -5444 -9620 -10189 -5544 1494 6354 6835 4469 3221 2300 1773 1385 3830 8768 11894 9470 2447
566 2447 -1267 427 6536 11786 13713 12545 9931 5887 392 -4383 -4885 482 7120 10214 9649 6691
582 6691 1750 -4105 -8752 -9357 -5144 757 3134 178 -5198 -7730 -6917 -5962 -5092 -3948 -3074 -3721 -7068
$$ packed form
470eK688O1o006j0116n998K719P210O143K995N97j298m331q047o319K27P785Q888
487b807M573m78k025k270k102k206P97N118N967J744l438l766n20K929M005K856
503H377L082K522j306n852p796k535M874P411N518J534l67k605n678q061n375
518f257J850P345O330N83m000m368k628j860k406p3K925K625j347n174m447r41
534a1843K758L838K439J578K9k970o886o396n61O571Q566N539P73j660k712m507
550e444m176n69M645P038M860M81k366j248r21n27l88K445M938L126k424p023
566B447l714J694O109N250J927j168k614m044n495m775n02N367O638L094n65k958
582F691m941n855m647o05M213N901K377k956n376k532Q13R55Q70J144Q74o47l347
$$ plain form
599 -7068 -10796 -12171 -9216 -4267 -68 2417 2522 483 -4212 -10800 -13710 -9340 300 8073 9811
614 9811 6384 2421 -158 -1472 -2232 -1245 1707 6916 9816 8470 4926 2805 2843 3781 5495 8328
630 8328 9379 6984 1500 -3598 -3607 1103 7403 10287 8569 4800 1327 -2668 -6430 -7802 -4908 255
646 255 4559 5195 2900 -1391 -5803 -8599 -9409 -6428 -1511 1842 305 -5101 -8784 -8140 -4005 -617
662 -617 203 -781 -1839 -3245 -5544 -8019 -8007 -4072 2016 6765 7694 4654 -103 -5389 -8375 -6807 -410
679 -410 6200 9457 7812 3972 1267 466 820 792 1235 2650 5045 4909 2549 435 969 2678 4954
696 4954 6684 6007 3177 -1498 -6065 -6897 -3449 3750 8987 8649 3795 -1189 -4190 -5811 -6817 -6214
712 -6214 -3105 1637 5388 4920 580 -4696 -7872 -6865 -4070 -469 1673 779 -2630 -5793 -5672 -2507
$$ packed form
599g068l728j375K955M949M199K485J05k039m695o588k910M370R640P773J738
614I811l427l963k579j314p60R87K952N209K900j346l544k121L8R38J714K833
630H328J051k395n484n098rM710O300K884j718l769l473l995l762j372K894N163
646B55M304O36k295m291m412k796q10K981M917L353j537n406l683O44M135L388
662f17Q20r84j058j406k299k475J2L935O088M749R29l040m757n286k986J568O397
679d10O610L257j645l840k705q01L54k8M43J415K395j36k360k114N34J709K276
696D954J730o77k830m675m567q32L448P199N237l38m854m984l001j621j006O03
712f214L109M742L751m68m340n276l176J007K795L601K142q94l409l163J21L165
$$ plain form
728 -2507 816 2674 1884 -68 -2131 -3860 -4684 -5908 -4074 902 5540 7577 5189 885 -3760 -6598
744 -6598 -5238 -723 4033 6672 5519 1794 -1367 -1266 665 2641 2633 1740 2033 2459 1018 -1135 -2398
761 -2398 -359 3477 7898 8525 4862 -1567 -6494 -7582 -4767 997 6118 8050 5795 2071 -1220
776 -1220 -3549 -4732 -4997 -3334 -598 2939 4459 2735 -1491 -4433 -4298 -1953 561 997 -409 -4157
792 -4157 -6350 -5537 -1917 2126 4638 3717 499 -3326 -5323 -5708 -5759 -4232 -788 4257 7129 6173 1550
809 1550 -4720 -8305 -6243 -1082 3879 5566 4447 2011 -481 -1120 -266 1436 2254 2415 2876 2809 1756
826 1756 -262 -1883 -1414 1990 6293 8395 6339 832 -4136 -6175 -3637 341 4419 5991 4541
841 4541 2067 -755 -1954 -2359 -2304 -1844 -861 471 1577 909 -1852 -4562 -4206 -1141 2529 3613 72
$$ packed form
728b507L323J858p90j952k063j729q24j224J834M976M638K037k388m304m645k838
744f598J360M515M756K639j153l725l161J01J931J976qq93K93M26j441k153j263
761b398K039L836M421O27l663o429m927j088K815N764N121J932k255l724l291
776a220k329j183k65J663K736L537J520j724m226k942J35K345K514M36j406l748
792d157k193Q13L620M043K512r21l218l825j997l85n1J527L444N045K872r56m623
809A550o270l585K062N161M961J687j119k436k492o39Q54J702Q18J61M61o7j053
826A756k018j621M69L404M303K102k056n507m968k039K538L978M078J572j450
841D541k474k822j199m05N5M60R83J332J106o68k761k710L56L065L670J084l541
$$ plain form
858 72 -5145 -8753 -7702 -3506 562 3300 3674 2288 -370 -3522 -5785 -6822 -6348 -2904 2049 6156
874 6156 7166 3344 -1574 -5127 -5359 -2019 2104 3855 3173 1478 153 772 1876 3328 3452 3054
890 3054 2103 1185 -122 -878 -727 430 3042 5990 8517 6180 1322 -4603 -6896 -4507 535 5011
906 5011 5827 3939 1021 -978 -2473 -3157 -3520 -2591 -817 1179 1790 -132 -2982 -5092 -4728 -1656 1554
923 1554 3292 1129 -2914 -6569 -7242 -4868 -991 2125 3080 2317 597 -1270 -3278 -4792 -4662 -2526
939 -2526 769 3610 4810 3617 81 -2773 -2804 -59 3052 4017 2309 -621 -1913 -813 1783 4168
955 4168 5237 3940 3237 1856 -356 -2725 -4051 -2391 1597 6028 8151 6912 2218 -3318 -6213
970 -6213 -5528 -2482 1609 3848 3448 1943 199 -1080 -1947 -2327 -2744 -1785 -474 370 -41 -1735 -3431
$$ packed form
858G2n217l608J051M196M068K738L74j386k658l152k263j037M74L444M953M107
874F156J010l822m918l553k32L340M123J751o82j695j325O19J104J452J24l98
890C054r51r18j307p56J51J157K612K948K527k337m858n925k293K389N042M476
906E011Q16j888k918j999j495o84l63R29J774J996O11j922k850k110L64L072L210
923A554J738k163m043l655o73K374L877L116R55p63j720j867k008j514J30K136
939b526L295K841J200j193l536k854l1K745L111R65j708k930j292J100K596K385
955D168J069j297p03j381k212k369j326J660L988M431K123j239m694n536k895
970f213O85L046M091K239m00j505j744j279q67l80m17R59J311Q44m11j694j696
$$ plain form
987 -3431 -2856 -538 2052 3180 1450 -2383 -5783 -6581 -4339 -24 3210 3936 2390 460 -1051 -2676
1003 -2676 -3923 -4105 -2681 829 3855 4641 2397 -1231 -3158 -2517 -100 2400 3515 2375 -344 -2527
1019 -2527 -2687 -869 1523 3545 3726 3401 2060 150 -2737 -3716 -3464 -542 3477 6421 6461 3143 -1112
1036 -1112 -3534 -3806 -1868 1116 3100 2430 960 175 -100 500 532 528 -137 241 220 -644 -2529 -3796 -2613
1055 -2613 712 3566 4633 2544 -1887 -5700 -6990 -5541 -2312 1092 2891 3070 1763 -607 -3214
1070 -3214 -4690 -4906 -3565 -950 1634 2859 1710 -851 -2693 -2790 -775 1341 2475 1312 -542 -2027
1086 -2027 -2341 -641 1906 3998 4695 3743 2083 728 -1107 -2056 -1796 239 3929 6564 6488 4101 43
1103 43 -2086 -1684 429 2345 2923 2409 1168 101 -570 -871 -318 380 1398 1252 -403 -1727 -3959
$$ packed form
987c431N75K318K590J128j730l833l400p98K242M315L234P26j546j930j511j625
1003b676j247j82J424L510L026P86k244l628j927O41K417K500J115j140k719k183
1019b527j60J818K392K022J81l25j341j910k887r79K52K922M019K944M0l318m255
1036a112k422k72J938K984J984o70j470p85k75O00L2mo65L78k1q64j885j267J183
1055b613L325K854J067k089m431l813j290J449L229L404J799J79j307k370k607
1070c214j476k16J341K615K584J225j149k561j842r7K015K116J134j163j854j485
1086b027l14J700K547K092O97r52j660j355j835r49K60K035L690K635p6k387m058
1103D3k129M02K113J916N78n14j241j067o71l01N53O98J018j46j655j324k232
$$ plain form
1120 -3959 -4700 -4063 -1331 1578 3252 2451 -1079 -4891 -6807 -6200 -4193 -1831 852 1878 919 -599
1136 -599 -2070 -3195 -3365 -2638 -1279 385 1170 1259 -225 -1124 -1063 1542 3669 4814 3006 440 -1602
1153 -1602 -1762 -341 2245 4477 5591 6128 4469 2074 -1043 -2504 -1976 331 2950 4970 5780 3456
1169 3456 331 -1613 -2841 -1787 -35 1077 563 -670 -1949 -2383 -2481 -1889 -755 -178 164 -1599 -3399
1186 -3399 -4891 -5482 -4663 -2349 542 2607 2414 -126 -3592 -5646 -5370 -2741 -330 1283 2107 2004
1202 2004 1534 528 -703 -990 324 2070 2932 2572 1726 244 -114 1242 2705 4294 5287 4069 1622
1219 1622 -861 -2477 -1724 200 2466 4216 4426 3673 1252 -1660 -3653 -3815 -2444 -501 1372 1976
1235 1976 699 -773 -2474 -3487 -2752 -1313 -370 -784 -2143 -3403 -3286 -2406 -1112 241 917 1122 695
$$ packed form
1120c959p41O37K732K909J674q01l530l812j916O07K007K362K683J026r59j518
1136e99j471j125j70P27J359J664P85Q9j484q99O1K605K127J145j808k566k042
1153a602j60J421K586K232J114N37j659k395l117j461N28K307K619K020Q10k324
1169C456l125j944j228J054J752J112n14j233j279m34r8N92J134N77L42j763j800
1186c399j492n91Q19K314K891K065j93k540l466k054K76K629K411J613Q24j03
1202B004m70j006j231k87J314J746Q62l60q46j482l58J356J463J589R93j218k447
1219A622k483j616P53J924K266J750K10p53k421k912j993j62J371J943J873O04
1235A976j277j472j701j013P35J439R43m14j359j260J17Q80J294J353O76K05m27
$$ plain form
1252 695 -1324 -3371 -4210 -3104 -317 2739 4212 4340 2890 371 -1727 -2048 -1448 1245 2857 3689
1268 3689 3623 2242 1407 829 493 984 1891 2577 1503 176 -1069 -1419 -720 575 2400 3112 2355 -101
1286 -101 -2644 -4808 -4525 -2811 -320 1282 1790 1184 -601 -2707 -4440 -4571 -3249 -1446 334 577
1302 577 -277 -1521 -1860 -1718 -931 -19 1017 982 -164 -1124 -1683 -1771 433 2887 4111 4350 3440 1227
1320 1227 -812 -1958 -1298 1032 3199 4939 4843 3852 1727 -236 -1098 -1249 133 1928 2464 1912 423
1337 423 -337 -750 -784 -346 334 575 -639 -2004 -3719 -4571 -3661 -1337 719 871 150 -1019 -2995 -4932
1355 -4932 -5913 -4246 -2142 521 1596 1427 -145 -1567 -2740 -2500 -1482 -114 1261 1682 1051 428
1371 428 480 482 1725 2496 3440 2979 2003 925 -375 -530 1146 3499 4936 5037 3906 2011 -146 -1334
$$ packed form
1252F95k019k047q39J106K787L056J473J28j450k519k098l21O00K693J612Q32
1268C689o6j381q35n78l36M91R07O86j074j327j245l50O99J295J825P12p57k456
1286a01k543k164K83J714K491J602N08o06j785k106j733j31J322J803J780K43
1302E77q54j244l39J42P87R12J036l5j146r60n59q8K204K454J224K39r10k213
1320A227k039j146O60K330K167J740r6r91k125j963q62j51J382J795N36n52j489
1337D23p60m13l4M38O80K41j214j365j715q52R10K324K056J52p21j169j976j937
1355d932r81J667K104K663J075j69j572j422j173K40J018J368J375M21o31o23
1371D28N2KJ243P71R44m61r76j078j300j55J676K353J437J01j131j895k157j188
$$ plain form
1389 -1334 -1719 -561 1289 3057 3055 2298 238 -1323 -1919 -2096 -1861 -1236 -166 -550 -1694 -3029 -3076 -2442
1407 -2442 -1217 -60 -156 -1471 -3281 -4265 -4435 -3833 -2131 -70 1539 1720 556 -1211 -2914 -3811 -2901
1424 -2901 -1061 1490 3239 3275 1792 93 26 251 828 1683 2316 2408 1895 1303 1014 1149 2342 3505
1442 3505 3629 3233 1879 581 -1055 -1353 -832 1373 3242 4073 2539 641 -1406 -2780 -2785 -1612 -736
1459 -736 36 415 630 -832 -2303 -2842 -3134 -1962 -1280 -709 -1105 -2037 -3142 -3369 -2005 -430 835 1101
1477 1101 78 -1491 -2785 -2815 -2009 -1025 958 2947 3339 2433 1231 -370 -1241 -1067 196 1812 3104
1494 3104 3452 2775 1321 267 877 1806 2153 2110 1443 450 48 -306 512 521 1632 2433 2185 1093 -1210
1513 -1210 -2872 -3750 -3195 -843 1154 2492 1609 -372 -2215 -3747 -3887 -2768 -1624 -925 8 142 -501
$$ packed form
1389a334l85J158J850J768kp57k060j561n96j77K35O25J070l84j144j335m7O34
1407b442J225J157r6j315j810r84j70O02J702K061J609J81j164j767j703q97R10
1424b901J840K551J749L6j483j699o7K25N77Q55O33R2n13n92k89J35J193J163
1442C505J24l96j354j298j636k98N21K205J869Q31j534j898k047j374nJ173Q76
1459g36P72L79K15j462j471n39k92J172O82N71l96r32j105k27J364J575J265K66
1477A101j023j569j294l0Q06R84J983J989L92r06j202j601q71J74J263J616J292
1494C104L48o77j454j054O10R29L47m3o67r93m02l54Q18RJ111Q01k48j092k303
1513a210j662q78N55K352J997J338q83j981j843j532j40J119J144O99R33J34o43
$$ plain form
1530 -501 -1429 -1893 -1474 -741 -18 299 27 -839 -1511 -1447 -522 1326 2592 3075 2349 516 -980 -1373 -983
1549 -983 833 1972 3166 3260 3321 2118 730 -991 -1336 -68 1360 2536 2079 857 -511 -746 -480
1566 -480 236 921 829 -156 -1205 -1944 -2633 -2232 -1156 71 554 1179 386 -1546 -3383 -4030 -3731 -2094
1584 -2094 158 1417 1435 216 -840 -1952 -1811 -1114 -185 461 313 640 756 368 543 924 1296 1724
1602 1724 2014 1826 659 -723 -802 217 2322 3884 4272 3014 1377 -600 -1523 -1249 -526 448 1489
1619 1489 2100 2002 989 -744 -2083 -2593 -1938 -797 176 -204 -925 -1995 -2131 -1838 -723 -398 -299 -997
1637 -997 -1869 -2979 -2868 -2622 -1459 -329 717 908 944 43 -1534 -2650 -2495 -723 1419 2879 2678
1654 2678 1621 620 32 613 1198 1710 2063 2059 1563 1338 1073 697 1283 2140 2608 2885 1991 715 -1292
$$ packed form
1530e01r28m64M19P33P23L17k72q66o72O4R25J848J266M83p26j833j496l93L90
1549i83J816J139J194R4O1j203j388j721l45J268J428J176m57j222j368k35K66
1566d80P16O85r2r85j049p39o89M01J076J227M83O25p93j932j837o47K99J637
1584b094K252J259J8j219j056j112J41O97R29O46j48L27J16l88J75L81L72M28
1602A724K90j88j167j382p9J019K105J562L88j258j637j977r23K74P23R74J041
1619A489O11r8j013j733j339n10O55J141R73l80p21j070j36K93J115L25R9o98
1637i97q72j110J11K46J163J130J046J91L6r01j577j116J55J772K142J460k01
1654B678j057j001n88N81N85N12L53mm96k25k65l76N86Q57M68K77q94j276k007
$$ plain form
1673 -1292 -1936 -1427 476 2334 2381 1888 554 -1277 -2374 -2705 -2591 -1752 -895 -255 -227 -363 -1386 -2249
1691 -2249 -2592 -2753 -1746 -924 -677 -1460 -2580 -2369 -1364 433 1069 913 -143 -960 -2069 -1695 -1092 -251
1709 -251 1091 2528 3198 2790 1939 -137 -836 -895 172 2397 3408 3444 2589 1163 626 758 1449 1339
1727 1339 1515 1271 943 444 175 -576 8 397 973 1150 575 -769 -2316 -3036 -2967 -1834 -130 922
1745 922 302 -997 -2059 -3076 -2813 -2170 -2085 -1238 -617 80 -505 -951 -1438 -1324 -766 529 643 579 -416
1764 -416 -1324 -1443 -593 1213 2638 3226 2527 1114 205 -730 -544 -164 1198 2750 3438 3387 2295 657
1782 657 -660 -1084 -321 738 1323 1772 1327 260 -332 -259 -118 492 123 -616 -1154 -1530 -1706 -1619 -1347 -862
1802 -862 255 730 291 -1324 -2665 -3586 -3099 -1593 154 999 1123 91 -759 -1654 -1664 -850 -631 307
$$ packed form
1673a292o44N09J903J858M7m93j334j831j097l31J14Q39Q57O40K8j36j023q63
1691b249l43j61J007Q22K47p83j120K11J005J797O36j56j056q17j109L74O03Q41
1709b51J342J437O70m08q51k076o99n9J067K225J011L6q55j426n37J32O91j10
1727A339J76k44l28m99k69p51N84L89N76J77n75j344j547p20O9J133J704J052
1745I22o20j299j062j017K63O43Q5Q47O21O97n85m46m87J14N58J295J14o4r95
1764d16r08j19Q50J806J425N88o99j413r09r35J86L80J362J552O88n1j092j638
1782F57j317m24P63J059N85M49m45j067n92P3J41O10l69p39n38l76j76Q7K72M85
1802h62J117M75m39j615j341r21M87J506J747Q45J24j032q50q95j0Q14K19R38
$$ plain form
1820 307 893 1304 1232 250 -46 86 398 1588 1989 1817 690 -78 -325 57 1209 2075 2889 2432 1045
1839 1045 -274 -828 -689 -491 -157 512 1194 1522 1135 -257 -1374 -1620 -1483 -734 320 -236 -862 -1753
1857 -1753 -1730 -1562 -495 -33 39 -417 -1427 -2058 -2254 -2168 -1193 -472 766 1687 1584 639 -780 -2105 -1847
1876 -1847 -466 799 1793 2225 2183 1352 739 177 746 823 1385 1319 1268 1378 1348 1003 596 1103 1816 1855 1497
1897 1497 -152 -986 -1766 -1226 154 1049 1186 1085 72 -1266 -2225 -2471 -2490 -1519 -735 -16 -216 -485 -1206
1916 -1206 -2177 -2291 -2011 -1015 -701 -413 -1057 -1219 -1314 -1464 -209 642 1033 956 425 -491 -854 -620 -179 1000
1936 1000 2042 2714 2690 2268 942 38 -165 597 1690 2602 2610 2143 1577 1376 964 755 670 932 596 393
1956 393 -127 -672 -1008 -186 217 875 848 -9 -1149 -2591 -3104 -2927 -2140 -940 -149 -31 -407 -1868 -2481
$$ packed form
1820C07N86M11p2r82k96J32L12J190M01j72j127p68k47L82J152Q66Q14m57j387
1839A045j319n54J39J98L34O69O82L28l87j392j117k46J37P49J054n56o26q91
1857a753K3J68J067M62P2m56j010o31j96Q6R75P21J238R21j03r45j419j325K58
1876a847J381J265R94M32m2q31o13n62N69P7N62o6n1J10l0l45m07N07P13L9l58
1897A497j649q34p80N40J380Q95J37j01j013j338r59k46j9R71P84P19k00k69p21
1916a206r71j14K80R96L14K88o44j62r5j50J255Q51L91p7n31r16l63K34M41J179
1936A000J042O72k4m22j326r04k03P62J093R12Qm67n66k01m12k09q5K62l36k03
1956C93n20n45l36Q22M03O58k7q57j140j442n13J77P87J200P91J18l76j461o13
$$ plain form
1975 -2481 -3022 -2768 -1856 -1296 -286 -327 -288 -455 -876 -1026 -869 283 761 836 674 -253 -22 375 1517 2222
1995 2222 2444 2407 2006 1408 402 112 606 1585 2602 3127 2837 2293 1137 306 -239 -266 737 1297 1374
2014 1374 517 -95 -240 -915 -810 -374 -665 -286 -1333 -2075 -2192 -2449 -2058 -1271 -590 -377 -684 -1557 -2404
2033 -2404 -3292 -3309 -2445 -982 183 84 -28 -639 -576 -972 -1372 -746 -37 803 874 1366 810 1143 1030 1267
2053 1267 1664 1893 2190 1469 657 569 723 2158 2484 2953 2743 1892 946 -166 -655 -534 201 1002 1311
2072 1311 1337 823 -386 -1039 -1697 -1609 -1153 -614 -432 -827 -1542 -1928 -1758 -1579 -1053 -952 -1282 -1465 -1782 -2280
2092 -2280 -2433 -1796 -802 126 648 528 33 -963 -1461 -1198 -629 529 1273 1620 1685 1216 794 562 523 996
2112 996 1356 1869 1524 1350 1018 529 1127 1718 1776 2038 1741 844 -103 -887 -1033 -240 674 1173 1345 300
$$ packed form
1975b481n41K54R12N60J010m1L9j67m21j50J57J152M78P5j62r27K31L97J142P05
1995B222K22l7m01n98j006k90M94R79J017N25k90n44j156q31n45k7J003N60P7
2014A374q57o12j45o75J05M36k91L79j047p42j17k57L91P87O81K13l07q73q47
2033b404q88j7Q64J463J165r9j12o11O3l96m00O26P09Q40P1M92n56L33j13K37
2053A267L97K29K97p21q12q8J54J435L26M69k10q51r46j112m89J21P35Q01L09
2072A311K6n14j209o53o58Q8M56N39J82l95p15l86J70J79N26J01l30j83l17m98
2092b280j53O37R94R28N22j20m95r96m98K63N69J158P44L47O5m69m22k32l9M73
2112I96L60N13l45j74l32m89N98N91N8K62k97q97r47p84j46P93R14M99J72j045
$$ plain form
2132 300 -309 -1147 -2145 -2111 -1512 -762 -161 35 -75 -1020 -1433 -1744 -1611 -1088 -727 -748 -503 -1112 -1507 -1107 -432
2153 -432 261 674 420 240 -380 -987 -895 -326 490 1596 2050 1955 1384 789 -21 -180 -183 768 1404 2003 1507
2174 1507 1130 231 551 404 559 750 574 454 170 -285 -654 -163 -65 217 426 30 -593 -1309 -1983 -1966
2194 -1966 -1396 -435 137 866 262 -229 -1011 -1696 -1844 -1303 -158 -2 299 252 33 -426 -343 -275 107 -45
2214 -45 743 673 93 -291 247 631 1396 1948 1396 1113 551 -189 -734 -408 374 1170 1893 1565 1164 557 -217
2235 -217 -769 -930 -177 -56 547 440 -279 -379 -843 -967 -412 -644 -239 -522 -1005 -1410 -1550 -1193 -258 398
2255 398 9 3 -490 -1077 -1311 -1508 -1161 -352 776 962 983 491 -67 -246 -586 -228 529 943 1112 1176 507
2276 507 174 584 884 1009 1146 909 592 184 71 -24 264 799 1414 1198 675 19 -315 -1280 -1158 -597
$$ packed form
2132C00o09q38r98L4N99P50O01J96j10r45m13l11J33N23L61k1K45o09l95M00O75
2153d32O93M13k54j80o20o07R2N69Q16J106M54r5n71n95q10j59lR51O36N99m96
2174A507l77q99L20j47J55J91j76j20k84m55l69M91R8K82K09l96o23p16o74J7
2194a966N70R61N72P29o04m91p82o85j48N41J145J56L01m7k19m59Q3O8L82j52
2214d5P88p0n80l84N38L84P65N52n52k83n62p40n45L26P82P96P23l28m01o07p74
2235b17n52j61P53J21O03j07p19j00m64j24N55k32M05k83m83m05j40L57R35O56
2255C98l89om93n87k34j97L47Q09J128J86K1m92n58j79l40L58P57M14J69O4o69
2276E07l33M10L00J25J37k37l17m08j13r5K88N35O15k16n23o56l34r65J22N61
$$ plain form
2296 -597 143 681 608 -178 -361 -948 -1113 -1172 -1375 -635 -189 -120 -691 -1202 -981 -365 15 115 138 -123 -535
2317 -535 -1040 -1238 -894 74 678 1400 1194 565 119 -295 -804 -529 -47 912 1569 1715 905 332 -28 -23 -48
2338 -48 505 698 543 600 145 -15 34 327 749 476 262 226 -400 -816 -1225 -811 396 984 805 572 -277
2359 -277 -686 -1146 -1246 -1238 -231 353 451 -14 -296 -626 -863 -552 -780 -277 -34 74 -172 -471 -574 -232 464
2380 464 902 666 503 25 -477 -762 -764 -152 865 1325 1188 665 99 -136 -388 -415 -262 182 892 1087 442
2401 442 -260 -514 137 260 174 175 22 172 -217 -491 -523 -179 565 669 671 -402 -594 -751 -1137 -927 -341 766
2423 766 1164 706 80 -446 -848 -755 -559 -238 116 489 394 170 -355 -619 -52 12 -107 201 111 -416 -148
2444 -148 -697 -498 556 961 1106 298 -85 -588 -631 -626 -128 329 607 1066 647 26 -304 -221 -549 -280 -81
$$ packed form
2296e97P40N38p3p86j83n87j65n9k03P40M46O9n71n11K21O16L80J00K3k61m12
2317e35n05j98L44R68O04P22k06o29m46m14n09K75M82R59O57J46q10n73l60Nk5
2338d8N53J93j55N7m55j60M9K93M22k73k14l6o26m16m09M14J207N88j79k33q49
2359b77m09m60j00QJ007N84R8m65k82l30k37L11k28N03K43J08k46k99j03L42O96
2380D64M38k36j63m78n02k85kO12J017M60j37n23n66k35k52k7J53M44P10J95o45
2401D42p02k54O51J23q6Jj53J50l89k74l2L44P44J04Kj073j92j57l86K10N86J107
2423G66L98m58o26n26m02R3J96L21L54L73r5k24n25k64N67O4j19L08r0n27K68
2444a48n49J99J054M05J45q08l83n03m3NM98M57K78M59m19o21l30Q3l28K69J99
$$ plain form
2465 -81 540 496 308 -93 -310 -481 386 388 422 52 -485 -479 -667 -462 -193 233 762 793 209 -343 -861 -902 -678
2488 -678 -495 124 1262 921 452 -245 -625 -677 235 15 -182 374 191 222 162 -482 -101 256 497 245 102
2509 102 -117 -375 -603 -215 200 977 1181 686 12 -905 -895 -891 -349 -215 474 731 902 597 -366 -495 -580
2530 -580 -27 -78 243 577 417 105 -121 -424 -53 612 681 64 -635 -792 -696 -47 -73 140 779 773 473 -368
2552 -368 -1047 -771 -431 -352 -235 527 357 453 -389 -856 -592 -69 194 3 104 -103 -213 174 -324 23 459
2573 459 748 725 -111 -225 -360 -607 -588 -314 642 1255 1007 563 -604 -643 -736 -329 -18 232 466 701 742
2594 742 174 -146 -157 98 91 155 -129 -236 -494 -738 -452 -128 464 430 93 -617 -1132 -873 -572 -66 106 583
2616 583 497 613 71 -738 -1161 -706 -451 98 439 415 598 375 -139 -562 -216 336 611 400 -222 9 -251
$$ packed form
2465h1O21m4j88m01k17j71Q67KL4l70n37Oj88K05K69M26N29L1n84n52n18m1K24
2488f78J83O19J138l41m69o97l80n2R12k20j97N56j83L1o0o44L81L57K41k52j43
2509A02k19k58k28L88M15P77K04m95o74r17J0MN42J34O89K57J71l05r63j29q5
2530e80N53n1L21L34j60l12k26l03L71O65O9o17o99j57R6O49k6K13O39ol00q41
2552c68o79K76L40P9J17P62j70R6q42m67K64N23K63j91J01k07j10L87m98L47M36
2573D59K89k3q36j14j35k47J9K74R56O13k48m44j167l9r3M07L11K50K34K35M1
2594G42n68l20j1K55pO4k84j07k58k44K86L24N92l4l37p10n15K59L01N06J72M77
2616E83q6J16n42q09m23M55K55N49L41k4J83k23n14m23L46N52K75k11o22K31k60
$$ plain form
2637 -251 216 290 384 471 673 658 -136 -514 -391 -322 312 414 984 1067 685 131 -684 -488 -414 235 139 272 160
2660 160 210 -202 -589 -345 -363 403 78 -286 -444 -923 -608 -568 -113 -149 579 342 -189 -799 -1271 -878 -329
2681 -329 -90 367 190 446 284 -590 -400 -553 -151 256 169 394 442 414 286 -108 32 587 806 516 185
2702 185 90 -78 572 681 594 811 833 892 40 -459 -334 -370 -51 621 594 737 818 237 -487 -516 -476 -327 298
2725 298 307 -153 -325 -146 -464 -529 -462 -137 126 10 -551 -902 -1271 -601 -336 21 558 79 -31 -500 -907
2746 -907 -888 -466 105 321 565 455 422 434 -310 -374 -123 336 261 537 388 305 233 383 562 632 794 621 420
2769 420 -252 -466 -286 138 506 739 714 305 271 -240 -901 -826 -320 -46 493 409 284 -43 -281 -686 -538
2790 -538 -485 -166 -64 -679 -417 -433 -882 -276 -56 2 195 -31 -548 -838 -957 -513 41 356 36 434 351
$$ packed form
2637b51M67P4R4Q7K02j5p94l78J23O9O34J02N70Q3l82n54q15J96P4O49r6J33j12
2660A60N0m12l87K44j8P66l25l64j58m79L15M0M55l6P28k37n31o10m72L93N49
2681c29K39M57j77K56j62q74J90j53M02M07q7K25M8k8j28l94J40N55K19k90l31
2702A85r5j68O50J09q7K17K2N9q52m99J25l6L19O72k7J43Q1n81p24k9M0J49O25
2725B98Rm60j72J79l18o5O7L25K63j16n61l51l69O70K65L57N37m79j10m69m07
2746i07J9M22N71K16K44j10l3J2p44o4K51M59p5K76j49q3p2J50J79P0J62j73k01
2769D20o72k14J80M24L68K33k5m09l4n11o61P5N06K74N39q4j25l27k38m05J48
2790e38N3L19J02o15K62j6m49O06K20N8J93k26n17k90j19M44N54L15l20L98q3
$$ plain form
2811 351 6 -531 -683 -544 252 298 304 592 507 198 -10 98 89 231 569 462 313 -47 -32 -91 348 572 914
2834 914 481 124 88 -434 -385 76 115 323 689 444 316 -327 -779 -1009 -337 103 37 146 -192 -28 -3 -451
2856 -451 -690 -193 20 306 -315 -193 -403 -558 -142 23 52 377 330 216 -227 -620 -582 152 237 529 760
2877 760 464 72 -193 -402 -441 -168 449 216 555 390 165 229 -290 284 41 182 223 38 -454 -397 -113
2898 -113 349 306 307 254 -94 -245 -230 -459 -497 38 261 449 427 2 20 -432 -732 13 68 8 432 39 342
2921 342 -8 -321 21 187 291 73 106 -273 -202 -239 166 199 238 527 213 -47 -145 -468 -350 -177 78 378
2943 378 338 225 263 -195 -272 -617 -310 96 44 125 16 -298 -185 -41 202 -175 124 197 -260 -555 -438 -66
2965 -66 224 388 494 494 52 -42 -300 -420 -406 282 613 758 499 590 53 92 -16 -36 68 507 176 -116 -53
$$ packed form
2811C51l45n37j52J39P96M6OK88q5l09k08J08rJ42L38j07j49l60J5n9M39K24L42
2834I14m33l57l6n22M9M61L9K08L66k45j28o43m52k30O72M40o6J09l38J64K5m48
2856d51k39M97K13K86o21J22k10j55M16J65K9L25m7j14m43l93L8P34Q5K92K31
2877G60k96l92k65k09l9K73O17k33L39j65k25O4n19N74k43J41M1j85m92N7K84
2898a13M62m3Jn3l48j51J5k29l8N35K23J88k2m25J8m52l00P45N5o0M24l93L03
2921C42l50l13L42J66J04k18L3l79P1l7M05L3L9K89l14k60r8l23J18J73K55L00
2943C78m0j13L8m58p7l45L07M06n2Q1j09l14J13J44K43l77K99P3m57k95J17L72
2965f6K90J64J06%m42r4k58j20J4O88L31J45k59R1n37L9j08k0J04M39l31k92O3
$$ plain form
2988 -53 133 165 280 11 187 116 243 -36 -575 -522 -257 151 632 403 203 -147 -475 -794 -803 -379 -234 -85
3010 -85 114 168 -480 -158 -348 -567 -406 -3 -106 105 -239 -199 -191 61 -79 334 198 12 71 -317 -394 -155
3032 -155 277 423 424 564 215 26 267 208 111 180 381 459 325 355 24 75 -209 40 -74 27 372 5 -240
3055 -240 -332 0 -153 -161 137 265 -94 -582 -440 -623 -603 -145 -42 240 239 -29 -718 -477 -729 -377 -45 -64
3077 -64 -71 -134 -246 -89 -219 -201 -301 85 187 89 21 -234 -261 112 194 694 689 424 62 250 -63 -117 14 335
3101 335 697 739 478 87 288 -6 -170 -98 102 282 354 194 88 -108 -2 250 -117 -126 35 -273 -143 -416
3123 -416 -387 -333 -66 401 323 -409 -133 -530 -605 -253 -371 145 300 270 114 -155 -410 -555 -530 -111 42 126
3145 126 185 -155 308 193 367 456 305 124 252 -100 -147 -79 300 576 386 479 359 286 -43 37 59 58 -21 111
$$ packed form
2988e3J86L2J15k69J76p1J27k79n39N3K65M08M81k29k00l50l28l19rM24J45J49
3010h5J99N4o48L22j90k19J61M03j03K11l44M0QK52j40M13j36j86N9l88p7K39
3032a55M32J46JJ40l49j89K41n9r7O9K01P8j34L0l31N1k84K49j14J01L45l67k45
3055b40r2L32j53qK98J28l59m88J42j83K0M58J03K82jk68o89K41k52L52L32j9
3077f4po3j12J57j30J8j00L86J02r8o8k55k7L73Q2N00nk65l62J88l13n4J31L21
3101C35L62M2k61l91K01k94j64P2K00J80P2j60j06j96J06K52l67rJ61l08J30k73
3123d16K9N4K67M67p8p32K76l97p5L52j18N16J55l0j56k69k55j45K5M19J53Q4
3145A26N9l40M63j15J74Q9j51j81J28l52m7O8L79K76j90R3j20p3l29Q0K2jp9J32
$$ plain form
3169 111 618 395 63 40 -420 -404 -286 23 -22 -180 176 -308 -171 -552 -396 124 274 -118 -135 -101 -579 -325
3191 -325 -524 -124 0 222 97 -556 -290 -431 -518 43 127 509 254 271 25 -97 -49 -96 235 130 270 291
3213 291 172 -79 199 102 564 356 589 193 -114 -148 -342 -6 215 372 257 386 143 -419 -213 -90 -386
3234 -386 -162 -80 61 370 89 -157 -429 -401 -360 -225 -133 -32 -277 -263 -22 -360 232 -60 86 145 232 -33
3256 -33 -190 -192 -254 256 245 475 333 314 -80 -363 33 -86 307 475 627 320 -9 259 -113 113 422 213
3278 213 -23 174 -93 -19 44 -118 -52 144 146 -175 -521 -208 -513 -415 72 -58 183 -64 -49 -107 -619 -472 -448
3301 -448 -319 -153 -45 39 -2 -92 -89 28 61 178 -109 -212 -219 91 -79 340 125 441 88 417 161 210 42
3324 42 81 280 290 588 272 384 334 -116 -280 -284 200 81 -239 -92 469 128 15 -178 -197 -122 122 -320 -232
$$ packed form
3169A11N07k23l32k3m60J6J18L09m5j58L56m84J37l81J56N20J50l92j7L4m78K54
3191c25j99M00J24K22j25o53K66j41q7N61Q4L82k55J7k46j22M8m7L31j05J40K1
3213B91j19k51K78r7M62k08K33l96l07l4j94L36K21J57j15J29k43n62K06J23k96
3234c86K24Q2J41L09k81k46k72K8M1J35R2J01k45J4K41l38N92k92J46N9Q7k65
3256c3j57ko2N10j1K30j42j9l94k83L96j19L93J68J52l07l29K68l72K26L09k09
3278B13k36J97k67P4O3j62O6J96Kl21l46L13l05R8M87j30K41k47J5n8n12J47K4
3301d48J29J66J08Q4m1r0LJ17L3J17k87j03pL10j70M19k15L16l53L29k56M9j68
3324D2L9J99J0K98l16J12n0m50j64mM84j19l20J47N61l41j13j93j9P5K44m42Q8
$$ plain form
3347 -232 -116 -620 -591 -15 -163 39 -50 15 -375 -598 -425 -430 -181 122 241 45 -160 -49 25 -385 -412 -26
3369 -26 521 -122 139 -80 11 115 310 86 28 -9 217 14 -414 28 84 123 394 243 54 293 -63 -267
3391 -267 -181 -210 -52 169 500 307 161 22 -233 -97 -105 -313 360 -66 -288 -214 -161 -200 268 -20 -368 -83
3413 -83 -82 -35 -243 -151 -223 68 212 207 407 -323 -114 -480 -461 -2 -20 207 336 194 -20 -44 51 -6 -101 -8 436
3438 436 80 -32 38 249 25 -410 64 -59 199 320 -78 -62 60 279 438 71 50 105 -149 -218 -429 -126
3460 -126 -39 -180 123 -144 193 -24 -268 -230 130 -115 170 24 -144 -128 -92 -82 23 119 237 -29 95 152
3482 152 58 -539 -50 213 322 367 87 335 -11 -10 -4 -86 -32 -117 103 84 96 122 -133 105 -303 156 53 -79
3506 -79 -83 -292 -178 -91 164 121 157 -86 -237 -404 -592 -280 -184 104 290 192 59 145 -128 -186 -224 -223 300 25
$$ packed form
3347b32J16n04K9N76j48K02q9O5l90k23J73nK49L03J19j96k05J11P4m10k7L86
3369b6N47o43K61k19R1J04J95k24n8l7K26k03m28M42N6L9K71j51j89K39l56k04
3391b67Q6k9J58K21L31j93j46j39k55J36qk08O73m26k22P4N3l9M68k88l48K85
3413h3JM7k08R2p2K91J44nK00p30K09l66J9M59j8K27J29j42k14k4R5n7r5R3M44
3438D36l56j12P0K11k24m35M74j23K58J21l98J6J22K19J59l67k1N5k54o9k11L03
3460a26Q7j41L03k67L37k17k44L8L60k45K85j46j68J6L6J0J05R6J18k66J24N7
3482A52r4n97M89K63J09M5k80K48l46JOq2N4q5K20j9J2K6k55K38m08M59j03j32
3506g9mk09J14Q7K55m3L6k43j51j67j88L12R6K88J86r8j33Q6k73n8l8JN23k75
$$ plain form
3530 25 -21 -7 -5 -283 -182 -138 -184 10 -87 -130 -214 48 339 -138 191 256 16 205 -237 -109 -391 -180 58 142
3554 142 18 371 36 166 192 153 -82 19 91 -119 -76 24 -227 23 61 -96 123 -47 -175 -376 -371 19
3576 19 -37 80 148 -25 -72 188 -397 -93 -294 -15 82 13 84 42 -4 -261 -206 9 -66 115 212 445 8 8 228
3601 228 45 287 275 261 110 57 -59 -21 -34 207 121 310 490 63 47 -214 -77 -311 24 -157 173 325
3623 325 273 -189 -262 -274 -70 -243 -57 142 -474 -165 -185 -8 177 138 128 26 -207 204 -178 -253 -289 -35 61
3646 61 277 -39 147 337 -89 -365 -233 -177 365 104 49 109 34 28 -78 -11 -12 198 138 -82 -68 -58 130 53 268
3671 268 43 -103 -3 -117 -167 -221 114 212 294 271 218 -350 -60 -157 89 -8 -65 382 154 21 -247 10 -363
3694 -363 -95 -45 -47 327 -294 -273 -223 -221 -78 68 258 -133 -100 -308 -300 -242 -94 143 194 109 14 108 63 -243 -63
$$ packed form
3530B5m6J4Kk78J01M4m6J94r7m3q4K62K91m77L29O5k40J89m42J28k82K11K38Q4
3554A42j24L53l35J30K6l9k35J01P2k10M3J00k51K50L8j57K19j70j28k01NL90
3576A9n6J17O8j73m7K60n85L04k01K79R7o9P1m2m6k57N5K15p5J81R7K33m37%K20
3601B28j83K42j2j4j51n3j16L8j3K41q6J89J80m27j6k61J37k34L35j81L30J52
3623C25n2m62p3j2K04j73J86J99o16L09k0J77J85l9j0j02k33M11l82p5l6K54R6
3646F1K16l16J86J90m26k76J32N6N42k61n5O0p5oj06O7jK10o0k20J4J0J88p7K15
3671B68k25j46J00j14n0n4L35R8Q2k3n3n68K90r7K46r7n7M47k28j33k68K57l73
3694c63K68N0kL74o21K1N0KJ43J46J90l91L3k08QN8J48K37N1q5r5R4m5l06J80
$$ plain form
3719 -63 -229 -72 -60 107 -429 91 249 66 -43 9 258 -25 285 18 -39 -325 -29 448 118 -123 287
3740 287 -3 -226 -212 -89 76 -1 -10 10 50 -47 -180 -410 175 -477 -349 -132 -296 112 -33 -38 -229 -182 -63
3763 -63 -190 -285 -165 -491 135 111 42 214 38 96 115 -50 -254 -402 -174 -20 204 227 136 95 176 25 98 33
3787 33 -15 -51 23 -109 72 -56 -23 17 203 191 -10 291 196 -94 -90 -98 45 145 -153 8 -143 20 -233 -430
3811 -430 -340 231 233 134 90 -183 90 3 203 -68 -26 -77 -42 153 8 -60 365 145 -78 73 -39 -95 -303 -57
3835 -57 -141 230 206 179 67 211 -56 113 -108 -151 17 -303 104 86 7 186 231 191 163 162 -371 -19 -408 -88
3859 -88 -65 192 32 312 -180 274 16 -129 -88 38 -152 138 -62 194 138 -39 69 127 96 -316 71 304
3881 304 31 -35 -83 -132 -41 65 71 -437 471 -125 0 -72 183 -210 -5 67 64 -46 -38 108 -119 -28 -181 2
$$ packed form
3719f3j66J57J2J67n36N20J58j83j09N2K49k83L10k67n7k86K96M77l30k41M10
3740B87k90k23J4J23J65p7rK0M0r7j33k30N85o52J28K17j64M08j45nj91M7J19
3763f3j27r5J20l26O26k4o9J72j76N8J9j65k04j48K28J54K24K3r1m1Q1j51P3o5
3787C3m8l6P4j32J81j28L3M0J86j2k01L01r5k90MqJ43J00k98J61j51J63k53j97
3811d30R0N71Kr9m4k73K73q7K00k71M2n1L5J95j45o8M25k20k23J51j12n6k08K46
3835e7q4L71k4k7j12J44k67J69k21m3J68l20M07j8p9J79M5m0k8jn33L52l89L20
3859h8K3K57j60K80m92M54k58j45M1J26j90K90k00K56n6j77J08N8l1m12L87K33
3881C04k73o6m8m9R1J06On08R08n96J25p2K55l93K05P2lj10QJ46k27R1j53J83
$$ plain form
3905 2 126 6 123 -29 -73 154 -66 98 -1 148 11 130 -104 -130 142 220 -35 251 152 -141 29 -6 -77
3928 -77 141 106 211 -16 227 -199 -302 -275 -48 181 -287 200 134 91 175 -75 416 -103 -73 439 -151 308
3950 308 -17 -111 71 68 139 -125 135 -160 51 106 24 307 262 -194 47 8 -33 -154 172 -187 -110 -145 7 101
3974 101 -44 -55 -279 -228 160 -140 -181 49 -139 -168 -170 143 -140 -190 217 81 -97 -17 -120 -79 -188 141 54
3997 54 44 10 -202 55 -37 -105 -64 70 -162 340 187 140 101 53 -131 166 -244 -2 -212 314 -202 -71 -148
4020 -148 217 82 -88 -101 82 -130 -75 57 -224 -177 93 118 -79 -79 -177 -51 -156 -429 300 -188 23 267
4042 267 -133 66 -19 179 308 144 -225 -22 146 -100 209 118 179 179 126 146 -75 -37 -7 83 -101 60 196
4065 196 262 232 -32 373 -147 307 -103 78 35 127 211 -109 291 -162 7 27 -103 -162 133 -184 83 -18
$$ packed form
3905BJ24j20J17j52m4K27k20J64r9J49j37J19k34k6K72P8k55K86r9k93J70l5p1
3928g7K18l5J05k27K43m26j03K7K27K29m68M87o6m3Q4k50M91n19L0N12n90M59
3950C08l25r4J82lP1k64K60k95K11N5q2K83m5m56K41l9m1j21L26l59P7l5J52R4
3974A01j45j1k24N1L88l00m1K30j88k9kL13k83n0M07j36j78Q0j03M1j09L29q7
3997E4j0l4k12K57r2o8M1J34k32N02j53m7l9m8j84K97m10K42k10N26n16J31p7
4020a48L65j35j70j3J83k12N5J32k81M7K70K5j97%r8J26j05k73P29m88K11K44
4042B67m00J99q5J98J29j64l69K03J68k46L09r1O1%n3K0k21L8L0R0j84J61J36
4065A96O6l0k64M05n20M54m10J81m3R2Q4l20M00m53J69K0j30n9K95l17K67j01
$$ plain form
4087 -18 -20 5 -305 -63 150 92 -340 -248 -318 -97 165 -230 90 -8 -237 223 -6 316 -5 81 -300 158 -211
4110 -211 94 -131 -68 170 -77 140 288 90 -374 111 -271 165 305 142 259 163 -164 -147 -174 18 47 135
4132 135 -14 -142 261 -204 -273 -114 26 59 111 186 107 -262 96 64 200 250 -35 51 -449 -173 -278 -73 45
4155 45 -35 340 9 149 -99 -193 -158 95 -86 29 292 12 171 35 -25 -22 172 38 -49 180 -238 54 85
4178 85 146 34 261 -151 -50 99 -251 -134 -117 -253 -79 153 60 65 -402 4 128 26 -268 -162 25 -170
4200 -170 -333 -36 -68 92 -88 49 -160 14 -86 -347 -352 -70 87 143 65 67 -38 -21 -169 -175 12 57 233 121
4224 121 50 256 104 203 137 -21 40 402 80 59 -48 -55 2 195 151 -87 53 322 -95 269 -43 -109 233
4247 233 122 428 -99 161 189 -202 15 -285 52 -187 335 35 118 -270 -252 66 -47 138 111 -11 12 -15
$$ packed form
4087a8kK5l10K42K13n8m32R2p0K21K62l95L20r8k29M60k29L22l21Q6l81M58l69
4110b11L05k25O3K38k47K17J48j98m64M85l82M36J40j63J17r6l27J7k7J92K9Q8
4132A35j49j28M03m65o9J59J40L3N2P5p9l69L58l2J36N0k85Q6n00K76j05K05J18
4155D5q0L75l31J40k48r4L5K53j81J15K63k80J59j36o0LJ94j34q7K29m18K92L1
4178H5O1j12K27m12J01J49l50J17J7j36J74K32r3Nm67M06J24j02k94J06J87j95
4200a70j63K97l2J60j80J37k09J74j00k61nK82J57N6p8Kj05J7j48oJ87M5J76j12
4224A21p1K06j52R9o6j58O1L62l22k1j07pN7J93m4k38J40K69m17L64l12o6L42
4247B33j11L06n27K60K8l91K17l00L37k39N22l00Q3l88J8L18j13J85k7j22K3k7
$$ plain form
4269 -15 135 -71 213 280 -144 -21 -4 -166 -194 -46 100 -50 57 115 -6 -68 -99 31 -339 80 51 173 482
4292 482 226 187 -38 62 169 221 -164 4 -85 55 -100 -199 49 -29 242 6 199 81 -263 -145 -21 14
4314 14 242 103 72 71 -67 6 -112 199 132 -159 390 9 149 53 -91 156 -4 158 -62 -85 -31 -66 -81 79
4338 79 39 -214 169 -175 -377 -212 54 -230 190 230 161 112 -52 -197 36 212 13 139 -145 66 -232 -297
4360 -297 1 -60 266 -175 13 -205 205 -86 -123 -145 -96 29 9 5 123 -97 -32 -183 82 119 -8 346 -49
4383 -49 87 -34 -268 -124 35 -4 140 62 153 -50 234 26 -12 -122 -100 -120 40 -50 -102 54 -22 63 104 39
4407 39 275 123 -11 -98 7 -112 -31 152 -57 32 146 36 -113 127 -112 -247 55 7 -94 67 21 -36
4429 -36 24 37 -37 215 42 -105 123 64 -7 -30 134 -93 168 300 -178 -216 -180 -135 86 107 228 256 -161 -49
$$ packed form
4269a5J50k06K84O7m24J23J7j62k8J48J46j50J07N8j21o2l1J30l70M19k9J22L09
4292D82k56l9k25J00J07N2l85J68q9J40j55r9K48p8K71k36J93j18l44J18J24L5
4314A4K28j39l1jj38P3j18L11o7k91N49l81J40r6j44K47j60J62k20k3N4l5j5J60
4338G9m0k53L83l44k02J65K66k84M20M0o9m9j64j45K33J76j99J26k84K11k98o5
4360b97K98o1L26m41J88k18M10k91l7k2M9J25k0mJ18k20O5j51K65L7j27L54l95
4383d9J36j21k34J44J59l9J44p8R1k03K84k08l8j10K2k0J60r0n2J56p6Q5M1o5
4407C9K36j52j34q7J05j19Q1J83k09Q9J14j10j49K40k39j35L02m8j01J61m6n7
4429c6O0J3p4K52j73j47K28n9p1k3J64k27K61J32m78l8L6M5K21K1J21K8m17J12
$$ plain form
4453 -49 -226 -328 57 -178 -133 142 172 85 4 -112 19 156 90 238 73 -298 216 374 -89 140 109 -64
4475 -64 7 -67 -58 -143 -84 -138 43 -113 194 243 -16 -87 62 149 -148 101 222 103 197 -114 -209 -130 120 93 -116
4500 -116 73 133 -71 -382 -188 -106 132 134 115 179 -127 -59 292 -197 24 -203 37 -56 63 19 -84 109 111 -270
4524 -270 -16 -80 -197 12 309 -254 29 262 -54 -262 -113 -271 -20 -406 -215 -76 56 375 -77 -178
4544 -178 41 -269 -292 -252 77 -70 133 77 91 -390 131 -115 3 -14 379 -262 -57 11 -39 146 39 232
4566 232 126 -122 -194 -95 28 -8 -24 552 187 28 23 -46 60 -114 -260 20 -116 47 15 28 -113 -281 -164
4589 -164 -144 22 -9 252 -111 171 88 -105 241 -15 30 27 -137 46 -427 46 71 -26 236 419 149 -149 -131
4612 -131 -53 -43 -184 -32 -39 116 18 72 -298 -41 -46 222 -90 -149 269 91 31 -201 -74 94 153 200 22 -86
$$ packed form
4453d9j77j02L85k35M5K75L0q7q1j16J31J37o6J48j65l71N14J58m63K29l1j73
4475f4P1p4Rq5N9n4J81j56L07M9k59p1J49Q7k97K49J21j19R4l11r5P9K50k7k09
4500a16J89O0k04l11J94Q2K38Kj9O4l06O8L51m89K21k27K40r3J19m4j03J93Kl81
4524b70K54o4j17K09K97n63K83K33l16k08J49j58K51l86J91J39J32L19m52j01
4544a78K19l10k3M0L29j47K03n6J4m81N21k46J18j7L93o41K05O8n0J85j07J93
4566B32j06k48p2R9J23l6j6N76l65j59no9J06j74j46K80j36J63l2J3j41j68J17
4589a64K0J66l1K61l63K82q3j93L46k56M5lj64J83m73M73K5r7K62J83k70k98J8
4612a31P8J0j41J52pJ55r8N4l70K57nK68l12n9M18j78o0k32J27J68N9M7j78j08
$$ plain form
4636 -86 291 -47 66 -136 -62 154 250 369 16 -119 -431 -22 238 83 -103 196 25 221 324 -120 123
4657 123 87 -2 52 163 281 -45 83 -9 116 249 198 -133 -18 -268 275 -147 -224 307 60 279 95 213
4679 213 -49 176 -317 -127 8 12 -48 -155 6 -439 -94 -61 -9 -191 63 -47 -185 -90 100 170 172 121 111 95
4703 95 102 27 -76 -20 165 134 160 -221 -33 -114 -95 -63 -66 193 71 -45 -67 -217 -37 213 -18 367 299 149 66
4728 66 74 -201 -22 -110 -115 -99 414 91 -18 -154 -176 52 32 -164 -147 -43 227 16 -194 156 -279 111 -56
4751 -56 -64 -80 217 -51 -122 129 -138 116 439 208 -110 -176 -256 70 -224 76 -166 67 166 224 -136 -193 3
4774 3 -16 293 159 41 256 -257 -75 2 2 230 125 158 13 -28 28 -73 78 153 295 -62 241 -300 60
4797 60 -158 22 149 121 89 -113 149 -149 143 -218 -65 -87 112 -156 -185 -169 150 -172 -350 217 209 -48 -197
$$ packed form
4636h6L77l38J13k02P4K16R6J19l53j35l12M09K60j55j86K99j71J96J03m44K43
4657A23l6q9N4J11J18l26J28r2J25J33n1l31J15k50N43m22p7N31k47K19j84J18
4679B13k62K25m93J90J35Mo0j07J61m45L45L3N2j82K54j10j38R5J90P0Kn1j0j6
4703I5Pp5j03N6J85l1K6l81J88q1J9L2lK59j22j16k2j50J80K50k31L85o8j50q3
4728F6Qk75J79q8nJ6N13l23j09j36k2K28k0j96J7J04K70k11k10L50m35L90j67
4751e6qj6K97k68p1K51k67K54L23k31l18o6q0L26k94L00k42K33R9N8l60n7J96
4774Cj9L09j34j18K15n13J82P7%K28j05L3j45m1N6j01J51P5J42l57L03n41L60
4797F0k18J80J27k8l2k02K62k98K92l61J53k2J99k68k9J6L19l22j78N67qk57j49
$$ plain form
4820 -197 -169 147 -307 19 121 138 185 350 -149 72 -138 164 -277 232 255 282 153 72 -47 -160 157 43
4842 43 207 23 -92 165 54 -351 244 -20 -210 -71 -177 -186 -92 12 -377 -48 350 133 -155 -11 -288
4863 -288 71 -36 -182 -35 119 116 237 12 -50 -21 -151 195 -18 -131 368 266 118 -65 372 163 287
4884 287 270 54 253 -232 -9 -25 214 63 52 200 83 -259 -221 60 34 -73 99 188 -61 113 -91 90
4906 90 -64 53 138 -74 157 -260 38 -269 -247 -91 104 -154 -60 -48 -187 230 -281 -354 85 211 93 25
4928 25 -250 222 -272 -273 -223 287 91 70 -84 131 -170 225 53 192 3 187 102 247 -121 -19 -33 203
4950 203 357 175 151 -81 39 167 -3 -318 273 65 -112 103 47 -279 78 -426 -260 -197 131 336 114
4971 114 -89 64 75 145 -27 55 78 -161 -100 -318 20 227 -123 203 189 234 -121 -269 -9 -206 323 229 91
$$ packed form
4820a97K8L16m54L26J02J7M7J65m99K21k10L02m41N09K3K7j29q1j19j13L17j14
4842D3J64j84j15K57j11m05N95k64j90J39j06rR4J04l89L29L98k17k88J44k77
4863b88L59j07j46J47J54lJ21k25o2K9j30L46k13j13M99j02j48j83M37k09J24
4884B87j7k16J99m85K23j6K39j51j1J48j17l42L8K81k6j07J72Q9k49J74k04J81
4906I0j54J17Q5k12K31m17K98l07K2J56J95k58R4J2j39M17n11p3M39J26j18o8
4928B5k75M72m94jN0N10j96k1j54K15l01L95j72J39j89J84q5J45l68J02j4K36
4950B03J54j82k4k32J20J28j70l15N91k08j77K15n6l26L57n04J66O3L28K05k22
4971A14k03J53J1P0j72Q2K3k39O1k18L38K07l50L26j4M5l55j48K60j97N29r4j38
$$ plain form
4994 91 23 85 -30 71 -242 -52 -284 -50 -14 353 -155 69 -91 172 97 281 -95 252 188 -349 -35 -50
5016 -50 277 149 152 -58 -99 -45 -173 -255 -129 106 242 455 2 -60 -296 -107 -381 -126 79 -270 132 103 124
5039 124 -13 -208 36 -94 -3 -90 -594 -63 3 18 -105 197 63 125 108 188 -254 -164 -274 -186 -170 210 -116
5062 -116 115 168 -324 -145 -239 68 -170 -173 -111 -4 43 104 62 -173 72 124 -144 1 208 -239 -256 307 10
5085 10 460 -64 -100 33 -181 -341 123 -143 -169 72 48 87 275 -186 -86 -360 -6 25 -73 3 51 -5 -339
5108 -339 42 226 31 170 -176 58 4 44 18 -240 255 -80 35 58 -189 -131 260 -90 -13 -103 221 -112
5130 -112 72 204 -6 -63 -22 -19 -264 85 -218 115 -274 -166 300 248 315 -5 22 -119 43 -55 -158 -5 -134
5153 -134 -201 -75 133 -320 -147 -106 89 98 157 145 159 265 266 -45 -165 -23 9 -52 0 -142 -103 24 -200 -78
$$ packed form
4994I1o8O2j15J01l13J90k32K34L6L67n08K24j60K63p5J84l76L47o4n37L14j5
5016e0L27j28Lk10m1N4j28q2J26K35J36K13m53o2k36J89k74K55K05l49M02k9K1
5039A24j37j95K44j30R1q7n04N31O6J5j23L02j34O2j7Q0m42R0j10Q8J6L80l26
5062a16K31N3m92J79r4L07k38lO2J07M7O1m2k35K45N2k68J45K07m47j7N63k97
5085A0M50n24l6J33k14j60M64k66k6K41k4L9J88m61J00k74L54L1r8P6M8n6l34
5108c39L81J84j95J39l46K34n4M0k6k58M95l35J15K3k47N8L91l50P7r0L24l33
5130a12J84J32k10n7M1Lk45L49l03L33l89J08M66n2O7l20K7j41J62r8j03J53j29
5153a34o7J26K08m53J73M1J95RN9j2J4J06Jl11j20J42L2o1N2j42L9J27k24J22
$$ plain form
5177 -78 -209 -172 146 -406 -510 -143 23 -109 114 472 273 98 -181 -256 -312 -110 5 -382 129 -65 98
5198 98 -45 -3 126 -65 142 10 -101 -226 9 90 -10 170 112 189 184 -12 -124 -317 -35 -3 185 241 322
5221 322 -63 222 166 -307 -12 83 12 213 139 167 -48 41 -96 12 116 156 105 -204 -78 36 -435 -258 383
5244 383 -54 45 29 -138 -242 -275 -184 195 94 383 -74 -5 91 -52 -66 85 -204 -186 200 -69 -134 -184 368
5267 368 150 126 90 176 87 20 -248 61 -44 -237 251 670 124 6 112 -404 -134 73 -257 150 138 -196
5289 -196 304 -327 -115 -77 -225 78 -49 200 140 0 14 -198 155 -11 292 9 -174 -299 -16 1 -129
5310 -129 -50 90 -62 -101 4 -123 -151 20 -29 219 191 249 -261 87 47 100 0 127 -125 273 -9 403 48
5333 48 -6 123 59 18 133 -153 -205 286 -18 139 -58 228 -57 133 283 -104 -350 -238 80 166 90 -54
$$ packed form
5177g8j31L7L18n52j04L67J66j32K23L58j99j75k79p5n6K02J15l87N11j94J63
5198I8j43M2J29j91K07j32j11j25K35Q1j00J80n8P7nj96j12j93K82L2J88N6Q1
5221C22l85K85n6m73K95R5p1K01p4K8k15Q9j37J08J04M0n1l09J26J14m71J77O41
5244C83m37R9j6j67j04l3R1L79j01K89m57O9R6j43j4J51k89J8L86k69o5n0N52
5267C68k18k4l6Q6q9o7k68L09j05j93M88M19n46j18J06n16K70K07l30M07j2l34
5289a96N00o31K12L8j48L03j27K49o0j40J4k12L53j66L03k83j83j25K83J7j30
5310a29P9J40j52l9J05j27k8J71m9K48k8N8n10L48m0N3j00J27k52L98k82M12l55
5333D8n4J29o4m1J15k86n2M91l04J57j97K86k85J90J50l87k46J12L18Q6p6j44
$$ plain form
5355 -54 271 -146 77 139 67 49 52 -85 -138 -98 -185 201 -358 -60 -215 -208 160 2 -33 -23 -151 -185 -374 -51 579
5380 579 146 198 -187 98 -86 172 46 -194 -64 -4 -121 32 -179 -62 -44 -152 221 -43 61 -95 105
5401 105 354 251 203 -4 -59 -135 -149 -222 -255 84 253 93 115 150 -230 -314 -73 -70 108 367 98 115 -158 90
5425 90 55 118 -119 202 9 229 55 -49 -57 -197 -314 -85 217 -194 -78 -54 97 -205 -323 59 -55 56
5447 56 5 140 144 -8 85 51 -4 -207 -233 -151 63 -45 -64 117 32 17 -278 -205 -372 -78 53 275 320 -134 -51
5472 -51 30 -260 -353 -84 26 -104 -26 -10 132 -44 -166 -32 -230 -13 20 64 357 164 215 67 41 47 -137 -44
5496 -44 -224 -43 -303 -27 -136 -114 206 84 132 34 -173 1 -361 -308 -116 -300 130 -215 81 258 41 -103
5518 -103 -61 136 -119 286 119 -141 -102 -124 -56 47 -75 -107 -121 223 -362 -28 25 85 224 46 158 -68 -121
$$ packed form
5355e4L25m17K23O2p2j8Lj37n3M0q7L86n59K98j55PL68j58l5J0j28l4j89L23O30
5380E79m33N2l85K85j84K58j26k40J30O0j17J53k11J17J8j08L73k64J04j56K00
5401A05K49j03m8k07n5p6j4p3l3L39J69j60K2L5l80q4K41LJ78K59k69J7k73K48
5425I0l5O3k37L21j93K20j74j04qj40j17K29L02m11J16K4J51l02j18L82j14J11
5447E6n1J35Mj52R3l4n5k03k6Q2K14j08j9J81q5j5k95P3j67K94J31K22M5m54Q3
5472e1Q1k90r3K69J10j30P8J6J42j76j22J34j98K17L3M4K93j93N1j48k6Oj84R3
5496d4j80J81k60K76j09K2L20j22M8r8k07J74l62N3J92j84M30l45K96J77k17j44
5518a03M2J97k55M05j67k60L9k2O8J03j22l2j4L44n85L34N3O0J39j78J12k26n3
$$ plain form
5541 -121 9 199 -255 107 385 188 272 325 82 -217 110 -288 88 -194 94 -335 -117 -89 -153 194 107 133
5563 133 98 22 76 -246 -344 185 102 107 248 -166 205 74 -53 -53 -219 -125 -77 305 -12 -21 -67 30 -188 194 -5
5588 -5 205 200 24 103 194 155 -1 230 127 -138 74 -65 69 50 -268 219 151 -57 -141 4 29 -152 -132 -161
5612 -161 -305 172 60 -134 -32 -208 95 -21 -136 -394 -228 187 -75 -17 -326 -194 -86 -277 441 93
5632 93 110 -245 -463 -91 -113 -11 248 75 116 286 -207 76 83 12 -100 232 82 33 20 65 -210 84 66 25
5656 25 204 189 -183 -47 66 76 228 204 -135 -145 -497 -180 4 52 -271 88 124 45 -53 -111 -14 -401 -235 -101
5680 -101 50 -70 -19 -308 -149 107 65 105 44 79 121 -14 -254 -37 509 336 -65 -109 36 294 133 -4
5702 -4 -172 33 -104 356 -66 -24 185 -109 191 -16 153 143 164 -18 -286 94 120 -157 -102 -86 141 371 -143
$$ packed form
5541a21J30J90m54L62K78j97Q4N3k43k99L27l98L76k82K88m29K18K8o4L47q7K6
5563A33l5p6N4l22r8N29q3NJ41m14L71j31j27%j66R4M8L82l17rm6R7k18L82j99
5588eK10nj76P9R1l9j56K31j03k65K12j39J34j9l18M87o8k08q4J45K5j81K0k9
5612a61j44M77j12j94J02j76L03j16j15k58J66M15k62N8l09J32J08j91P18l48
5632I3J7l55k18L72k2J02K59j73M1J70m93K83Pp1j12L32j50m9j3M5k75K94j8m1
5656B5J79j5l72J36J13J0J52k4l39j0l52L17J84M8l23L59L6p9r8n8R7l87J66J34
5680a01J51j20N1k89J59K56m2M0o1L5M2j35k40K17N46j73m01m4J45K58j61j37
5702dj68K05j37M60m22M2K09k94L00k07J69j0K1j82k68L80K6k77N5J6K27K30n14
$$ plain form
5725 -143 -281 -198 -195 191 190 60 -115 -3 228 -199 -148 8 13 32 145 -47 -342 90 299 -84 -139 56 -254
5748 -254 -48 65 207 151 69 -143 -137 312 427 -53 -208 -280 9 272 -54 138 29 185 131 -85 -88 -462 -4
5771 -4 -109 18 111 230 -143 -201 -43 130 -32 193 -21 -99 159 -61 -65 184 310 -99 100 -245 -29 -57 59
5794 59 -24 -27 -140 -74 -106 -157 -355 38 130 -181 -188 -6 -27 290 75 -199 -255 -69 -280 183 3 -91 -29 363 42
5819 42 262 211 13 470 249 120 107 -117 -20 -67 -209 -147 57 128 -98 -114 -31 82 -51 -6 -136 28 195
5842 195 310 52 242 -203 53 -17 179 -196 188 -15 -93 231 -135 185 24 62 -81 -243 -136 -60 -437
5863 -437 178 161 322 -126 -229 -298 -67 -96 -271 276 -107 -169 257 -68 -174 -123 133 77 -10 -34 135 152 -265
5886 -265 -212 -75 -44 215 65 80 -36 -350 -199 55 -36 300 135 -152 174 56 155 -132 94 -71 -66 -200
$$ packed form
5725a43j38Q3LL86jj30j75J12K31m27N1J56NJ9J13j92k95M32K09l83n5J95l10
5748b54K06J13J42n6q2k12OM49J15m80j55p2K89K63l26J92j09J56n4k16ll74M58
5771dj05J27R3J19l73n8J58J73j62K25k14p8K58k20mK49J26m09J99l45K16k8J16
5794E9q3lj13O6l2n1j98L93R2l11pJ82k1L17k15k74n6J86k11M63j80r4O2L92l21
5819D2K20n1j98M57k21j29j3k24R7m7j42O2K04P1k26j6Q3J13j33M5j30J64J67
5842A95J15k58J90m45K56p0J96l75L84k03p8L24l66L20j61L8j43j62J07P6l77
5863d37O15j7J61m48j03o9K31k9j75N47l83o2M26l25j06N1K56n6q7k4J69J7m17
5886b65N3J37L1K59j50J5j16l14J51K54r1L36j65k87L26j18R9k87K26j65Nj34
$$ plain form
5908 -200 -186 -62 68 21 -19 52 115 55 -24 -191 210 -37 -55 359 96 138 -26 -28 -112 -78 -9 -100 -125 270 -80
5933 -80 233 -83 151 133 -126 -286 -42 162 5 -126 177 41 5 54 207 -7 58 176 -332 -316 -118 105
5955 105 251 182 -144 33 -30 -183 -148 -341 58 -118 -45 -89 -6 -16 8 -41 -51 102 -11 195 -39 -51 45 254
5979 254 -342 237 -47 167 60 -229 49 -45 53 136 4 226 56 -36 -11 -299 -365 96 86 19 -112 -78 408
6002 408 114 -197 -430 240 -416 112 229 -95 53 -252 65 261 -2 194 -57 -220 239 97 -122 158
6022 158 -55 187 116 148 118 -121 -168 170 54 -306 186 -74 -170 15 -234 40 -34 -16 265 -179 -170 158 -57
6045 -57 -188 -146 25 -22 21 -56 -432 -140 -76 -255 -156 153 -191 309 339 294 -99 82 -11 -103 99 308 -107 188
6069 188 -7 374 -1 -58 165 17 -60 -229 244 38 -28 140 7 -93 -107 -11 -65 -131 41 -144 13 -113
$$ packed form
5908b00J4J24J30m7m0P1O3o0p9j67M01k47j8M14k63M2j64kq4L4O9r1k5L95l50
5933h0L13l16K34j8k59j60K44K04j57j31L03j36l6M9J53k14O5J18n08J6J98K23
5955A05J46o9l26J77o3j53L5j93L99j76P3m4Q3j0K4m9j0J53j13K06k34j2R6K09
5979B54n96N79k84K14j07k89K78r4R8Q3j32K22j70r2K5k88o6M61j0o7j31L4M86
6002D08k94l11k33O70o56N28J17l24J48l05L17J96k63J96k51j63M59j42k19K80
6022A58k13K42p1L2l0k39m7L38j16l60M92k60r6J85k49K74p4J8K81m44RL28k15
6045e7j31M2J71m7M3p7l76K92O4j79R9L09l44N00L0m5l93J81r3r2K02K09m15K95
6069A88j95L81l75n7K23j48p7j69M73k06o6J68j33j00j4R6n4o6J72j85J57j26
$$ plain form
6091 -113 132 109 56 81 -187 -33 -135 -32 -1 -107 54 -7 -194 209 192 -56 112 -29 129 37 -3 -19 -246
6114 -246 122 97 232 25 49 -35 -335 52 96 -53 -154 155 9 121 -60 -61 157 346 -125 213 -74 -253
6136 -253 -162 260 -126 209 161 -54 111 31 -26 -196 1 -29 140 -82 14 -6 -159 -173 -196 20 -171 26 -140
6159 -140 -171 -5 106 -65 -171 -88 -1 -172 -141 119 -75 -18 -51 -76 -441 53 -83 -41 -32 -276 -90 226 7
6182 7 252 -199 213 -203 -234 -130 -153 18 -62 22 453 -17 19 244 33 148 394 -32 19 64 -221 11 32
6205 32 169 9 135 9 -81 48 25 -109 -215 37 -113 288 5 -158 -42 -178 -363 -297 70 63 195 -261
6227 -261 209 -72 6 -56 126 158 152 -523 93 86 143 88 -197 334 199 -14 -213 165 -100 0 85 28 -97 106
6251 106 58 119 196 -174 -71 30 -39 15 120 388 142 -175 22 87 102 142 230 -106 37 5 -23 -68 62 250
$$ packed form
6091a13K45k3n3K5k68J54j02J03L1j06J61o1j87M03j7k48J68j41J58r2m0j6k27
6114b46L68k5J35k07K4q4l00L87M4j49j01L09j46J12j81jK18J89m71L38k87j79
6136b53R1M22l86L35m8k15J65q0n7j70J97l0J69k22R6k0j53j4k3K16j91J97j66
6159a40l1J66J11j71j06Q3Q7j71L1K60j94N7l3k5l65M94j36M2Rk44J86L16k19
6182GK45m51M12m16l1J04k3J71q0Q4M31m70L6K25k11J15K46m26N1M5k85K32K1
6205C2J37j60J26j26r0J29k3j34j06K52j50M01k83j63J16j36j85O6L67pJ32m56
6227b61M70k81P8o2J82L2oo75O16pN7n5k85N31j35k13j99L78k65J00Q5n7j25K03
6251A06m8O1P7l70J03J01o9N4J05K68k46l17J97O5J5M0Q8l36J43l2k8m5J30J88
$$ plain form
6275 250 -128 -164 -156 -89 -11 36 -75 141 -46 116 156 -33 -367 -71 -128 66 -67 125 238 -52 170 -175 -78
6298 -78 -30 -24 -38 -196 109 -35 304 -102 -133 124 -73 385 -130 -285 -334 -85 359 -198 -93 -72 -58 -76 41
6321 41 -240 -19 -28 60 -154 121 226 55 -28 11 21 87 149 162 107 -218 -27 -392 137 -3 -318 -15 268 -194
6345 -194 62 240 -133 149 33 317 234 -15 261 -266 -412 -283 -47 13 270 -373 9 276 -93 112 -64
6366 -64 -50 -6 9 -126 -311 142 -124 -55 186 113 -148 -142 11 81 -141 -112 -338 50 -213 201 84 19 -87 -295
6390 -295 156 112 -32 -207 211 21 142 -117 94 26 156 -54 -95 86 -263 200 117 457 24 327 132
6411 132 80 120 -238 -171 71 231 55 121 -217 -28 -89 -233 88 -63 200 -219 -51 -175 -301 151 -36 23
6433 23 38 158 -124 -230 73 -60 -3 100 -85 192 244 95 49 248 -179 -9 -109 -49 91 259 -102 -47
$$ packed form
6275B50l78l6QO7P8M7j11K16j87J62M0j89l34K96n7J94j33J92J13k90K22l45R7
6298g8M8Oj4j58L05j44L39m06l1K57j97M58n15j55m9K49M44n57J05K1J4j8J17
6321D1k81K21rQ8k14K75J05j71q3L9J0O6O2J3n5l25J91l65N29j40l15L03K83m62
6345a94K56J78l73K82j16K84q3k49K76n27j46J29K36O0K57o43L82K67l69K05j76
6366f4J4M4J5j35j85M53k66O9K41p3k61OJ53P0k22K9k26L88k63M14j17o5j06k08
6390b95M51m4j44j75M18j90J21k59K11o8J30k10m1J81l49M63q3L40m33L03j95
6411A32n2M0l58O7K42J60j76O6l38J89o1j44L21j51K63m19J68j24j26M52j87N9
6433B3J5J20k82j06L03j33N7J03j85K77N2j49m6J99m27J70j00O0J40J68l61N5
$$ plain form
6455 -47 81 -341 -194 61 9 -72 115 -171 98 168 130 118 93 -281 -138 -24 34 -156 179 43 296 -146 27
6478 27 150 -285 -95 172 -74 -211 -86 183 86 -180 -255 34 189 -63 10 19 -340 -260 -136 -260 -2 112
6500 112 -8 -36 -61 -184 -50 -60 -182 60 142 43 51 116 45 3 -421 237 -192 -87 89 141 72 132 117 -167 37
6525 37 76 115 -49 99 -96 116 268 -154 261 100 59 -34 -247 -315 -77 198 -401 -237 -35 284 183 -136
6547 -136 -215 -24 61 -52 -144 57 227 -128 -25 -41 -105 37 46 0 7 -217 -58 -77 -129 -178 -48 140 51 -64 -252
6572 -252 179 -106 179 -133 234 237 175 20 -27 -145 -138 160 81 0 78 6 -7 25 -132 -164 -71 -64 7 -245 -177 -24
6598 -24 -170 -48 330 376 157 143 15 -211 -180 -56 -150 -27 93 68 24 -79 -46 -102 200 227 64 196 -93
6621 -93 84 -94 -105 85 -349 50 114 -46 -92 81 -60 11 43 2 244 -223 -45 -188 88 1 -178 48 140
$$ packed form
6455d7J28m22J47K55n2q1J87k86K69P0l8j2k5l74J43J14N8j90L35j36K53m42J73
6478B7J23m35J90K67k46j37J25K69r7k66p5K89J55k52P3Rl59Q0J24j24K58J14
6500A12j20k8k5j23J34j0j22K42Q2r9QO5p1m2m24O58m29J05J76N2o9O0j5k84K04
6525C7L9L9j64J48j95K12J52m22M15j61m1r3k13o8K38K75n99J64K02L19j01l19
6547a36p9J91Q5j13r2K01J70l55J03j6o4J42Rm6Pk24J59j9n2m9J30J88q9j15j88
6572b52M31k85K85l12L67Lo2j55m7j18PK98p9q1P8p2j3L2j57l2R3PP1k52O8J53
6598b4j46J22L78M6k19j4j28k26L1J24r4J23J20k5m4j03L3n6L02K7j63J32k89
6621i3J77j78j1J90m34L99O4j60m6J73j41P1L2m1K42m67J78j43K76q7j79K26R2
$$ plain form
6644 140 -120 129 -47 -2 80 -215 -328 -88 365 96 397 -186 54 340 257 -204 14 105 -72 20 -13 -139
6666 -139 136 184 186 44 23 -146 -193 -172 27 127 297 156 87 189 156 162 -118 -106 -70 177 170 133 184 -124 -69 333
6692 333 -61 265 140 -81 -208 -139 13 -78 315 123 417 -221 241 205 -21 62 36 -213 47 147 -11 122
6714 122 115 -290 -39 89 142 35 381 -66 134 82 49 -12 -129 280 233 21 -434 -149 322 -16 1 53 -144
6737 -144 212 144 137 74 -238 -69 64 -139 137 -41 -92 6 -170 -68 71 -3 6 -202 -189 -67 -267 162 229 194
6761 194 -251 -33 -10 -194 54 -421 -207 -331 191 48 110 -42 -189 7 -217 134 170 -150 206 77 6
6782 6 -107 21 -162 216 314 13 -287 158 -239 73 204 -6 -104 146 -57 -107 46 -75 -28 87 92 116 91
6805 91 -41 -118 -131 -96 -74 -96 -32 43 101 -87 230 6 -143 92 193 137 -67 -255 -162 -60 -157 280 -81 133
$$ packed form
6644A40k60K49j76M5Q2k95j13K40M53k69L01n83K40K86q3m61K18R1j77R2l3j26
6666a39K75M8Kj42k1j69m7K1J99J00J70j41o9J02l3Ok80J2L6K47pl7N1l08N5M02
6692C33l94L26j25k21j27O9J52r1L93j92K94o38M62l6k26Q3k6k49K60J00j58J33
6714A22pm05K51J28N3j07L46m47K00n2l3o1j17M09m7k12m55K85M71l38J7N2j97
6737a44L56o8po3l12J69J33k03K76j78n1R8j76J02J39p4Rk08J3J22k00M29O7l5
6761A94m45K18K3j84K48m75K14j24N22j43O2j52j47J96k24L51L6l20L56j29p1
6782Fj13J28j83L78R8l01l00M45l97L12J31k10r8K50k03n0J53j21M7J15NK4k5
6805I1j32p7j3L5K2k2O4P5N8j88L17k24j49K35J01n6k04j88R3J02r7M37l61K14
$$ plain form
6829 133 -167 -53 -235 -200 220 187 141 60 114 -81 -67 -83 -102 107 7 -90 62 227 191 -231 129 186 114 203
6853 203 31 188 77 -100 -22 -19 89 124 175 73 257 -8 34 -98 56 -19 -17 193 209 -62 -302 -164 -340
6876 -340 -199 56 86 34 48 -145 12 1 -183 165 99 78 -88 -40 72 47 7 -113 59 -119 -127 -49 -141 -98 -132
6901 -132 40 10 -123 -66 -101 121 230 13 106 232 -130 49 401 -376 131 -103 -48 -182 260 55 52 79 32
6924 32 -99 -269 -6 267 17 3 53 53 -49 -371 -35 -180 -338 153 1 -328 195 -90 128 146 167 114 -203
6947 -203 -45 -180 47 -71 160 223 0 8 -55 -74 -13 71 48 168 -91 -107 100 34 -181 -104 -317 -36 18 13 403
6972 403 175 61 63 -3 292 216 -80 -90 -168 -44 -140 -541 84 -52 110 -50 112 -100 0 -84 -157 73 70 162
6996 162 -104 140 350 71 -280 -61 -164 -50 106 304 -74 -92 29 9 284 119 168 192 -108 119 -287
$$ packed form
6829A33l00J14j82L5M20l3m6q1N4j95J4j6j9K09j00r7J52J65l6m22L60N7p2Q9
6853B03j72J57j11j77P8LJ08L5N1j02J84k65M2j32J54p5KK10J6k71k40J38j76
6876c40J41K55L0n2J4j93J57j1j84L48o6k1j66M8J12k5m0j20J72j78qP8r2M3l4
6901a32J72l0j33N7l5K22J09k17R3J26l62J79L52p77N07k34N5j34M42k05lK7m7
6924C2j31j70K63K73k50j4N0%j02l22L36j45j58M91j52l29N23k85K18J8K1n3l17
6947b03J58j35K27j18K31O3k23Qo3j9O1Q4k3J20k59j6K07o6k15P7k13K81N4nL90
6972D03k28j14Ko6K95p6k96j0p8J24r6m01O25j36J62j60J62k12J00q4p3K30lR2
6996A62k66K44K10k79l51K19j03J14J56J98l78j8J21k0K75j65M9K4l00K27m06
$$ plain form
7017 -287 187 131 -45 75 348 -46 160 -113 -68 166 -282 137 -37 32 -26 -248 72 13 87 268 174 38
7039 38 43 221 206 -296 -147 -17 -92 -1 -92 -76 74 -4 -215 1 168 251 -9 151 12 75 -117 -72 -183 -311
7063 -311 127 159 238 109 188 -190 -121 82 -52 -49 117 65 108 27 -60 12 87 -56 -70 351 -152 114 32 222 -40
7088 -40 50 110 -215 -155 -204 -273 291 -28 136 19 -88 -135 122 36 233 -206 -222 -254 -290 -99 171 247 -35 33
7112 33 109 -55 -16 76 203 -24 110 -328 197 106 142 -211 8 -209 -138 23 -132 -108 203 40 46 83 -9 -260
7136 -260 -141 40 -101 -195 110 179 -24 48 113 131 342 37 60 -58 164 -146 -175 -18 -170 168 27 252
7158 252 -102 86 -47 207 67 139 138 86 -79 -83 -355 132 152 144 -97 -87 -96 -86 -169 -302 78 -38 221 -74 84
7183 84 -452 63 26 13 -72 78 156 -150 158 -12 193 32 -59 -115 -124 153 300 98 -287 174 -132 -246 -217
$$ packed form
7017b87M74n6j76J20K73l94K06k73M5K34m48M19j74O9n8k22L20n9P4J81r4j36
7039C8NJ78j5n02J49J30p5R1r1J6J50p8k11K16J67Q3k60J60j39O3j92M5j11j28
7063c11M38L2P9j29P9l78O9K03j34LJ66n2M3q1q7P2P5j43j4M21n03K66q2J90k62
7088d0R0O0l25O0m9o9N64l19J64j17j07m7K57q6J97m39j6l2l6J91K70P6k82O8
7112C3P6j64L9R2J27k27J34m38N25r1L6l53K19k17P1J61j55K4L11j63OL7r2k51
7136b60J19J81j41r4L05O9k03P2O5J8K11l05K3j18K22l10k9J57j52L38j41K25
7158B52l54J88j33K54j40P2jn2j65mk72M87K0qk41J0rJ0q3j33L80j16K59k95J58
7183H4n36N15l7j3q5J50P8l06L08j70K05j61r1n6rK77J47k02l85M61l06j14K9
$$ plain form
7206 -217 -47 -158 238 227 224 170 -4 187 241 -68 145 -96 -150 -148 87 81 46 47 117 -160 -144 19 22 -240 193 -150
7232 -150 90 -335 -42 -77 374 -70 69 -104 -253 234 49 184 26 354 -38 93 4 56 4 -106 -36 115
7254 115 -100 14 -19 17 -98 -89 -36 -150 36 41 -55 -68 -20 -54 -99 269 -89 124 170 -363 22 38 -97 -72 -158
7279 -158 135 172 -106 53 -41 100 -146 32 21 -249 -75 30 -157 61 50 94 -7 110 -118 2 165 217
7301 217 -5 43 -37 159 80 -56 -167 -49 -121 172 160 59 52 160 18 -91 -107 121 10 271 -238 28 22
7324 22 51 -5 -3 -109 44 -13 -84 -87 -233 363 204 -39 144 60 -41 -79 427 -98 42 213 -180 -93 307 0
7348 0 214 156 -47 10 40 -156 44 51 -184 -227 -167 -340 42 218 31 -106 -27 -546 -83 16 235 -34 85 375
7372 375 145 -360 -165 -110 145 -20 39 -144 -67 -20 85 31 -188 -173 -337 135 56 53 9 107 -6 18 -302 -72
$$ packed form
7206b17J70j11L96j1ln4j74J91N4l09K13k41n4KK35ol5JP0k77J6J63Lk62M33l43
7232a50K40m25K93l5M51m44J39j73j49M87j85J35j58L28l92J31q9N2n2j10P0J51
7254A15k15J14l3L6j15RN3j14J86Nr6j3M8l4m5L68l58K13M6n33L85J6j35K5q6
7279a58K93L7k78J59r4J41k46J78j1k70J74J05j87K18j1M4j01J17k28J20J63N2
7301B17k22M8q0J96p9j36j11J18p2K93j2j01pJ08j42j09j6K28j11K61n09K66o
7324B2K9n6Kj06J53n7p1lj46N96j59k43J83q4j01l8N06n25J40J71l93Q7M00l07
7348@K14n8k03N7L0j96K00Pk35m3O0j73L82J76j87j37P9n19M63R9K19k69J19K90
7372C75k30n05J95N5K55j65N9j83P7M7J05n4k19J5j64M72p9lm4R8j13K4l20K30
$$ plain form
7396 -72 265 -317 -107 -19 -137 -31 24 -393 -6 -203 -38 64 -29 -291 -150 72 24 -120 63 -46 -320 -25
7418 -25 124 -85 -137 18 -20 31 266 75 -244 -109 73 148 -89 321 117 41 267 -71 1 292 134 7
7440 7 -13 7 22 13 -63 74 104 151 -191 128 -111 -272 195 -47 -77 -44 85 110 -65 52 -30 150 15 -311 90
7465 90 -454 111 123 6 9 36 -85 172 211 248 129 2 -55 241 102 -33 100 117 129 -64 -126 256 3 -12
7489 -12 45 77 253 264 197 25 -159 241 -9 -330 -46 -197 23 -73 -200 14 4 129 -39 -332 -229 -281 -327
7512 -327 -196 -213 -82 57 370 45 33 212 -86 -117 -48 47 63 204 -21 311 -119 -109 283 40 -276 33
7534 33 -149 -288 -151 -160 133 -270 191 290 56 -173 -253 -44 -175 158 8 144 18 39 163 -123 -165 -179 1
7557 1 -188 139 -204 136 80 -145 -179 84 -187 176 67 28 -76 -94 92 -181 154 50 174 157 -101 105
$$ packed form
7396g2L37n82K10Q8j18J06N5m17L87j97J65J02r3k62J41K22m8j44J83j09k74K95
7418b5J49k09n2J55l8N1K35j91l19J35J82P5k37M10k04p6K26l38P2K91j58j27
7440Gk0K0J5rp6J37L0M7l42L19k39j61M67k42l0L3J29K5j75J17q2J80j35l26M01
7465I0n44N65J2j17LK7j21K57L9L7j19j27n7K96j39j35J33J7J2j93o2L82k53j5
7489a2N7L2J76J1o7j72j84M00k50l21K84j51K20r6j27K14j0J25j68k93J03n2m6
7512c27J31j7J31J39L13l25j2J79k98l1O9R5J6J41k25L32m30J0L92k43l16L09
7534C3j82j39J37rK93m03M61R9k34k29q0K09j31L33j50J36j26K1J24k86m2j4J80
7557Aj89L27l43L40n6k25l4K63k71L63j09l9j04j8J86k73L35j04J24j7k58K06
$$ plain form
7579 105 -109 114 -148 160 -125 53 108 115 274 196 -40 -67 -262 52 230 -125 -45 218 150 -7 52 20 -47
7602 -47 -89 -125 -1 85 83 228 -372 -198 -186 -210 -211 116 22 48 -123 111 -190 151 -41 93 -96 143 60 -26 8
7627 8 32 322 -89 87 70 95 19 72 -260 -165 31 48 91 113 131 274 96 242 -318 58 -158 138 -16 -71
7651 -71 -364 58 112 29 -6 -204 -175 -55 135 159 91 326 -108 352 224 -48 -226 -52 -39 -95 60 5 -29 -13
7675 -13 190 23 -248 -246 51 -162 -243 36 -68 -349 285 -174 -205 -155 28 -205 -94 -66 -47 -15 -287 -16 -23 101
7699 101 -21 46 210 25 -402 372 159 104 38 42 68 -117 312 -6 -172 -188 -47 176 35 -5 -120 -39 4
7722 4 -400 134 99 17 -98 9 -163 34 -367 -55 54 -81 329 -218 -65 6 -5 19 -59 -71 -211 -207 -8 -273
7746 -273 -219 1 27 -34 -51 -270 -167 -88 257 180 147 -198 86 -36 -48 -251 97 -265 -68 -20 217 -30 -17
$$ packed form
7579A05k14K23k62L08k85J78N5PJ59p8k36k7j95L14J78l55Q0K63o8j57N9l2o7
7602d7m2l6J24Q6kJ45o00J74J2k4jL27r4K6j71K34l01L41j92J34j89K39q3q6L4
7627HK4K90m11J76j7K5p6N3l32R5J96J7M3K2J8J43j78J46n60L76k16K96j54n5
7651g1k93M22N4q3l5j98K9J20J90K4o8K35m34M60j28k72j78J74J3n6J55n5l4J6
7675a3K03j67k71KK97k13q1K79j04k81O34m59l1N0J83k33J11K8J9L2k72K71pJ24
7699A01j22O7J64j85m27P74k13n5o6MK6j85M29l18j66j6J41K23j41m0j15Q1M3
7722Dm04N34l5q2j15J07j72J97m01L12J09j35M10n47J53P1j1K4p8j2j40MJ99k65
7746b73N4K20K6o1j7k19J03P9L45p7l3l45K84j22j2k03L48l62J97M8K37k47J3
$$ plain form
7769 -17 135 171 -21 -86 -33 112 198 -145 -92 -3 446 -7 13 -181 -181 -189 168 -40 -24 109 31 19 286 72 156
7794 156 -43 120 246 -144 -134 11 13 109 -218 106 165 86 -60 55 -70 69 -6 22 -164 62 173 24 -37
7817 -37 276 202 -1 70 -109 -368 -125 18 221 -138 175 -87 -70 127 -5 134 141 184 44 -55 207 115 -68
7840 -68 -281 79 -223 68 200 4 -224 36 -74 -300 -247 -170 151 20 -171 -146 -56 314 50 -35 180 -70
7862 -70 102 -133 -32 202 -5 -192 4 14 168 14 11 4 90 180 115 -170 -73 -10 -62 -72 69 65 102 -37 -212
7887 -212 -103 169 165 177 79 90 182 88 96 114 -35 159 295 -54 -58 -115 -274 -204 -133 160 -111 10 263 225 80
7912 80 -136 -38 -251 -87 -2 113 291 299 -34 -26 -144 -52 78 191 51 159 -242 48 -72 -157 127 124 -13 0
7936 0 130 -81 99 -241 40 5 -407 168 36 -106 77 224 88 96 2 -105 173 67 -12 -211 41 -4 -34
$$ packed form
7769a7J52L6j92o5N3J45Q6l43N3Q9M49m53K0j94%qL57k08J6J33p8j2K67k14Q4
7794A56j99J63J26l90J0J45KR6l27L24N9p9j46J15j25J39p5K8j86K26J11j49o1
7817c7L13p4k03P1j79k59K43J43K03l59L13k62J7J97j32J39PM3j40r9K62r2j83
7840f8k13L60l02K91J32j96k28K60j10k26N3P7L21j31j91K5R0L70k64q5K15k50
7862g0J72k35J01K34k07j87J96J0J54j54lpQ6R0o5k85R7O3n2j0J41mL7j39j75
7887b12J09K72mJ2r8J1R2r4QJ8j49J94J36l49mn7j59P0P1K93k71J21K53l8j45
7912H0k16R8k13J64Q5J15J78Ql33Qj18R2J30J13j40J08m01K90j20q5K84lj37J3
7936@J30k11J80l40K81l5m12N75j32j42J83J47j36Qr4j07K78j06p9j99K52m5l0
$$ plain form
7959 -34 283 -64 59 -113 -304 -45 41 -32 173 -146 11 129 136 -124 31 -38 -117 -2 146 -121 -196 -95 68
7982 68 46 -35 59 -58 376 204 60 -130 78 -314 47 44 50 136 391 -337 -280 -277 -78 461 -257 55 -44 -165
8006 -165 104 -70 -231 155 -29 -69 -13 54 10 178 271 82 -260 -230 -2 -209 -71 -335 174 -229 87 -132
8028 -132 55 -106 208 28 -16 194 88 137 -97 -61 -229 -55 -38 -130 -6 70 -335 3 -128 30 252 212
8050 212 142 -42 66 -82 -113 -16 -50 -31 178 107 171 -76 22 37 56 -46 79 -101 -108 294 353 99 -118 151
8074 151 116 23 -26 64 -126 -174 -135 95 278 14 294 -79 -200 -51 24 182 -104 31 73 -246 50 212 -185
8097 -185 24 -22 66 -355 6 -13 -185 -115 -157 -32 52 -104 13 -189 -112 -140 -92 -43 -51 22 -184 11 -113 23
8121 23 -156 44 -9 16 294 -147 -218 203 75 -228 -127 161 -60 -299 -319 190 341 -77 92 -101 26 -86
$$ packed form
7959c4L17l47J23j72j91K59Q6p3K05l19J57J18Pk60J55o9p9J15J48k67p5J01J63
7982F8k2q1R4j17M34j72j44j90K08l92L61lOQ6K55p28N7LJ99N39p18L12r9j21
8006a65K69j74j61L86j84m0N6O7m4J68R3j89l42L0K28k07J38k64N09m03L16k19
8028a32J87j61L14j80m4K10j06M9k34L6j68J74J7r2J24P6m05L38j31J58K22m0
8050B12p0j84J08j48l1R7l4J9K09p1O4k47R8J5J9j02J25j80pM02N9k54k17K69
8074A51l5r3m9R0j90m8L9K30J83k64K80l73j21J49P5J58k86J35M2l19K96J62l97
8097a85K09m6Q8m21L61j9j72P0m2J25Q4j56J17k02P7k8M8M9qP3k06J95j24J36
8121B3j79K00n3K5K78m41p1M21j28l03J01K88k21k39k0N09J51m18J69j93J27j12
$$ plain form
8143 -86 -202 40 -199 -282 245 159 327 -109 7 -33 -163 62 96 137 -187 3 -19 -200 -1 132 -157 98
8165 98 -227 -79 40 185 218 27 21 -152 -235 35 -149 -2 241 15 105 19 110 64 82 35 80 -72 -37 110
8189 110 -97 -117
$$ packed form
8143h6j16K42k39q3N27q6J68m36J16m0j30K25L4M1l24J90k2j81J99J33k89K55
8165I8l25J48J19J45L3j91oj73q3K70j84J47K43k26R0q6R1m6J8m7M5j52L5J47
8189A10k07k0
8191a17
$$ Imaginary data points
##PAGE= N=2
##DATA TABLE= (X++(I..I)), XYDATA
$$ plain form
0 0 0 0 0 0 0 0 0 0 0 8 -8 8 -8 12 -16 16 -24 24 -32 34 -40 48 -56 64 -72 84 -93 108 -122 137 -156 172
32 172 -194 218 -241 268 -300 332 -367 408 -451 500 -552 613 -678 753 -838 935 -1045 1176
50 1176 -1332 1518 -1748 2044 -2437 2983 -3805 5174 -7878 15317 -78476 -283960 -182824 32420
64 32420 195132 165521 33990 -71408 -45826 57412 139906 121927 48836 437 30666
75 30666 110122 176765 163947 71493 -27699 -33745 58398 155117 157011 69119 -19686 -26377 39946
88 39946 98740 80764 8515 -45341 -38286 -1234 15862 -1317 -33208 -54272 -50369 -25069 -863
101 -863 -8598 -57519 -114706 -131631 -88236 -19301 13715 -17331 -72805 -92807 -66110 -36436 -39425
114 -39425 -62003 -65582 -38111 -1596 13631 1117 -19846 -29284 -21391 -2140 22574 41051 38970
$$ packed form
0@%%%%%%%%%Qj6J6j6K0k8L2m0M8n6O6p4Q8j04J20j36J56j77K01k30K59k93L28
32A72l66M12m59N09n68O32o99P75q59R51j052J165j291J431j591J773j980K221
50A176k508K850l266L792m481N420o788Q979j3052K3195r3793k05484J01136K15244
64C2420J62712k9611j31531j05398K5582J03238Q2494j7979p3091m8399L0229
75C0666P9456O6643j2818r2454r9192o046R2143R6719J894q7892q8805o691O6323
88C9946N8794j7976p2249n3856P055L7052J7096j7179l1891k1064L903K5300K4206
101h63p735m8921n7187j6925M3395O8935L3016l1046n5474k0002K6697K9674k989
114c9425k2578l579K7471L6515J5227j2514k0963r438P893J9251K4714J8477k081
$$ plain form
127 38970 15082 -6166 4271 41430 71126 66550 40780 26141 34576 48375 44592 26834 20430
140 20430 36852 58564 61348 44779 25853 12559 4105 687 9360 25477 32047 16196 -13240
153 -13240 -30509 -21515 -1322 4111 -11632 -27252 -26123 -19329 -26058 -43594 -52008 -40640 -18940
166 -18940 -6075 -8987 -20803 -32353 -42227 -50320 -47868 -28204 -786 11035 -299 -16593 -18198
179 -18198 -8096 -3079 -7682 -10665 -681 15852 22950 14933 4468 6564 18844 26852 24959 22553
193 22553 22828 17736 5123 -2139 9362 33012 48056 40162 17893 2048 982 4664 211 -4832
207 -4832 1578 19235 28567 18535 -889 -14691 -17496 -15479 -12125 -6214 2104 4689 -5537 -22380
221 -22380 -28799 -16824 -1087 1279 -8699 -16686 -14883 -11441 -15788 -22364 -18676 -3222 10763 11747
$$ packed form
127C8970k3888k1248J0437L7159K9696m576k5770j4639Q435J3799l783j7758o404
140B0430J6422K1712K784j6569j8926j3294q454l418Q673J6117O570j5851k9436
153a3240j7269Q994K0193N433j5743j5620J129O794o729j7536q414J1368K1700
166a8940J2865k912j1816j1550r874q093K452J9664K7418J1821j1334j6294j605
179a8198J0102N017m603k983R984J6533P098q017j0465K096J2280Q008j893k406
193B2553K75n092j2613p262J1501K3650J5044p894k2269j5845j066L682m453n043
207d832O410J7657R332j0032j9424j3802k805K017L354N911Q318K585j0226j6843
221b2380o419J1975J5737K366r978p987J803L442m347o576L688J5454J3985R84
$$ plain form
235 11747 1870 -8631 -13145 -14651 -14115 -7357 8646 22018 20031 3361 -9423 -6762 5588 11948
249 11948 7306 2114 5537 11930 9697 -722 -7299 -489 12825 19972 15044 5398 -2664 -9976
263 -9976 -15802 -14236 338 17707 23883 13048 -4651 -12643 -10570 -8052 -10729 -10160 -243 12886
277 12886 15861 4924 -8450 -12432 -7172 -1318 1131 2636 4585 3369 -3811 -10233 -5529 8549
291 8549 18938 14252 951 -7072 -5835 -2499 -4011 -5590 905 14690 22395 15149 -853 -13118
305 -13118 -14615 -10606 -4989 2384 10125 12802 4721 -7809 -14340 -9972 -1675 609 -3769 -5915 -3528
320 -3528 -1650 -6600 -13459 -12286 -1314 9428 9345 330 -9429 -13630 -13807 -11548 -4592 7153 17382
335 17382 16512 4662 -6666 -8807 -3390 1185 1982 3516 11124 17067 14145 3343 -3933 -892 8168
$$ packed form
235A1747r877j0501m514j506N36O758J6003J3372j987j6670j2784K661J2350O360
249A1948m642n192L423O393k233j0419o577O810J3314P147m928r646q062p312
263i976n826J566J4574J7369O176j0835j7699p992K073K518k677N69R917J3129
277A2886K975j0937j3374l982N260N854K449J505J949j216p180o422M704J4078
291H549J0389m686j3301q023J237L336j512j579O495J3785P705p246j6002j2265
305a3118j497M009N617P373P741K677q081j2530o531M368Q297K284m378k146K387
320c528J878m950o859J173J0972J0742q3r015r759m201j77K259O956J1745J0229
335A7382q70j1850j1328k141N417M575P97J534P608N943k922j0802p276L041R060
$$ plain form
350 8168 13777 12081 7122 2656 -95 -2591 -1057 6018 14738 17608 9805 -1817 -8410 -9271 -9115
365 -9115 -8595 -4723 4118 12284 10667 -1441 -14841 -19773 -16436 -9978 -6409 -3355 -289 -1146 -6795
380 -6795 -13769 -14279 -7457 -1051 -968 -5994 -8575 -7584 -6206 -7322 -7218 -2 10264 15376 9319 -2081
396 -2081 -9361 -8526 -3334 3088 10887 17963 20436 15320 5563 -1374 -816 4150 8191 9376 11432 13886
412 13886 12975 6042 -916 -919 5604 12027 10304 3391 -3339 -5667 -6337 -6261 -3502 3024 8922 6640 -3276
429 -3276 -14101 -18297 -16314 -12707 -9412 -4655 1074 3588 -2238 -12390 -19010 -17235 -10076 -4694 -2854
444 -2854 -2922 -3096 -4000 -6428 -7185 -3175 3603 7576 5370 102 -3094 -2822 -978 1608 7077 14789 20547
461 20547 17601 7594 -1736 -3520 665 5775 10768 14559 17895 16728 9194 -58 -3787 -368 5429
$$ packed form
350H168N609j696m959m466k751k496J534P075Q720K870p803j1622o593q61J56
365i115N20L872Q841Q166j617j2108j3400m932L337O458L569L054L066q57n649
380f795o974n10O822O406Q3n026k581R91J378j116J04P216J0266N112o057j1400
396b081p280Q35N192O422P799P076K473n116r757o937N58M966M041J185K056K454
412A3886r11o933o958lO523O423j723o913o730k328o70P6K759O526N898k282r916
429c276j0825m196J983L607L295M757N729K514n826j0152o620J775P159N382J840
444b854o8j74r04k428p57M010O778L973k206n268l196K72J844K586N469P712N758
461B0547k946j0007r330j784M185N110M993L791L336j167p534r252l729L419N797
$$ plain form
476 5429 6981 5387 3276 1774 -552 -3968 -5789 -2937 2511 3797 -1182 -9453 -14607 -14995 -12318
491 -12318 -8405 -3861 1127 2750 -2589 -11757 -18380 -18098 -13381 -7261 -2311 1019 3135 1180 -4304
506 -4304 -9700 -9428 -3329 2548 4141 2983 2287 2612 2062 1117 3098 8588 14325 14393 8376 875 -1887
523 -1887 463 5240 9304 13463 16526 16036 9926 710 -4458 -4265 210 4619 7869 8301 7251 3419
539 3419 -3164 -8185 -7455 -2845 728 -459 -4415 -7300 -8603 -8819 -8333 -5879 -2104 399 -2241 -8998
555 -8998 -14645 -15224 -12242 -7418 -3310 1829 5497 4199 -2916 -11178 -13641 -8787 -847 4617 6326
570 6326 6203 5336 3688 1248 -492 1260 6020 9235 8269 5672 3504 3120 3568 5299 8819 12803
586 12803 13957 9001 1073 -5139 -4724 -26 5820 8473 9527 8566 4780 -1800 -7784 -9081 -6216
$$ packed form
476E429J552j594k111j502k326l416j821K852N448J286m979q271n154l88K677
491a2318L913M544M988J623n339r168o623K82M717O120M950L330K116j955n484
506d304n396K72O099N877J593j158o96L25n50r45J981N490N737O8o017p501k762
523a887K350M777M064M159L063m90o110r216n168J93M475M409L250M32j050l832
539C419o583n021P30M610L573j187l956k885j303k16M86K454L775K503k640o757
555h998n647n79K982M824M108N139L668j298p115q262k463M854P940N464J709
570F326j23q67j648k440j740J752M760L215r66k597k168l84M48J731L520L984
586A2803J154m956p928o212M15M698N846K653J054r61l786o580n984j297K865
$$ plain form
601 -6216 -1691 1120 1301 797 -2090 -5562 -9619 -9904 -5935 -340 546 -4534 -10098 -12119 -9649 -5375
617 -5375 -1897 257 1158 1535 -1610 -7172 -10971 -10309 -5479 480 5586 9336 8625 3651 -2657 -6350
633 -6350 -4652 1188 6646 8336 6627 4446 4247 4093 3594 3277 5349 6987 6460 3479 105 -1413
649 -1413 -433 2662 6325 9306 10144 6945 -646 -8633 -10808 -6205 1147 5507 5671 3792 1208 -2259
665 -2259 -5913 -8945 -9236 -5710 -546 1908 795 -2118 -5061 -7269 -6179 -3166 864 1838 -1116 -6165
681 -6165 -8769 -7409 -2980 1598 3792 3978 3146 1397 -2214 -6122 -7118 -3847 1739 6102 8635 7450
697 7450 4022 -678 -3998 -3455 738 5550 7213 4907 613 -923 903 2794 3724 3688 4312 4569 3066
714 3066 -614 -4445 -5519 -2558 3205 7994 8692 6194 416 -6318 -9497 -7353 -2188 2328 3910
$$ packed form
601f216M525K811J81n04k887l472m057k85L969N595Q86n080n564k021K470M274
617e375L478K154R01L77l145n562l799O62M830N959N106L750p11m974o308l693
633f350J698N840N458J690j709k181j99j54m99l17K072J638n27k981l374j518
649a413R80L095L663K981Q38l199p591p987k175M603P352M360J64j879k584l467
665b259l654l032k91L526N164K454j113k913k943k208J090L013M030R74k954n049
681f165k604J360M429M578K194J86q32j749l611l908r96L271N586M363K533j185
697G450l428m700l320N43M193M812J663k306m294j536J826J891R30l6O24K57j503
714C066l680l831j074K961N763M789O98k498n778o734l179K144N165M516J582
$$ plain form
729 3910 3206 1726 -505 -2280 -4370 -5788 -5057 -1894 748 479 -1719 -4116 -4437 -2913 -143 3296
745 3296 3237 201 -4892 -8345 -8256 -3305 2242 6181 5770 3198 962 -1219 -4646 -6821 -5802 -1040
761 -1040 4613 8563 8145 3339 -1898 -4950 -3460 -2 3524 5025 3331 814 -1289 -524 1497 2995
777 2995 3879 3948 3502 2850 424 -2855 -4809 -3141 1563 6552 8346 5641 1118 -4029 -6940 -5207
793 -5207 -1446 2442 3678 2333 -1 -1695 -1860 -1566 -1899 -2103 -1546 452 696 -1802 -4835 -6517 -4433
810 -4433 699 5424 5845 1424 -4518 -8237 -8984 -5895 -1556 2979 5257 4407 2680 220 -2891 -5963
826 -5963 -6567 -4071 993 5647 6575 4066 -272 -2050 -1631 925 3491 3852 1964 -814 -1679 -566
842 -566 2334 4669 5702 5141 3735 1990 -657 -2425 -4171 -3454 1362 6218 9218 7547 1472 -4539
$$ packed form
729C910p04j480k231j775k090j418P31L163K642k69k198k397l21J524K770L439
745C296n9l036n093l453Q9M951N547L939m11k572k236k181l427k175J019M762
761a040N653L950m18m806n237l052J490L458L526J501j694k517k103P65K021J498
777B995Q84O9m46o52k426l279j954J668M704M989J794k705m523n147k911J733
793e207L761L888J236j345k334j694j65K94l33k04N57J998K44k498l033j682K084
810d433N132M725M21m421n942l719p47L089M339M535K278q50j727k460l111l072
826e963o04K496N064M654R28k509m338j778M19K556K566L61j888k778q65J113
842e66K900K335J033n61j406j745k647j768j746P17M816M856L000j671o075o011
$$ plain form
858 -4539 -7129 -4879 -685 2040 3034 2265 951 -678 -2218 -3009 -3211 -2239 -1237 449 524 -1484 -4627
875 -4627 -6994 -5135 -1057 2979 4537 2266 -2589 -6739 -7865 -5546 -1867 1355 2647 2654 2346 741
891 741 -1410 -2599 -3523 -2531 298 3204 4339 3016 -125 -2300 -765 3118 6298 5774 2685 -1703
907 -1703 -3173 -1844 550 3306 5365 6542 6048 4207 606 -2969 -5442 -5055 -1047 4227 7540 6992
923 6992 3444 -2041 -5348 -5081 -2671 -291 700 73 -689 -998 -1172 -1458 -1882 -1532 -1201 -764 -1140 -2638
941 -2638 -4640 -5621 -4376 -496 3503 5233 2780 -2013 -6452 -7353 -4388 -654 2326 3130 3175 2591 1190
958 1190 -733 -2993 -3313 -1779 1590 4167 4403 2036 -971 -2067 -1183 1823 5101 5424 3602 -84
974 -84 -2482 -2837 -1443 1048 3054 4282 4628 4045 1982 -1605 -4726 -4707 -2147 1568 4551 4821 2971
$$ packed form
858d539k590K250M194K725R94p69j314j629j540p91k02R72J002J686P5k008l143
875d627k367J859M078M036J558k271m855m150j126K319L679L222J292Pl08j605
891G41k151j189r24R92K829K906J135j323l141k175J535L883L180n24l089m388
907a703j470J329K394K756K059J177m94j841l601l575k473L87M008N274L313n48
923F992l548n485l307K67K410K380R91o27p62l09j74k86m24L50L31M37l76j498
941b638k002r81J245L880L999J730k453m793m439r01K965L734K980Q04M5n84j401
958A190j923k260l20J534L369K577K36k367l007j096Q84L006L278L23j822l686
974h4k398l55J394K491K006J228L46n83k063l587l121J9K560L715K983K70j850
$$ plain form
991 2971 -738 -3136 -3061 -1075 1114 838 -307 -2370 -2781 -1610 -371 79 682 1467 1334 866 -1953
1008 -1953 -5339 -6535 -4690 -230 4563 6220 4599 448 -3824 -6127 -5472 -2796 222 2353 3035
1023 3035 2709 1533 -146 -1852 -2587 -2354 -70 1675 2400 1023 -758 -2176 -934 1451 3766 4342
1039 4342 2733 -675 -3432 -3858 -1551 1230 3780 4486 4108 3460 1773 -468 -3215 -3829 -1859 2170
1055 2170 5062 4945 2212 -526 -2278 -1537 391 1867 2404 1058 -595 -2133 -2406 -1824 -365 928
1071 928 1933 2232 959 -1652 -4426 -6296 -5752 -2780 1390 4090 3464 642 -2821 -5492 -5322 -3668
1087 -3668 -1755 -55 564 400 -157 -357 -922 -1205 -1412 -39 1127 1645 95 -1992 -2613 -802 2650
1104 2650 5352 6204 4000 740 -1699 -2514 -1919 348 3069 5625 6644 5670 3092 614 -2021 -2436
$$ packed form
991B971l709k398P5J986K189k76j145k063m11J171J239M50O03P85j33m68k819
1008a953l386j196J845M460M793J657j621m151m272k303O55K676L018K131O82
1023C035l26j176j679j706p35K33K284J745P25j377j781j418J242K385K315N76
1039D342j609l408k757m26K307K781K550P06l78o48j687k241k747o14J970M029
1055B170K892j17k733k738j752P41J928J476N37j346j653j538k73N82J459J293
1071I28J005K99j273k611k774j870N44K972M170K700o26k822l463k671J70J654
1087c668J913J700O19j64n57k00n65k83k07J373J166N18j550k087o21J811L452
1104B650K702Q52k204l260k439q15N95K267K721K556J019r74k578k478k635m15
$$ plain form
1120 -2436 -1085 1455 3860 4686 3019 352 -1585 -1428 -319 1102 1482 196 -1425 -3338 -3739 -2847
1136 -2847 -1681 -199 824 925 157 -2183 -4739 -6561 -6373 -3814 -114 2357 2609 176 -3014 -4726
1152 -4726 -4197 -2671 -1096 380 836 1046 657 -223 -576 -254 1620 3138 3282 2608 1081 -665 -1664
1169 -1664 -487 2283 5692 7122 5780 3038 -280 -1799 -2199 -702 1462 3321 4878 4345 2531
1184 2531 101 -1675 -2818 -1915 -801 599 1589 432 -1597 -3283 -2987 -1377 524 376 -1027 -3455
1200 -3455 -4561 -4865 -4391 -2895 -976 1190 1964 1385 -1579 -3879 -5297 -4913 -2614 732 3048 3721
1216 3721 2469 293 -1156 -1702 -775 995 2413 2531 2372 1934 1309 640 1231 2495 3810 3924 3013
1233 3013 934 -986 -1862 -1408 824 3105 5110 4459 1451 -1271 -3576 -3493 -2861 -1371 365 1223 1712
$$ packed form
1120b436J351K540K405Q26j667k667j937J57J109J421L80j286j621j913m01Q92
1136b847J166J482J023J01p68k340k556j822J88K559L700K471K52k433l190j712
1152d726N29J526J575J476M56K10l89q80l53L22J874J518J44o74j527j746r99
1169a664J177K770L409J430j342k742l318j519m00J497K164J859J557n33j814
1184B531k430j776j143R03J114J400R90j157k029j686K96J610J901j48j403k428
1200c455j106l04M74J496J919K166P74n79k964k300j418L84K299L346K316O73
1216C721j252k176j449n46R27J770J418J18j59m38o25o69N91J264J315J14r11
1233C013k079j920q76M54K232K281K005o51l008k722k305Q3O32J490J736Q58M89
$$ plain form
1250 1712 696 -1476 -3170 -3760 -2555 -1134 -389 -680 -1701 -2491 -3038 -2315 -994 845 1567 1320 -536
1267 -536 -2456 -3672 -3201 -1237 1054 3308 4563 4262 2214 -345 -2122 -2072 -556 1720 3728 4173
1283 4173 3783 2112 413 -272 375 1673 2187 1850 727 -266 -616 -774 -206 934 2237 2157 1304 -1207
1301 -1207 -3987 -4927 -3794 -1698 -64 1583 1581 455 -1812 -3830 -5083 -4299 -2421 -412 361 718 124
1318 124 -1009 -1978 -2076 -1282 370 904 764 -65 -800 -1102 -328 1317 3107 4298 4213 2589 123 -1471
1336 -1471 -1259 -43 2209 4209 5340 4651 3230 932 -1297 -1713 -781 1417 2110 2342 1426 513 -321
1353 -321 -1357 -1570 -829 -26 129 -1142 -2977 -3709 -3965 -2571 -745 593 872 119 -2141 -4440 -5392
1370 -5392 -4816 -3159 -746 1108 1939 1221 -517 -2208 -3133 -2944 -1255 934 2104 1757 1278 462 783
$$ packed form
1250A712j016k172j694n90J205J421P45k91j021p90n47P23J321J839P22k47j856
1267e36j920j216M71J964K291K254J255l01k048k559j777N0J516K276K008M45
1283D173l90j671j699o85O47J298N14l37j123r93l50j58N68J140J303q0q53k511
1301a207k780r40J133K096J634J647kj126k267k018j253P84J878K009P73L57n94
1318A24j133r69r8P94J652N34j40q29p35l02P74J645J790J191q5j624k466j594
1336a471K12J216K252K000J131o89j421k298k229m16R32K198O93K32r16r13q34
1353c21j036k13P41Q03J55j271j835p32k56J394J826J338K79p53k260k299r52
1370e392N76J657K413J854Q31p18j738j691r25J89J689K189J170l47m79q16L21
$$ plain form
1387 783 911 1871 2696 2973 3066 1411 208 56 786 2096 3806 4227 4251 3340 1258 -1297 -2076 -1495 587
1406 587 2874 3910 3281 1396 -500 -2038 -2188 -2171 -1404 -414 -162 -883 -1350 -2463 -2796 -2392 -1669 -825
1424 -825 -554 -1390 -3131 -4470 -4544 -2963 -669 1046 1625 753 -560 -2352 -3572 -3266 -1968 292 2239
1441 2239 2919 2596 1809 557 -425 -428 724 1875 3032 2974 1926 814 457 1642 3073 3553 3407 2369
1459 2369 655 -222 -768 -681 473 2003 3216 3114 1991 16 -2407 -3884 -3363 -1851 372 1100 1067
1476 1067 -93 -1644 -2416 -2590 -2753 -2020 -1216 -1144 -1452 -1892 -2215 -1880 -1411 -243 357 473 -123 -1585 -2526
1495 -2526 -2989 -2027 440 2716 3660 2785 1126 -205 -977 -876 -332 1138 2304 3352 3545 2415 894
1512 894 162 281 721 1864 2466 1843 708 -646 -758 -31 1477 2097 2219 1069 -590 -1624 -2436 -2730
$$ packed form
1387G83J28R60Q25K77R3j655j203j52P30J310J710M21K4r11k082k555p79N81K082
1406E87K287J036o29j885j896j538j50J7P67R90K52p21m67j113l33M04P23Q44
1424h25K71q36j741j339p4J581K294J715N79q72j313j792j220L06J298K260J947
1441B239O80l23p87j252r82lJ152J151J157n8j048j112l57J185J431M80j46j038
1459B369j714q77n46Q7J154J530J213j02j123j975k423j477N21J512K223P28l3
1476A067j160j551p72j74j63P33Q04P2l08m40l23L35M69J168O00J16n96j462r41
1495b526m63R62K467K276R44q75j659j331p72J01N44J470J166J048J93j130j521
1512H94p32J19M40J143O02o23j135j354j12P27J508O20J22j150j659j034q12k94
$$ plain form
1530 -2730 -2162 -321 1136 1708 984 -513 -2526 -3872 -3790 -2981 -1261 386 598 -287 -1341 -1796 -1268
1547 -1268 -742 -17 30 -446 -321 -372 -944 -375 415 1310 2772 2959 2371 232 -1863 -2027 -751 1233 3359
1566 3359 4312 3712 2064 643 -498 -756 -516 171 1240 1971 2204 1455 328 -739 -1498 -709 56 432
1584 432 46 -1292 -2140 -2485 -1977 -718 671 727 -401 -1639 -2918 -3304 -3057 -2250 -926 177 1508
1601 1508 1440 245 -1184 -2872 -2411 -1115 857 1476 1610 904 106 161 413 1415 1944 2036 1663 1184 432
1620 432 -160 48 842 1879 3447 4169 3158 1127 -856 -1873 -1689 -100 1300 2506 2267 1066 -236
1637 -236 -1325 -1890 -1685 -1645 -1209 -596 -647 -808 -1253 -1596 -2028 -1519 -509 -362 -830 -2177 -3698 -3301 -2173
1656 -2173 -128 977 1372 1014 -25 -1459 -1806 -2132 -1383 -45 1552 3199 3255 2431 845 -328 -699
$$ packed form
1530b730N68J841J457N72p24j497k013j346Q2Q09J720J647K12q85j054m55N28
1547a268N26P25M7m76J25n1n72N69P90Q95J462J87n88k139k095j64J276J984K126
1566C359R53o00j648j421j141k58K40O87J069P31K33p49j127j067p59P89P65L76
1584D32l86j338q48l45N08J259J389N6j128j238j279l86K47Q07J324J103J331
1601A508o8j195j429j688M61J296J972O19J34p06p98N5K52J002N29R2l73m79p52
1620D32n92K08P94J037J568P22j011k031j983j017J84J589J400J206k39j201j302
1637b36j089n65K05M0M36O13n1j61m45l43m32N09J010J47m68j347j521L97J128
1656b173K045J105L95l58j039j434l47l26P49J338J597J647N6q24j586j173l71
$$ plain form
1673 -699 505 2060 2616 2778 1779 1322 1009 1372 1569 2047 2269 1884 1018 -9 -517 -748 -377 591 1684
1692 1684 2080 1783 228 -1937 -3329 -3266 -2048 -444 575 -113 -950 -1708 -2240 -2191 -2324 -1579 -1350 -1019
1710 -1019 -933 -1363 -1679 -1971 -1440 -253 916 1159 997 -595 -2214 -2340 -1518 706 2265 3255 2913 2381
1728 2381 1244 334 -363 -390 264 1913 3209 3380 2898 1569 524 303 451 1559 1998 1672 428 -565
1746 -565 -398 290 894 1063 775 -50 -748 -1536 -2461 -2552 -2392 -966 529 1293 466 -892 -2603 -3570 -3666
1765 -3666 -2375 -749 138 130 -266 -874 -1405 -1259 -1102 -685 113 501 628 100 -256 -335 -128 1202 1959 2596
1785 2596 2341 1267 -358 -1112 -651 905 2237 3142 2547 1871 1329 374 -58 -406 -211 563 1318 1414 1199
1804 1199 -215 -818 -1171 -492 177 510 -171 -1387 -2077 -2393 -1435 -540 150 514 87 -856 -1734 -2420 -2935
$$ packed form
1673f99J204J555N56J62r99m57l13L63J97M78K22l85q66j027n08k31L71R68J093
1692A684L96k97j555k165j392O3J218J604J019o88q37p58n32M9j33P45K29L31
1710a019Q6m30l16k92N31J187J169K43j62j592j619j26Q22K224J559R90l42n32
1728B381j137r10o97k7O54J649J296J71m82j329j045k21J48J108M39l26j244r93
1746e65J67O88O04J69k88q25o98p88r25r1J60J426J495P64q27j358j711r67r6
1765c666J291J626Q87ql96o08n31J46J57M17P98L88J27n28l56p9K07J330P57O37
1785B596k55j074j625p54M61J556J332R05n95o76n42r55m32l48J95P74P55R6k15
1804A199j414o03l53O79O69L33o81j216o90l16R58Q95O90L64m27r43q78o86n15
$$ plain form
1823 -2935 -2513 -1419 94 1222 1754 500 -676 -1674 -1949 -1097 81 932 1467 1031 600 560 621 1161
1841 1161 985 1216 1001 1075 891 337 -15 19 1422 2674 2972 2268 689 -969 -1684 -1405 -244 960
1859 960 1572 1436 859 -319 -1336 -1968 -1911 -1414 -684 -205 -103 -245 -1224 -1845 -2022 -1437 -141 -309 -607
1878 -607 -1474 -2016 -1974 -1857 -586 899 1213 1187 385 -444 -795 -1047 -756 -218 1182 2254 2826 2450 1077
1897 1077 74 89 573 1531 1789 1717 1439 843 797 1063 1245 1362 1486 1448 914 -293 -1180 -1486 -1009 0
1917 0 1222 1758 923 -275 -2045 -2880 -3209 -2142 -1284 -386 -157 -326 -839 -1724 -2403 -1935 -1702 -1529 -958
1936 -958 -704 -654 -737 -1170 -993 -355 548 1390 720 113 -930 -814 -92 729 1938 2503 2688 2252 1468 636
1956 636 149 276 978 2048 2721 2549 2362 1229 574 220 447 1051 1300 1191 74 -457 -920 -686 -155
$$ packed form
1823b935M22J094J513J128N32j254j176r98k75Q52J178Q51N35m36m31m0O1N40
1841A161j76K31k15P4j84n54l52L4J403J252K98p04j579j658p15K79J161J204
1859I60O12j36n77j178j017o32N7M97P30M79J02j42r79o21j77N85J296j68k98
1878f07q67n42M2J17J271J485L14k6q02q29l51k52K91N38J400J072N72l76j373
1897A077j003J5M84R58K58p2k78n96m6K66J82J17J24l8n34j207q87l06M77J009
1917@J222N36q35j198j770q35l29J067Q58Q98K29j69n13q85o79M68K33J73N71
1936i58K54N0q3m33J77O38R03Q42o70o07j043J16P22Q21J209N65J85m36p84q32
1956F36m87J27P02J070O73j72j87j133o55l54K27O04K49j09j117n31m63K34N31
$$ plain form
1975 -155 51 539 145 -677 -1911 -2651 -2757 -2582 -1764 -931 66 -97 -699 -1750 -3204 -3179 -2418 -1355 -532
1994 -532 -454 -337 -358 -464 -1272 -801 -120 152 424 691 378 53 289 775 1471 2347 3268 2555 1338 503
2014 503 281 526 1383 2249 3166 3290 2910 1660 539 -226 -330 -133 783 1494 1366 883 368 -549 -1089
2033 -1089 -1039 -520 -452 -615 -1576 -2159 -2597 -1936 -1586 -1091 -559 -979 -1207 -2092 -3166 -3036 -2389 -1626 -478 545
2053 545 470 -17 -699 -1549 -1395 -1202 -122 690 1312 1143 1156 912 1116 885 1543 1888 1665 1719 1149 723 638
2074 638 1176 1573 2140 2612 2487 1716 210 -812 -702 -43 757 1362 1344 1046 202 -348 -1132 -1726 -1376 -988
2094 -988 -639 -648 -846 -1360 -1762 -1794 -1290 -942 -994 -993 -1617 -1978 -2051 -1812 -1195 -74 298 673 322 -347 -1220 -1367
2116 -1367 -1193 -334 933 1706 1793 1766 1046 319 -247 411 939 1524 1583 1567 1215 1099 612 875 1350 1299 1304 1115
$$ packed form
1975a55K06M88l94q22j234p40j06J75Q18Q33R97j63o02j051j454K5P61J063Q23
1994e32P8J17k1j06q08M71O81K72K72K67l13l25K36M86O96Q76R21p13j217q35
2014E03k22K45Q57Q66R17J24l80j250j121p65j04J97R16P11j28m83n15r17n40
2033a089N0N19O8j63r61n83m38O61L50M95N32m20k28q85j074J30O47P63J148J023
2053E45p5m87o82q50J54J93J080Q12O22j69J3k44K04k31O58L45k23N4n70m26q5
2074F38N38L97N67M72j25p71j506j022J10O59Q00O05j8k98q44n50p84n94L50L88
2094i88L49rj98n14m02l2N04L48n2Jo24l61p3K39O17J121L72L75l51o69q73j47
2116a367J74Q59J267P73Q7k7p20p27n66O58N28N85N9j6l52j16m87K63M75n1Nj89
$$ plain form
2138 1115 417 -313 -910 -468 408 893 1293 675 17 -871 -1890 -1748 -1458 -914 -550 248 30 -503 -979
2157 -979 -1728 -1768 -1378 -974 -520 -407 -839 -851 -758 -404 -160 156 303 773 47 -502 -921 -549 20 1026 1557
2178 1557 2163 1755 855 291 -283 -272 226 974 1798 1817 1546 927 456 32 115 259 569 113 254 -275 -569
2199 -569 -486 -188 10 155 348 -155 -965 -1794 -1774 -1888 -708 -410 438 399 62 -860 -1494 -2025 -1847 -629
2219 -629 45 669 797 170 -237 -342 -278 -165 368 549 770 452 410 355 594 948 1144 1368 1491 989 293
2240 293 -304 -473 4 730 1444 1669 1253 838 -184 -827 -1219 -848 -70 376 301 43 -185 -463 -949 -964
2260 -964 -827 -512 -504 -915 -1139 -1756 -1513 -639 -114 66 442 -81 -60 -1005 -1644 -1194 -324 274 1061 1041 1079 375
2282 375 -192 -799 -695 -200 641 1035 1030 903 469 320 484 746 734 1182 995 242 70 -255 159 376 1049
$$ packed form
2138A115o98p30n97M42Q76M85M00o18o58q88j019J42K90N44L64P98k18n33m76
2157i79p49m0L90M04M54J13m32j2R3L54K44L16J47M70p26n49m19L72N69J006N31
2178A557O06m08r00n64n74J1M98P48Q24J9k71o19m71m24Q3J44L10m56J41n29k94
2199e69Q3K98J98J45J93n03q10q29K0j14J180K98Q48l9l37r22o34n31J78J218
2219f29O74O24J28o27m07j05O4J13N33J81K21l18m2n5K39L54J96K24J23n02o96
2240B93n97j69M77P26P14K25m16m15j022o43l92L71P78M46p5k58k28k78m86j5
2260i64J37L15Qm11k24o17K43Q74N25J80L76n23K1r45o39M50Q70N98P87k0L8p04
2282C75n67o07J04M95Q41L94nj27m34j49J64K62j2M48j87p53j72l25M14K17O73
$$ plain form
2303 1049 1185 938 484 -181 -1224 -1378 -813 -398 543 555 482 -182 -477 -1224 -1359 -1225 -806 -155 -127 -379
2323 -379 -415 -746 -601 -378 -402 -110 273 -283 -945 -1097 -970 -222 258 576 1166 834 360 -438 -936 -1061 -265
2344 -265 766 1165 1321 1029 928 212 -45 -98 -200 306 1027 577 588 -78 -226 280 579 379 454 -38 -478
2365 -478 -349 -1079 -700 -19 294 807 591 166 -250 -1002 -1601 -1245 -978 1 789 199 7 -394 -665 -1108
2385 -1108 -948 -354 -49 124 -73 -411 -448 -195 118 267 193 431 295 -45 -620 -847 -695 534 1171 1097
2405 1097 792 486 -101 -593 -696 -365 388 523 966 722 375 154 -136 -269 -277 135 683 574 -214 -559
2425 -559 -415 5 405 732 775 139 -472 -491 -1084 -758 -673 -1 838 465 496 92 -326 -844 -1082 -593 87
2446 87 459 728 272 -358 -171 -181 -113 -56 33 100 412 -571 -516 -331 438 574 737 532 186 -77 -849 -1157
$$ packed form
2303A049J36k47m54o65j043j54N65M15R41J2p3o64k95p47j35J34M19O51K8k52
2323c79l6l31J45K23k4K92L83n56o62j52J27P48M80L18N90l32m74p98m98j25P96
2344b65J031L99J56k92j01p16k57n3j02N06P21m50J1o66j48N06K99k00P5m92m40
2365d78J29p30L79O81L13N13k16m25m16p52n99L56K67R79P88n90j92m01k71m43
2385a108J60N94L05J73j97l38l7K53L13J49p4K38j36l40n75k27J52J229O37p4
2405A097l05l06n87m92j03L31P53J35M43k44l47k21k90j33qM12N48j09p88l45
2425e59J44M20M00L27M3o36o11j9n93L26Q5O72Q39l73L1m04m18n18k38M89O80
2446H7L72K69m56o30J87j0O8N7Q9O7L12r83N5J85P69J36J63k05l46k63p72l08
$$ plain form
2468 -1157 -795 -161 1101 1180 888 153 16 -577 -541 -930 -203 70 435 442 -97 35 -20 83 -430 268 -230
2489 -230 371 311 -315 -787 -368 512 1001 687 411 -210 -823 -673 -1002 -458 524 613 983 618 256 -581 -526
2510 -526 -681 -485 -143 470 596 103 -461 -418 -104 -65 98 72 126 26 -224 -294 -566 -81 702 725 759 240
2532 240 19 -487 -816 -875 -680 420 791 1020 388 -251 -463 -104 -17 -337 87 131 383 449 188 -114 -147
2553 -147 179 46 260 34 -73 -344 -785 -498 -128 1028 932 292 51 -575 -973 -746 -939 -108 241 682
2573 682 692 55 -447 -520 -611 -738 -433 43 704 203 -221 -548 -397 287 741 434 133 -72 -2 -52 -240 -83
2595 -83 103 837 780 655 69 -361 -717 -524 -461 82 860 788 605 -48 -416 -111 71 4 -214 227 -190 -6
2617 -6 -269 -383 -388 188 556 -31 -354 -414 -588 -684 -697 -575 476 825 694 45 -475 -863 -704 -771 -437 4
$$ packed form
2468a157L62O34J262P9k92p35j37n93L6l89P27K73L65Pn39J32n5J03n13O98m98
2489b30O01o0o26m72M19Q80M89l14k76o21o13J50l29N44R82Q9L70l65l62q37N5
2510e26j55J96L42O13J26m93n64M3L14L9J63k6N4j00k50p0k72M85P83K3L4n19
2532B40k21n06l29n9J95J100L71K29o32o39k12L59Q7l20M24M4K52O6k61l02l3
2553a47L26j33K14k26j07k71m41K87L70J156r6o40k41o26l98K27j93Q31L49M41
2573F82J0o37n02p3r1j27L05M76O61n01m24l27J51O84M54l07l01k05P0n0j88J57
2595h3J86P34n7j25n86m30l56J93O3N43P78p2j83o53l68L05J82o7k18M41m17J84
2617fk63j14nN76L68n87l23o0j74r6j3J22J051L49j31o49n20l88J59o7L34M41
$$ plain form
2639 4 474 760 383 103 -352 -747 96 169 340 144 -8 228 45 77 463 855 1003 681 39 -269 75
2660 75 -2 105 151 691 1322 854 424 -546 -684 -529 -421 72 353 647 208 125 -443 -953 68 108 18 -303
2682 -303 -402 -368 -236 -569 -624 -84 52 334 -158 -219 -1123 -751 -723 -423 -90 504 344 308 -308 -512 -646 -647 -213
2705 -213 -241 -109 271 528 26 -407 -301 282 720 465 365 146 -60 -19 10 266 644 1109 733 381 3
2726 3 -204 -173 -98 107 502 880 809 720 -44 -520 -433 -394 149 85 -92 17 -123 -311 -663 -315 96 -84 -165
2749 -165 -749 -948 -426 -518 -576 -178 161 521 150 -507 -513 -857 -412 -278 253 504 575 719 91 -481 -362 194
2771 194 95 244 534 775 572 180 228 -88 274 562 369 664 118 -24 -274 202 288 512 839 941 424
2792 424 -206 -193 -313 -378 -471 -48 199 494 307 -263 -531 -844 -322 -228 -237 -225 -359 -128 -514 -530 -193 -155 209
$$ packed form
2639DM70K86l77k80m55l95Q43P3J71j96j52K36j83L2L86L92J48l22o42l08L44
2660G5p7J07M6N40O31m68m30r70j38J55J08M93K81K94m39q3n68n10J021M0r0l21
2682c03r9L4J32l33n5N40J36K82m92o1r04L72K8L00L33N94j60l6o16k04j34jM34
2705b13k8J32L80K57n02m33J06N83M38k55j00k19k06M1K9K56L78M65l76l52l78
2726Ck07L1P5K05L95L78p1q9p64m76Q7L9N43o4j77J09j40j88l52L48M11j80q1
2749a65n84j99N22r2n8L98L39L60l71o57ol44M45J34N31K51P1J44o28n72J19N56
2771A94r9J49K90K41k03l92M8l16L62K88j93K95n46j42k50M76Q6K24L27J02n17
2792D24o30J3j20o5r3M23K47K95j87n70k68l13N22R4rJ2j34K31l86j6L37L8L64
$$ plain form
2815 209 220 -481 -806 -570 -1001 -665 102 329 447 249 -11 -421 -514 -473 31 142 390 444 616 229 136 -34
2837 -34 69 -137 364 -78 95 91 183 -107 -17 439 320 735 82 -148 -561 -530 -477 192 66 581 741 202
2859 202 -83 -526 -621 -393 -179 25 188 459 244 -67 -543 -581 -405 -27 -137 -400 -330 -395 -157 -418 73
2880 73 353 7 146 153 -301 -434 -333 -392 -11 395 504 910 431 -171 -522 -437 -364 133 187 227 295 202 15
$$ packed form
2815B09J1p01l25K36m31L36P67K27J18j98k60m10r3M1N04J11K48N4J72l87r3j70
2837c4J03k06N01m42J73mR2k90R0M56j19M15o53k30m13L1N3O69j26N15J60n39
2859B02k85m43r5K28K14K04J63K71k15l11m76l8J76L78j10k63P0o5K38k61M91
2880G3K80l46J39Pm54j33J01n9L81M06J09M06m79o02l51Q5P3M97N4M0O8r3j87
$$ [...]
8191a35
##END NTUPLES=NMR FID
##END=
