##TITLE=1H_LR-689-C1
 CDCl3, 40 sc, 
 18.11.2019
##JCAMPDX= 6.0         $$ Bruker NMR JCAMP-DX V2.0
##DATA TYPE= NMR FID
##DATA CLASS= NTUPLES
##ORIGIN= UXNMR, Bruker Analytische Messtechnik GmbH
##OWNER= root
$$ XWIN-NMR		Version 3.5
$$ Mon Nov 18 14:48:13 2019 Russian Standard Time (UT+4h)  she@DPX200
##.OBSERVE FREQUENCY= 200.1315
##.OBSERVE NUCLEUS= ^1H
##.DELAY= (6, 6)
##.ACQUISITION MODE= SIMULTANEOUS
##.ACQUISITION SCHEME= undefined
##.AVERAGES= 8
##.DIGITISER RES= 18
##SPECTROMETER/DATA SYSTEM= spect
##.PULSE SEQUENCE= zg30
##.SOLVENT NAME= CDCl3
##.SHIFT REFERENCE= (INTERNAL, CDCl3, 0, 15.7039)
##AUDIT TRAIL= $$ (NUMBER, WHEN, WHO, WHERE, WHAT)
$$ ##TITLE= Audit trail, XWIN-NMR		Version 3.5
$$ ##JCAMPDX= 5.01
$$ ##ORIGIN= Bruker BioSpin GmbH
$$ ##OWNER= she
$$ F:/spectra/data/she/nmr/H-F/1/audita.txt
$$ ##AUDIT TRAIL=  $$ (NUMBER, WHEN, WHO, WHERE, WHAT)
(   1,<2019-11-18 14:46:54.48 +0400>,<she>,<DPX200>,
      <created by zg, POWCHK disabled, PULCHK disabled
       terminated by command 'halt'
       configuration hash MD5:
       00 E9 B6 7A A2 85 ED C7 34 08 36 98 17 FE 4E 26
       data hash MD5: 16K
       68 EB 43 53 E8 75 36 61 E1 67 02 41 B5 01 82 DC>)
$$ ##END=
$$ 
$$ hash MD5
$$ 6C FE B6 27 87 1E 94 44 C3 F5 BD 7B 1D 34 E3 A2
##$RELAX= 
##$RELAX= 
##$RELAX= 
##$RELAX= 
##$RELAX= 
##$RELAX= 
$$ Bruker specific parameters
$$ --------------------------
##$DU= <F:/spectra>
##$EXPNO= 1
##$NAME= <H-F>
##$PROCNO= 1
##$TYPE= <nmr>
##$USER= <she>
##$AMP= (0..31)
100 100 100 100 100 100 100 100 100 100 100 100 100 100 100 100 100 100 
100 100 100 100 100 100 100 100 100 100 100 100 100 100 
##$AQSEQ= 0
##$AQ_mod= 1
##$AUNM= <au_zg>
##$AUTOPOS= <>
##$BF1= 200.13
##$BF2= 200.13
##$BF3= 200.13
##$BF4= 200.13
##$BF5= 200.13
##$BF6= 200.13
##$BF7= 200.13
##$BF8= 200.13
##$BYTORDA= 1
##$CFDGTYP= 0
##$CFRGTYP= 5
##$CHEMSTR= <none>
##$CNST= (0..31)
1 1 145 1 1 1 1 1 1 1 1 1 1 1 1 1 1 1 1 1 1 1 1 1 1 1 1 1 1 1 1 1 
##$CPDPRG= <>
##$CPDPRG1= <>
##$CPDPRG2= <>
##$CPDPRG3= <>
##$CPDPRG4= <mlev>
##$CPDPRG5= <mlev>
##$CPDPRG6= <mlev>
##$CPDPRG7= <mlev>
##$CPDPRG8= <mlev>
##$CPDPRGB= <>
##$CPDPRGT= <>
##$D= (0..31)
0 1.2 0 0 0 0 0 0 0 0.06 0 0.03 0 0 0 0 0.0002 0 0 0 0 0 0 0 0 0 0 0 0 
0 0 0 
##$DATE= 1574074014
##$DBL= (0..7)
120 120 120 120 120 120 120 120 
##$DBP= (0..7)
150 150 150 150 150 150 150 150 
##$DBP07= 0
##$DBPNAM0= <>
##$DBPNAM1= <>
##$DBPNAM2= <>
##$DBPNAM3= <>
##$DBPNAM4= <>
##$DBPNAM5= <>
##$DBPNAM6= <>
##$DBPNAM7= <>
##$DBPOAL= (0..7)
0.5 0.5 0.5 0.5 0.5 0.5 0.5 0.5 
##$DBPOFFS= (0..7)
0 0 0 0 0 0 0 0 
##$DE= 6
##$DECBNUC= <off>
##$DECIM= 24
##$DECNUC= <off>
##$DECSTAT= 4
##$DIGMOD= 1
##$DIGTYP= 9
##$DL= (0..7)
0 120 120 120 120 120 120 120 
##$DP= (0..7)
150 150 150 150 150 150 150 150 
##$DP07= 0
##$DPNAME0= <>
##$DPNAME1= <>
##$DPNAME2= <>
##$DPNAME3= <>
##$DPNAME4= <>
##$DPNAME5= <>
##$DPNAME6= <>
##$DPNAME7= <>
##$DPOAL= (0..7)
0.5 0.5 0.5 0.5 0.5 0.5 0.5 0.5 
##$DPOFFS= (0..7)
0 0 0 0 0 0 0 0 
##$DQDMODE= 0
##$DR= 18
##$DS= 0
$$ [...]
##$SUBNAM2= <"">
##$SUBNAM3= <"">
##$SUBNAM4= <"">
##$SUBNAM5= <"">
##$SUBNAM6= <"">
##$SUBNAM7= <"">
##$SUBNAM8= <"">
##$SUBNAM9= <"">
##$SW= 24.0689530833862
##$SWIBOX= (0..15)
0 0 2 0 0 0 0 0 0 0 0 0 0 0 0 0 
##$SW_h= 4816.95568400771
##$TD= 16384
##$TD0= 1
##$TE= 0
##$TE2= 300
##$TE3= 300
##$TEG= 300
##$TL= (0..7)
0 120 120 120 120 120 120 120 
##$TP= (0..7)
150 150 150 150 150 150 150 150 
##$TP07= 0
##$TPNAME0= <>
##$TPNAME1= <>
##$TPNAME2= <>
##$TPNAME3= <>
##$TPNAME4= <>
##$TPNAME5= <>
##$TPNAME6= <>
##$TPNAME7= <>
##$TPOAL= (0..7)
0.5 0.5 0.5 0.5 0.5 0.5 0.5 0.5 
##$TPOFFS= (0..7)
0 0 0 0 0 0 0 0 
##$TUNHIN= 0
##$TUNHOUT= 0
##$TUNXOUT= 0
##$USERA1= <user>
##$USERA2= <user>
##$USERA3= <user>
##$USERA4= <user>
##$USERA5= <user>
##$V9= 5
##$VALIST= <valist>
##$VCLIST= <CCCCCCCCCCCCCCC>
##$VD= 0
##$VDLIST= <DDDDDDDDDDDDDDD>
##$VPLIST= <PPPPPPPPPPPPPPP>
##$VTLIST= <TTTTTTTTTTTTTTT>
##$WBST= 1024
##$WBSW= 4
##$XGAIN= (0..3)
0 0 0 0 
##$XL= 0
##$YL= 0
##$YMAX_a= 192902
##$YMIN_a= -112383
##$ZGOPTNS= <>
##$ZL1= 120
##$ZL2= 120
##$ZL3= 120
##$ZL4= 120
##$ABSF1= 10
##$ABSF2= 0
##$ABSG= 5
##$ABSL= 3
##$ALPHA= 0
##$AQORDER= 0
##$ASSFAC= 0
##$ASSFACI= 0
##$ASSFACX= 0
##$ASSWID= 0
##$AUNMP= <proc_1d>
##$AZFE= 0.1
##$AZFW= 0.1
##$BCFW= 1
##$BC_mod= 2
##$BYTORDP= 1
##$COROFFS= 0
##$CY= 11.3945322036743
##$DATMOD= 1
##$DC= 2
##$DFILT= <>
##$DTYPP= 0
##$F1P= 16.9975609425685
##$F2P= -3.02152046262296
##$FCOR= 0.5
##$FTSIZE= 0
##$FT_mod= 4
##$GAMMA= 1
##$GB= 0.15
##$INTBC= 1
##$INTSCL= 1
##$ISEN= 128
##$LB= 0.24
##$LEV0= 0
##$LPBIN= 0
##$MAXI= 10000
##$MC2= 0
##$MEAN= 0
##$ME_mod= 0
##$MI= 1.114404
##$NCOEF= 0
##$NC_proc= 0
##$NLEV= 6
##$NOISF1= 3.799351
##$NOISF2= 2.8
##$NSP= 1
##$NTH_PI= 0
##$NZP= 0
##$OFFSET= 15.70392
##$PC= 1
##$PHC0= -9427.175
##$PHC1= 12.20087
##$PH_mod= 1
##$PKNL= yes
##$PPARMOD= 0
##$PSCAL= 0
##$PSIGN= 0
##$REVERSE= no
##$SF= 200.130013532006
##$SI= 16384
##$SIGF1= 3
##$SIGF2= 2
##$SINO= 400
##$SIOLD= 16384
##$SREGLST= <1H.CDCl3>
##$SSB= 0
##$STSI= 0
##$STSR= 0
##$SW_p= 3612.71676300578
##$SYMM= 0
##$S_DEV= 0
##$TDeff= 0
##$TDoff= 0
##$TI= <>
##$TILT= no
##$TM1= 0
##$TM2= 0
##$TOPLEV= 0
##$USERP1= <user>
##$USERP2= <user>
##$USERP3= <user>
##$USERP4= <user>
##$USERP5= <user>
##$WDW= 1
##$XDIM= 8192
##$YMAX_p= 0
##$YMIN_p= 0
$$ End of Bruker specific parameters
$$ ---------------------------------
##NTUPLES= NMR FID
##VAR_NAME=  TIME,          FID/REAL,        FID/IMAG
##SYMBOL=    X,             R,               I
##VAR_TYPE=  INDEPENDENT,   DEPENDENT,       DEPENDENT
##VAR_FORM=  AFFN,          ASDF,            ASDF
##VAR_DIM=   8192,          8192,            8192
##UNITS=     SECONDS,       ARBITRARY UNITS, ARBITRARY UNITS
##FACTOR=    0.0002076,     1,               1
##FIRST=     0,             0,               0
##LAST=      1.7004516,     0,               0
##MIN=       0,             -112383,         0
##MAX=       1.7004516,     192902,          0
$$ Real data points
##PAGE= N=1
##DATA TABLE= (X++(R..R)), XYDATA
$$ [...]
2061A44K73m22j1M76j61n21M79J42k51r3P24j28o74K20Q33m86r42L50Q09k11m79
$$ 144 417 -5 -16 460 299 -222 257 399 148 55 779 651 -23 197 1030 544 -398 -48 761 550 71
2082G1M45J85k71M38J77j030k1N65L26p76R0O99r4o50J77O23m07p07M11O43m71
$$ 71 516 701 430 868 1045 15 -6 559 885 109 199 898 804 154 331 954 547 -160 251 894 423
2103D23l19N05L36q58K99P2j61n96O03M88p36P4K23N21o90m26L51K38o72L54J
$$ 423 104 609 945 87 386 458 297 -299 304 792 56 130 353 874 184 -242 109 347 -325 29 30
2124C0l44j36O77J31r36K33O13o68p24N59N85m93l47K12N12n35j91L30j40l67
$$ 30 -314 -450 227 358 -578 -345 268 -400 -1124 -565 20 -473 -820 -608 -96 -631 -822 -492 -632 -999
2144i99L38k0M9l76K69K55m31Q9q8K39l40o6M24j40L06k49k14j78K87j1j45k06
$$ -999 -661 -681 -632 -1008 -739 -484 -915 -826 -914 -675 -1015 -1081 -657 -797 -491 -740 -954 -1132 -845 -856 -1001 -1207
2166a207K77N18m68j17L18J77k33M7J66m7j83j01L27j1J36J00p5k8j86RK84ml56
$$ -1207 -930 -412 -880 -997 -679 -502 -735 -688 -522 -569 -752 -853 -526 -537 -401 -301 -376 -404 -590 -581 -297 -301 -657
2189f57J56K39L4k22J22K03L83n27K8L29j2k22J37J19m4O5j8J05j18qL92m88L5
$$ -657 -501 -262 -228 -450 -328 -125 258 -269 -241 88 76 -146 -9 110 66 131 113 218 100 92 484 -4 31
2212C1K92J57l12n4M64K06o84j4M54J92l84j00L60r6l6j20O9k64n0M91jn97N8
$$ 31 323 480 168 114 578 784 100 86 540 732 348 248 608 512 476 356 425 161 111 602 601 4 62
2235F2O35m3p69M42R4j15q0K01J39j50J08l4m05j02K12L92j91l10J11J54k46k56
$$ 62 697 654 -115 327 421 306 226 427 566 416 524 490 85 -17 195 587 396 86 197 351 105 -151
2257a51P57o0m82j21K88l5k59M4M59q73J78L50M22r62l4O37k95m45N97J16K74
$$ -151 606 546 64 -57 231 196 -63 -19 440 -433 -255 95 517 -445 -479 158 -137 -582 15 131 405
2278D05p34J75L13k49n03K55N00o04K92L59l65j96M92J10n01m96Q83J37o02l06
$$ 405 -329 -154 159 -90 -593 -338 162 -442 -150 209 -156 -352 140 250 -251 -747 136 273 -329 -635
2298f35Q58M7k22l70N03l05r0L36k79j0K2M82j69j77L2L28j06o37O29K24k84J8
$$ -635 223 270 48 -322 181 -124 -214 122 -157 -167 -145 337 168 -9 23 351 245 -392 237 461 177 195
2320A95M0O34l12r5K57m63r6K96K99n91p4O71K20n82m78Q09k24m13K49P05n03
$$ 195 235 869 557 462 719 256 160 456 755 164 90 761 981 399 -79 730 506 93 342 1047 544
2341E44k49J78K22n06K93N46l48o47M68L25m01l17N02J83p03rM74R9o47J22J26
$$ 544 295 473 695 189 482 1028 680 33 501 826 425 108 610 793 90 81 555 654 7 129 255
2362B55Q5k55M98l3n03R7K31l63l54J35O38Jq02J92M29j68l43J79L8k89n9K03
$$ 255 340 85 583 550 47 144 375 12 -342 -207 431 432 -370 -178 251 83 -260 -81 -43 -332 -391 -188
2384a88k34L3L65L14n25l11N84l24k87j77L82j16k14K04r9J27J74p7l55P8K06
$$ -188 -422 -389 -24 290 -235 -546 38 -286 -573 -750 -368 -484 -698 -494 -593 -466 -292 -369 -724 -646 -440
2405d40O9j62k84J70M12l06k35L11o5J46l66L43j87K44l9l7j15K1L73m67J8K73
$$ -440 -371 -533 -817 -647 -235 -541 -776 -465 -530 -384 -750 -407 -594 -350 -389 -426 -541 -520 -147 -614 -596 -323
2427c23m7j5o2L67p2k81L1K66j35j24K98j1q4Q6K93l5o00L53L00M7n96L99K46
$$ -323 -370 -385 -447 -80 -152 -433 -402 -136 -271 -395 -97 -108 -192 -106 187 152 -448 -95 205 252 -344 55 301
2450C01m5k71k31N76J49j02m0k00m5K81L28o23K83L46J39n68L9p1mp3R9K10m98
$$ 301 256 -15 -246 330 479 377 337 137 92 373 701 78 361 707 846 278 317 246 242 169 268 478 -20
2473b0M40J59j30n64K97K13m4m83L80J60K6k02K76Q1k23Rl86K71q8J79J43j33
$$ -20 420 579 449 -115 182 395 351 -132 248 408 434 232 508 589 366 375 -11 260 172 351 494 361
2495C61n5J28m13j13R1J91l09J01m5L3M25j99k34L7k24J36j45j4J08K11R7l16
$$ 361 306 434 21 -92 -1 190 -119 -18 -63 -30 395 196 -38 -1 -225 -89 -234 -248 -140 71 168 -148
2517a48k03J47oJ27n69M24N61k30n02J16K64J2k18l10J60P5K50l06K01n9L21o66
$$ -148 -351 -204 -210 -83 -652 -228 333 103 -399 -283 -19 -7 -225 -535 -375 -300 -50 -356 -155 -214 107 -559
2539e59J44qN6k69J62j03M99J49l66Q7Q8L1k05j64K32l26M31K44l23j57L53L64
$$ -559 -415 -423 -367 -636 -474 -577 -78 71 -295 -208 -120 -89 -294 -458 -226 -552 -121 123 -200 -357 -4 360
2561C60m71l6J32j04P5k59L45m6J52k22k7K34r3K19k55K14m9K06J11l62o2R2J81
$$ 360 -111 -147 -15 -119 -44 -303 42 -4 148 -74 -101 133 40 259 4 218 169 375 486 124 62 154 335
2584C35l86J91J97j13K66j57Mp7J76J8o31L43K13J03k68L48n2J86q9m82L83j73
$$ 335 -51 140 337 224 490 333 337 260 436 454 -177 166 379 482 214 562 510 696 607 125 508 335
2606C35k42O1k50K92OJ70k33q7K92L3l91R7J78PK66l53j46K24j4k42l9j4J04J10
$$ 335 93 154 -96 196 202 372 139 52 344 377 -14 83 261 268 534 181 35 259 245 3 -36 -50 54 164
2630A64l61L6J45lp7l60K23J55r2j25NN1J39O9l04R9J16K42m78j6k9L26j30j67
$$ 164 -197 -161 -16 -19 -96 -456 -233 -78 -170 -295 -290 -239 -100 -31 -335 -236 -120 122 -356 -372 -401 -75 -205 -372
2654c72J25J22M8m28J33o4J24P6j16J48Q1m6j98l8q3N02k29q6J87J25Lk07r4J81
$$ -372 -247 -125 -77 -505 -372 -436 -312 -236 -352 -204 -123 -169 -367 -405 -488 14 -215 -301 -114 11 14 -193 -287 -106
2678a06K34l53K12j11K06N8Q5Nk6Q5p9p1l12K94J67K43l62K4P4l3K37p0k09P4
$$ -106 128 -225 -13 -124 82 140 225 230 204 289 210 139 -173 121 288 531 169 193 267 234 471 401 192 266
2702B66K28k22R0j20K97k28k84L10K42j88J04M6N0j98j37K74k02p5L51m15M8Q0
$$ 266 494 272 362 242 539 311 27 337 579 391 495 541 591 393 256 530 328 253 604 189 237 317
2724C17J16j24K09J5L3k71r5K28k26J77j84kj03L38j83r7j68k6L58j53p4K02k06
$$ 317 433 309 518 533 566 295 200 428 202 379 195 193 90 428 245 148 -20 -46 312 159 85 287 81
2747H1Q4J30k62j21L81k64k36k5N81l11l24l25M39j07j36p2N84l73j35q7K47k53
$$ 81 165 295 33 -88 293 29 -207 -232 349 38 -286 -611 -172 -279 -415 -487 97 -276 -411 -498 -251 -504
2769e04L32O0k10l80J04M80j83k44K2P4j04j81m1N3K36J12k87P1M46j74O4k76
$$ -504 -172 -112 -322 -702 -598 -118 -301 -545 -523 -449 -553 -734 -775 -722 -486 -374 -661 -590 -144 -318 -254 -530
2791e30l02L76j46L0K22J1J11l68o6M35J51k00l5K1k18J81L1n0o9R8M77l15l34
$$ -530 -832 -456 -602 -572 -350 -339 -228 -596 -662 -227 -76 -276 -311 -290 -508 -327 -296 -346 -415 -317 160 -155 -489
2814d89R8L96M2l09M29rj75r9m7k05K57n1j06N22n24Q19m73l28K47K75j14j59
$$ -489 -391 5 47 -262 167 158 -17 -116 -163 -368 -111 -162 -268 254 -270 549 76 -252 -5 270 156 -3
2836cr8K37J91m5J04r9K0l35J67k02L72k81K80N7k16k84P12m05Pk6j56J27j21
$$ -3 -101 136 327 282 386 287 307 -28 139 -63 309 28 308 365 149 -135 577 172 179 153 -3 124 3
2859CK06qN1J48k70J04K61n90J02k18K88L74l53m6j59N61m09k2k07J72Q2n8J62
$$ 3 209 201 252 400 130 234 495 -95 7 -211 77 451 98 52 -107 454 45 23 -184 -12 70 12 174
2882A74l9j66R2K9k97l19K67L6P4p1L10n9j5m77K52J06J36k85n5K83O1j57L6O0
$$ 174 135 -31 61 90 -207 -526 -259 -223 -149 -220 90 31 16 -461 -209 -103 33 -252 -307 -24 37 -120 -84 -24
2906b4j31j79K4K32k28K22R5j19J03k70N34k14m28J88j57K37j34R1O00k18p9j18
$$ -24 -155 -334 -310 -78 -306 -84 11 -108 -5 -275 259 45 -383 -195 -352 -115 -249 -158 442 224 145 27
2928B7P2k2j23J1N4K3L3J08J2l1j61M77j11p27M75J32J03j3j45L48J27k91j01
$$ 27 99 77 -46 -35 19 42 75 183 195 164 3 480 369 -358 117 249 352 339 194 542 669 378 277
2951B77l40K74K64J7k73k6K75K46q36M33o4J63k19R1K80K7p0J56j05k55K49j05
$$ 277 -63 211 475 492 219 193 468 714 -122 311 247 410 191 282 562 589 519 675 570 315 564 459
2973D59Q7k71N2j70J45j93M98P2n03J5j0L54L6l18L23k58J06L0l60j98K93k2j64
$$ 459 546 275 327 157 302 109 607 679 176 191 181 535 571 253 576 318 424 454 94 -104 189 167 3
2996CL2J64M2j46j01LJ18k42l3M0Q1L69l19q4O3k29K7N6l08J06K22j17l1l54K49
$$ 3 35 199 241 95 -6 -3 115 -127 -160 -120 -39 330 11 -73 -10 -239 -212 -156 -464 -358 -136 -253 -284 -638 -389
3021c89O2k06J84NK00m75O8P9k37M62j71k9j71K71Q3m28J52K49J63j25k21j39
$$ -389 -327 -533 -349 -344 -144 -619 -551 -472 -709 -247 -418 -447 -618 -347 -264 -692 -540 -291 -128 -253 -474 -613
3043f13N66j37m73J60M2J39K30k23j22P8no0m3O5K43MM9P1m22N61j17k16k0j55
$$ -613 -47 -184 -657 -497 -455 -316 -86 -309 -431 -353 -358 -418 -461 -396 -153 -149 -100 -29 -451 110 -7 -223 -243 -398
3067c98L09l36K97K18L14j13k93l24L04L13k79K66l95N05k96j32J11P4l07K45
$$ -398 -89 -425 -128 90 404 291 -2 -326 -22 291 12 278 -117 388 92 -40 71 145 -162 83
3087H3k26O2K29J63N0k67K93m33L55j96L5m16M75p2j99J29J38o8j45o6N6qQ1J47
$$ 83 -143 -81 148 311 361 94 387 -46 309 113 148 -268 207 135 -64 65 203 135 -10 -76 -20 -28 53 200
3111B00l23N29j00j87Rk51K97l25j73J02K17l9p4r7M05j10R1m29J17N63l45k29
$$ 200 -123 406 306 119 128 -123 174 -151 -324 -222 -5 -44 -118 -215 190 80 171 -258 -141 422 77 -152
3133a52om4K41j84O8j63k06L98k33p8N7N13k46l25L80k60K21j85L42l83J82l69
$$ -152 -158 -202 39 -145 -77 -240 -446 -48 -281 -359 -302 211 -35 -360 20 -240 -19 -204 138 -245 -63 -432
3155d32J85n6j44K41K52l47j90K51L67k15lj14K99k60m3Q4K99k64N1j50N2K09
$$ -432 -247 -303 -447 -206 46 -301 -491 -240 127 -88 -91 -205 94 -166 -209 -125 174 -90 -39 -189 -137 72
3177G2j19J06o7M7r6K67o36K89M20l52o0L25L4j02l7N6K33j59J99n2j91R2O5K24
$$ 72 -47 59 -8 39 -57 210 -426 -137 283 -69 -129 196 230 128 91 147 380 221 420 368 177 269 334 558
3201E58m39j03K36L4o3j88L95M8m08J45J28J57r4j81P2j02J75M41p10J85K76p3
$$ 558 119 16 252 286 223 35 430 478 70 215 343 500 406 225 297 195 370 811 101 286 562 489
3223D89k41r0Q2K99m6k03J67j59o3J84p5n1j30K67K3m59K77k99L79k48r3L30j50
$$ 489 248 158 240 539 493 290 457 298 235 419 344 293 163 430 453 -6 271 -28 351 103 10 340 190
3246A90j53j01L42m4j19J53l72j84K35K93l18K3L14k02k39N9Mj06L11j25j92K91
$$ 190 37 -64 278 234 115 268 -104 -288 -53 240 -78 -55 259 57 -182 -123 -119 -225 86 -39 -231 60
3268F0m7l17J62J57J33l53k7p2P2j35J08k30L27j42J46J6k41J97j99J12K0p4K90
$$ 60 13 -304 -142 15 148 -205 -232 -304 -232 -367 -259 -489 -162 -304 -158 -142 -383 -186 -385 -273 -253 -327 -37
3291c7o5P3J45o60N65k93K58k96K98R5o9l5K87k12k44l98K72K68l7P3k29L87q4
$$ -37 -102 -29 116 -544 21 -272 -14 -310 -12 83 14 -21 266 54 -190 -588 -316 -48 -85 -12 -241 146 62
3314F2m71L18J6J84k73K31k19K44L24m99P1J0p0L8J52j53K47P6k66J04O2P5j35
$$ 62 -409 -91 -75 109 -164 67 -152 92 416 -83 -12 -2 -72 -34 118 -35 212 288 22 126 188 263 128
3337A28n1q7J41J64j25L81n26j1J15j42P0J36n76N93k3J62k3q0O0j29j78m1K06
$$ 128 77 -10 131 295 170 551 25 14 129 -13 57 193 -383 210 187 349 326 246 306 177 -1 -42 164
3360A64Oo2j06K86j84j16j79J99K78l19R5l18M38k67K97l79K76L0l24m1M08m75
$$ 164 170 108 2 288 104 -12 -191 8 286 -33 62 -256 182 -85 212 -167 109 139 -185 -226 182 -293
3382b93M15j99j40M1J70k58n2Q6k59K96P4j08p8J90N8k03K26L2j59J5k55N0K53
$$ -293 122 -77 -217 -176 -6 -264 -316 -230 -489 -193 -119 -227 -305 -115 -57 -260 -34 -2 -161 -146 -401 -351 -98
3405i8K10k48j00K39k32o2j71K05m0K9M5j9K98j19oPk54J45j86J47L1J71Q4k3
$$ -98 112 -136 -236 3 -229 -291 -462 -257 -297 -268 -223 -242 56 -63 -69 -62 -316 -171 -357 -210 -179 -8 76 53
3429E3k17j6P6j71J67n5N4M03j29j40l5nK7p8P5j00K32J11Lj21M03j27o3l28j58
$$ 53 -164 -180 -104 -275 -108 -163 -109 294 165 25 -10 -15 12 -66 9 -91 141 252 255 134 537 410 347 19 -139
3454a39M21N5j26l6K39j13J73k54Q3l26J61J7J69M9n3P4r9k0p4L1Q2k59M2J25
$$ -139 282 337 211 175 414 301 474 220 303 -23 138 155 324 373 320 394 295 275 201 232 314 55 97 222
3478B22L2q1m3k92M47N8k53q3L52k93K38l70K04J25k03j22M04k92j08J68j21O3
$$ 222 254 173 130 -162 285 343 90 7 359 66 304 -66 138 263 60 -62 342 50 -58 110 -11 52
3500E2j37J14K6l04L0o9L21j83n0K08p1Pk24M21k74k22j20l8M66J18n22l8M26
$$ 52 -85 29 55 -249 -219 -288 33 -150 -200 8 -63 -56 -280 141 -133 -355 -475 -513 -47 71 -451 -489 -63
3523f3J88k36k05J37j3j35L74k80K39kj31J4l24K31J9j40J04K7N17n88J95k00
$$ -63 125 -111 -316 -179 -192 -327 47 -233 6 4 -127 -113 -437 -206 -187 -327 -223 -196 321 -267 -72 -272
3545b72Q3K00l03K34j08M06j34J2L1k30L89k92j43n8L15j24j42M0L60k09J94j83
$$ -272 -189 11 -292 -58 -166 240 106 118 149 -81 308 16 -127 -185 130 6 -136 -96 264 55 249 66
3567F6N4O8M2m05L33J98K0R5r5k16R9k55j3o9K13l3M20k48J4m6O2m20n5K13K41
$$ 66 120 188 230 -175 158 356 376 471 376 160 259 4 -9 -78 135 102 522 274 288 242 304 -116 -171 42 283
3592B83K68m51M05m34L9L10J0j79n4j48J09J30k19M43k24j87m8K97k68j58J27
$$ 283 551 100 505 71 110 420 430 251 197 49 158 288 69 512 288 101 53 350 82 -76 51
3613E1J87J99k20K0J38l22J3J64m05P1M4K78l94n1L42O8p4p8j4J00k86K2P7l2
$$ 51 238 437 217 237 375 53 66 230 -175 -104 -60 218 -176 -227 115 183 109 31 17 117 -169 -147 -70 -102
3637a02q5L41n40J60R6j33kl3j18L34P4m66m1J94J64l66J20J55Q6n7o3K66j87
$$ -102 -187 154 -386 -226 -130 -263 -265 -298 -416 -82 -8 -474 -515 -321 -157 -523 -403 -248 -162 -219 -282 -16 -203
3660b03K83m98J26N9O1L05k47p5J49R7q1l97R8J07J88P1n5r0M0j6K38l24l24M64
$$ -203 80 -418 -292 -233 -172 133 -114 -189 -40 57 -24 -421 -323 -216 -28 43 -12 -102 -62 -78 160 -164 -488 -24
3684b4j71m2J28K4r8N40l06J93l90J60k28r0K71p7L37O6J3k06K32l06L6J20MN
$$ -24 -195 -237 -109 -85 -183 357 51 244 -146 14 -214 -304 -33 -110 227 293 306 100 332 26 62 182 186 191
3708A91j89M86r0k92K11n4j92mK0j35J90N3L9p6j65K46k6O7k6k70J49N7p8M2j25
$$ 191 2 488 398 106 317 263 71 67 87 -48 142 195 234 158 -7 239 213 280 254 -16 133 190 112 154 29
3733B9M04n51L31n11M08L52j51o8l42L14m8m48q5L88L8r9k40M02mr1L6l99M07
$$ 29 433 -118 213 -298 110 462 311 243 -99 215 167 -281 -366 22 60 -39 -279 123 119 28 64 -335 72
3756G2K43o26L33l75K39L14k23j49o4R1K5J40j74J26q0j41k1j07J84O4l12J03
$$ 72 315 -311 22 -353 -114 200 -23 -172 -236 -145 -120 20 -154 -28 -108 -249 -270 -377 -193 -129 -441 -338
3778c38L23J76l86J09l6J29K26m77J03j99K49Q1k19M1M27n62L73j76l02L65j88
$$ -338 -15 161 -225 -116 -152 -23 203 -274 -171 -370 -121 -40 -259 -218 209 -353 20 -156 -458 -93 -281
3799b81J13o7N7L75l17J9K29K5j87Q0j72K74j1l22J93j52L32j43M2R4r2k05n5
$$ -281 -168 -235 -178 197 -120 -101 128 153 -34 46 -126 148 137 -185 8 -144 188 45 87 181 89 -116 -171
3822a71oM11j0m7N9k73M37jk63k16M33J25j45j88j64J95J9q0q3J62m2J44j8R2
$$ -171 -177 234 224 177 236 -37 400 399 136 -80 353 478 333 145 -19 176 195 115 32 194 152 296 278 370
3846C70p3K38r9n18j8N09k34o0J05m11L48K03j99j71O5k33K67n3o9k74P17j50
$$ 370 297 535 436 -82 -100 409 175 115 220 -191 157 360 161 -10 55 -178 89 36 -33 -307 410 260
3868B60m48J06N2N1k4r6J19j63M45k48N5k54Q9j14r1j46M56J13m09l7M43j5l42
$$ 260 -188 -82 -30 21 -3 -99 20 -143 302 54 109 -145 -56 -170 -261 -407 49 162 -247 -284 159 144 -198
3891a98J54J66j75q2r5j08L89qj62k23K49k13l0J32r2J95K13n06J1L12J09p6j26
$$ -198 -44 122 -53 -135 -230 -338 51 43 -119 -342 -93 -306 -336 -204 -296 -101 112 -394 -383 -71 38 -38 -164
3914a64m6J63N4J17l05N7R0L4r4k63j7oL90k32r7L79j88J10K16p4k39L8J96m22
$$ -164 -210 -47 7 124 -181 -124 -34 0 -94 -357 -374 -380 10 -222 -319 60 -128 -18 198 124 -115 -77 119 -303
3938c03L89p2J13j51L7M6k23J4k24P62l82J88j66k5M96l76k33L73r4k25J61Q0
$$ -303 86 14 127 -24 13 59 -164 -150 -374 388 6 194 28 3 499 123 -110 263 169 -56 105 185
3960A85M0n6K12k91m7K27pj89p0J14J25J29l86L68m67L33l9P4n10M05M9P7n5k50
$$ 185 225 169 381 90 43 270 263 74 4 118 243 372 -14 354 -113 220 181 255 -255 150 199 276 221 -29
3984b9qL35j72j19l56M46l8n88M24O12j12l58j24Q7K00k00l18R4J95o6K62j00
$$ -29 -37 298 126 7 -349 97 59 -529 -105 507 395 37 -87 0 200 0 -318 -224 -29 -95 167 67
4006F7k22L08k49j26rP0L7J90j60j82L42m92K28M4PJ38n3PJ43m03L84j27l11o0
$$ 67 -155 153 -96 -222 -231 -161 -124 66 -94 -276 66 -426 -198 -154 -147 -9 -62 -55 88 -315 69 -58 -369 -429
4030d29N53p1l41Q0J93K6l09J58j01Q9O7k43P2J17J94J00l09p2K53m9p3N9J03
$$ -429 124 53 -288 -208 -15 11 -298 -140 -241 -152 -85 -328 -256 -139 55 155 -154 -226 27 -22 -95 -36 67
4053F7l2p4r2M7J74j92p7L06J24k92K66l23R5j27L45j51r2L84n27o3J82L30J16
$$ 67 35 -39 -131 -84 90 -102 -179 127 251 -41 225 -98 -3 -130 215 64 -28 356 -171 -234 -52 278 394
4076C94m33L93n38M28K9K20m62J3L93k06L9j61n1J34K1m0j4k08K81m0l3Lk5o8
$$ 394 -39 354 -184 244 273 493 31 44 437 231 270 109 58 192 213 173 159 -49 232 192 159 162 137 69
4100F9J77k91L21Rk22K21k30R8R5j01k68K36L7k74L30k38J17Q3J26l82Q6K42k52
$$ 69 246 -45 276 285 63 284 54 152 247 146 -122 114 151 -123 207 -31 86 169 295 -87 -1 241 -11
4123a1j71Q5J04j12K06p1J1P3J3k34L14l17J14j29J58k63K72K30m35P6l22M08
$$ -11 -182 -97 7 -105 101 30 41 114 127 -107 207 -110 4 -125 33 -230 42 272 -163 -87 -409 -1
4145aK06m84P5Q0j42R5k68M60j44l0k03NJ53Nj18r9O27k69j49K86k15k59K24J30
$$ -1 205 -279 -204 -124 -266 -171 -439 21 -123 -153 -356 -351 -198 -193 -311 -410 217 -52 -201 85 -130 -389 -165 -35
4169c5j57j59M38o7j27Mp0K17k5m56L36j44K88n3k84L40j9L06l93k11J54K80r7
$$ -35 -192 -351 87 20 -107 -103 -173 44 19 -437 -101 -245 43 -10 -294 46 27 333 -60 -271 -117 163 66
4192F6l1J48p3Q4j20K10n09P32p88N55N2k86J16J99q0o9J60k27O5M6n5J9q8J57
$$ 66 35 183 110 194 74 284 -225 507 -281 274 326 40 156 355 275 206 366 139 204 250 195 214 126 283
4216B83l24N8N14m76j03J80n3J71n98P83j28l62K1j18L13j68p6K06j90J51%K10
$$ 283 -41 17 531 55 -48 132 79 250 -348 435 307 -55 -34 -152 161 -7 -83 123 -67 84 84 294
4238B94o3M3k11j04J16k68L45m9J35k18j38L21k72J0K01M3L8k60k2n1j30J01K46
$$ 294 231 274 63 -41 75 -193 152 103 238 20 -118 203 -69 -59 142 185 223 -37 -59 -110 -240 -139 107
4261A07m70L40j81N5j25J04l9R1k06MM30k97J6j08K11J5j78PJ97j84L7r2K64j59
$$ 107 -363 -23 -204 -149 -274 -170 -209 -118 -324 -320 110 -187 -171 -279 -68 -53 -231 -224 -27 -211 -174 -266 -2 -161
4285a61K1J65l93l2L26R2m22n8L39r7J79%l2J62j92j54K05P4j03j61J78p3J8L02
$$ -161 -140 25 -368 -400 -74 18 -404 -462 -123 -220 -41 -41 -73 89 -103 -257 -52 22 -81 -242 -64 -137 -119 183
4309A83k49K7pJ1J39p7J27k72M37j3j16j95k24j42L00L20o2j29J18j77q0J75P3
$$ 183 -66 -39 -46 -35 104 27 154 -118 319 306 190 -5 -229 -371 -71 249 187 58 176 -1 -81 94 167
4332A67j76n8RJ04m9J04Nq2J73J38j36k3k80J83Q2j92M6p1M17j49l93K53oJ33
$$ 167 -9 -67 -58 46 -3 101 106 24 197 335 199 176 -104 79 161 -31 15 -56 361 212 -181 72 66 199
4356A99k85J42K0M9k82K33j70J52J50l05J59N2k90M97m52K98K05l10j04n0k78
$$ 199 -86 56 76 125 -157 76 -94 58 208 -97 62 114 -176 321 -131 167 372 62 -42 -92 -370
4377c70O25k49j28K11l99N21j87N8l17J79J83k55m3K97m04M42l04k45Q9K09J19
$$ -370 255 6 -122 89 -310 211 24 82 -235 -56 127 -128 -171 126 -278 164 -140 -385 -296 -87 32
4398C2k12J22m4p5K31k54J88j04k00L31j98R5j25N9K47l43M80k73j82K06L9k3
$$ 32 -180 -58 -102 -177 54 -200 -12 -116 -316 15 -183 -88 -213 -154 93 -250 230 -43 -225 -19 20 -3
4420ck18J65n2K5M0P3L4k19L85j60k57K88j82M91l52j64L8j2k3O9R4N6J34j36
$$ -3 -221 -56 -108 -83 -43 30 64 -155 230 70 -187 101 -81 410 58 -106 -68 -80 -103 -34 60 116 250 114
4444A14k10M08j24J03l47k4K07J7J45k74M08k31p0Q1l03K53K2K1J86n34J06M77
$$ 114 -96 312 188 291 -56 -80 127 144 289 15 423 192 122 203 -100 153 175 196 382 -152 -46 431
4466D31k62k3j39J80J62k88o8O7J90j54l45N64ok08J05j70q9J89K06l62M55l64
$$ 431 169 146 7 187 349 61 -7 60 250 96 -249 315 309 101 206 36 -53 136 342 -20 435 71
4488G1J05l28j80M07%k67J68K36Nq6k39N2J91k94j5K56k45N5P0n3J34j07j0K1
$$ 71 176 -152 -332 75 75 -192 -24 212 217 131 -108 -56 135 -159 -174 82 -163 -108 -38 -91 43 -64 -74 -53
4512e3l24J24K27j05J59K4k61K56kj50Q3o0l27K95k59K86k2j98J99k4J19j27l12
$$ -53 -377 -253 -26 -131 28 52 -209 47 45 -105 -22 -82 -409 -114 -373 -87 -109 -307 -108 -132 -13 -140 -452
4535d52M73k82Q2P0j5n3j21R6L2L02j83K3oK79o40J00K28P2k60M20j24j30K49
$$ -452 21 -261 -179 -109 -124 -177 -298 -202 -170 132 -51 -28 -34 245 -395 -295 -67 5 -255 165 41 -89 160
4558A60k19K6j83J21K26k61K50K07l29k36L76O2P7k08j71l9L66j88Ol44P23P1
$$ 160 -59 -33 -216 -95 131 -130 120 327 -2 -238 138 200 277 69 -102 -141 225 37 43 -301 422 493
4580D93m69Q4P9p9Jk66M58o6%p3k52L56l23J45j29K20R9j43l4k9K65J87l37J92
$$ 493 24 108 187 108 109 -157 301 235 235 162 -90 266 -57 88 -41 179 278 135 101 72 337 524 187 379
4604C79l09J12l07J94J04j30J76j62p4K6M6M0j06q4j9J42p2k59M50j25k96J98
$$ 379 70 182 -125 69 173 43 219 57 -17 9 55 95 -11 -95 -114 28 -44 -303 147 22 -274 -76
4626g6o4J46k1o7j58R3J5J19r5P7l3J27k90K25P9m45N06l53L72k29j62pj31K2
$$ -76 -140 6 -15 -82 -240 -147 -132 -13 -108 -31 -64 63 -227 -2 77 -368 138 -215 157 -72 -234 -241 -372 -350
4650c50O1L82K77o80J55K24k70J18j61l54N82k97J58%J43j54J10L6j20j47J71
$$ -350 -289 93 370 -310 -155 69 -201 -83 -244 -598 -16 -313 -155 -155 -12 -166 -56 -20 -140 -287 -116
4671a16M63n38J42P0o2j23K02j22J28r3j97J82J44k50N90n73L7j86M08k95L28
$$ -116 347 -191 -49 21 -41 -164 38 -84 44 -49 -246 -64 80 -170 420 -153 -116 -302 106 -189 139
4692A39j67P3Q0K3k72K34L4m01L99r5J74j12R2P0n9n0J79k69J45q8J4m09K23O3
$$ 139 -28 45 125 148 -124 110 144 -257 142 47 221 109 201 271 212 162 341 72 217 129 143 -266 -43 20
4716B0K81j67M5j4j66J99k36K59J90j93k10J52k2J14p0k00L51j74j20k11K45K8
$$ 20 301 134 179 165 -1 198 -38 221 411 218 8 160 138 252 182 -18 333 159 39 -172 73 101
4738A01r4L90j40k61j91K66K95m94l6oJ50j56L21k04j92L79k32L7j33l5J4K11
$$ 101 7 397 257 -4 -195 71 366 -128 -164 -170 -20 -176 145 -59 -251 128 -104 -67 -200 -235 -221 -10
4760a0N2k61l5L7J47j95L01Oj97P7p4OJ74r7o7J77j63J25j3k36J02J13o5OP0j51
$$ -10 42 -219 -254 -217 -70 -265 36 42 -155 -78 -152 -146 28 -69 -136 41 -122 3 -10 -246 -144 -31 -96 -90 -20 -171
4786a71J70j39m2K80n79K81N09l54j73J13K47l35K42O2K20o59L86k64K07J47j23
$$ -171 -1 -140 -182 98 -481 -200 309 -45 -218 -105 142 -193 49 111 331 -328 58 -206 1 148 25
4807B5j66K21q4l09K41K17j77Q1j53Pn1R5K54r6L93m39k57J19J05L50l87M8K17
$$ 25 -141 80 -4 -313 -72 145 -32 49 -104 -97 -148 -53 201 105 498 59 -198 -79 26 376 -11 37 254
4830B54j13p2n0J70l26o4J95J7K53o0P8l2r5N9R8k43j10K14O3J05m09J89N6j96
$$ 254 141 69 19 189 -137 -201 -6 11 264 204 282 250 155 214 312 69 -41 173 236 341 -68 121 177 -19
4854a9J23Rj06j04J33R5J31k81m8K52Rk9PJ11l81P1J14J41m82K58K0p5j0k8K45
$$ -19 104 113 7 -97 36 131 262 -19 -67 185 194 165 172 283 -98 -27 87 228 -254 4 24 -51 -61 -89 156
4879A56k21o5k1J15k87M23n00L60O6j05K76j88m6K2j03R0k95J31L18k69N2j45
$$ 156 -65 -130 -151 -36 -323 100 -400 -40 26 -79 197 9 -37 -15 -118 -28 -323 -192 126 -143 -91 -236
4901b36j36J40J97l6j81L64l01OJ54k39M79l03O9k67J08L1K02r4N2p6k0J43l2
$$ -236 -372 -232 -35 -71 -252 112 -189 -183 -29 -268 211 -92 -23 -290 -182 -151 51 -43 9 -67 -87 56 24
4924B4n41M31j01J90n1Rj4m7J55o4Q0o0r9M5j19M26j26k47J74j21j6K06J39l64
$$ 24 -517 -86 -187 3 -48 -39 -53 -100 55 -9 71 11 -88 -43 -162 264 138 -109 65 -56 -72 134 273 -91
4948i1L08l89q7K37O2qJ25k21J48m4o9P1J15k42l2n5L45k70L33oJ9k86M25q5l03
$$ -91 217 -172 -259 -22 40 32 157 -64 84 40 -29 42 157 -85 -117 -172 173 -97 236 230 249 -37 388 303 0
4973@J10J79j38kN9l11N38p8j01m23J78J53k72K46j63PL5K00k91j74N22j53Q5
$$ 0 110 289 151 149 208 -103 435 357 256 -167 11 164 -108 138 -25 -18 17 217 -74 -248 274 121 206
4996B06m15L51k26mL70j32j21R4k84J7K74k58j02K71j35pQ2K2L0N4J84l68r7m6
$$ 206 -209 142 -84 -88 282 150 29 123 -161 -144 130 -128 -230 41 -94 -101 -19 3 33 87 271 -97 -194 -240
5020b40K70k13K60m5j40j33P1L1n9jJ02j07j1n9M5n0L00L7K05m04K82l41J10m5
$$ -240 30 -183 77 32 -108 -241 -170 -139 -198 -199 -97 -204 -215 -274 -229 -279 21 58 263 -141 141 -200 -90 -135
5044a35j59L46O5k6o5j09N3Q2n0m4K07k31m3M15n61R1j79L27R6M7n2q0l09N86
$$ -135 -294 52 117 91 26 -83 -30 52 2 -42 165 -66 -109 306 -255 -164 -343 -16 80 127 75 -5 -314 272
5068B72k84o0J13r5J70Q5m6k3l78L01K85k11j8L49l47Q3K32j49p4k17J04N6P3
$$ 272 -12 -72 41 -54 116 201 155 132 -246 55 340 129 111 460 113 196 428 279 205 -12 92 148 221
5091B21k44j73K05M19j25k56k7R7m0N8p0n8L06l75J82j11J17k11J27k18L76K4
$$ 221 -23 -196 9 428 303 47 20 117 77 135 65 7 313 -62 120 9 126 -85 42 -176 200 224
5113B24k2J0J47j96p4J20j54k09Q5J41q8n1m9J67k12pK48j21J73m26J55p8p3L77
$$ 224 202 212 359 163 89 209 55 -154 -69 72 -16 -67 -116 51 -161 -168 80 -41 132 -294 -139 -217 -290 87
5137H7n11J05J46K70r0oj24k7R0j15K44k28K38j92Q1j73L61n00J20P5q7J87l39
$$ 87 -424 -319 -173 97 7 1 -123 -150 -60 -175 69 -159 79 -113 -32 -205 156 -344 -224 -149 -236 -49 -388
5160c88J95K48r2j05J79j10k87L02j68nK38j4k0j19j35J78l14N11j32j65p4M49
$$ -388 -193 55 -37 -142 37 -73 -360 -58 -226 -231 7 -7 -27 -146 -281 -103 -417 94 -38 -203 -277 172
5182A72m09J18J76k89M58j84L75m38J74o9L1Lj52L1M9j50L94j07j20J64J38j99
$$ 172 -237 -119 57 -232 226 42 417 -21 153 84 115 118 -34 -3 46 -104 290 183 63 227 365 166
5204A66l87O60m22J17j51j9k12R4J41K48R3j68l5%o9J99J4q1l51L24k07R3L7j13
$$ 166 -221 439 17 134 -17 -36 -248 -154 -13 235 328 160 125 125 56 255 269 188 -163 161 -46 47 84 -29
5228b9j75L77k30o4J16Q3Q5J59l23O8l15M66j34k85L74k04K94l81oM5J99k42R1
$$ -29 -204 173 -57 -121 -5 78 163 322 -1 67 -248 218 84 -201 173 -31 263 -118 -124 -79 120 -122 -31
5251c1kk52J56MJ11P2k79J20L05j06j74m5j5k73J08L05m4P8j4k32J4J24P3j04
$$ -31 -33 -285 -129 -125 -14 58 -221 -101 204 98 -76 -121 -136 -409 -301 4 -40 38 24 -208 -194 -70 3 -101
5275a01J63o9k1j22J28j25K06l90K80j86P6J17P8j49J59j82J75lj52J41j24J05
$$ -101 62 -7 -28 -150 -22 -147 59 -331 -51 -237 -161 -44 34 -115 44 -138 37 34 -118 23 -101 4
5297Dj21j09J33J63j94J97l5l55K68M3K2l34L08j28K14k00L16Ok48m9Q1K88k8
$$ 4 -117 -226 -93 70 -124 73 38 -317 -49 -6 16 -318 -10 -138 76 -124 192 198 -50 -99 -18 270 242
5320B42j21l01R0K92j69J20j37K36n8J69m12rK10j59J65j39O3N2J55j09J73k56
$$ 242 121 -180 -90 202 33 153 16 252 194 363 -49 -58 152 -7 158 19 82 134 289 180 353 97
5342I7k7J49j17J04k8k09k4n6R7o1J26J17j12K21r1P6l33K54j21j93K07r1J76
$$ 97 70 219 102 206 178 -31 -55 -111 -14 -75 51 168 56 277 186 262 -71 183 62 -131 76 -15 161
5365A61J83n35M52k05j68qj80O72n12L58l49m6R2l31M84j24K4Q5l1l9J03M1l6
$$ 161 344 -191 261 56 -112 -120 -300 372 -140 218 -131 -177 -85 -416 68 -56 -32 53 22 -17 86 127 91
5388I1n0j43k22L48l9k15L6J94L52o14K12k34J53j05l7K20j41j49L15J99k48N1
$$ 91 41 -102 -324 24 -15 -230 -194 0 352 -262 -50 -284 -131 -236 -273 -53 -194 -343 -28 171 -77 -26
5410b6j54j35J22PJ04j60J92R2j19j23J72n3n1j44L53l94M01j87J85k66r2M42
$$ -26 -180 -315 -193 -186 -82 -242 -50 42 -77 -200 -28 -81 -132 -276 77 -317 84 -103 82 -184 -276 166
5432A66j27Q3l61L88k33R9j06K3K63j88K67l2j18k50L55n7m9l1j57L37n58J53
$$ 166 39 122 -239 149 -84 15 -91 -68 195 7 274 242 124 -126 229 172 123 92 -65 272 -286 -133
5454a33l3J45J61k57J82J22j59J32j67K79r2j86n6j17J1M94j83J35J34k60j03
$$ -133 -166 -21 140 -117 65 187 28 160 -7 272 180 -6 -62 -179 -168 326 143 278 412 152 49
5475D9j93N1j04L67o6j56K9L6J47q8j08L20L0l30q7O6M7l46L18K9p6jj60J12j66
$$ 49 -144 -93 -197 170 104 -52 -23 13 160 72 -36 284 314 -16 -103 -37 10 -336 -18 11 -65 -66 -226 -114 -280
5500b80N42k82n0j31N9J77k28L5J38j01n6J07k15L90k15Kj03K2n2J72j34P7j9
$$ -280 262 -20 -70 -201 -142 35 -193 -158 -20 -121 -177 -70 -285 105 -110 -108 -211 -189 -241 -69 -203 -126 -145
5523a45n6K49j26J67j26o8J83Q5m43K97l33P4J06J46j74J47m0J51O8j27k1J16
$$ -145 -201 48 -78 89 -37 -105 78 163 -280 17 -316 -242 -136 10 -164 -17 -57 94 162 35 14 130
5545A30l20J86k35K10P5J63k21k32K80j12J76k91L02k71J16J68L17o34j48L76
$$ 130 -190 -4 -239 -29 46 209 -12 -244 36 -76 100 -191 111 -160 -44 124 441 -193 -341 35
5565C5r7l6K21j43R1J67l90K40N7L1j08j92K13k5J84j00P2j04j9j23n1L2M9J32
$$ 35 -62 -98 123 -20 71 238 -152 88 145 176 68 -124 89 64 248 148 220 116 97 -26 -77 -45 4 136
5589A36q2j91R5M51k95KJ5j19L43l74N8o3J44L84j94l06m4K26j36nj44M2K23j98
$$ 136 54 -137 -42 409 114 116 131 12 355 -19 39 -24 120 504 310 4 -40 186 50 45 -99 -57 166 -32
5613c2o2O7J16J56n19K96J09j57P1J64n24j3K59j18o1J31K71m36L51m26J96L1
$$ -32 -94 -27 89 245 -274 22 131 -26 45 209 -315 -328 -69 -187 -248 -117 154 -282 69 -357 -161 -130
5635a30k10M04N9j89k33K78j68j92K41l01P9M81l36K53l76J69L5J6J13j71n5P3
$$ -130 -340 64 123 -66 -299 -21 -189 -381 -140 -441 -362 119 -217 36 -340 -171 -136 -120 -7 -178 -233 -160
5657a60J87k34L3J67k20J93m5K75o3n5j70L22j62j03j14J43J32j14j27J5J25m8
$$ -160 27 -207 -174 -7 -227 -34 -79 196 133 78 -92 230 68 -35 -149 -6 126 12 -115 -100 25 -23
5679b3M8k76J04R6k40L62j58J88q6n7n8P7K26m09K24K66l15K11l4j85N7RL8j72
$$ -23 25 -251 -147 -51 -291 71 -87 101 15 -42 -100 -23 203 -206 18 284 -31 180 146 -39 18 27 65 -107
5703a07K54o4J9m84N52q0R1m08L78oJ26J15l54m4J57n32L22L5K80j10j1q7K52
$$ -107 147 83 102 -382 170 90 181 -227 151 145 271 386 32 -12 145 -387 -65 -30 250 140 129 42 294
5726B94r3m43J93o2J81nl48L82J21j0J12k27l34J43lL3K84n75L96K3p3j60J13
$$ 294 201 -242 -49 -111 70 65 -283 99 220 210 322 95 -239 -96 -99 -66 218 -357 39 62 -11 -171 -58
5749e8K17l04k8M87m30l8J17R6k67k06O09j73J36k44J82r4p0K25k66k8k72M59
$$ -58 159 -145 -173 314 -116 -154 -37 59 -208 -414 195 22 158 -86 96 2 -68 157 -109 -137 -409 50
5771E0j1j45j40rJ76p0J42J77l05j13L24j87J2L63k23K0j12J60j13l4K4R2j82
$$ 50 39 -106 -246 -255 -79 -149 -7 170 -135 -248 76 -111 -99 264 41 61 -51 109 -4 -38 -14 78 -104
5794a04o8R4n5J86k1p4M9qj13o0J25r2P1P8j27l0j78J05L11J68m51K93l1J0j06
$$ -104 -172 -78 -133 53 32 -42 7 -1 -114 -174 -49 -141 -70 8 -119 -149 -327 -222 89 257 -194 99 68 78 -28
5819b8J78q8j01J70q6N3Q1k87K25L5k46K75np0L8K51q8K91m94J73m01J39J6K3
$$ -28 150 62 -39 131 45 98 179 -108 117 152 -94 181 176 106 144 395 307 598 104 277 -124 15 31 54
5843E4M8j15K25j68J95J2k29k6Q7N0k65K66j43m8J91j42nN2j56J26L19l82K29
$$ 54 102 -13 212 44 239 251 22 -4 83 133 -132 134 -9 -57 134 -8 -13 39 -117 9 328 -54 175
5866A75j97n6J14J07j39J64l72L31j28L52j68k55p3j76K45L12j63k66L04K1k37
$$ 175 -22 -78 36 143 4 168 -204 127 -1 351 183 -72 -145 -321 -76 236 73 -193 111 132 -105
5887a05qj85K69Q4j83J73j59J94m5l59J8M38k59J92j68K68j98k67L50k48J39l7
$$ -105 -113 -298 -29 55 -128 45 -114 80 35 -324 -306 132 -127 65 -103 165 -33 -300 50 -198 -59 -96
5909i6%j09k4K33j98j03J34k22N14j16QP9j61J57j47j48k8J92j46L4J01J25j09
$$ -96 -96 -205 -229 4 -194 -297 -163 -385 129 13 21 100 -61 96 -51 -199 -227 -35 -181 -147 -46 79 -30
5932c0m4k31O35k69k86J4n0M15j04N0l6r4j47OJ06K4J6J81j90J16J29J15k38j04
$$ -30 -74 -305 330 61 -225 -211 -261 154 50 100 64 -30 -177 -171 -65 -41 -25 156 -34 82 211 326 88 -16
5956a6J20k7j84L82k12k04L40j52Q7q3Q1j49J77n9j46K33m4K9k19j53M96k86p1
$$ -16 104 77 -107 275 63 -141 199 47 134 51 132 -17 160 101 -45 188 144 173 -46 -199 297 11 -60
5979f0r9J63J62j49R5k39L60m72K95N6o6l08L06M6K18j11k43m2K15j66J18l9k29
$$ -60 -159 4 166 17 112 -127 233 -239 56 112 46 -262 44 90 308 197 -46 -88 127 -39 79 40 -189
6002a89%J91k08J73N2P6k65j12K76R2j08QQ1Q7P5l64L70l20L19l33J43l33K60
$$ -189 -189 2 -206 -33 19 95 -170 -282 -6 86 -22 -14 67 154 229 -135 235 -85 234 -99 44 -289 -29
6025b9l14J28J22rQj11K59j28l14J12J81j03j24OK33O3k70J94L0L7k7k09j8J01
$$ -29 -343 -215 -93 -102 -94 -205 54 -74 -388 -276 -95 -198 -322 -316 -83 -20 -290 -96 -66 -29 -56 -265 -283 -182
6049a82K24l8K3J61n56L24L8j2K08j76Q4K9k06M0mL62j97k39P4L7l46N30l07Q5
$$ -182 42 4 27 188 -368 -44 -6 -18 190 14 98 127 -79 -39 -43 319 122 -117 -43 -6 -352 178 -129 -44
6073d4O3q3K57nmr7l40L13J01j15N0m3K96k74J63j86P7j3r5q2L00j32k03K95r0
$$ -44 19 -64 193 188 184 87 -253 60 161 46 96 53 349 75 238 52 129 116 21 -61 239 107 -96 199 109
6098A09r8O5K8m23M23j42N73n26J46k72K58l98J25M76l49m7NJ26P7l2O4k29J18
$$ 109 11 76 104 -319 104 -38 535 9 155 -117 141 -257 -132 344 -5 -52 -47 79 156 124 188 -41 77
6121G7j01R8j31J81k46K20M6k59J47j31N0j54Q0J73l9k52J10RL79j12j44r3k62
$$ 77 -24 74 -57 124 -122 98 144 -115 32 -99 -49 -203 -123 50 11 -241 -131 -122 257 145 1 -92 -354
6144c54Q7L66k59j11J99L3Q9o3k00M46j57p3J57m17J4R0K68k65J28K84m72K86
$$ -354 -267 99 -160 -271 -72 -39 50 -13 -213 233 76 3 160 -257 -243 -153 115 -150 -22 262 -210 76
6166G6l5J23k29R5k05K05k16k7J30R0k10L75k00m7J9J04L5k10Q8l19N16p2l77
$$ 76 41 164 -65 30 -175 30 -186 -213 -83 7 -203 172 -28 -75 -56 48 83 -127 -39 -358 158 86 -291
6189b91M61k79M00k17m0l17J57J30P2J65m63J03O5J3K07j37j9o8j44K69Oo6J76
$$ -291 170 -109 291 74 34 -283 -126 4 76 241 -222 -119 -54 -41 166 29 10 -58 -202 67 73 7 183
6212A83j32k64R7P9O6j29J91j26R9J04r0k28R7M3l01M47m21K79L54J05m38j78
$$ 183 51 -213 -116 -37 29 -100 91 -35 64 168 78 -150 -53 -10 -311 136 -285 -6 348 453 15 -163
6234a63R0K31j68j06K03J74k62J70k08n5L3K63k18j04K55l14R6J9K34l48O9l7
$$ -163 -73 158 -10 -116 87 261 -1 169 -39 -94 -61 202 -16 -120 135 -179 -83 -64 170 -178 -109 -146
6256a46N6J37k78L04j56R7k50L60l19K87j62P9k50J13J28j7L7k02p3o4j2J89J20
$$ -146 -90 47 -231 73 -83 14 -236 124 -195 92 -70 9 -241 -128 0 -17 20 -182 -255 -319 -331 -142 -22
6279b2L0l32K54J57n7j69K28j6j90Nj02O9k4J77k37K9M17m24k3j38K47NK85k81
$$ -22 8 -324 -70 87 30 -139 89 73 -117 -112 -214 -145 -169 8 -229 -200 217 -207 -230 -368 -121 -116 169 -112
6303a12K00j71m1K10k20J28j82K66k10o8M05jl34q9K10K17k82K5R4k78M17R4k52
$$ -112 88 -83 -124 86 -134 -6 -188 78 -132 -200 205 204 -130 -219 -9 208 -74 -49 45 -233 184 278 26
6326B6k66L53j91L51m8l06K19l2l01N9L94o6P2k53j5L28j82k39Q6J56p5l97M38
$$ 26 -240 113 -78 273 225 -81 138 106 -195 -136 258 192 264 11 -4 324 142 -97 -11 145 70 -327 111
6349A11J0l9p0K03J27l84L30j37M0j70Q7k61K56l3M0j17j82K84N0j3j08p7k36
$$ 111 121 82 12 215 342 -42 288 151 191 21 108 -153 103 70 110 -7 -189 95 145 132 24 -53 -289
6372b89P6j40K74O1J57k70Q9P7J27k75J34j00R4K09k36n6p6j57J16J71J78k18
$$ -289 -213 -353 -79 -18 139 -131 -42 35 162 -113 21 -79 15 224 -12 -68 -144 -301 -185 -14 164 -54
6394e4k25K72j43K0L00k75j14L01M3n3k23J40K03l02L6L45k02j09j23p9M49n30
$$ -54 -279 -7 -150 -130 170 -105 -219 82 125 72 -151 -11 192 -110 -74 271 69 -40 -163 -242 207 -323
6416c23pL76k07j24K14o1J13J73k29K5K42l85Q8K3j67J11L21j25M2l87L42Q1k60
$$ -323 -330 46 -161 -285 -71 -132 -19 154 -75 -50 192 -193 -105 -82 -249 -138 183 58 100 -287 55 136 -124
6439a24j1J85O8j69L58j95J03j78r3K53k63K4J17k8O1q1M0j56Q2K28j53N4j67
$$ -124 -135 50 118 -51 307 112 215 37 -56 197 -66 -42 75 47 108 27 67 -89 -7 221 68 122 -45
6462d5OK17j70m3R2m4L4K32k85K6Q2N6M7j18l5q7N7N2L8n1k53J26J84m3Rj73j5
$$ -45 -39 178 8 -35 57 13 47 279 -6 20 102 158 205 87 52 -35 22 74 112 61 -192 -66 118 75 84 -89 -104
6489a04n4J0J31N4k25N21k98q5L57l92K7K08q9k3J25pl12J64k12k3J56O9J9l04
$$ -104 -158 -148 -17 37 -188 333 35 -50 307 -85 -58 150 61 38 163 156 -156 8 -204 -227 -71 -2 17 -287
6513b87P03o37K83k91k5K42k8J55p9k2n2J82j04j38j2j12K79j57LP4r8J32j40
$$ -287 416 -221 62 -229 -254 -12 -40 115 36 14 -38 144 40 -98 -110 -222 57 -100 -97 -23 -121 11 -129
6536a29J34o7K2Q9Km1j62M8J50m5m05J12K25PL0J77k23K3O0K29j74k3j47O3M3
$$ -129 5 -62 -40 49 51 10 -152 -104 46 1 -404 -292 -67 -60 -30 147 -76 -53 7 236 62 39 -108 -45 -2
6561bL2k26K31J81l27o1O2P8K4k69O1J66L6j8p6K43Q1r8R9l26N4O7J72q7P6m15
$$ -2 30 -196 35 216 -111 -172 -110 -32 -8 -277 -216 -50 -14 -32 -108 135 216 118 217 -109 -55 12 184 97 173 -242
6587b42K61P9M0r4Q8%P2o4L7l41Q4K38m3Qk07O22l55n7j38J66m3m02L20j6J20
$$ -242 19 98 138 44 132 132 204 140 177 -164 -80 158 115 123 -84 538 183 126 -12 154 111 -291 29 13 133
6612A33N8J4k04J70l76K85j27n0M04o35K57n1L03j82k59K08J10l24K15J71l6J03
$$ 133 191 205 1 171 -205 80 -47 -97 307 -328 -71 -122 181 -1 -260 -52 58 -266 -51 120 84 187
6634A87k08k11k4K14j00k6J09J91l24L97k28k16j44O05k14k95K51J28j53j80l3
$$ 187 -21 -232 -256 -42 -142 -168 -59 132 -192 205 -23 -239 -383 222 8 -287 -36 92 -61 -241 -274
6655b74Q4L25j61n7J71j04j8L1K42m29O0L28j46j84o9K79J38l08j28O5K58j68
$$ -274 -190 135 -26 -83 88 -16 -34 -3 239 -190 -130 198 52 -132 -201 78 216 -92 -220 -155 103 -65
6677f5O2J20J3l05K41j39r9L8K41j26R9j18j24L33j63o1J65l1k9p6J06R9j81j40
$$ -65 -3 117 130 -175 66 -73 -172 -134 107 -19 80 -38 -162 171 8 -53 112 81 52 -24 82 181 0 -140
6701a40Q2K51r9l6j85L0J33J72j14J33k5k15L04l79J18L27k78M5l6P3p2j80R7
$$ -140 -58 193 94 58 -127 -97 36 208 94 227 202 -13 291 -88 30 357 79 124 88 161 89 -91 6
6724Fn5P9J47m82M49l81O0J71m2J36m2m9J73k59J14K67l05j32J49J43j29o9k52
$$ 6 -49 30 177 -305 144 -237 -177 -6 -48 88 46 -3 170 -89 25 292 -13 -145 4 147 18 -51 -303
6747c03K30J94j32r3K44rm41O0L62j44m4K21k17J02K8n2j96J28j0l57L79k01K03
$$ -303 -73 121 -11 -104 140 131 -310 -250 112 -32 -76 145 -72 30 58 6 -190 -62 -72 -429 -50 -251 -48
6770d8j23J51r6m7nK00l2j91P6n4J57l77M26r2M01m54n4L7K47o2k19N8j85J18
$$ -48 -171 -20 -116 -163 -168 32 0 -191 -115 -169 -12 -389 37 -55 346 -108 -162 -125 122 60 -159 -101 -286 -168
6794a68M1l3K23k64J35L06l28L21n26L95k61M05m13M86k99J17k65j51M45m6JP5
$$ -168 -127 -160 63 -201 -66 240 -88 233 -293 102 -159 246 -167 319 20 137 -128 -279 166 120 121 196
6816A96k25j14K64k24K57J06J7k41L3N6k2K24o07N94k27j52K01p8J43j29q3J16
$$ 196 -29 -143 121 -103 154 260 277 36 69 125 103 327 -280 314 87 -65 136 58 201 72 -11 105
6838A05j49q2J51J5L2k00K06k92M02k7J44p0k81L41l24J94J51r7k12J15lj51j40
$$ 105 -44 -126 25 40 72 -128 78 -214 188 161 305 235 -46 295 -29 165 316 219 7 122 119 -32 -172
6861a72M72j17p0l53K40p1K21k34K70j30K5K0m3m9n1Q5l66J50L25m5l8n99M13
$$ -172 300 183 113 -240 0 -71 150 -84 186 56 81 101 58 9 -42 43 -323 -173 152 107 69 -530 -117
6884a17K38k05J65J89k94m9J40l6L7k44j40L60k60K33K3m69L31J2J03j61o0J29
$$ -117 121 -84 81 270 -24 -73 67 31 68 -176 -316 44 -216 17 40 -429 -98 -86 17 -144 -204 -75
6906g5m0P4MK08l87L88k74n6k0Op9P60p20N8PR3l2o7Q5m6K34j69J4N4p0j58J56
$$ -75 -115 -41 -37 171 -216 172 -102 -158 -178 -172 -251 509 -211 -153 -146 -53 -85 -152 -67 -113 121 -48 -34 20 -50 -208 -52
6933e2l32N29j73K35j39p9K09j91m9P7K55m96K38K14r3J5j46J70m02M41j44k89
$$ -52 -384 145 -28 207 68 -11 198 7 -42 35 290 -206 32 246 153 168 22 192 -210 231 87 -202
6955b02P7O7K54p3j18J95l71J5L65j65j74J24p0J57K25j77O1K0q6j02j68M34k25
$$ -202 -125 -58 196 123 5 200 -171 -156 209 44 -130 -6 -76 81 306 129 190 210 124 22 -146 288 63
6978F3j99K04o0J19n6l66L39J6k42K08J14K9k58K31j10K06l03K07M0k47k5K07
$$ 63 -136 68 8 127 71 -295 44 60 -182 26 140 169 -89 142 32 238 -65 142 182 -65 -90 117
7000A17J64l55P6J82j02j34j69L2J52J25l24J43M7K43l29l3L33j22l06j23M06
$$ 117 281 -74 2 184 82 -52 -221 -189 -37 88 -236 -93 -46 197 -132 -165 168 46 -260 -383 23
7021B3j09k20N74j20k23J26p5R7j68K04q1P0l53M36l47k4j21j56O64j71m0N4r3
$$ 23 -86 -306 268 148 -75 51 -24 73 -95 109 28 98 -255 181 -166 -190 -311 -467 197 26 -14 40 -53
7044e3j6J14j74j49L13J75P4m18K77j17j11K82l15J81K3P0K07j83k32J59k95Q8
$$ -53 -69 45 -129 -278 35 210 284 -134 143 26 -85 197 -118 63 86 156 363 180 -52 107 -188 -100
7066a00j48L86kp4mJ11k78J12M1Q7ok53L71oQ5k14l27J31j21P6L26n5M0j41n7
$$ -100 -248 138 136 62 58 169 -109 3 44 131 125 -128 243 237 322 108 -219 -88 -209 -133 193 138 178 37 -20
7091b0q1J13j39L96l00J67j52L5J54j53o3K17J73l72L14j21q5k04k54M46p5p9
$$ -20 -101 12 -127 269 -31 136 -16 19 173 20 -43 174 347 -25 289 168 83 -121 -375 71 -4 -83
7113h3J16j7J77k72J66j17J39k13Q0J21m6J09k92J88J30l90K03q4K61k58O8j54
$$ -83 33 16 193 -79 87 -30 109 -104 -24 97 51 160 -132 56 186 -204 -1 -85 176 -82 -14 -168
7135a68L93l14K84l95K45o6J18m36K80nL11p4j05j73J90j30JJ44l9k36L1K64l41
$$ -168 225 -89 195 -200 45 -21 97 -339 -59 -64 247 173 68 -105 85 -45 -44 100 61 -175 -144 120 -221
7158b21N17j33m15K10k06J90J06P4k13RP4k85L38K3m41N2K36R4j95L69j06k88
$$ -221 296 163 -252 -42 -248 -58 48 122 -91 -82 -8 -293 45 68 -373 -321 -85 9 -186 183 77 -211
7180b11K53K63l34j23J61rm5K97j74k41K17n3j32K66j34K94j43q9K4O5j92N9K62
$$ -211 42 305 -29 -152 9 0 -45 252 78 -163 54 1 -131 135 1 295 152 63 87 152 -40 19 281
7203B81p7l26L45n8R8j83P5k55N0Q3j37K96o0O3k09j9J36Ok03K23N4O5j8n4j41
$$ 281 204 -122 223 165 263 80 155 -100 -50 33 -104 192 132 195 -14 -33 103 109 -94 129 183 248 230 176 35
7228C5L03j78K3l47R7j08K82j40k9L0j10J92n4R3k73M02k26o0Qk00K69k6n2j93
$$ 35 338 160 183 -164 -67 -175 107 -33 -62 -32 -142 50 -4 89 -184 218 -8 -68 -60 -260 9 -17 -69 -262
7252b62K06q6J7m55L49M1K1O6J83j96J40q6j8k1J12k93O1l1j0J48j14K35R7P1
$$ -262 -56 -142 -125 -580 -231 -190 -169 -103 80 -116 24 -62 -80 -101 11 -282 -221 -252 -262 -114 -228 7 104 175
7276A75k82K71l05j00R9L5J76k53J24k3j43L03j41J55j47J04J6j97p4J08K37P1
$$ 175 -107 164 -141 -241 -142 -107 69 -184 -60 -83 -226 77 -64 91 -56 48 64 -133 -207 -99 138 209
7298B09k49J81l82L67J7k85K12p1o3J74m79M07m3j62J4Q3L3j62K65l5q2J46j52
$$ 209 -40 141 -241 126 143 -142 70 -1 -64 110 -369 38 -5 -167 -153 -70 -37 -199 66 31 -51 95 -57
7321e7J66o7J21l03J22j2N4N0o6J34L4j15k38L34l6K01p3q6l8l82K9M03j67J73
$$ -57 109 42 163 -140 -18 -30 24 74 8 142 176 61 -177 157 121 322 249 163 125 -257 -228 175 8 181
7345A81n0k63L67n20l0L12k94K32M12l60%j30J25K62l29j35j5J85j47L25q2j07
$$ 181 131 -132 235 -285 -315 -3 -297 -65 347 -13 -13 -143 -18 244 -85 -220 -235 -50 -197 128 46 -61
7367f1J9o6Rq9K24J22k34J21q8J39N9K2k67Q1p2k1K57l51J98k0q7L34n21L68k48
$$ -61 -42 -108 -99 -188 36 158 -76 45 -43 96 155 177 -90 -9 -81 -102 155 -196 2 -18 -105 229 -292 76 -172
7392a72J79q8o8j51K07J52k97J84J7k21K35J65j47j38Q0k14M10k66J18n9L21m15
$$ -172 7 -81 -149 -300 -93 59 -238 -54 -37 -258 -23 142 -5 -143 -63 -277 133 -133 -15 -74 247 -168
7414a68q7L04j6m2K27k61J32k13K26K33l71L0j13J83q5J42m5o9Kj2KK03l23J14
$$ -168 -255 49 33 -9 218 -43 89 -124 102 335 -36 -6 -119 64 -21 121 76 7 9 -3 -1 202 -121 -7
7438go5j55j20M66N1k16L51l76R4J24j34K46k04j42O3J33j30K78l67L67n67K82
$$ -7 -72 -227 -347 119 170 -46 305 -71 23 147 13 259 55 -87 -24 109 -21 257 -110 257 -310 -28
7460b8l8R7K08k31Q0J40rk34j1k5k54M76J11m26L86k61L1r9n2K16R7j26k0jq2
$$ -28 -66 31 239 8 88 228 219 -15 -26 -51 -305 171 282 -144 242 -19 12 -87 -139 77 174 48 28 27 -55
7485e5j73K15m4L52k83k40K71k02J99k88L58Q2j69j00J51j90N5j01J33l38K37
$$ -55 -228 -13 -57 295 12 -228 43 -159 40 -248 110 192 23 -77 74 -116 -61 -162 -29 -367 -130
7506a30K0P5j03O4J58J9k52K76n63J40K45N1R8m79P4M35m64J38K39q1L21l83J04
$$ -130 -110 -35 -138 -74 84 103 -149 127 -436 -296 -51 0 98 -381 -307 128 -336 -198 41 -40 281 -102 2
7529Bp7j44K05j38O9K1r0K52k81M8j45J77K33J4m21P4J41K67m3j80j49R0Q0j06
$$ 2 -75 -219 -14 -152 -83 -62 -152 100 -181 -133 -278 -101 132 146 -275 -201 -60 207 164 -16 -165 -75 5 -101
7553a01M1j04K17j03M08k80k52K23K34j77j44k4lo4J89J63j47K57l55Q4l57N04
$$ -101 -60 -164 53 -50 358 78 -174 49 283 106 -38 -62 -65 -129 60 223 76 333 -22 62 -295 209
7575B09J1k89p7N87n28P8Jj2O6M5J57j43K3J29j67kM2O1j98L7j52K11o0J19j49
$$ 209 220 -69 -146 441 -87 -9 -8 -20 46 91 248 105 128 257 90 88 130 191 -7 30 -122 89 29 148 -1
7600am4Q1m0L37k19l9k54R7L3l3n4j1K00M0R9m9Q6o8J79l63J51j41K27j17K48
$$ -1 -45 36 -4 333 114 75 -179 -82 -49 -82 -136 -147 53 93 192 143 229 161 340 -23 128 -13 214 97 345
7625C45k99k45L21j90l76L85K07k28Q3K8q2J92O8k07N3j05L24p0m06J86j33K54
$$ 345 46 -199 122 -68 -444 -59 148 -80 3 31 -51 141 209 2 55 -50 274 204 -202 -16 -149 105
7647A05j58L37k64j39R6j5P3k97L84k9j72p7L93m20K16Q1kk88J53R7k20K7m1M0
$$ 105 -53 284 20 -119 -23 -38 35 -262 122 93 -79 -156 237 -183 33 114 112 -176 -23 74 -146 -119 -160 -120
7671a20o4J38J96l66K55j06J89l9Pl2J30j50k4L7J39k80J11j84K67m22J33M42
$$ -120 -184 -46 150 -216 39 -67 122 83 90 58 188 38 14 51 190 -90 21 -163 104 -318 -185 257
7693B57q0P4p32N89m2jK30j13J27l5k12k74R6n2M55l79kJ17M1J28l32J69j31J53
$$ 257 177 251 -481 108 66 65 295 182 309 274 62 -212 -116 -168 287 -92 -94 23 64 192 -140 29 -102 51
7717E1K68k62l0L1k90J60P1j28K77m21M18k2j9rR1q2on9J16j46n4J76l34K41J93
$$ 51 319 57 27 58 -232 -72 -1 -129 148 -273 145 123 104 95 186 104 98 39 155 9 -45 131 -203 38 231
7742B31k90j36J77M08j79r4l9q1N7k97M15m06J00j14N42l73j46J27j84L73k92
$$ 231 -59 -195 -18 390 211 117 78 -3 54 -243 172 -234 -134 -248 294 -79 -225 -98 -282 91 -201
7763b01L4k54L75j66J87Jl8R4J08n03Q1N13k56R5k77k2K00K06k51j46K10J65j95
$$ -201 -167 -421 -46 -212 -25 -24 -62 32 140 -363 -282 231 -25 70 -207 -229 -29 177 -74 -220 -10 155 -40
7786d0r9L7j56M29k40mK67J45o00oL50L7R9j58l96J11Q7K6J82o8o8J2R0r6Rj84
$$ -40 -139 -102 -258 171 -69 -73 194 339 -261 -267 83 120 219 61 -335 -224 -137 -111 71 3 -65 -53 37 -59 -50 -234
7812b34K31K82m00K37J15n31K07J64j8r5J36j02R2J3R3k08L38j16k98K53j68j88
$$ -234 -3 279 -121 116 231 -300 -93 71 53 -42 94 -8 84 97 190 -18 320 204 -94 159 -9 -197
7834a97K04k6j0K4K1J50l3k82J37j73K95J32k55k37K85r2J71p8j49L15l14l7R7
$$ -197 7 -19 -29 -5 16 166 133 -149 -12 -185 110 242 -13 -250 35 -57 114 36 -113 202 -112 -149 -52
7857e2K2J62j15J5K7j79K19L4j27k58K15K20j64Nm04L70L00m66Q0n9K19k76L7
$$ -52 -30 132 17 32 59 -120 99 133 6 -252 -37 183 19 24 -380 -10 290 -176 -96 -155 64 -212 -175
7880a75j39K48N2j29K29MJ2j80k8L74m94j1J62M6p4J95k32j5K12k85J29J83r4
$$ -175 -314 -66 -14 -143 86 90 102 -78 -106 268 -226 -237 -75 -29 -103 92 -140 -155 57 -228 -99 84 -10
7903a0j78J56k6J16K22n10j3K38M5o0p9M49l46J19o6K42m63Q7j06N8J55J50j49
$$ -10 -188 -32 -58 58 280 -230 -243 -5 40 -20 -99 350 4 123 57 299 -164 -77 -183 -125 30 180 31
7926C1J19k69J91OJ46k37N6j82K93k79MmK06jm9k89K99k84R2K50m09J60L74k68
$$ 31 150 -119 72 78 224 -13 43 -139 154 -125 -121 -125 81 80 31 -258 41 -243 -151 99 -310 -150 224 -44
7950d4k4O4l62L03K82j66k25K20J26j84K36J14l61O5m5K69m99J08n9K73j04m5
$$ -44 -68 -4 -366 -63 219 53 -172 48 174 -10 226 340 -21 44 -1 268 -231 -123 -182 91 -13 -58
7972e8r4N72j95p8m3kj64K06J50l65M08n09M3K50k4q2J47p0P7r2k49M60p1P5j87
$$ -58 -152 420 225 147 104 102 -62 144 294 -71 337 -172 -129 121 97 15 162 92 169 77 -172 288 217 292 105
7997A05k95K45q2j06L71p1k32rj34P6nK03p1K28k79J05N3j28k16K39J80k72J06
$$ 105 -190 55 -27 -133 238 167 -65 -74 -208 -132 -137 66 -5 223 -56 49 102 -26 -242 -3 177 -95 11
8020A1M0Lj09p8j86L12k9J45J15n46J75j04R3J12k8J37k56M63m47J71j02K07O4
$$ 11 51 54 -55 -133 -319 -7 -36 109 224 -322 -147 -251 -158 -46 -74 63 -193 270 -177 -6 -108 99 163
8043A63k39j9J68l6r5J89l6J01k32J7l0o3J49L9L7M0q7n6L7N9k43K99Oj71J24
$$ 163 -76 -95 73 37 -58 131 95 196 -36 -19 -49 -112 37 76 113 153 66 10 47 106 -137 162 168 -3 121
8068A21O9l86K59m9J38l45L57k04R5o3N9P0j08RJ27LK85n66L94r3l9L9k45l4K97
$$ 121 190 -196 63 14 152 -193 164 -40 55 -8 51 121 13 22 149 152 437 -129 265 172 133 172 -73 -107 190
8093A90j77K16j99J55M4l04J95J75k74l5J55Kk54P7J19N6Qq2j84o6M33m54J67
$$ 190 13 229 30 185 229 -75 120 295 21 -14 141 143 -111 -34 85 141 149 67 -117 -183 250 -204 -37
8116c7j33K5K02o2r1J13k60K61j17J60J9j05J86k30m48L69K4J73n3j86L28k15
$$ -37 -170 -145 57 -5 -96 17 -243 18 -99 61 80 -25 161 -69 -517 -148 -124 49 -4 -190 138 -77
8138g7%J21l52J00L67k28p5N09l60j34N3j44J86PJ55j65k69R4J81o3m1J96j97
$$ -77 -77 44 -308 -208 159 -69 -144 365 5 -129 -76 -220 -34 -27 128 -37 -306 -212 -31 -94 -135 61 -136
8161a36lQ2Mj33M3K75m34L27k39J42j9K61k68j14m7K99j77J23J65k41o9K22Pp3
$$ -136 -139 -57 -53 -186 -143 132 -302 25 -214 -72 -91 170 -98 -212 -259 40 -137 -14 151 -90 -159 63 70 -3
8185cK17j6k79L44Q2k28
$$ -3 214 198 -81 263 345 117
8191A17
$$ Imaginary data points
##PAGE= N=2
##DATA TABLE= (X++(I..I)), XYDATA
0@%%%%%%%qJ6j6J6k4L2m0M8n6P2q8J04j20J36j60J85k10K42k81L22l63M12m68
$$ 0 0 0 0 0 0 0 0 -8 8 -8 8 -16 16 -24 24 -32 40 -48 56 -64 72 -88 97 -113 129 -152 170 -193 219 -249
30b49N30n96O69p49Q36r33J038j152J279j418J571j740J926k134K366k622K909
$$ -249 281 -315 354 -395 441 -492 546 -606 673 -745 826 -914 1012 -1122 1244 -1378 1531
47A531l237L614m051M561n170N914o842Q040r655J1964j5564K2007l7055J35016
$$ 1531 -1706 1908 -2143 2418 -2752 3162 -3680 4360 -5295 6669 -8895 13112 -23943 111073
61A11073Q1829k44031k5380Q2653J3479n3907Q2894Q5698k0891n4188K552n1593
$$ 111073 192902 -51129 -76509 6144 19623 -34284 48610 134308 113417 59229 61781 10188
73A0188p0260K9384R3245Q999j4257L8035O710q1271l7799L2614m563k8707O2391
$$ 10188 -60072 -30688 62557 71556 57299 95334 102044 20773 -17026 15588 11025 -17682 44709
86D4709P9557k6705n8818J0063j2507o9560j466P8007J4014l0043N2027N7196
$$ 44709 124266 97561 38743 48806 36299 -33261 -34727 43280 57294 27251 79278 136474
98A36474q3235j14167J8866O6549j3654j1438O7849M7712l7610m5583k3891m4022
$$ 136474 53239 -60928 -42062 24487 10833 -605 67244 114956 77346 31763 7872 -36150
110c6150k3583N1880N8901J699M412L3206k1404p8457l5166J4704m772M242O4987
$$ -36150 -59733 -7853 51048 52747 57159 90365 68961 -9496 -44662 -29958 -34730 -30488 34499
123C4499N3631k2866l2676N56k9915o2337n449N0653K5969Q349M0043J9375n5982
$$ 34499 88130 65264 32588 33144 3229 -59108 -64557 -13904 12065 20414 60457 79832 23850
136B3850o0281L650J2634k1058P146N9339L5010k4679k9398j3714k3911j8896
$$ 23850 -36431 -32781 -20147 -41205 -34059 25280 60290 35611 6213 -7501 -31412 -50308
148e0308J6823K5799R705J4752K0282j4318m1679j9938N541L06M736K7229K4609
$$ -50308 -33485 -7686 2019 16771 37053 22735 -18944 -38882 -33341 -33035 -28299 -1070 23539
161B3539m039j4877j1214k0415k2422M814K5183J5516Q319J3488k740l3710k8776
$$ 23539 19500 4623 -6591 -27006 -49428 -44614 -19431 -3915 4404 17892 15152 -18558 -47334
174d7334L610R948k9J6415L5858J1434k5114k6241j1609j2155q888J4234K9372
$$ -47334 -43724 -33776 -33805 -17390 18468 29902 4788 -21453 -33062 -45217 -54105 -39871 -10499
187a0499J9700P646j595j8061l0107j9081M51Q557J4197K5143K2381j500j9126
$$ -10499 9201 16847 15252 -2809 -32916 -51997 -51546 -42989 -28792 -3649 18732 17232 -1894
200a894j8143j6948j5456J622K1353K2487J2433Q481k920k3323k5868p142M427
$$ -1894 -20037 -36985 -52441 -50819 -29466 -6979 5454 13935 11015 -12308 -38176 -45318 -40891
213d0891L436J4522K7362J3111j2950j8162r875j1639j2109O638K3117J6959N659
$$ -40891 -37455 -22933 4429 17540 4590 -13572 -23447 -35086 -47195 -40557 -17440 -481 5178
226E178J061o359j8193j6040k406N078P801J5349J5325l30j1453r209q330r298
$$ 5178 6239 -120 -18313 -34353 -36759 -31681 -23880 -8531 6794 6464 -4989 -14198 -22528 -31826
240c1826o0J3293J3009O749K679l104j2859j2616k370M775N779J0547J3558M019
$$ -31826 -31886 -18593 -5584 1165 3844 740 -12119 -24735 -27105 -22330 -16551 -6004 7554 11573
254A1573j0507j1757p820o096m97J0796J5138R045J897l056j1322j4132p222K234
$$ 11573 1066 -10691 -18511 -24607 -25104 -14308 830 9875 11772 8716 -2606 -16738 -23960 -21726
268b1726P518J2646J5060O815o829j1282r346j0007n635O241J6013J5276P542
$$ -21726 -14208 -1562 13498 20313 13484 2202 -7144 -17151 -22786 -16545 -532 14744 22286
281B2286q84q057j2984j2058o534K161J0694J5813J2547L422n375j1169j2176
$$ 22286 21402 13345 361 -11697 -18231 -16070 -5376 10437 22984 26406 21031 9862 -2314
294b314q979j651O703J1824J2882Q106j684q048r727q919n367K371R603J0086
$$ -2314 -11293 -12944 -6241 5583 18465 26571 24887 16839 7112 -1807 -7174 -4803 4800 14886
308A4886O191K181l173p491p693m475r20N903R469M746k053j786j260n553o794
$$ 14886 21077 23258 20085 12594 4901 426 -494 5409 14878 19624 17571 15785 14525 8972 2178
323B178J075Q326N004l4M28r50o747o657J274L786K929N520O515j124q623p138
$$ 2178 3253 11579 16583 16549 16977 16027 9280 2623 3897 7683 10612 16132 22647 21523 12900 5762
339E762l367l424O58Q523R794M299M73m349r863r745m009J98M176J0841J2020
$$ 5762 2395 -1029 -371 8152 17946 22245 22718 18369 8506 -1239 -5248 -5050 -874 9967 21987
354B1987J949o238n490o245j1559p274O799J2044O862L863M314k906j1928j0721
$$ 21987 23936 17698 12208 5963 -5596 -12870 -6071 5973 12835 16698 21012 18106 6178 -4543
368d543l022j372K428R968J0168K241k721l059o698r708l915K978N543M911O141
$$ -4543 -7565 -8937 -6509 3459 13627 15868 13147 10088 3390 -6318 -10233 -7255 -1712 3199 9340
383I340K249l955l968l261m692l064M708N932o15j927K589Q34o016l481M397L649
$$ 9340 11589 7634 3666 405 -4287 -7351 -2643 3289 2674 747 3336 4170 -1846 -5327 -930 2719
399B719j713j271K204j651n190j357K969K551J934L744K511l614n219l771k447
$$ 2719 1006 -265 1939 288 -4902 -6259 -3290 -739 1195 4939 7450 3836 -1383 -5154 -7601
414g601j418K814N766O218K617r75n007o393m464k580P59N589Q024N218M07k959
$$ -7601 -9019 -6205 -439 5779 8396 7421 2414 -3979 -8443 -11023 -10264 -4675 3349 8567 8974 6015
430F015m037o712p196o31O007O233L855M006K537l162q389p046k577J256K671
$$ 6015 1978 -4734 -11930 -12561 -6554 -321 3534 7540 10077 6915 -1474 -8520 -11097 -9841 -7170
445g170M900O460L558j170m336m508m838k952J803M805L442J782J592M19l214
$$ -7170 -2270 4190 7748 6578 2242 -2266 -7104 -10056 -8253 -3448 -6 1776 3368 3787 573
460E73m592j531Q67P52M92J281R84j61j257j718J9J107J041J61q69O06j90l119
$$ 573 -4019 -5550 -4683 -3931 -3439 -2158 -1174 -1335 -2592 -4310 -4291 -3184 -2143 -1982 -2851 -2245 -2435 -5554
478e554k519K324L624P72m5J900k65l852m030m27J003K27L680M487L99l909j809
$$ -5554 -8073 -5749 -2125 -1353 -1398 502 237 -3615 -7645 -8072 -7069 -6842 -3162 1325 1724 -2185 -3994
495c994q31l651k855K697N877K839L02J561q86n152m789r89R66J796M267M779
$$ -3994 -4825 -8476 -11331 -8634 -2757 82 384 1945 1059 -4093 -8882 -9871 -8905 -7109 -2842 1937
511A937J759j591k772l934m545j277K603L134K306L519L136j597n042k160n19
$$ 1937 3696 2105 -667 -4601 -9146 -10423 -7820 -4686 -2380 1139 4275 2678 -2364 -4524 -5043
526e043j134M8M007L487k53O1P78k207l930O2K427J26j53K713K315k567k846R10
$$ -5043 -6177 -6129 -2122 1365 1112 1173 1951 -256 -4186 -4124 -1697 -1571 -1724 989 3304 737 -2109 -1199
544a199M39j713P74L847P69j831N00M65k581q00K721J176k180J106K711j937l855
$$ -1199 -760 -2473 -1699 2148 2917 1086 1586 2051 -530 -1330 1391 2567 387 1493 4204 2267 -1588
561a588J769K752j691j392L626J724m324k088K172m63k825K669M676N0j678J898
$$ -1588 181 2933 1242 -150 3476 5200 876 -1212 960 497 -2328 341 5017 5067 3389 5287
577E287p67o300k251L754Q62j724L643N464j569m973o60n33m504q61M949K630
$$ 5287 4520 -1780 -4031 -277 585 -1139 2504 7968 6399 1426 766 233 -4271 -5132 -183 2447
593B447r51J968K892l524n554L12J419j985O53M956K340k476j114P70l116m034
$$ 2447 1496 3464 6356 2832 -2722 -2410 -991 -2976 -2323 2633 4973 2497 1383 2153 -963 -4997
609d997N40K214Q61K104L034j353l095M29m1l242k341L010K889j75P21J187j239
$$ -4997 -4457 -2243 -1382 722 3756 2403 -692 -263 -304 -3546 -5887 -2877 12 -163 558 1745 506
626E06j810J509Q6l631j550L442J912k370j115K443J785o66k82j444j324O6J103
$$ 506 -1304 205 291 -3340 -4890 -1448 464 -1906 -3021 -578 1207 541 259 -1185 -2509 -2443 -1340
643a340j157p61K284K812j37jK24j871k834J22J586r04q74L912L591o02k151j092
$$ -1340 -2497 -3258 -974 1838 1701 1700 1924 53 -2781 -2659 -1073 -1977 -2851 1061 4652 4050 1899 807
661H07k372k453K086K092p33J453M540K608l981m152j018o23O00J726J086K27
$$ 807 -1565 -4018 -1932 160 -573 880 5420 8028 4047 -105 -1123 -1746 -1146 580 1666 1893
677A893L482M055l236o369r78K595j796j837M145L854j366L40L598k590o922o64
$$ 1893 5375 9430 6194 -175 -1153 1442 -354 -2191 1954 5808 4442 4782 8380 5790 -1132 -1796
693a796M495k92k678K480L729m37k74J225k311m571J114M186k217l916K778M967
$$ -1796 2699 2407 -271 2209 5938 5501 5227 6452 4141 -430 684 4870 2653 -1263 1515 6482
709F482o34k061J76r40j871J290R38m424j628O533L939m579k371M375N2n722j584
$$ 6482 5848 3787 3963 3023 1152 2442 3380 -1044 -2672 3861 7800 3221 850 5225 5277 -445 -2029
726b029K614p69j805M459M234k479l024J888o65n050j128K924k49m65N213L255
$$ -2029 585 -184 -1989 2470 6704 4225 1201 3089 2424 -2626 -3754 -830 -1079 -1544 3669 6924
742F924m226m054K068L04m883j884L921K576J14K742M62m749k062L179j236o717
$$ 6924 2698 -1356 712 1016 -3867 -5751 -1830 746 860 3602 4064 -685 -2747 432 -804 -7521
758g521J118Q184J991m931L01M514k297n425L17J984j757n72M151J930k496m4
$$ -7521 -6403 1781 3772 -1159 -858 3656 1359 -4066 -3749 -1765 -3522 -4094 57 1987 -509 -553
774e53K435k453l342J265K031k518j473M554K702k748j440K161J41k818o32M07
$$ -553 1882 -571 -3913 -2648 -617 -3135 -4608 -54 2648 -100 -1540 621 762 -2056 -2688 -2281
790b281j021J017M051k6l275J067M280k496o389N27N113j021l380L061M779j587
$$ -2281 -3302 -2285 1766 1740 -1535 -468 3812 1316 -5073 -4546 567 -454 -3834 -773 4006 2419
806B419l291Q96K65l940o36L145L83r82L173K458l235l003K483j02m591m01M381
$$ 2419 -872 24 289 -3651 -4287 -1142 -759 -1741 1432 3890 655 -2348 135 33 -4558 -4959 -578
823e78J988j889Q94J982j902k855J054o25k851J616N353j305m021K884L171l735
$$ -578 1410 -479 415 2397 495 -2360 -1306 -1931 -4782 -3166 2187 882 -3139 -255 2916 -819
839h19n358L084L189l362j499M648J984l637l22J878j617l220K284J804l220k59
$$ -819 -6177 -3093 96 -3266 -4765 -117 1867 -1770 -2092 -214 -1831 -5051 -2767 -963 -4183 -4442
855d442M911N80m715k6M313k352m335J431L072j691q73K998O0k782J596K516l756
$$ -4442 469 1049 -3666 -3692 621 -1731 -6066 -4635 -1563 -3254 -4127 -1129 -1069 -3851 -2255 261 -3495
872c495l394M057L181m522j371N643J509n132p65L323j157l913K371L030k084
$$ -3495 -6889 -2832 349 -4173 -5544 99 1608 -3524 -4289 -966 -2123 -6036 -3665 -635 -2719
887b719k58L940m20m835O53L637k569l565L607M755k351k067L037Q11m313l35
$$ -2719 -2977 963 543 -4292 -3639 -2 -2571 -6136 -2529 2226 -125 -2192 845 1656 -2657 -2992
903b992K252j091j130L682K531l465j212M012o75n215L23M677n66l270L355L658
$$ -2992 -740 -1831 -2961 721 3252 -213 -1425 2587 1912 -3303 -2980 1697 1131 -2139 1216 4874
919D874k341k973K069N74l099M91L120r67j518K969K310l502k088K873O65l305
$$ 4874 2533 -440 1629 2203 -896 -405 2715 1748 230 3199 5509 2007 -81 2792 3457 152
935A52l86L447M91j716J461J506k353j135K107r32k506J486L473q33k413K205
$$ 152 -234 3213 3704 1988 3449 4955 2602 1467 3574 2642 136 1622 5095 4262 1849 4054
951D054J825l063k135J815O21k397N67L100k0j287Q62Q28k360j562R03K68j708
$$ 4054 5879 2816 681 2496 3117 720 1287 4387 4367 3080 3942 4770 2410 848 1751 2019 311
968C11R46K858L93j363J7O77j836j908p3P29J19J193J427k25r61P81p02k501j094
$$ 311 1257 4115 4508 3145 3162 3839 2003 95 22 751 870 2063 3490 3265 2304 3085 2383 -118 -1212
987a212J564Q75n47N64J681K22j460r28j95p22m74J7R41O70J328k70n54p27p60
$$ -1212 352 1227 680 1244 2925 3147 1687 759 564 -158 -632 -615 326 996 2324 2054 1500 773 13
1006A3o18r91O4J027J109P45J26m62l09n8q35j771m1J384Q51k2O91R06K35j384
$$ 13 -605 -1596 -1532 -505 604 1349 1475 1013 704 646 -189 -1960 -2001 -617 234 212 903 1809 2044 660
1026F60r86n39o92J19M85N07O46J620L41r84j143J11p77j124j84J217J235O57
$$ 660 -326 -865 -1557 -1438 -953 -446 200 1820 2161 1177 34 145 -632 -1756 -1940 -723 512 1169
1044A169N63M03j272j042J53j328j098J269J853J02m05J244Q09j852j807k33O03
$$ 1169 1732 2135 863 -179 -26 -1354 -2452 -1183 670 772 367 1611 2420 568 -1239 -1472 -869
1061h69m45O03J222N61K55L19m71j672j207M03o8l70R12J959O07j203r7j39j107
$$ -869 -1314 -711 511 1072 1327 1646 1175 -497 -1704 -1301 -1369 -1739 -827 1132 1739 536 439 300 -807
1080h07j566L15N89J56P50J337n3r56L5j13j868j091J018J150n31J85J272J194
$$ -807 -2373 -2058 -1469 -1313 -563 774 721 -235 -200 -313 -2181 -3272 -2254 -1104 -1635 -1450 -178 1016
1098A016j452r71l08n25j219j92R88O36O98Q57k6q59o06k02n22j404P52J303K37
$$ 1016 -436 -1407 -1715 -2240 -3459 -3651 -2663 -2027 -1329 -472 -498 -1357 -1963 -2165 -2687 -4091 -3339 -2036 -1799
1117a799K5Q94M26p00j559l10k08j50N29R86O9J60O63o5j404j101O43O73o56K04
$$ -1799 -1774 -880 -454 -1154 -2713 -3023 -3231 -3381 -2852 -1866 -1797 -1637 -974 -1039 -2443 -3544 -2901 -2228 -2884 -2680
1137b680J433Q05m68l34M3m84r96j39M59M38O76P43M97n57rk42q77p27M66J037
$$ -2680 -1247 -442 -910 -1244 -1201 -1685 -2681 -2820 -2361 -1923 -1247 -504 -7 -564 -573 -815 -1692 -2419 -1953 -916
1157i16K19j2Q47O25m14m64l49n80K29K92N69j74K94J289Q1j054k29J41L06q58
$$ -916 -697 -709 138 763 349 -115 -464 -1044 -815 -523 46 -128 166 1455 1536 482 253 394 700 -158
1177a58Q9Q74N27J0k08M98k40o50Mk79M34J35O32j5K08R5J64o72m32k39J58K45
$$ -158 -69 805 1332 1342 1134 1632 1392 742 746 467 901 1036 1668 1653 1861 1956 2120 1448 1016 777 935 1180
1199A180rL30O88M30p01m97p81M30j89j39N73J56L20M31j13j011m21K69j80k90
$$ 1180 1171 1501 2189 2619 1918 1421 640 1070 881 742 1315 1471 1791 2222 2109 1098 677 946 766 476
1219D76K18Q57k76l8M20r4j088m35J57N94j84j14L97L94k41L27o41j025k88J069
$$ 476 694 1551 1275 1237 1657 1563 475 40 197 791 607 493 890 1284 1043 1370 729 -296 -584 485
1239D85p4m99J55Q82N0r96M0Ln82m50Q10P51o01o1J041m63j002M47n4r87l44J438
$$ 485 411 -88 67 949 999 3 43 46 -536 -986 -176 575 -26 -87 954 491 -511 -64 -118 -1105 -1449 -11
1261a1P06k39q65J140%p03n93k6l57M92Q59j47o77Q10J210j348j252M94J068r38
$$ -11 695 456 -409 731 731 28 -565 -591 -948 -456 403 256 -421 389 1599 251 -1001 -507 561 -377
1281c77j21J035N84n37l6Q69r37j332K71J046k91m06J367P39r90o8O42r46j106
$$ -377 -498 537 1121 584 548 1417 480 -852 -581 465 174 -232 1135 1874 884 816 1458 512 -594
1300e94J16J496J0l78P25K72q3l18k69j407j82J126R55j317K50J894Q94k035q74
$$ -594 -478 1018 1028 650 1375 1647 1564 1246 977 -430 -612 514 1469 152 402 2296 3190 1155 281
1319B81O92j22j069M91N96K7j77Q91K24q62j169P71j11j285P59J160k44k53O16
$$ 281 973 851 -218 273 869 896 719 1610 1834 972 -197 574 463 -822 -63 1097 853 600 1216
1338A216K80j224r41j77O50k37L06M50l36O65O35k54k455K18J046m08j266O60
$$ 1216 1496 272 -669 -846 -196 -433 -127 323 -13 652 1287 1033 -1422 -1204 -158 -566 -1832 -1172
1356a172J533L87p42l84K57r31r46K60O25k12N2J154L92q86j72l29j99q10K34
$$ -1172 361 748 6 -378 -121 -1052 -1998 -1738 -1113 -1325 -1273 -119 273 -613 -785 -1114 -1313 -2123 -1889
1375a889L79n2K96P52J76j78q52k63P5l99K16m96M81Q69R53n14j136R7P00n64
$$ -1889 -1510 -1562 -1266 -514 -338 -516 -1368 -1631 -1556 -1955 -1739 -2235 -1754 -885 68 -446 -1582 -1485 -785 -1349
1395a349j071J33J597M03p05P21K77l47j079J09L18k93j41P50N22j08K15L41o19
$$ -1349 -2420 -2287 -690 -287 -992 -271 6 -341 -1420 -1311 -993 -1286 -1427 -677 -155 -263 -48 293 -326
1414c26j068L75L74j48j21Q02N90J94p8m96l70l49O07l48n57O78J256L74j327
$$ -326 -1394 -1019 -645 -793 -914 -112 478 672 594 98 -272 -621 -14 -362 -919 -241 1015 1389 62
1433F2J20Q47o31q52l02Q67N56n86O97N22l36m49L86l53p55p1O07K38JL12N31
$$ 62 182 1029 398 -454 -756 111 667 81 778 1300 964 515 901 548 -207 -278 329 567 568 880 1411
1454A411k70o71l61J13J5k66j58M09Q27J62n87n82J84J98m01p89J25R13L31m0
$$ 1411 1141 470 109 222 237 -29 -187 222 1049 1211 624 42 226 424 23 -766 -641 272 603 563
1474E63m78M50j41o32m23q7K02K73J60L8J58J83J2k13m71o72L84L93k41m66R88
$$ 563 85 535 394 -238 -661 -748 -546 -273 -113 -75 83 266 278 65 -406 -1078 -694 -301 -542 -1008 -20
1495b0M41m26p03L88o7p42QM84N31m54K85J31l08k43L29l19n42O14O33k66o71
$$ -20 421 -5 -708 -320 -387 -1129 -1121 -637 -106 -560 -275 -144 -452 -695 -366 -685 -1227 -613 20 -246 -917
1516i17P62M72m39j109N38N99l97k33Q80O9n83K46M98m65r24J249J92q93Q8J118
$$ -917 -155 317 -122 -1231 -693 -94 -491 -724 156 225 -358 -112 386 -79 -1003 246 438 -455 -367 751
1536G51L51j252J59J015m87j408J057N32o99J46J006k88p33L84R70q49j289J604
$$ 751 1102 -150 9 1024 537 -871 186 718 19 165 1171 883 150 534 1504 655 -634 970
1554I70O96j349m43J410M19j602K60R06j11r73N40O45p01p5R25j7j533L69J362
$$ 970 1666 317 -126 1284 1703 101 361 1267 1156 183 723 1368 667 592 1517 1500 -33 336 1698
1573A698o72j467P85J676p83j466J047O29j390J64J094m76p96Q26R77j473j031
$$ 1698 1026 -441 344 2020 1237 -229 818 1447 57 221 1315 839 43 869 1846 373 -658
1590f58J330P37j769o98K020q1j094P8J045k29j202L93L20o53k71J169m3j228
$$ -658 672 1409 -360 -1058 962 881 -213 -135 910 681 -521 -128 192 -461 -732 437 394 -834
1608h34M44J328j025j407Q65R21j110n54J120M08r16rR89o10j017P05P42j231
$$ -834 -390 938 -87 -1494 -629 292 -818 -1372 -252 156 -760 -769 220 -390 -1407 -702 40 -1191
1626a191n28J446O99j403n20J304J62j396K09J095j35r58P00O03n72J1k39J54
$$ -1191 -1719 -273 426 -977 -1497 -193 -31 -1427 -1218 -123 -258 -1216 -516 87 -485 -474 -713 -559
1644e59m90K03N55n90k65J228N92j016m31P58O5j129J91P17J06M5K93K68n49o54
$$ -559 -1049 -846 -291 -881 -1146 82 674 -342 -773 -15 50 -1079 -888 -171 -65 -20 273 541 -8 -662
1664f62R46O4j167J92J041L92j031M10J060K8j251j02M60n8j75J27M34L57l60
$$ -662 284 348 -819 -627 414 806 -225 185 1245 1273 22 -80 380 322 147 274 708 1065 705
1683G05M03m03k20j35M00p08J64M65L90o9n00O27k11m79m50M97j10q3M43K01l37
$$ 705 1108 705 485 350 750 42 206 671 1061 992 492 1119 908 429 -21 476 366 283 726 927 590
1704E90J10O49m82j205L03P02j71o95K45P10L05p30k63K82n64o1J2K10M17NR6
$$ 590 700 1349 867 -338 -35 667 496 -199 46 756 1061 331 68 350 -214 -275 -263 -53 364 369 465
1725D65o45K75O2N8j007Q8L51J71n6qL12L5m33m6j47k95J28J73M9n27P61R01p69
$$ 465 -180 95 157 215 -792 -704 -353 -182 -238 -246 66 101 -332 -378 -525 -820 -692 -519 -470 -997 -236 665 -104
1748a04j148L04L49P0o52L95M16J02k11j10J24j06j7n32j85P05K7L8K29K7M65
$$ -104 -1252 -948 -599 -529 -1181 -786 -370 -268 -479 -589 -465 -571 -588 -1120 -1305 -600 -573 -535 -306 -279 186
1769A86m69j47r3m92L35J71N42j73j77R66o07p56K14L21L18r33M37O61R5j77J32
$$ 186 -283 -430 -523 -1015 -680 -509 33 -140 -317 649 42 -714 -500 -179 139 -794 -357 304 399 222 354
1790C54l21j4O2l63l00M71N85k51j78L71M79j50r62K55N41l36j55J72M76l40J59
$$ 354 33 19 81 -282 -582 -111 474 223 45 416 895 745 -217 38 579 243 88 260 736 396 555
1811E55j57l01K34K5M3Q5n14O58M89p66R0L59j59m88r5j8J65J81K55k11m18M90
$$ 555 398 97 331 356 399 484 -30 628 1117 351 441 800 641 153 58 40 205 386 641 430 12 502
1833E02k2k24m90J17M18m35j51R59j97k44l35K61r1k37o3j85R1L99Q5l18m5j43
$$ 502 480 256 -234 -117 301 -134 -285 674 477 233 -102 159 68 -169 -232 -417 -326 73 158 -160 -205 -348
1855c48N4J66l94l27Q19m16MJ02j05l39r2J86k3l49P18j33m63K91M88j04q06j17
$$ -348 -294 -128 -522 -849 -30 -446 -442 -340 -445 -784 -876 -690 -713 -1062 -344 -477 -940 -649 -161 -265 -1071 -1188
1877a188P67k4k52l21M66K22L1l07j2Q1Q5J73m42K1J17K83k27j60L69J63m43L0
$$ -1188 -421 -445 -697 -1018 -552 -330 -299 -606 -618 -537 -452 -279 -721 -700 -583 -300 -527 -687 -318 -155 -598 -568
1899e68Q5L89J95l9m25J79L07m6R2k68L03L18k95j93N2M52k39m31K34J00J49J31
$$ -568 -483 -94 101 62 -363 -184 123 77 169 -99 204 522 227 34 86 538 299 -132 102 202 351 482
1921D82l16J08K11P8M2m81J90J30J55M3j78P0N26k92j99l4J65pl46J51Q0J44J4
$$ 482 166 274 485 563 605 124 314 444 599 642 464 534 1060 768 569 535 700 693 347 498 578 722 736
1944G36l12M72j60J89o45M68J63Q4j93j60K9l0%k75Q2j17M98q5k89J88J52k91
$$ 736 424 896 736 925 280 748 911 995 802 642 671 641 641 366 448 331 829 744 455 643 795 504
1966E04j37n77N11L66m08k46j09M00L91n30l68K34K86n10m03L55L40L64o09M23
$$ 504 367 -210 301 667 259 13 -96 304 695 165 -203 31 317 -193 -596 -241 99 463 -146 277
1986B77k35O4j50m11j47J11N30k96k46m0P15j46j17p97O64L27p08R9j26O78k63
$$ 277 42 106 -44 -455 -602 -491 39 -257 -503 -543 172 26 -91 -888 -224 103 -605 -506 -632 46 -217
2007b17L32m53l19P8M10o18j09P02J58k32JQ7K58o60j57M04M8j51J94N33m26J3
$$ -217 115 -338 -657 -579 -169 -787 -896 -194 -36 -268 -267 -180 78 -582 -739 -335 -287 -438 -244 289 -137 -124
2029a24J44j5n32p5N31K88n92J19M85N1m07M26L1l54m6N1J9k20Q98r0l16k66K45
$$ -124 20 5 -527 -602 -71 217 -375 -256 229 280 -127 299 330 -24 -70 -19 0 -220 678 588 272 6 251
2052B51M50o34l80Q58j95l83J19O82K31o77l57N60l19k19J23L84j07m77P40p7
$$ 251 701 67 -313 545 350 -33 86 768 999 322 -35 525 206 -13 110 494 387 -90 650 573
2072E73m69j18O61n06n46M46N80k85m87L93J32m33k51M80o92R9N82M73r07j95
$$ 573 104 -14 647 141 -405 41 621 336 -151 242 374 -59 -310 170 -522 -423 159 632 -275 -470
2092d70P51Q2j054J32P59l00r38N95N35p20K0K52R8o52r3N46M8o11L83Q67o63
$$ -470 281 363 -691 -559 200 -100 -1038 -443 92 -628 -608 -356 -258 -910 -1003 -457 -409 -1020 -637 230 -433
2113d33o17M00N14o21l94M13K72k88m3J79j15k28Q70o64k88l9M06j7p67N28R33
$$ -433 -1050 -650 -136 -757 -1151 -738 -466 -754 -797 -618 -733 -961 -91 -755 -1043 -1082 -676 -693 -1460 -932 1
2134Ak44q04J76L88l2n01J07M63j65J50N0J48m08oN62l18k47L55L22j65J29l91
$$ 1 -243 -1047 -871 -483 -515 -1016 -909 -446 -611 -461 -411 -263 -671 -677 -115 -433 -680 -325 -3 -168 -39 -430
2156d30M93j96r5J52l5K40k5m2k33M21O7n2j66L3K75J75n35L16L64l75J51pn5
$$ -430 63 -133 -228 -76 -111 129 104 62 -171 250 317 265 99 132 407 582 47 363 727 352 503 496 441
2179D41M01m51L5J59k63K46P1k40K22K37O9j39m28L07L72j3p18L29L17k05k16
$$ 441 842 391 426 585 322 568 639 399 621 858 927 788 360 667 1039 1026 308 637 954 749 533
2200E33K14J85l53j14k9O3K38l44L66p2k36K7O9j54j22M28k05n26L02M17K2k13
$$ 533 747 932 579 465 436 499 737 393 759 687 451 478 547 393 271 699 494 -32 270 687 709 496
2222D96l00J59N4k02O7j69Q6l16N76L0n30j57O66k57k78k34L39K52o50L83K62
$$ 496 196 355 409 207 274 105 191 -125 451 481 -49 -206 460 203 -75 -309 30 282 -368 15 277
2243B77k53k20J85j67j78N7N07j90o71M66M90n51k94L70L49m78l48O09k26L14
$$ 277 24 -196 -11 -178 -356 -299 208 18 -653 -187 303 -248 -542 -172 177 -301 -649 -40 -266 48
2263D8k82N45m39j22J31j28q3K31O00l30n28K62M04m17j23r7M54j95j74J65LJ54
$$ 48 -234 311 -128 -250 -119 -247 -330 -99 501 171 -357 -95 309 -108 -231 -328 126 -69 -243 -78 -75 79
2285G9j29L39rm70M69J58l06l90M94M92n14j6L61K75q81J59L07L4m76J78L45n21
$$ 79 -50 289 280 -190 279 437 131 -259 235 727 213 197 558 833 -48 111 418 452 -24 154 499 -22
2307b2K87J01Nj86j56P73n23k57K07L70m18o5L57K31m60j87J91l60J3K53L23k87
$$ -22 265 366 371 185 29 802 279 22 229 599 181 116 473 704 244 57 248 -112 -99 154 477 190
2329A90j62N53j00o12k59N56L44q03n6P70j67l71J10O0l18j33K65k87j51M08K06
$$ 190 28 581 481 -131 -390 166 510 -293 -349 421 254 -117 -7 53 -265 -398 -133 -420 -571 -163 43
2350D3l81m10N75K82o26q8M7K91j09j51J86q9m26O02j98k03k79L98j0m19N43J63
$$ 43 -338 -748 -173 109 -517 -605 -558 -267 -376 -527 -341 -430 -856 -254 -452 -655 -934 -536 -546 -965 -422 -259
2372b59j53o82M56N34n38l56K91M04j24l37L94k54j47M48m5n26K07N36m46R4q6
$$ -259 -412 -1094 -638 -104 -642 -998 -707 -303 -427 -764 -370 -624 -771 -323 -368 -894 -687 -151 -597 -503 -589
2393e89M25Jm89K14J10L5K07l60R4j01J14N17l31j55K37L69k06m5q4K99j53m35
$$ -589 -164 -163 -652 -438 -328 -293 -86 -446 -352 -453 -339 178 -153 -308 -71 298 92 47 -37 262 109 -326
2415c26M11K77l55K08K2k49K93J22j23l15L26O83p11j98M36j00J8k75L05k95N38
$$ -326 85 362 7 215 237 -12 281 403 280 -35 291 974 263 65 501 401 419 144 449 154 692
2436F92k32Q0k01j52L75k1j78l67N50j09P3n5L48K7m52O4K91j02n30Q5J58l26
$$ 692 460 540 339 187 562 541 363 -4 546 437 510 455 803 830 378 442 733 631 101 186 344 18
2458A8M49J33o33MM10M16q35k01N48L4p0q8O6R5n16K71P2n02J00M89m54k35K89
$$ 18 467 600 -33 -29 381 797 -38 -239 309 343 273 185 251 346 -170 101 173 -329 -229 260 -194 -429 -140
2481a40N36m02j74L0J81j76n9o8q0K54J8k08j52Q7K52j11l44O8J36J42o59N96
$$ -140 396 -6 -180 -150 31 -145 -204 -272 -352 -98 -80 -288 -440 -353 -101 -212 -556 -488 -352 -210 -869 -273
2503b73K27o00L19j52J42l90K00J96n8l2J90L28m10L8K14j41m71J94L23K4j51
$$ -273 -46 -646 -327 -479 -337 -727 -527 -331 -389 -421 -231 97 -313 -275 -61 -202 -673 -479 -156 -132 -283
2524b83K08P9J3k11j24K85PQj08N4P3Q0J44k48q3J38K28o5j41m8N49j12l96K70
$$ -283 -75 4 17 -194 -318 -33 -26 -18 -126 -72 1 81 225 -23 -106 32 260 195 54 6 555 443 47 317
2548C17r1K69m12J46j59J35J22P0l44K88O1K08m47L3%K37j66J5J44J82Ok00j82
$$ 317 226 495 83 229 70 205 327 397 53 341 402 610 163 196 196 433 267 282 426 608 614 414 232
2571B32n6R8N7n9k6K16J09l39k03J38j82l3kJ69K01k07M8L8k84M90l53k1j02J26
$$ 232 176 274 331 272 246 462 571 232 29 167 -15 -48 -50 119 320 113 161 199 -85 405 52 31 -71 55
2595E5N6j49k12M10RQ6m36j71O5M91l41P4J2k60M86n41K04K32j75q3j34Q2nO3
$$ 55 111 -38 -250 160 169 255 -181 -352 -287 204 -137 -63 -51 -311 175 -366 -162 70 -105 -188 -322 -240 -245 -182
2619a82p4r5P8K46R0o52O7%O37l97J10k9J93j78k06r1K19o3p9K07j3K57L3j89
$$ -182 -256 -351 -273 -27 63 -589 -522 -522 115 -282 -172 -201 -8 -186 -392 -483 -264 -327 -406 -199 -212 45 78 -111
2643a11l57L49p4QP6j35J61J58M0j62j70L86n07L60k00R5J51p4j23L8M23Qn03
$$ -111 -468 -119 -193 -185 -109 -244 -83 75 115 -47 -217 169 -338 22 -178 -83 68 -6 -129 -91 332 340 -163
2666a63L05k35M76j52j65o9N01l2l10j28K38O4r6k01K24M58l05J8j7j94N4r3L4
$$ -163 142 -93 383 231 66 -3 498 466 156 28 266 330 234 33 257 715 410 428 411 217 271 178 212
2689B12n4K36j45j5o5j32L21q6k28j9L51nK35n17j60M40J14k78l13J03O06k25
$$ 212 158 394 249 234 169 37 358 272 44 25 376 371 606 89 -71 369 483 205 -108 -5 601 376
2711C76k41k23K91o0m13M3RN51k71l42J47K02j20J10j15n04M24n7k22o4J51K20
$$ 376 135 -88 203 143 -270 -227 -218 333 62 -280 -133 69 -51 59 -56 -560 -136 -193 -415 -479 -328 -108
2733a08j48R9k77J9N2l45M9K23Q8O3m93J78M57l28k35L4J28L3n0q2K40M78k97
$$ -108 -256 -157 -434 -415 -363 -708 -659 -436 -348 -285 -778 -600 -143 -471 -706 -672 -544 -511 -561 -643 -403 75 -222
2756b22k97l50N52l2o9k43P4K54jJ15j94j82M71k13j04j7P6N40r8n24K91J6K95
$$ -222 -519 -869 -317 -349 -418 -661 -587 -333 -334 -219 -413 -595 -124 -337 -441 -458 -382 158 60 -464 -173 -157 138
2779A38l92k39K85k1K85k65K63p8N7n0k27K32L13k21j17J06N13j4k59k50K69l64
$$ 138 -254 -493 -208 -229 56 -209 54 -24 33 -17 -244 -12 301 80 -37 69 582 568 309 59 328 -36
2801c6K96j9l9K42k33R6R7J16k77J77%j45p0J91L7m15M51M8l83J9J85pL2L6P1
$$ -36 260 241 202 444 211 307 404 520 243 420 420 275 205 396 433 18 469 517 134 153 338 331 363 399 470
2826D70lR5M6l76om32L32J28l3NK21o5k42J33j3K22l87M3J25m4k1L33k24k39l
$$ 470 467 562 608 232 226 -206 126 254 221 226 447 382 140 273 260 482 95 138 263 219 198 531 307 68 65
2851F5L00k87m11K86M37l03j62j32M90k22k9j75k8k0J26N4k87L47P1M1l50L13
$$ 65 365 78 -333 -47 390 87 -75 -207 283 61 32 -143 -171 -191 -65 -11 -298 49 120 161 -189 124
2873A24j60n4o1K37j09J14L2j13l13M7r3J04J67j50n8M48J17n16N12Rk37j70Q2
$$ 124 -36 -90 -151 86 -23 91 123 10 -303 -256 -349 -245 -78 -228 -286 162 279 -237 275 284 47 -123 -41
2896d1K06l05J15r2O2K70J8n25M34K76j60k08J7K24k9j31K35j48oJ18q4k33p1
$$ -41 165 -140 -25 -117 -55 215 233 -292 142 418 258 50 67 291 262 131 366 218 212 330 246 13 -58
2919e8M71N1o13L86L20n4k44l30J51J7j02L23k1Q7n6J81m26J02r0O6J27l29N30
$$ -58 413 464 -149 237 557 503 259 -71 80 97 -5 318 297 384 328 509 83 185 95 161 288 -41 489
2942D89N5n65L03R1j09n1K0q0j00K90J50m60K3p8N3J9k14p8N07l35Qj26L83k60
$$ 489 544 -21 282 373 264 213 233 153 53 343 493 33 56 -22 31 50 -164 -242 265 -70 -62 -188 195 -65
2966f5k8k30K38j57j67J43m0J71n5J02k12j29J42J03k67k09M28q1k57j58N05j56
$$ -65 -93 -323 -85 -242 -409 -266 -306 -135 -190 -88 -300 -429 -287 -184 -451 -660 -232 -313 -570 -728 -223 -379
2988c79P8m74K80r9K6K0J68m37O89l5l3n84J69K6J35j20j86M99j2k38J58k07Q0
$$ -379 -301 -775 -495 -594 -568 -548 -380 -817 -128 -163 -196 -780 -611 -585 -450 -570 -756 -257 -269 -507 -349 -556 -476
3011d76K3m43L87k7L40J16l33K0J29k7J32o36L14M68k22M0m21O49p2l17N4j81
$$ -476 -453 -896 -509 -536 -196 -80 -413 -393 -264 -291 -159 -795 -481 -13 -235 -195 -616 33 -39 -356 -302 -483
3033d83M71l83L69k34L2N88k52l9l82N72j40l40L38QK44k56j45J70k4j99J28O0
$$ -483 -12 -395 -26 -260 -228 360 108 69 -313 259 119 -221 117 125 369 113 -32 138 114 -85 43 103
3055A03N6L41l67m9O4J80J95l39K17M1j45J9k04l2M05M0l45mk76J67K48k34q9
$$ 103 159 500 133 84 148 328 523 184 401 442 297 316 112 80 485 525 180 176 -100 67 315 81 -8
3078hK81K25l34k05K03j64K85j83jn8K54o8k56L04j78j43O3J69j87Km8j45J70
$$ -8 273 498 164 -41 162 -2 283 100 99 41 295 227 -29 275 97 -46 17 186 -1 1 -47 -192 -22
3101b2k65K03L00m44K2L3L65k20n2J88n8K54l75P2j91lr3Q4l7J95O9p1m8n7j34
$$ -22 -287 -84 216 -228 -206 -173 192 -28 -80 108 50 304 -71 1 -190 -193 -286 -202 -239 -44 25 -46 -94 -151 -285
3126b85l2r2M01L6k91P8O6O2l1P3J05n19M32L37k46k42jL39j65j43R9%J5nl36
$$ -285 -317 -409 -8 28 -263 -185 -119 -57 -88 -15 90 -429 3 340 94 -148 -149 190 25 -118 -19 -19 -4 -9 -345
3151c45M82O1o3Q9j08k30L45J21l61J60kR0j97j90L82O1j37M2K99k06k22M40k56
$$ -345 137 198 135 224 116 -114 231 352 -9 151 149 239 42 -148 234 295 158 200 499 293 71 511 255
3174B55J82l74L16Jlk63J98J07k46M17l6K87n87R5j15J21k97j81M17J73Q1o33
$$ 255 437 63 379 380 377 114 312 419 173 590 554 841 254 349 234 355 58 -123 294 467 548 -85
3196h5L09m5L5j94jJ94L9Q3J4k66J73kl31K86j93J85j62K03p7P3k6L1k66m23L15
$$ -85 224 179 214 20 19 213 252 335 349 83 256 254 -77 209 16 201 39 242 165 238 212 243 -23 -446 -131
3221a31N9L18l95K32P2j38j90K99o1j93l57J08M5k41M73j23k27j77L63qk1j36
$$ -131 -72 246 -149 83 155 17 -173 126 65 -128 -485 -377 -332 -573 -100 -223 -450 -627 -264 -272 -293 -429
3243d29K00o5j19L3L10j27q6p0k58K85Q9j28j04Q2j63N44o29L74p2m3R7k76M52
$$ -429 -229 -294 -413 -380 -70 -197 -283 -353 -611 -326 -237 -365 -469 -387 -550 -6 -635 -261 -333 -376 -279 -555 -103
3266a03l55L69j90J76l5J20j61J12m37M66k04O9j27L67L92p39j42J82l1N69n65
$$ -103 -458 -89 -279 -103 -138 -18 -179 -67 -504 -38 -242 -173 -300 67 459 -280 -422 -240 -271 298 -267
3287b67K71k6Q2O5l91K95J34J05j99j39M2L87j45n9J07m00M83k72R0l38L38O1
$$ -267 4 -22 60 125 -266 29 163 268 69 -70 -28 359 214 155 262 -138 345 73 163 -175 163 224
3309B24J07j93r2K52J35l90J53k01J56K89n05K13M5O0j09K44p1l02L30k43p3J06
$$ 224 331 138 46 298 433 43 196 -5 151 440 -65 148 193 253 144 388 317 15 345 102 29 135
3331A35r2J47k73K90j51J09j47O7m0k95J82J26l26j09M62n39N55p4n7j61K40k32
$$ 135 43 190 -83 207 56 165 18 85 45 -250 -68 58 -268 -377 85 -454 101 27 -30 -191 49 -183
3353a83L37k70oJ26j43J09l40Q2J58r7J44m21N8L22q3j14k55J74M36l81Q1K20
$$ -183 154 -116 -122 4 -139 -30 -370 -288 -130 -227 -83 -504 -446 -124 -207 -321 -576 -402 34 -347 -266 -46
3375d6j13P4k0j98j11M15p8J8j34mK9j59K98m59R6L7nJ42J5L44l61K08k49J14
$$ -46 -159 -85 -105 -303 -414 1 -77 -59 -193 -197 -168 -327 -29 -488 -392 -355 -360 -218 -203 141 -220 -12 -261 -147
3399a47m3J24KQ6Q4l6k21K24l4j68Q9j40K41O0QJ94k59Q5j47k2K74k70o8L97k9
$$ -147 -190 -66 -64 22 106 70 -151 73 39 -129 -40 -180 61 121 129 323 64 149 2 -20 254 -16 -84 313 284
3424B84j16J39l8L30n70J66j30M3K28J66l57L44j36k18J51K5K4q6m0j37K78K34
$$ 284 168 307 269 599 29 195 65 108 336 502 145 489 353 135 286 311 335 249 209 72 350 584
3446E84n80K24o3j22K68j02k25K07K96j67P6j79R1j25Ok41K19j49P9q0J38J13
$$ 584 4 228 165 43 311 209 -16 191 487 320 396 217 308 183 189 -52 167 18 97 17 155 268
3468B68k53j07P9j01R0q3K6J2J13o3l06qK3L97j51l47L02k35N36m59J57kJ47k97
$$ 268 15 -92 -13 -114 -24 -107 -81 -69 44 -19 -325 -333 -310 87 -64 -411 -109 -344 192 -267 -110 -112 35 -262
3492b62J27l41J95J12j3J53k42J57q9m9o0N7j22K29k46J46K18k20R6J1l17K30
$$ -262 -135 -476 -281 -169 -182 -29 -271 -114 -203 -252 -312 -255 -377 -148 -394 -248 -30 -250 -154 -143 -460 -230
3514b30k8K00pq1N72m72j43R1K81J14n68K11J79j42K02K9J13l68L13k02q7O6J32
$$ -230 -258 -58 -65 -146 426 -46 -189 -98 183 297 -271 -60 119 -23 179 208 321 -47 266 64 -23 43 175
3537A75j19k59M29J19m25l9J93j16K24k32P1lL70k02j45J63L9l2j96J57Q4l27
$$ 175 56 -203 226 345 -80 -119 74 -42 182 -50 21 18 388 186 41 204 243 211 15 172 256 -71
3559g1O4K13J03r9m0J57n45J08J77J61r1O5n4Q2r1Q8k01j67r5K55k38K23L35o5
$$ -71 -7 206 309 210 170 327 -218 -110 67 228 137 202 148 230 139 227 26 -141 -236 19 -219 4 339 274
3583B74j31K2N1k73P7k49K31J60l61J70Q5M0j05m06K17Q8Jm5k8O5J13K06k61k43
$$ 274 143 165 216 -57 20 -229 2 162 -199 -29 56 96 -9 -415 -198 -110 -109 -154 -182 -117 -4 202 -59 -302
3607c02Rj26M82m12O4J57%j18j54K64n62M66l07K44k05K11J35l98J74J77q5j5
$$ -302 -293 -419 63 -349 -285 -128 -128 -246 -400 -136 -698 -232 -539 -295 -500 -289 -154 -552 -378 -201 -286 -301
3629c01m1j79K98j67K41J93l36j43L31k45N7J3Q6J55l53L71J80k99n6m4L43k68
$$ -301 -342 -521 -223 -390 -149 44 -292 -435 -104 -349 -292 -279 -193 -38 -391 -20 160 -139 -195 -239 104 -164
3651a64r5L54l88L96j43j2q4R2l9L64k13j80N4N42m33R1M1n0p2k03L07lJ17j45
$$ -164 -259 95 -293 103 -40 -52 -136 -44 -83 281 68 -112 -58 484 51 142 183 133 61 -142 165 162 279 134
3675A34K47Kl67j4O0o1J69J9k77K72n6K92k2j27M7m8kj88Q4J5j61J09J91j36l07
$$ 134 381 383 16 2 62 1 170 189 -88 184 128 420 398 271 318 270 268 80 164 179 18 127 318 182 -125
3700a25O17p3l47k08K43J83p0p2QO4Jl43j4K66N0k03L0kq8K11L48l24J42J4l23
$$ -125 492 419 72 -136 107 290 220 148 156 220 221 -122 -136 130 180 -23 7 5 -83 128 476 152 294 308 -15
3725a5o7k33N63q6M6j67m40N16l70J52j49K96j2o7j32j35M18m6k42j67L11K9k13
$$ -15 -82 -315 248 162 208 41 -399 117 -253 -101 -250 46 34 -33 -165 -300 118 72 -170 -337 -26 3 -210
3748b10K15k59K36l29N3j99M05l6j22pJ73m44P08k92K31k61J66j2n38J53M06L33
$$ -210 5 -254 -18 -347 -294 -493 -88 -124 -246 -253 -80 -524 184 -108 123 -138 28 16 -522 -369 37 370
3770C70m27o2j92K43j94K0J92L4J97o4q3K49j99K75k53k12J07J70m1p4q1L17j26
$$ 370 -57 -119 -311 -68 -262 -242 -50 -16 181 117 34 283 84 359 106 -106 1 171 130 56 -25 292 166
3793A66j2j58N2K20k02J8K25j0J11k43j41J73K6J99l62N6J3k36L66j83R3kK14
$$ 166 154 -4 48 268 66 84 309 299 410 167 26 199 225 424 62 118 131 -105 261 78 171 169 383
3816C83k54L03k58K72K6l28O4P9j00j47j68M60j89Q4m2J54n02L09OR8N1J19k18
$$ 383 129 432 174 446 472 144 208 287 187 40 -128 332 143 227 185 339 -163 146 152 250 301 420 202
3839B02m70L07j53K42j9j00j63J27J17l23Lj11K07k2n1NJ04o8R8j52Q6m9j88O5
$$ 202 -268 39 -114 128 109 9 -154 -27 90 -233 -230 -341 -134 -156 -207 -202 -98 -166 -68 -220 -134 -183 -371 -306
3863c06L72n11L44j96r7J94Q8l03R5l8J46K21K6r2l0P1j59k58J13J27L5j21K7
$$ -306 66 -445 -101 -297 -394 -200 -112 -415 -320 -358 -212 9 35 -57 -87 -16 -175 -433 -320 -193 -158 -279 -252
3886b52P2L16n65K12K6P0j66J86j18K52m35J99J86l02K29O6N6l77O2L87P6J7j90
$$ -252 -180 136 -429 -217 -191 -121 -287 -101 -219 33 -402 -203 -17 -319 -90 -24 32 -345 -283 104 180 197 7
3909Gk3K2k89M69l29J76j6rj10L50k4j61O2l62LN63m24J31J49k2M78j91k71O4
$$ 7 -16 6 -283 186 -143 33 17 8 -102 248 224 63 125 -237 -234 329 -95 36 185 163 641 450 179 243
3933B43R1r1j93P5L48l44J14J97k35nq7n2J1J76J20k39k62K49O4k2k56J97J1o
$$ 243 334 243 50 125 473 129 243 440 205 200 113 61 72 248 368 129 -133 116 180 158 -98 99 110 104
3957A04J12j29J44M0j06p7q0pO5n1j70K52K2j49J02P4j72pN0j93l17L63K9j10
$$ 104 216 87 231 271 165 88 8 1 66 15 -155 97 119 -30 72 146 -26 -33 17 -176 -493 -130 -101 -211
3981b11K17l28K96k17j47J05N1k3K56j55j46K21j3j91K8J39jl2K2r3L42k63J77
$$ -211 6 -322 -26 -243 -390 -285 -234 -257 -1 -156 -302 -81 -94 -285 -257 -118 -119 -151 -129 -222 120 -143 34
4004C4k49J40O9nn03K79M2j37L10p1l3J78p5j56Jj48K47n6J59k3j61Q3q6L0N2
$$ 34 -215 -75 -6 -11 -514 -235 -193 -330 -20 -91 -124 54 -21 -177 -176 -324 -77 -133 26 3 -158 -75 -161 -131 -79
4029g9J96J38q4q1K2k12j30N9QK91j61M87j18n9n7k25J59m1k54K10K65j90J59
$$ -79 117 255 171 90 112 -100 -230 -171 -163 128 -33 454 336 277 220 -5 154 113 -141 69 334 144 303
4052C03q8pJ98k94m1Kn4K82p3o6o5M5k22M99j46p3l01K39N9j84K36l22O37j66
$$ 303 215 208 406 112 71 73 19 301 228 162 97 142 -80 419 273 200 -101 138 197 13 249 -73 564 398
4076C98l23j73L03j76n7k16L12N7K9P1j59J04k89L31n52P4M47k15L03k68j91L14
$$ 398 75 -98 205 29 -28 -244 68 125 154 225 66 170 -119 212 -340 -266 181 -34 269 1 -190 124
4098A24J51k35k65n5O45n21q8J48N7j40J2j31L35k83oN0O5L96l05j1o2j85J62
$$ 124 275 40 -225 -280 365 -156 -244 -96 -39 -179 -167 -298 37 -246 -252 -202 -137 259 -46 -57 -119 -304 -142
4121a42N9m04L89M3j12p7J24k80K65j57j35L19j58K47P1m10J68qR1p3j85J18J55
$$ -142 -83 -487 -98 -55 -167 -244 -120 -400 -135 -292 -427 -108 -266 -19 52 -358 -190 -198 -107 -180 -365 -247 -92
4144i2J15j15k6j26J1M70o42Q7L27n4n4K12n8j47K2K79l33J77J93j67K3KK46j65
$$ -92 23 -92 -118 -244 -233 237 -405 -318 9 -45 -99 113 55 -92 -70 209 -124 53 246 79 102 104 350 185
4168A85r1m9K94k41j23K2j26K46J82l17J6RJ24K78m43J15K07k90K35j98p1J92
$$ 185 94 45 339 98 -25 -3 -129 117 299 -18 -2 7 131 409 -34 81 288 -2 233 35 -36 156
4190A56l0m6k56N3M61k55K42j11j23L12r3k27nK4K27l83j48r9M23m00K64L04k71
$$ 156 126 80 -176 -123 338 83 325 214 91 403 310 83 78 102 329 -54 -202 -301 122 -278 -14 290 19
4213A9j01M7M15l50q9p3j1K8J98j62o5j98K18J70k29K91l96K93j43K10o1m17K04
$$ 19 -82 -35 380 30 -59 -132 -143 -115 83 -79 -144 -342 -124 46 -183 108 -288 5 -138 72 11 -406 -202
4236b02j7k72K39K29k11J22j78J81k50K93l07J88l4l4m8J42Q5k6k40K59O3k10
$$ -202 -219 -491 -252 -23 -234 -112 -290 -109 -359 -66 -373 -185 -219 -253 -301 -159 -74 -100 -340 -81 -18 -228
4258b28J66J97lj44l5J82n42J87M6K4j8k4J4K38j1j01%p5O9k3J16k18J98J29p6
$$ -228 -62 135 132 -12 -47 135 -407 -220 -174 -150 -168 -192 -178 60 49 -52 -52 -127 -58 -81 35 -183 15 144 68
4283F8O3J54m8m5k02L35j65o6J73%J04m02J50j67J35J04K2j64J91j10J05k9L1
$$ 68 131 285 237 192 -10 325 160 94 267 267 371 -31 119 -48 87 191 213 49 240 130 235 206 237
4306B37J78q7j80K41k84j89L67k85o4P9K86m6k00J87k07K29m6k6j18J79mL5k14
$$ 237 415 328 148 389 105 -84 283 -2 -66 13 299 253 53 240 33 262 216 190 72 251 247 282 68
4329F8J06k20J40j59j12M59l39K06J42m37J9m1L67k26Kj16j44L54m48L46j61l2
$$ 68 174 -46 94 -65 -177 282 -57 149 291 -146 -127 -168 199 -27 -25 -141 -285 69 -379 -33 -194 -226
4351b26J57j34k08J68P6O2k5rn4J29k04M9J34L27o41J57n8L86L7l68L10p0j85
$$ -226 -69 -203 -411 -243 -167 -105 -130 -139 -193 -64 -268 -219 -85 242 -399 -242 -300 86 123 -245 65 -5 -190
4374a90M0j49K26J8L6j68K28m36L96j68J53PJ18l14JK21L5l52J88J27NM15l06
$$ -190 -150 -299 -73 -55 -19 -187 41 -395 1 -167 -14 -7 111 -203 -202 19 54 -298 -110 17 22 437 131
4397A31j86q5N0m6j59J54N9Q7j4j96N60k27J28l50J56J83m13J31N6N1K08j23k09
$$ 131 -55 -140 -90 -136 -295 -141 -82 5 -9 -205 355 128 256 -94 62 245 -168 -37 19 70 278 155 -54
4420e4J43k4l8L5J74j82J39Rj99J50Q2j71K04k80J47j32K56q5RM2R7O8m57J58
$$ -54 89 65 27 62 236 54 193 202 3 153 235 64 268 -12 135 3 259 174 183 225 322 390 -67 91
4444I1qk72M68m19L30n1J3J02j32l2J29j06K0j5j92K05k19j10K69P3rk18O2j13
$$ 91 83 -189 279 -140 190 139 152 254 122 90 219 113 133 118 -74 131 -88 -198 71 144 135 -83 -21 -134
4468a34J75k14q4L62J2m2K13n75M00j7j20J43n75N22j20j77k2K71l27K32J19j42
$$ -134 41 -173 -257 105 117 75 288 -287 113 96 -24 119 -456 66 -54 -231 -253 18 -309 -77 42 -100
4490a00K67k40j35K81l20Q9r1o9J23L1N8J56j20j61l9R6O9O4k28J92l39J92j6
$$ -100 167 -73 -208 73 -247 -158 -249 -318 -195 -164 -106 50 -70 -231 -270 -174 -105 -41 -269 -77 -416 -224 -240
4513b40L42k30j68M17j39o0k94M32l52K31Q3o2R8j33j4j01K75k16K39n5j35K54
$$ -240 102 -128 -296 121 -18 -78 -372 60 -292 -61 22 -40 58 -75 -89 -190 85 -131 108 53 -82 172
4535A72j94J50k43M0K42J91Lk97j2k30K91pj11k1K35j4n8R1l44L35N5q4l89K69
$$ 172 -22 128 -115 -75 167 358 361 64 52 -178 113 106 -5 -26 209 195 137 228 -116 219 274 190 -199 70
4559G0r9J90j49j34L29J39l10j89K33k9M44o28K09Pj15J21k34M0J22L00j22k60
$$ 70 -29 161 12 -122 207 346 36 -153 80 51 495 -133 76 83 -32 89 -145 -105 17 317 195 -65
4581f5L29l24m20M70j34K74q0k51J76J43j23J56k46J64j28j76L47K04l33j01K1
$$ -65 264 -60 -480 -10 -144 130 50 -201 -25 118 -5 151 -95 69 -59 -235 112 316 -17 -118 -97
4602i7Qq9K79j88P3m69L86L17l89r0O2R5k26M77k61j1J10k26N0m0J46j46J4j14
$$ -97 -89 -178 101 -87 -14 -483 -97 220 -169 -259 -197 -102 -328 149 -112 -123 -13 -239 -189 -229 -83 -229 -215 -329
4626c29Q6L24j33p4j68M10J48m56k55J56K87k69J39L5Q8R2j51k34L87j82J19o9
$$ -329 -243 81 -52 -126 -294 116 264 -192 -447 -291 -4 -273 -134 -99 -11 81 -70 -304 83 -99 20 -49
4648d9r7NJ58m04L88r1L93k53j48M9J91j5O3J06j68j36j06j9J07J3J40N2n20M01
$$ -49 -146 -141 17 -387 1 -90 303 50 -98 -49 142 127 190 296 128 -8 -114 -133 -26 -13 127 179 -341 60
4672F0p3J66K40l50O0J39m53J80O0N9nJ81j92K70j29P1j71K73l41rJ48j9l6J02
$$ 60 -13 153 393 43 103 242 -211 -31 29 88 83 264 72 342 213 284 113 386 45 36 184 165 129 231
4696B31O5l76K34L08l69J27k15J56l32K14M7K87l46j26N00j34j87O4j14J85L3
$$ 231 296 -80 154 462 93 220 5 161 -171 43 90 377 31 -95 405 271 84 148 34 219 252
4717B52m66L09j16R2k54J85J6r5l22K33J24M09n04l2K10k0j40l8J12k12K72k74
$$ 252 -214 95 -21 71 -183 2 18 -77 -399 -166 -42 367 -137 -169 41 21 -119 -157 -45 -257 15 -259
4739b59J30j11j99M72l85L34nl0O6j00J54j71j30k5j4L1L02o8p5j56jQ0Jk71J25
$$ -259 -129 -240 -439 33 -352 -18 -23 -53 13 -87 67 -104 -234 -259 -273 -242 60 -8 -83 -239 -240 -160 -159 -430 -305
4764c05K66j53J07k06L54L2p5j67j17L46j13N3j04R6K38j4k60K5Q4p7p2J98j99
$$ -305 -39 -192 -85 -291 63 95 20 -147 -264 82 -31 22 -82 14 252 238 -22 3 87 10 -62 136 -63
4787f3p2M5K1p7K33j91L86m9j65P8R3m33J56M38k95J9j51J84J29k11J62k89K31
$$ -63 -135 -90 -69 -146 87 -104 282 233 68 146 239 -194 -38 400 105 124 -27 157 286 75 237 -52 179
4810A79K51m51K4Q0P9Q2j33L68j48k00J15j76OMj81K78j6K33j11k05J35p2j40
$$ 179 430 -21 3 83 162 244 111 479 331 131 246 70 76 80 -101 177 161 394 283 78 213 141 1
4833AP2J45m83M08j0k10Q6j83L98k73q1k3M8J56QJ0n0J5M3j26q3O2j92J37q6J80
$$ 1 73 218 -265 143 133 -77 9 -174 224 -49 -130 -153 -105 51 59 69 19 34 77 -49 -132 -70 -262 -125 -211 -31
4859c1r8J4j6j53J49p0J43l20K93o8L19k67j35J11p3L9Q5k7j61O3L42j30l38K39
$$ -31 -129 -115 -131 -284 -135 -205 -62 -382 -89 -157 162 -105 -240 -129 -202 -163 -78 -105 -266 -203 139 9 -329 -90
4883i0K84j93k98O4R1o3L23n6j57J12m6M1j87J46M1P2j21nK4J14l4K51k42k42
$$ -90 194 1 -297 -233 -142 -205 118 62 -95 17 -29 12 -175 -29 12 84 -37 -42 -18 96 62 313 71 -171
4907a71J23J35K9j15J6j33L23j73k4j41M46q5j45r7M7j31K09K87j81p7Q3O8l17
$$ -171 -48 87 116 1 17 -116 207 34 10 -131 315 230 85 -12 35 -96 113 400 219 142 225 293 -24
4930b4J71M3j77J96J81o67L80O2j44J24k64K47j16J12J76j00L9m3j12l5K00k01
$$ -24 147 190 13 209 390 -277 103 165 21 145 -119 128 12 124 300 200 239 196 84 49 249 48
4952D8J01j01J44j53K5k9K8J10l29N13m16n8K38l11K77j39j74L66J5j36k28J38
$$ 48 149 48 192 39 64 35 63 173 -156 357 -59 -117 121 -190 87 -52 -226 140 155 19 -209 -71
4974g1Q8n2K5l23M95k76R4j37L54n04J6L85l59K2J65n4NJ0L21l59n8j19M8M57
$$ -71 17 -35 -10 -333 162 -114 -20 -157 197 -307 -291 94 -265 -243 -78 -132 -127 -117 204 -155 -213 -332 -284 173
4998A73l74K91j51j71K11j91J49k45M69n3l82J6L31l08L27m08L49M2k08L37l50
$$ 173 -201 90 -61 -232 -21 -212 -63 -308 161 108 -274 -258 73 -235 92 -316 33 75 -133 204 -146
5019a46M4j80L22k69mK09Q4r9N6o0M7L94o96K35M16j41j67j23o0J8J67R9k7oJ04
$$ -146 -102 -282 40 -229 -233 -24 60 -39 17 -43 4 398 -298 -63 353 212 45 -78 -138 -120 47 146 119 113 217
5044B17j60o4M2j42L12K7k5k76K97m38K20k09K43J77p6N2r9q1L16l67O0j98N2
$$ 217 57 -7 35 -107 205 232 207 -69 228 -210 10 -199 44 221 145 197 98 17 333 -34 26 -172 -120
5067a20L47l78K55K08k14Mk06L04k66R7K10l01jJ35k39N1K06m9J6J31l46J18j4
$$ -120 227 -151 104 312 98 102 -104 200 -66 31 241 -60 -61 74 -165 -114 92 43 59 190 -156 -38 -52
5090e2K59j96m1k5J88p6L9J6r7rk02K09j36K39M7j46J46k20k16K58j33L65k31
$$ -52 207 11 -30 -55 133 57 96 112 15 6 -196 13 -123 116 163 17 163 -57 -273 -15 -148 217 -14
5113a4k01l05K56M63k83j89J44J57j10j77L82k84P6J6O2j58L6J19j32K8j5K18
$$ -14 -215 -520 -264 199 -84 -273 -129 28 -82 -259 123 -161 -85 -69 -7 -165 -129 -10 -142 -114 -129 89
5135H9k59N7k85K57k1J50j43j77K02K64j74k79M48q2p4r4L33j33J55K16n18Q7
$$ 89 -170 -113 -398 -141 -162 -12 -155 -332 -130 134 -40 -319 129 47 -27 -121 212 79 234 450 -68 19
5157A9p6j15r3K93j02J21N7k3Q5n4j37J04k07J40j42J79K7q9J73l10K93k37O7
$$ 19 -57 -172 -265 28 -74 47 104 81 166 112 -25 79 -128 12 -130 49 76 -13 160 -150 143 -94 -27
5180b7K39j40p0k2K01K53k22l21P2J22J01j61j66L23K96k01m52L16J52n3j00k27
$$ -27 212 72 2 -20 181 434 212 -109 -37 85 186 25 -141 182 478 277 -175 141 293 240 140 -87
5202h7J49J43l26K71k20J48l69M08n18M65r9O3O5j76J39j78J29K5K5j80j08O6
$$ -87 62 205 -121 150 -70 78 -291 117 -401 64 -35 28 93 -83 56 -122 7 32 57 -123 -231 -165
5224a65J14J16m6q0k34L91l8Q4m03P9Q1m9J3J50K92k98j91K40k96k55M66m5O8
$$ -165 -51 65 19 -61 -295 96 58 142 -261 -182 -101 -150 -137 13 305 7 -184 56 -240 -495 -29 -74 -6
5247fR5j62q4k08K31K19q8J19r0j79l9K51J76l04K4J06J2j51pN5k30N40o02N10
$$ -6 89 -73 -157 -365 -134 85 -3 116 26 -153 -192 59 235 -69 -45 61 73 -78 -85 -30 -260 280 -322 188
5271A88j67o9J08k51P1R7K74q5Pj97L41l03m7j10M3R2M3k17J61J27N2J38r0k66
$$ 188 21 -48 60 -191 -120 -23 251 166 173 -24 317 14 -33 -143 -100 -8 35 -182 -21 106 158 296 206 -60
5295f0J61P3j61M28o2l27K50n2K27m46M6M64o51J59P4NK91m96J21kK89k08J05
$$ -60 101 174 13 441 379 52 302 250 477 31 77 541 -110 49 123 128 419 -77 44 42 331 123 228
5318B28k65L0J09l21J07K92k10N2l4q3J2K51k88JR9M8K26j19m0j04N0L1k17K71
$$ 228 -37 -7 102 -219 -112 180 -30 22 -12 -95 -83 168 -120 -119 -20 28 254 135 95 -9 41 72 -145 126
5342A26J1l77L54k88K25k40L69j50K4L07m35K22r2K05o20L12M7j54L1jM8J70j65
$$ 126 137 -240 114 -174 51 -189 180 30 54 361 -74 148 56 261 -359 -47 0 -154 -123 -124 -76 94 -71
5365g1J22k30N5q1k1K66j14p8r8k21J64L90n1j52p2M7j35M18k30K61k7l3m80K42
$$ -71 51 -179 -124 -205 -226 40 -74 -152 -250 -471 -307 83 32 -120 -192 -145 -280 138 -92 169 142 109 -371 -129
5389a29L97k47j59K58j94L64l35j85L22m07N11k0l22rK77M7J54j24k00J62l41
$$ -129 268 21 -138 120 -74 290 -45 -230 92 -315 196 176 -146 -155 122 169 323 199 -1 161 -180
5410a80J97r2J09l3J62k09k21M79P7l05j01M86l21K28m52J11K50K33l21j05k3
$$ -180 17 -75 34 1 163 -46 -267 212 289 -16 -117 369 48 276 -176 -65 185 418 97 -8 -31
5431c1L99l01J18j08j63L65M0k46J59n9j07M2m4j39L94l04J8J5P4J0J03j5j88
$$ -31 368 67 185 77 -86 279 319 73 232 173 66 108 64 -75 319 15 33 48 122 132 235 220 32
5454C2Q4q2M1l61K57J7P2l25J15J52k05J25N0n3k9Q6j86K6P1J15M0K7l77K11K3
$$ 32 116 34 75 -286 -29 -12 60 -265 -150 2 -203 -78 -28 -81 -110 -24 -210 -184 -113 2 42 69 -308 -97 -74
5479g4l1M8j57L63l16J19J53j63l8p4J04k19K47J22l95L06j31r9Q9rj15K37%R1
$$ -74 -105 -57 -214 149 -167 -48 105 -58 -96 -170 -66 -285 -38 84 -311 -5 -136 -235 -146 -155 -270 -33 -33 58
5503E8j30k40j46L06j29J09P7m26N79m46J73J50L2J07J5l00l5J57J9K35j47o4
$$ 58 -72 -312 -458 -152 -281 -172 -95 -521 58 -388 -215 -65 -33 74 89 -211 -246 -89 -70 165 18 -46
5525d6k81K52R6j62QP9J20m3N0j07L5q2J13J1kl3M72k50n3r0J93k08k26L55q8
$$ -46 -327 -75 21 -141 -133 -54 66 23 73 -34 1 -81 32 43 41 8 480 230 177 87 280 72 -154 201 113
5550A13P2J02p2j20k30J96Q7o2Qj9J50j14j72J17j10N8K55k12%j16N0j66K36J11
$$ 113 185 287 215 95 -135 61 148 86 94 75 225 111 -61 56 -54 4 259 47 47 -69 -19 -185 51 162
5574A62NLj45J18j7k96K37j77J3L00m08K62k1n1J56J24l72P7L4j05M7j24K74R4
$$ 162 167 170 25 143 126 -170 67 -110 -97 203 -205 57 36 -15 141 265 -107 -30 4 -101 -54 -178 96 190
5598A90j65M8q8o6J25R1k29J09j41J0k09J62R0p0K95k09R4k60P1N4J5J03j21j36
$$ 190 25 73 -15 -81 44 135 -94 15 -126 -116 -325 -163 -73 -143 152 -57 37 -223 -152 -98 -83 20 -101 -237
5622b37K1L09k43m4K12j59J10J65k21k63M00j33m1k6L87k1k63J11j6m67K17J13
$$ -237 -216 93 -150 -194 18 -141 -31 134 -87 -350 50 -83 -124 -150 237 216 -47 64 48 -419 -202 -89
5644h9Pm0o0L1o1K53J48k19j7k70M21p8j07J50l16M23j74L13j61r2q5J6R5K8M2
$$ -89 -82 -122 -182 -151 -212 41 189 -30 -47 -317 104 26 -81 69 -247 176 2 315 154 62 -23 -7 88 116 158
5669A58j7J1K10k90J38j20K16p1n3j85J58j89L80j23l1o2K05j34j62p3j46K7l
$$ 158 141 152 362 72 210 90 306 235 182 -3 155 -34 346 223 192 130 335 201 39 -34 -180 -153 -156
5692a56M54j48k05K68J3k27P8j36K05l4M0j19J79k35j53M09k69O7j2j07L21r4
$$ -156 298 150 -55 213 226 -1 77 -59 146 112 152 33 212 -23 -176 233 -36 31 19 -88 233 139
5714A39j41r9K78k95R5j09j53O63l75J07k65K41j91L17k41j32J95j96J08N5M5
$$ 139 -2 -101 177 -118 -23 -132 -285 378 3 110 -155 86 -105 212 -29 -161 34 -162 -54 1 46
5735D6K6O3l74R8K43k47M2Mj96J3K11Ok16J67o2K1N8j67L25l67J68J03R4r7k1
$$ 46 72 135 -239 -141 102 -145 -103 -99 -295 -282 -71 -65 -281 -114 -176 -155 -97 -264 61 -306 -138 -35 59 -38 -59
5760e9K98l71N1k9K86k15K29k58q6L9j49J29r7J15J67n4J77k53K26k81K27j02
$$ -59 239 -132 -81 -110 176 -39 190 -68 -154 -115 -264 -135 -232 -117 50 -4 173 -80 146 -135 92 -10
5782a0K29j25q8J65k17l2J88k69J69M10l75J01j93K42J84l80j4j25k4N00m09K50
$$ -10 219 94 6 171 -46 -78 110 -159 10 420 45 146 -47 195 379 -1 -15 -140 -164 336 -73 177
5804A77n3J72k22loj14P4J76P1l56J35NK96n93L90j35j42K55l40J81K37l15K99
$$ 177 124 296 74 71 65 -49 25 201 272 -84 51 56 352 -241 149 14 -128 127 -213 -32 205 -110 189
5827A89P7m41L61J52k41j42k6j23J1K49Q1j65j5Oj81M47j30j47J85j75Jj9P3J7
$$ 189 266 -175 186 338 97 -45 -71 -194 -183 66 147 -18 -33 -27 -208 239 109 -38 147 -28 -27 -46 27 44
5851D4k13P4j41J70j81j3L46m11M73k15j8j40k2K60L4k51M99j97j02k7N4j38J66
$$ 44 -169 -95 -236 -66 -247 -260 86 -325 148 -67 -85 -225 -247 13 47 -204 295 98 -4 -31 23 -115 51
5874E1j92j13L64q3l9j82J26J37k04N6l10M81j36K8P3o3n6j32K45jj89j0J21K19
$$ 51 -141 -254 110 27 -12 -194 -68 69 -135 -79 -389 92 -44 -16 57 -6 -62 -194 51 50 -139 -149 -28 191
$$ [...]
8191B7
##END NTUPLES=NMR FID
##END=
