##TITLE=1H_LR-689-A-CK-1
 CDCl3, 8 sc, 
 23.10.2019
##JCAMPDX= 6.0         $$ Bruker NMR JCAMP-DX V2.0
##DATA TYPE= NMR FID
##DATA CLASS= NTUPLES
##ORIGIN= UXNMR, Bruker Analytische Messtechnik GmbH
##OWNER= root
$$ XWIN-NMR		Version 3.5
$$ Wed Oct 23 15:43:07 2019 Russian Standard Time (UT+4h)  she@DPX200
##.OBSERVE FREQUENCY= 200.1315
##.OBSERVE NUCLEUS= ^1H
##.DELAY= (6, 6)
##.ACQUISITION MODE= SIMULTANEOUS
##.ACQUISITION SCHEME= undefined
##.AVERAGES= 8
##.DIGITISER RES= 18
##SPECTROMETER/DATA SYSTEM= spect
##.PULSE SEQUENCE= zg30
##.SOLVENT NAME= CDCl3
##.SHIFT REFERENCE= (INTERNAL, CDCl3, 0, 15.7039)
##AUDIT TRAIL= $$ (NUMBER, WHEN, WHO, WHERE, WHAT)
$$ ##TITLE= Audit trail, XWIN-NMR		Version 3.5
$$ ##JCAMPDX= 5.01
$$ ##ORIGIN= Bruker BioSpin GmbH
$$ ##OWNER= she
$$ F:/spectra/data/she/nmr/H-F/1/audita.txt
$$ ##AUDIT TRAIL=  $$ (NUMBER, WHEN, WHO, WHERE, WHAT)
(   1,<2019-10-23 15:41:46.35 +0400>,<she>,<DPX200>,
      <created by zg, POWCHK disabled, PULCHK disabled
       configuration hash MD5:
       00 E9 B6 7A A2 85 ED C7 34 08 36 98 17 FE 4E 26
       data hash MD5: 16K
       E2 9B 53 33 30 49 C2 B9 24 18 81 B2 82 E4 C8 4B>)
$$ ##END=
$$ 
$$ hash MD5
$$ 04 29 A7 14 C3 54 E7 7B E2 4C F8 A1 67 AB 1D FC
##$RELAX= 
##$RELAX= 
##$RELAX= 
##$RELAX= 
##$RELAX= 
##$RELAX= 
$$ Bruker specific parameters
$$ --------------------------
##$DU= <F:/spectra>
##$EXPNO= 1
##$NAME= <H-F>
##$PROCNO= 1
##$TYPE= <nmr>
##$USER= <she>
##$AMP= (0..31)
100 100 100 100 100 100 100 100 100 100 100 100 100 100 100 100 100 100 
100 100 100 100 100 100 100 100 100 100 100 100 100 100 
##$AQSEQ= 0
##$AQ_mod= 1
##$AUNM= <au_zg>
##$AUTOPOS= <>
##$BF1= 200.13
##$BF2= 200.13
##$BF3= 200.13
##$BF4= 200.13
##$BF5= 200.13
##$BF6= 200.13
##$BF7= 200.13
##$BF8= 200.13
##$BYTORDA= 1
##$CFDGTYP= 0
##$CFRGTYP= 5
##$CHEMSTR= <none>
##$CNST= (0..31)
1 1 145 1 1 1 1 1 1 1 1 1 1 1 1 1 1 1 1 1 1 1 1 1 1 1 1 1 1 1 1 1 
##$CPDPRG= <>
##$CPDPRG1= <>
##$CPDPRG2= <>
##$CPDPRG3= <>
##$CPDPRG4= <mlev>
##$CPDPRG5= <mlev>
##$CPDPRG6= <mlev>
##$CPDPRG7= <mlev>
##$CPDPRG8= <mlev>
##$CPDPRGB= <>
##$CPDPRGT= <>
##$D= (0..31)
0 1.2 0 0 0 0 0 0 0 0.06 0 0.03 0 0 0 0 0.0002 0 0 0 0 0 0 0 0 0 0 0 0 
0 0 0 
##$DATE= 1571830905
##$DBL= (0..7)
120 120 120 120 120 120 120 120 
##$DBP= (0..7)
150 150 150 150 150 150 150 150 
##$DBP07= 0
##$DBPNAM0= <>
##$DBPNAM1= <>
##$DBPNAM2= <>
##$DBPNAM3= <>
##$DBPNAM4= <>
##$DBPNAM5= <>
##$DBPNAM6= <>
##$DBPNAM7= <>
##$DBPOAL= (0..7)
0.5 0.5 0.5 0.5 0.5 0.5 0.5 0.5 
##$DBPOFFS= (0..7)
0 0 0 0 0 0 0 0 
##$DE= 6
##$DECBNUC= <off>
##$DECIM= 24
##$DECNUC= <off>
##$DECSTAT= 4
##$DIGMOD= 1
##$DIGTYP= 9
##$DL= (0..7)
0 120 120 120 120 120 120 120 
##$DP= (0..7)
150 150 150 150 150 150 150 150 
##$DP07= 0
##$DPNAME0= <>
##$DPNAME1= <>
##$DPNAME2= <>
##$DPNAME3= <>
##$DPNAME4= <>
##$DPNAME5= <>
##$DPNAME6= <>
##$DPNAME7= <>
##$DPOAL= (0..7)
0.5 0.5 0.5 0.5 0.5 0.5 0.5 0.5 
##$DPOFFS= (0..7)
0 0 0 0 0 0 0 0 
##$DQDMODE= 0
##$DR= 18
##$DS= 0
##$DSLIST= <SSSSSSSSSSSSSSS>
$$ [...]
##$SUBNAM2= <"">
##$SUBNAM3= <"">
##$SUBNAM4= <"">
##$SUBNAM5= <"">
##$SUBNAM6= <"">
##$SUBNAM7= <"">
##$SUBNAM8= <"">
##$SUBNAM9= <"">
##$SW= 24.0689530833862
##$SWIBOX= (0..15)
0 0 2 0 0 0 0 0 0 0 0 0 0 0 0 0 
##$SW_h= 4816.95568400771
##$TD= 16384
##$TD0= 1
##$TE= 0
##$TE2= 300
##$TE3= 300
##$TEG= 300
##$TL= (0..7)
0 120 120 120 120 120 120 120 
##$TP= (0..7)
150 150 150 150 150 150 150 150 
##$TP07= 0
##$TPNAME0= <>
##$TPNAME1= <>
##$TPNAME2= <>
##$TPNAME3= <>
##$TPNAME4= <>
##$TPNAME5= <>
##$TPNAME6= <>
##$TPNAME7= <>
##$TPOAL= (0..7)
0.5 0.5 0.5 0.5 0.5 0.5 0.5 0.5 
##$TPOFFS= (0..7)
0 0 0 0 0 0 0 0 
##$TUNHIN= 0
##$TUNHOUT= 0
##$TUNXOUT= 0
##$USERA1= <user>
##$USERA2= <user>
##$USERA3= <user>
##$USERA4= <user>
##$USERA5= <user>
##$V9= 5
##$VALIST= <valist>
##$VCLIST= <CCCCCCCCCCCCCCC>
##$VD= 0
##$VDLIST= <DDDDDDDDDDDDDDD>
##$VPLIST= <PPPPPPPPPPPPPPP>
##$VTLIST= <TTTTTTTTTTTTTTT>
##$WBST= 1024
##$WBSW= 4
##$XGAIN= (0..3)
0 0 0 0 
##$XL= 0
##$YL= 0
##$YMAX_a= 293201
##$YMIN_a= -314878
##$ZGOPTNS= <>
##$ZL1= 120
##$ZL2= 120
##$ZL3= 120
##$ZL4= 120
##$ABSF1= 10
##$ABSF2= 0
##$ABSG= 5
##$ABSL= 3
##$ALPHA= 0
##$AQORDER= 0
##$ASSFAC= 0
##$ASSFACI= 0
##$ASSFACX= 0
##$ASSWID= 0
##$AUNMP= <proc_1d>
##$AZFE= 0.1
##$AZFW= 0.1
##$BCFW= 1
##$BC_mod= 2
##$BYTORDP= 1
##$COROFFS= 0
##$CY= 11.3945322036743
##$DATMOD= 1
##$DC= 2
##$DFILT= <>
##$DTYPP= 0
##$F1P= 20.1720416913024
##$F2P= 0.152960286110954
##$FCOR= 0.5
##$FTSIZE= 0
##$FT_mod= 4
##$GAMMA= 1
##$GB= 0.15
##$INTBC= 1
##$INTSCL= 1
##$ISEN= 128
##$LB= 0.24
##$LEV0= 0
##$LPBIN= 0
##$MAXI= 10000
##$MC2= 0
##$MEAN= 0
##$ME_mod= 0
##$MI= 1.114404
##$NCOEF= 0
##$NC_proc= 0
##$NLEV= 6
##$NOISF1= 3.799351
##$NOISF2= 2.8
##$NSP= 1
##$NTH_PI= 0
##$NZP= 0
##$OFFSET= 15.70392
##$PC= 1
##$PHC0= -9567.725
##$PHC1= 8.600797
##$PH_mod= 1
##$PKNL= yes
##$PPARMOD= 0
##$PSCAL= 0
##$PSIGN= 0
##$REVERSE= no
##$SF= 200.130013532006
##$SI= 16384
##$SIGF1= 3
##$SIGF2= 2
##$SINO= 400
##$SIOLD= 16384
##$SREGLST= <1H.CDCl3>
##$SSB= 0
##$STSI= 0
##$STSR= 0
##$SW_p= 3612.71676300578
##$SYMM= 0
##$S_DEV= 0
##$TDeff= 0
##$TDoff= 0
##$TI= <>
##$TILT= no
##$TM1= 0
##$TM2= 0
##$TOPLEV= 0
##$USERP1= <user>
##$USERP2= <user>
##$USERP3= <user>
##$USERP4= <user>
##$USERP5= <user>
##$WDW= 1
##$XDIM= 8192
##$YMAX_p= 0
##$YMIN_p= 0
$$ End of Bruker specific parameters
$$ ---------------------------------
##NTUPLES= NMR FID
##VAR_NAME=  TIME,          FID/REAL,        FID/IMAG
##SYMBOL=    X,             R,               I
##VAR_TYPE=  INDEPENDENT,   DEPENDENT,       DEPENDENT
##VAR_FORM=  AFFN,          ASDF,            ASDF
##VAR_DIM=   8192,          8192,            8192
##UNITS=     SECONDS,       ARBITRARY UNITS, ARBITRARY UNITS
##FACTOR=    0.0002076,     1,               1
##FIRST=     0,             0,               0
##LAST=      1.7004516,     0,               0
##MIN=       0,             -314878,         0
##MAX=       1.7004516,     293201,          0
$$ Real data points
##PAGE= N=1
##DATA TABLE= (X++(R..R)), XYDATA
$$ [...]
$$ plain form
1980 915 -164 -447 164 745 -413 -1312 -408 857 83 -110 661 707 -476 -1444 -893 -77 117 -53 360
1999 360 818 -567 -1147 -463 7 -981 -999 -187 -142 -1293 -913 708 860 -887 -874 -285 -479 -2069 -1373
2018 -1373 965 775 -598 -598 511 -701 -1738 -1122 660 -240 -874 -77 293 -951 -896 581 452 -1103
2036 -1103 -1307 -196 -101 -976 -347 1363 1048 -507 -1120 -176 -716 -1157 -305 1092 483 -461 -348 51 -149
2055 -149 -592 -385 294 -195 -578 -272 354 264 182 574 775 -142 -1707 -902 787 905 -374 200 1367
2074 1367 41 -1315 -566 823 40 -803 692 939 -308 -992 749 1240 -468 -1119 200 164 -1264
2091 -1264 -910 1259 937 -457 -358 558 -231 -2165 -1035 1171 874 -955 -570 655 -393 -899 -485
2108 -485 -85 -625 -943 -784 -208 -631 -785 150 487 -638 -1350 -812 -669 -733 -938 536 851 -32 -1102
$$ packed form
1980I15j079k83O11N81j158q99R04J265p74j93P71M6j183r68N51Q16J94j70M13
1999C60M58j385n80O84M70r88j8Q12M5j151L80J621J52j747J3N89j94j590O96
2018a373K338j90j373%J109j212j037O16J782r00o34P97L70j244N5J477j29j555
2036a103k04J111R5q75O29J710l15j555o13R44n40m41Q52J397o09r44J13L99k00
2055a49m43K07O79m89l83L06O26r0q2L92K01r17j565Q05J689J18j279N74J167
2074A367j326j356P49J389p83q43J495K47j247o84J741M91j708o51J319l6j428
2091a264L54K169l22j394R9R16p89j934J130K206k97j829L85J225j048n06M14
2108d85M00n40l18J59N76m23j54R35L37j125p12N38J43o4k05J474L15q83j070
$$ plain form
2127 -1102 -627 -373 -1125 -1456 -188 157 -520 -991 -230 154 -535 -652 -166 -439 -1536 -1092 276 198 -340
2146 -340 156 589 -206 -1691 -1078 88 -258 -921 18 853 202 -936 -574 441 -228 -1005 -144 670 -392
2165 -392 -843 435 1361 94 -923 362 386 -1010 -745 1037 1152 277 244 1078 630 -487 -340 981
2183 981 654 -355 -111 1257 961 78 818 1397 597 -204 209 766 132 74 1655 1769 1047 284 607
2202 607 620 222 49 918 964 1136 505 876 1088 922 493 684 514 527 156 495 1211 1066 981 1036 839 51
2224 51 -334 491 675 239 486 1284 1104 -10 -327 885 664 -468 86 789 859 -325 326 1585 617
2243 617 -429 -30 823 -461 -634 791 892 399 111 772 526 -411 -633 562 350 -540 25 526 135
2262 135 -254 89 387 48 -663 -483 -73 -238 -176 180 572 -11 -5 -360 -90 -285 -505 -161 -170 439 32 175
$$ packed form
2127a102M75K54p52l31J268L45o77m71P61L84o89j17M86k73j097M44J368p8n38
2146c40M96M33p95j485O13J166l46o63R39Q35o51j138L62J015o69p77Q61Q14j062
2165c92m51J278R26j267j017J285K4j396K65J782J15q75l3Q34m48j117J47J321
2183I81l27j009K44J368k96q83P40N79q00q01M13N57o34n8J581J14p22p63L23
2202F07J3l98j73Q69M6J72o31L71K12j66m29J91j70J3l71L39P16j45q5N5j97p88
2224E1l85Q25J84m36K47P98j80j114l17J212k21j132N54P03P0j184O51J259r68
2243F17j046L99Q53j284j73J425J01m93k88O61k46r37k22J195k12q90N65N01l91
2262A35l89L43K98l39p11J80M10j65O2L56L92n83Ol55K70j95k20L44rO09m07J43
$$ plain form
2284 175 172 192 -310 -659 -99 190 -379 -294 297 223 -215 -160 44 -478 -772 -491 391 255 -242 205 700 -165
2306 -165 -604 396 511 -443 -378 371 177 -257 -131 403 286 -770 -51 419 -233 -593 163 120 24 -170
2326 -170 448 -67 -462 -403 268 -318 -558 381 250 -128 -644 46 -271 -676 -259 -158 -455 -650 -14 162
2346 162 -700 -728 19 -237 -750 -496 -435 -326 -793 -105 -16 -725 -622 -314 -718 -1132 -482 -30 -193 -1414 -93
2367 -93 -193 -1000 -797 -225 -629 -1352 -680 63 -686 -957 143 -537 -1140 -1079 -243 -662 -1335 -689 28 -399
2387 -399 -1136 -662 -51 -955 -1038 -579 -488 -920 -658 -71 -295 -713 -323 -472 -641 -886 -257 -112 -370 -152 173
2408 173 149 -313 -16 -190 -267 -819 79 0 -13 -110 314 -51 -566 -30 268 -204 -567 395 706 -37 529 662
2430 662 295 -199 417 398 79 -107 789 773 334 351 806 386 -29 302 364 220 210 847 1064 560 504 1132
$$ packed form
2284A75lK0n02l49N60K89n69Q5N91p4m38N5K04n22k94K81Q82j36m97M47M95q65
2306a65m39J000J15r54O5P49j94m34J26N34j17j056P19M70o52l60P56m3r6j94
2326a70O18n15l95N9O71n86k40R39j31l78n16O90l17m05M17J01k97j95O36J76
2346A62q62k8P47k56n13K54O1J09m67O88Q9p09J03L08m04m14O50M52j63j221J321
2367i3j00q07K03N72m04p23O72P43p49k71J100o80o03O1Q36m19o73O46P17m27
2387c99p37M74O11r04q3M59R1m32K62N87k24m18L90j49j69k45O29J45k58K18L25
2408A73k4m62K97j74p7n52Q98p9j3r7M24l65n15N36K98m72l63R62L11p43N66J33
2430F62l67m94O16j9l19j86Q96j6m39J7M55m20m15L31O2j44j0O37K17n04n6O28
$$ plain form
2452 1132 765 333 350 991 259 217 888 1124 809 598 1011 623 130 468 581 809 356 692 986 689
2472 689 559 447 378 385 458 560 585 753 793 759 382 534 549 374 82 172 513 219 190 839 439 376 -83 250
2496 250 468 -51 109 131 342 -116 374 426 192 -70 268 136 -116 -75 6 523 81 34 404 483 -344 -277
2518 -277 80 -131 -502 -6 559 63 -20 13 -237 -412 -840 -151 64 93 -473 5 192 -113 -186 -268 -218 -167
2540 -167 -473 -187 60 -1 -69 547 75 -261 -537 74 -93 -307 -270 303 461 81 -226 643 194 -277 -361
2561 -361 266 40 -72 31 609 685 -99 -49 112 82 -579 -197 228 -50 -523 21 460 17 -295 27 387
2582 387 -66 -344 -283 95 -108 -206 -51 365 130 -189 -325 -223 -301 -685 314 351 -375 -572 142 -113 -622
2603 -622 -534 -61 224 -848 -766 21 260 -650 -557 371 -406 -967 -793 27 76 -901 -106 307 -594 -1194 -575
$$ packed form
2452A132l67m32J7O41p32m2O71K36l15k11M13l88m93L38J13K28m53L36K94k97
2472F89j30j12o9PP3J02K5J68M0l4l77J52J5j75k92R0L41k94k9O49m00o3m59L33
2496B50K18n19J60K2K11m58M90N2k34k62L38j32k52M1Q1N17m42m7L70P9q27O7
2518b77L57k11l71M96N65m96q3L3k50j75m28O89K15K9n66M78J87l05p3q2N0N1
2540a67l06K86K47o1o8O16m72l36k76O11j67k14L7N73J58l80l07Q69m49m71q4
2561c61O27k26j12J03N78P6p84N0J61l0o61L82M25k78m73N44M39m43l12L22L60
2582C87m53k78O1L78k03r8J55M16k35l19j36J02p8l84R99L7p26j97P14k55n09
2603f22Q8M73K85j072Q2P87K39r10R3R28p77n61J74Q20M9r77P95M13r01o00O19
$$ plain form
2624 -575 -24 -286 -774 -105 -231 -640 -1166 -310 0 -750 -824 -335 65 -715 -720 -50 289 -236 -534 -173 -177 -689
2646 -689 -665 36 287 -329 -323 -167 -267 -597 -793 260 12 -673 -428 341 -80 -843 -357 272 95 -574 -82
2667 -82 149 -397 -447 344 1041 -1 -864 145 506 -397 -309 859 979 70 -608 620 316 -85 -132 938
2687 938 616 -353 -172 627 688 29 353 1208 566 -196 387 1067 708 174 576 1574 637 -160 3 1406
2707 1406 653 -45 531 1210 237 -313 360 1169 623 48 838 868 -13 -48 920 1372 582 -112 434 503 -176
2728 -176 -207 860 793 -17 -117 758 334 -678 -61 743 777 -156 -9 258 122 -369 156 779 95 -570
2748 -570 13 311 -291 -634 201 1014 -185 -725 -396 211 -208 -487 286 516 -479 -960 47 482 -489
2767 -489 -570 399 177 -943 -856 -70 122 -303 -452 181 74 -931 -786 -73 278 -757 -502 271 -107 -1361
$$ packed form
2624e75N51k62m88O69j26m09n26Q56L10p50p4M89M00p80nO70L39n25k98L61mn12
2646f89K4P01K51o16OJ56j00l30j96J053k48o85K45P69m21p63M86O29j77o69M92
2667h2K31n46n0P91O97j042q63J009L61r03Q8J168J20r09o78J228l04m01m7J070
2687I38l22r69J81P99O1o59L24Q55o42p62N83O80l59n34M02R98r37p97J63J403
2707A406p53o98N76O79r73n50O73Q09n46n75P90L0q81l5R68M52p90o94N46O9o79
2728a76l1J067o7q10j00Q75m24j012O17Q04L4r33J47K67j36m91N25O23o84o65
2748e70N83K98o02l43Q35Q13j199n40L29O07m19k79P73K30r95m81J007M35r71
2767d89q1R69k22j120Q7P86J92m25j49O33j07j005J45P13L51j035K55P73l78j254
$$ plain form
2787 -1361 -338 226 76 -586 -458 121 -806 -821 -263 519 -83 -722 -173 6 -616 -686 -17 438 -180 -481
2807 -481 132 -77 -712 -543 252 388 -427 -554 -5 329 -565 -12 896 181 -600 -389 188 85 -550 -75
2827 -75 1001 280 -744 -230 381 -95 -353 156 875 -34 -467 -51 506 -94 -264 473 664 -288 -740 138
2847 138 840 -157 -143 712 357 -524 -787 73 206 107 -252 359 254 -715 -59 171 186 -312 -119 182 -59
2868 -59 -469 -315 465 202 -379 -127 -69 -391 -632 -138 560 -329 -328 -93 196 -78 -646 85 411 -319 -475
2889 -475 -277 32 -242 -279 207 402 -49 -338 -98 -21 -353 -277 288 215 -515 -332 47 51 -385 -253 551 100
2911 100 -221 -162 342 236 -140 212 262 -43 -475 -230 511 49 -217 260 347 310 -326 109 326 260 53 443
2933 443 268 76 -95 310 694 180 195 166 197 406 114 436 668 -89 155 310 476 141 336 734 508
$$ packed form
2787a361J023N64j50o62J28N79r27j5N58P82o02o39N49J79o22p0O69M55o18l01
2807d81O13k09o35J69P95J36q15j27N49L34q94N53R08p15p81K11N77j03o35M75
2827g5J076p21j024N14O11m76k58N09P19r09m33M16N57o00j70P37J91r52m52Q78
2847A38P02r97J4Q55l55q81k63Q60J33r9l59O11j05r69O56K30J5m98J93L01k41
2868e9m10J54P80k63n81K52N8l22k41M94O98q89JK35K89k74n68P31L26p30j56
2889d75J98L09k74l7M86J95m51k89K40P7l32P6N65p3p30J83L79Mm36J32Q04m51
2911A00l21N9N04j06l76L52N0l05m32K45P41m62k66M77Q7l7o36M35K17o6k07L90
2933D43j75j92j71M05L84n14J5k9L1K09k92L22K32p57K44J55J66l35J95L98k26
$$ plain form
2954 508 267 338 851 505 51 563 685 441 7 86 307 171 277 428 527 -17 312 298 313 28 26 131
2976 131 183 301 18 308 128 -25 -138 55 496 -161 -3 447 141 25 -300 89 156 -264 -463 -271 146
2997 146 138 -84 292 -45 -322 -263 -173 -256 -339 -205 -329 -463 -450 -171 -84 -459 -389 -114 -420 -317 -415 -120 -292
3020 -292 -412 -315 -334 -327 -423 -213 -316 -493 -231 -319 -134 -266 -330 -48 -537 -220 -421 -332 -337 -211 -81 -577 -258
3043 -258 -29 -301 -266 32 -203 -327 -239 -34 -38 -502 -264 -81 -305 -162 -146 -101 -14 -474 -122 113 24 -245 -190
3066 -190 9 -385 -263 176 379 26 -92 104 31 -359 -45 213 103 -68 204 305 34 63 -42 -88 97
3087 97 -208 157 272 -103 185 -45 -4 -250 -203 -204 77 224 407 -65 -92 -9 86 44 -68 9 96 -163 153 35
3111 35 114 75 185 -147 -79 -117 100 -53 23 -55 -91 24 -417 -38 33 65 -33 -31 -236 -53 -235 45 -235 -116
$$ packed form
2954E08k41P1N13l46m54N12J22k44m34P9K21j36J06J51R9n44L29j4J5k85kJ05
2976A31N2J18k83K90j80j53j13J93M41o57J58M50l06j16l25L89O7m20j99J92M17
2997A46qk22L76l37k77N9R0q3q3J34j24j34J3K79Q7l75P0K75l06J03r8K95j72
3020b92j20R7j9Pr6K10j03j77K62q8J85j32o4K82m89L17k01Q9nJ26J30m96L19
3043b58K29k72L5K98k35j24Q8K05mm64K38J83k24J43J6M5Q7m60L52K35q9k69N5
3066a90J99l94J22M39K03l53j18J96p3l90L14K58j10j71K72J01k71K9j05m6J85
3087I7l05L65J15l75K88k30M1k46M7jK81J47J83m72k7Q3R5m2j12P7Q7k59L16j18
3111C5P9l9J10l32O8l8K17j53P6p8l6J15m41L79P1L2r8Kk05J83j82K80k80J19
$$ plain form
3135 -116 -72 54 95 -303 60 69 -286 24 394 -96 -16 -110 -322 127 -252 -405 -151 -43 164 -26 83 -179
3157 -179 -227 56 -123 -384 209 -58 131 99 148 -50 236 72 -96 -34 71 265 23 -116 7 141 -51
3178 -51 48 91 175 -4 350 287 305 199 642 313 71 -24 484 377 69 213 387 331 164 57 635 170 281
3201 281 87 422 159 235 452 512 33 290 399 385 152 189 32 375 164 -43 352 437 39 -19 212 25
3223 25 74 76 374 473 335 -21 154 -40 103 36 178 28 49 -281 110 395 -62 87 45 -41 -372 -238 -231 -8
3247 -8 -92 36 104 135 -465 -162 443 -177 -327 -55 274 -431 -366 -119 195 -168 -323 -222 -211 -391 -324 64 38
3270 38 -384 -99 -307 51 -453 -177 28 -46 -527 -605 -192 -348 -361 -205 -180 -213 -460 -499 -304 -62 -416 -24
3292 -24 191 16 -679 -410 100 -234 -306 -202 53 -298 -406 164 288 -40 -429 -292 56 -103 -731 107 208
$$ packed form
3135a16M4J26M1l98L63Rl55L10L70m90Q0r4k12M49l79j53K54J08K07j90J09k62
3157a79m8K83j79k61N93k67J89l2M9j98K86j64j68O2J05J94k42j39J23J34j92
3178e1R9M3Q4j79L54o3J8j06M43l29k42r5N08j07l08J44J74n6j67j07N78m65J11
3201B81j94L35k63P6K17O0m79K57J09j4k33L7j57L43k11k07L95Q5l98n8K31j87
3223B5M9KK98R9j38l56J75j94J43o7J42j50K1l30L91K85m57J49m2q6l31J34PK23
3247hq4J28O8L1o00L03O05o20j50K72L29p05O5K47L14l63j55J01J1j80O7L88k6
3270C8m22K85k08L58n04K76K05p4m81p8M13j56j3J56K5l3k47l9J95K42l54L92
3292b4K15j75o95K69N10l34p2J04K55l51j08N70J24l28l89J37L48j59o28Q38J01
$$ plain form
3313 208 -126 -150 385 363 -207 -76 49 183 -17 234 395 201 -119 -123 295 122 208 322 389 -53 -335 105
3335 105 748 143 -93 -159 170 111 -226 276 452 174 -9 69 348 126 -186 292 412 292 -187 201 102
3356 102 -148 36 538 405 -31 -455 229 362 51 -232 674 405 -243 -387 152 73 -539 -158 463 -6
3376 -6 -297 64 114 140 -158 187 325 -309 -103 -73 121 -85 -237 332 -39 -225 -113 257 299 -31 -265 -136
3398 -136 -117 -238 -380 -54 242 139 -519 37 233 -251 -214 200 318 136 -197 151 180 -584 -191 498 371
3419 371 -47 -134 198 232 -291 -157 301 47 -276 -216 112 180 -153 349 318 -37 -389 176 487 -262 -34 460
3441 460 406 -201 -251 135 579 -50 188 441 323 115 -209 246 407 -149 38 333 285 -239 488 352 134
3462 134 68 -71 497 82 -257 222 552 6 109 151 348 57 -176 14 384 7 -292 30 365 -298 -432
$$ packed form
3313B08l34k4N35k2n70J31J25J34k00K51J61j94l20mM18j73Q6J14O7m42k82M40
3335A05O43o05k36o6L29n9l37N02J76k78j83P8K79k22l12M78J20j20m79L88r9
3356A02k50J84N02j33m36m24O84J33l11k83R06k69o48j44N39p9o12L81O21m69
3376fk91L61N0K6k98L45J38o34K06L0J94k06j52N69l71j86J12L70M2l30k34J29
3398a36J9j21j42L26K96j03o58N56J96m84L7M14J18j82l33L48K9p64L93O89j27
3419C71m18q7L32L4n23J34M58k54l23O0L28O8l33N02l1l55l52N65L11p49K28M94
3441D60n4o07n0L86M44o29K38K53j18k08l24M55J61n56J87K95m8n24P27j36k18
3462A34o6j39N68m15l39M79L30n46J03M2J97k91k33J90L70l77k99L22L35o63j34
$$ plain form
3483 -432 -37 272 -27 -370 272 -39 -242 -350 458 497 58 -239 125 -70 -601 -72 150 -73 -266 -58
3503 -58 -57 -93 -312 -305 333 -266 -455 -368 31 59 -437 244 -10 -262 -382 40 46 -349 -62 149 -70 -122 -430 -275
3527 -275 77 -621 -308 -173 149 -308 -324 227 58 -286 -387 -100 -208 -304 -401 -92 245 196 -108 -237 -49
3548 -49 -747 -281 -145 59 -1 128 188 -35 -362 -4 -158 -11 -271 171 328 -130 -15 104 329 -7 66
3569 66 5 131 155 -204 271 448 -171 337 98 62 21 190 108 386 74 -128 214 60 75 117 257 -27 -339
3592 -339 139 146 156 316 226 535 63 32 90 80 94 99 175 401 244 -59 320 216 239 -138 -33 133 -136 -214
3616 -214 17 216 163 22 65 189 -9 44 253 -163 -152 -183 173 153 -249 -127 -259 168 -93 -380 114 63
3638 63 -128 -286 113 -146 -163 -282 -38 -298 -334 178 -167 -189 -477 -187 3 -124 -277 -52 -3 30 -71 160
$$ packed form
3483d32L95L09k99l43O42l11k03j08Q08L9m39k97L64j95n31N29K22k23j93K08
3503e8Jl6k19PO38n99j89Q7L99K8m96O81k54k52j20M22Ol95K87K11k19n2l08J55
3527b75L52o98L13J35L22m57j6N51j69l44j01K87j08r6r7L09L37m9l04j29J88
3548d9o98M66J36K04o0J29O0k23l27L58j54J47k60M42J57m58J15J19K25l36P3
3569F6o1J26K4l59M75J77o19N08k39l6m1J69q2K78l12k02L42j54J5M2J40k84l12
3592c39M78PJ0J60r0L09m72l1N8j0J4NP6K26j57l03L79j04K3l77J05J66k69p8
3616b14K31J99n3j41M3J24j98N3K09m16J1l1L56k0m02J22j32M27k61k87M94n1
3638F3j91j58L99k59j7j19K44k60l6N12l45k2k88K90J90j27j53K25M9L3j01K31
$$ plain form
3660 160 -139 -170 -184 1 122 383 -380 127 -331 -265 28 -240 -64 -269 67 -36 103 -59 184 -34 29
3681 29 -117 143 254 335 78 214 323 86 -326 204 94 275 110 189 -5 -5 -4 -7 -9 97 116 96 400 -52
3705 -52 74 146 57 76 107 -35 167 -78 140 125 71 -35 210 121 57 325 251 -139 71 447 304 31 54 -42
3729 -42 482 437 22 145 -59 229 191 200 120 -36 -96 32 -52 -57 82 75 95 107 74 54 24 137 -117 -187 -33 -20
3755 -20 -49 -85 -108 -58 -146 97 55 -232 -241 -211 -221 61 -333 -245 -13 -86 -373 -70 -50 -348 -236 -137 -71 -132 213 -112
3781 -112 -203 45 -404 -91 -44 -13 -224 -113 66 -218 -138 208 -208 -125 -159 -45 -221 -264 322 147 -191 -224 56
3804 56 -201 -167 -138 -133 53 72 74 109 135 -48 143 89 369 -10 64 541 166 -166 -6 -130 79 206 293 319 62
3829 62 114 200 270 0 268 463 418 150 63 3 386 163 340 282 -43 175 40 139 344 400 181 28 44 -200
$$ packed form
3660A60k99l1j4J85J21K61p63N07m58O6K93k68J76k05L36j03J39j62K43k18O3
3681B9j46K60J11Q1k57J36J09k37m12N30j10J81j65P9j94%JlkJ06J9k0L04m52
3705e2J26P2q9J9L1j42K02k45K18j5n4j06K45q9o4K68p4l90K10L76j43k73K3r6
3729d2N24m5m15J23k04K88l8Rq0j56o0J28q4nJ39pK0J2l3k0l0J13k54p0J54J3
3755b0k9l6k3N0q8K43m2k87rL0j0K82l94Q8K32p3k87L03K0k98J12R9O6o1L45l25
3781a12r1K48m49L13M7L1k11J11J79k84Q0L46m16Q3l4J14j76m3N86j75l38l3K80
3804E6k57L4K9NJ86J9KL5K6j83J91n4K80l79P4M77l75l32J60j24K09J27Q7K6k57
3829F2N2Q6P0k70K68J95m5k68q7o0L83k23J77n8l25K18j35R9K05N6k19j53J6k44
$$ plain form
3853 -200 110 248 -38 264 -31 121 150 216 296 326 102 66 -186 14 204 135 55 -44 44 241 -190 -173 106
3876 106 -192 -150 102 240 -78 131 11 -7 62 -173 71 -8 -429 -37 175 -4 98 -156 106 -221 -206 -263
3898 -263 30 70 -358 185 42 -143 56 -97 -228 -188 -156 -108 -105 -322 -100 -304 -149 -249 -155 -148 -164 57 -48
3921 -48 -58 -203 -237 -207 -123 -224 -316 67 145 -67 -131 -344 114 -130 -150 -227 135 46 -143 -249 395 293 -109 45
3945 45 198 -269 95 38 129 61 24 153 101 114 -124 200 426 -203 -185 -98 -14 -12 188 463 77 13 -3 205 45
3970 45 191 -49 298 -26 -154 -110 120 40 -93 -8 70 141 168 233 54 113 -242 -115 314 285 -89 257 113
3993 113 -83 -19 -59 150 -83 6 86 74 -254 -96 194 104 -50 -37 136 -151 16 -192 -30 -113 -181 -281 292
4016 292 102 -271 70 130 -118 -213 -117 -68 99 -338 29 107 -143 -236 73 163 -99 -257 -224 -172 69 -90 -155
$$ packed form
3853b00L10J38k86L02k95J52K9O6Q0L0k24l6k52K00J90o9q0r9Q8J97m31J7K79
3876A06k98M2K52J38l18K09j20j8O9k35K44p9m21L92K12j79J02k54K62l27J5n7
3898b63K93M0m28N43j43j85J99j53j31M0L2M8Lk17K22k04J55j00R4Pj6K21j05
3921d8j0j45l4L0Q4j01r2L83P8k12o4k13M58k44k0p7L62q9j89j06O44j02m02J54
3945D5J53m67L64n7R1o8l7J29n2J3k38L24K26o29J8Q7Q4KK00K75l86o4j6K08j60
3970D5J46k40L47l24j28M4K30q0j33Q5P8P1K7O5j79N9l55J27M29k9l74L46j44
3993A13j96O4m0K09k33Q9Q0j2l28J58K90r0j54J3J73k87J67k08J62q3o8j00N73
4016B92j90l73L41O0k48r5R6M9J67m37L67P8k50r3L09R0k62j58L3N2K41j59o5
$$ plain form
4039 -155 251 -8 -286 26 -125 55 -121 -129 -54 -24 -101 18 119 -97 -66 -136 141 -140 -68 -49 -158 -158 -215 200
4063 200 -14 -300 -94 233 -91 33 74 432 41 -77 -108 178 216 155 328 208 125 -9 -101 198 165 -95
4085 -95 233 297 -61 331 204 170 -16 142 154 121 137 -35 179 495 236 338 -72 95 105 -223 94 -20
4107 -20 73 -165 123 100 -136 115 34 -101 -52 114 205 -2 -37 176 -12 -92 314 173 -7 168 -194 39 -171
4130 -171 -6 -15 160 84 -1 160 349 -312 -87 -162 -73 -10 -143 11 25 78 -180 -114 66 -217 -97 -70 -104 -79
4154 -79 -10 122 197 -360 -146 -62 -296 -220 -97 187 -3 131 146 5 271 -270 -309 -184 156 -78 -491 -160
4176 -160 -4 -298 -266 -15 -137 -110 -51 -200 31 -301 -153 -147 69 -245 -141 -193 -123 -63 -11 342 348 -24 -26 59 -233
4201 -233 -63 66 116 -180 -227 -33 186 186 17 14 78 -27 77 57 270 170 -107 286 -25 8 -221 136 39
$$ packed form
4039a55M06k59k78L12j51J80j76qP5L0p7J19J01k16L1p0K77k81P2J9j09%n7M15
4063B00k14k86K06L27l24J24M1L58l91j18l1K86L8o1J73j20q3j34r2K99l3k60
4085i5L28O4l58L92j27l4j86J58J2l3J6j72K14L16k59J02m10J67J0l28L17j14
4107b0R3k38K88k3k36K51q1j35M9J66R1k07l5K13j88q0M06j41j80J75l62K33k10
4130a71J65rJ75p6q5J61J89o61K25p5Q9O3j33J54J4N3k58O6J80k83J20K7l4K5
4154g9O9J32P5n57K14Q4k34P6J23K84j90J34J5j41K66n41l9J25L40k34m13L31
4176a60J56k94L2K51j22K7N9j49K31l32J48OK16l14J04n2P0O0N2L53Ol72kQ5k92
4201b33J70J29N0k96m7J94K19%j69lO4j05J04k0K13j00k77L93l11L3k29L57r7
$$ plain form
4224 39 238 -60 126 241 256 -67 -2 241 -141 -91 273 237 3 -13 173 -66 98 71 -51 -41 -211 361 117
4247 117 122 205 -11 -119 -72 205 -3 171 174 82 9 176 -294 77 -11 -21 -33 -81 -38 -90 -233 160 -34 29 -304
4272 -304 -195 142 -297 -82 -59 257 -279 110 -239 -27 -240 -226 -141 -150 -4 -111 27 41 48 -79 -216 -104 -235
4295 -235 -165 -51 -203 -142 -159 193 2 -13 -336 -145 194 -214 -297 40 144 97 88 108 209 -230 -148 -116 0 20
4319 20 -160 -4 274 -197 -80 217 470 72 87 196 131 -4 151 172 185 67 42 158 145 41 -56 -112 103
4342 103 186 38 -36 -95 41 68 73 -219 61 271 264 37 74 149 -33 174 104 39 261 121 -198 181 112 252
4366 252 -64 -289 57 -194 112 38 7 -106 191 46 57 169 58 41 1 26 -21 67 -83 -46 248 7 -18
4389 -18 85 -89 -64 -20 117 123 -69 210 -68 -171 -160 203 -113 -168 -68 -67 -504 -391 -161 96 -107 18 -203
$$ packed form
4224C9J99k98J86J15J5l23O5K43l82N0L64l6k34j6J86k39J64k7j22J0j70N72k44
4247A17NQ3k16j08M7K77k08J74Lr2p3J67m70L71q8j0j2m8M3n2j43L93j94O3l33
4272c04J09L37m39K15K3L16n36L89l49K12k13J4Q5rJ46j07J38J4Pj27j37J12j31
4295b35P0J14j52O1j7L52j91j5l23J91L39m08q3L37J04m7rK0J01m39Q2L2J16K0
4319B0j80J56K78m71J17K97K53l98J5J09o5j35J55K1J3j18k5J16j3j04r7n6K15
4342A03Q3j48p4n9J36K7Nk92K80K10pk27L7P5j82K07p0o5K22j40l19L79o9J40
4366B52l16k25L46k51L06p4l1j13K97j45J1J12j11j7m0K5m7Q8j50L7K94k41k5
4389a8J03j74K5M4J37Oj92K79k78j03J1L63l16n5J00Jm37J13K30K57k03J25k21
$$ plain form
4412 -203 -162 -101 24 -52 -59 22 -163 -219 -226 -83 -93 93 -147 -345 -164 -188 -169 25 167 27 72 3 -188 -103 -261
4437 -261 55 -59 145 -49 179 115 -85 -161 -19 166 18 1 -110 83 191 -195 114 68 218 17 147
4458 147 360 -196 110 192 115 5 99 287 -99 -189 -73 -85 -152 -1 -59 105 -53 145 168 107 -113 139 64
4481 64 158 71 62 -114 127 199 72 122 16 15 -64 -32 -210 194 120 157 -61 105 -188 303 -42 98 7 -2 48 -15
4507 -15 36 -18 -145 -349 81 328 59 -75 -375 -69 360 9 -229 -94 79 -287 195 -34 -40 -260 -201 -120
4529 -120 34 41 222 -53 -56 66 -59 -150 120 -120 -202 -248 139 -253 -47 219 -468 -248 4 291 -213 176
4551 176 -261 -84 -179 -216 41 -84 -269 -21 -87 24 -74 -186 -135 26 220 -115 212 -206 87 -48 14 96
4573 96 -129 376 56 83 240 -13 36 332 220 76 234 121 11 114 199 122 134 187 191 -8 8 118 259
$$ packed form
4412b03M1O1J25p6pQ1j85n6pJ43j0J86k40j98J81k4J9J94J42j40M5o9j91Q5j58
4437b61L16j14K04j94K28o4k00p6J42J85j48j7j11J93J08l86L09m6J50k01J30
4458A47K13n56L06Q2p7j10R4J88l86r0J16j2o7J51n8J64j58J98K3o1k20K52p5
4481F4R4q7rj76K41P2j27N0j06jp9L2j78M04p4L7k18J66k93M91l45J40r1rN0o3
4507a5N1n4j27k04M30K47k69j34l00L06M29l51k38J35J73l66M82k29ok20N9Q1
4529a20J54PJ81k75lJ22j25r1K70k40q2m6L87l92K06K66o87K20K52K87n04L89
4551A76m37J77r5l7K57j25j85K48o6J11r8j12N1J61J94l35L27m18K93j35O2Q2
4573I6k25N05l20K7J57k53M9K96j12j44J58j13j10J03Q5p7J2N3Mj99J6J10J41
$$ plain form
4596 259 166 173 38 -15 -53 -18 193 -54 185 43 317 154 115 231 -55 15 172 -27 -154 -64 171 276 221
4619 221 -5 84 346 4 88 203 -82 -120 -363 -5 247 164 -79 62 31 -16 63 105 61 -55 -230 -129 -143
4642 -143 -67 -118 -107 10 93 -146 -33 86 -203 -226 173 39 14 55 96 -53 -317 -106 -207 143 -121 -259 -78
4665 -78 97 -127 -104 101 336 -94 -259 -156 -149 -159 30 -82 -182 -234 16 -61 -289 102 -205 -344 -167 -200 -28
4688 -28 -127 -54 -448 -198 114 -235 -316 -55 137 -45 -35 -222 31 55 -190 -199 88 -61 4 30 -97 125 -92
4711 -92 218 187 -206 103 173 257 -26 -46 546 61 368 -189 93 298 97 73 253 126 273 229 244 73 -38
4734 -38 60 195 260 -30 153 176 255 178 63 177 17 -56 -26 206 119 130 5 37 58 184 59 -10 -53 177 35
4759 35 121 -5 13 11 163 -6 28 154 72 47 -106 261 -139 15 46 -29 -27 -90 63 27 80 137 -154 -96 -206 -135
$$ packed form
4596B59r3Pj35n3l8L5K11k47K39j42K74j63l9J16k86P0J57j99j27R0K35J05n5
4619B21k26Q9K62l42Q4J15k85l8k43L58K52q3k43J41l1m7P9M2m4j16j75J01j4
4642a43P6n1J1J17Q3k39J13J19k89k3L99j34k5M1M1j49k64K11j01L50k64j38J81
4665g8J75k24K3K05K35m30j65J03Pj0J89j12j00n2K50p7k28L91l07j39J77l3J72
4688b8r9P3l94K50L12l49q1K61J92j82J0j87K53K4k45rK87j49O5K6j27K22k17
4711i2L10l1l93L09P0Q4k83k0N92m85L07n57K82K05k01k4J80j27J47m4J5j71j11
4734c8R8J35O5k90J83K3P9p7j15J14j60p3L0K32q7J1j25L2K1J26j25o9m3K30j42
4759C5Q6j26J8kJ52j69L4J26q2k5j53L67m00J54L1p5Ko3J53l6N3N7k91N8j10P1
$$ plain form
4785 -135 -198 302 -182 -24 85 -75 -45 -237 120 96 153 -18 -125 61 -355 -211 -116 268 114 -102 -21 -274
4807 -274 151 -198 72 255 -56 35 -21 36 118 233 129 -77 -159 226 19 -102 10 -135 7 191 -228 36
4829 36 13 -115 -283 134 -50 -119 -68 -239 56 -200 44 69 121 -8 46 -4 92 32 62 86 122 -74 14 -185 -158
4854 -158 123 -63 79 -120 319 -160 145 24 5 -135 33 307 12 92 114 263 -99 117 140 121 187 280
4876 280 311 157 400 165 -3 -39 26 -87 96 -49 -253 32 36 -1 34 309 67 32 -94 -93 -214 137 -147
4899 -147 142 -48 -170 -119 -114 -250 -47 41 -188 -66 -171 -177 -72 -117 -21 -85 -300 -236 -225 77 -264 -217 -63 40
4923 40 -191 156 -75 -253 -178 22 158 -209 -90 -101 -464 -102 84 -130 -202 322 -120 102 -32 -13 -344 209
4945 209 132 -4 -242 -157 94 91 -103 -325 -127 165 118 159 209 229 83 -35 142 -31 -266 246 -19 186 -214
$$ packed form
4785a35o3N00m84J58J09j60L0j92L57k4N7j71j07J86m16J44R5L84j54k16Q1k53
4807b74M25l49K70J83l11R1n6N7Q2J15j04k06q2L85k07j21J12j45J42J84m19K64
4829C6k3j28j68M17j84o9N1j71K95k56K44K5N2j29N4n0R6o0L0K4L6j96Q8j99K7
4854a58K81j86J42j99M39m79L05j21j9j40J68K74k95Q0K2J49l62K16K3j9O6R3
4876B80L1j54K43k35j68l6O5j13J83j45k04K85Ml7L5K75k42l5j26Jj21L51k84
4899a47K89j90j22N1Nj36K03Q8k29J22j05oJ05m5R6o4k15O4J1L02l41M7J54J03
4923D0k31L47k31j78P5K00J36l67J19j1l63L62J86k14p2N24m42K22j34J9l31N53
4945B09p7j36k38Q5K51lj94k22J98K92m7M1N0K0j46j18J77j73k35N12k65K05m00
$$ plain form
4968 -214 56 135 165 -174 -34 189 313 148 70 47 190 -3 436 402 59 -32 -26 210 133 49 254 51 -53
4991 -53 276 -9 316 -18 30 -162 -334 184 -169 177 69 29 -297 68 47 -163 -182 40 104 -13 -30 -7 91
5014 91 -235 61 114 119 -203 118 128 -320 -55 -117 -69 -75 138 85 -327 -101 20 -7 -77 22 -166 -46 -39 -54 -37 -106
5040 -106 -169 -100 -390 -303 54 -118 -290 4 126 -242 -168 -356 2 99 27 40 -17 -77 -104 -18 -46 -79 260 -61
5064 -61 -228 -190 130 -124 -136 85 -87 -141 31 -90 -3 -70 111 -79 -375 -150 1 110 -283 93 -140 131
5086 131 105 -133 75 135 -214 57 489 102 127 80 199 8 101 -18 142 41 57 97 -217 163 316 -106
5108 -106 11 -96 143 118 -108 -107 23 195 31 94 216 -172 -136 40 -117 315 3 6 246 468 187 360
5130 360 29 375 74 275 226 193 -145 210 -177 91 360 23 36 45 -40 162 14 -88 -152 37 -253 -197 -201
$$ packed form
4968b14K70P9L0l39J40K23J24j65p8k3J43j93M39l4l43r1OK36p7q4K05k03j04
4991e3L29k85L25l34M8j92j72N18l53L46j08m0l26L65k1k10j9K22O4j17j7K3R8
5014I1l26K96N3Nl22L21J0m48K65o2M8oK13n3m12K26J21k7p0R9j88J20Pj5J7o9
5040a06o3O9k90Q7L57j72j72K94J22l68P4j88L58R7p2J3n7o0k7Q6k8l3L39l21
5064f1j67L8L20k54j2K21j72n4J72j21Q7o7J81j90k96K25J51J09l93L76k33K71
5086A31k6k38K08O0l49K71M32l87K5m7J19j91R3j19J60j01J6M0l14L80J53m22
5108a06J17j07K39k5k26JJ30J72j64O3J22l88L6J76j57M32l12LK40K22k81J73
5130C60l31L46l01K01m9l3l38L55l87K68K69l37J3Rq5K02j48j02o4J89k90N6m
$$ plain form
5153 -201 114 124 161 -10 -40 28 -78 -184 -2 -47 -285 -50 -96 -152 -98 10 -338 -33 -215 -179 168 1 63
5176 63 94 -105 29 131 102 -192 206 27 161 -100 -190 -161 -118 -137 70 -289 -74 -45 -341 -91 342 127 -92
5199 -92 -33 -58 239 -7 33 -71 -36 -97 -248 53 -87 -149 68 -103 59 140 119 -187 -326 131 1 -123 268
5222 268 -128 16 -176 238 186 64 196 -12 26 65 230 58 159 260 272 -120 244 49 44 58 -172 -21
5244 -21 114 73 -281 129 178 -92 -261 281 282 277 -172 163 48 43 37 30 219 -59 81 28 7 -184 273 134 -128
5269 -128 -73 298 133 150 -293 1 33 -177 -208 -171 268 -281 241 -54 158 -303 -48 54 197 -451 152 -224
5291 -224 -144 -62 -153 26 -176 37 -208 87 -97 -179 -160 187 -140 -337 -125 -103 -78 -46 -36 -88 -26 -154 -186 152
5315 152 69 91 -117 -47 113 250 -155 -84 148 59 48 -121 1 -139 115 244 13 81 -211 -228 -24 100 126
$$ packed form
5153b01L15J0L7j71l0O8j06j06J82m5k38K35m6n6N4J08l48L05j82L6L47j67O2
5176F3L1j99J34J02k9k94L98j79J34k61r0K9M3j9K07l59K15K9k96K50M33k15k19
5199i2N9k5K97k46M0j04L5o1j51L01j40o2K17j71J62Q1k1l06j39M57j30j24L91
5222B68l96J44j92M14n2j22J32k08L8L9J65j72J01J01J2l92L64j95nJ4k30J51
5244b1J35m1l54M10M9k70j69N42Jnm49L35j15nopJ89k78J40n3k1j91M57j39k62
5269a28N5L71j65J7m43K94L2k10l1L7M39n49N22k95K12m61K55J02J43o48O03l76
5291b24Q0Q2r1J79k02K13k45K95j84q2J9L47l27j97K12K2K5L2J0n2O2j28l2L38
5315A52q3K2k08P0J60J37m05P1K32q9j1j69J22j40K54J29k31O8k92j7K04J24K6
$$ plain form
5338 126 242 131 112 115 82 -279 -20 -40 -105 -73 137 67 38 64 62 -254 -60 78 104 98 -14 28 111 132 147 -72
5364 -72 143 140 -216 50 307 -43 -67 -11 419 -351 43 67 -256 198 -54 104 17 14 136 -95 -57 -108 -39 -122
5388 -122 27 -18 60 138 14 -151 -189 86 -111 -304 51 61 -11 -56 -391 185 -60 -195 -146 -185 107 -200 -228
5411 -228 448 222 -9 -177 -21 236 -328 -124 -311 -286 -184 -117 3 -75 -108 27 -299 -425 -308 -212 142 478
5433 478 72 -16 150 20 -312 -178 36 27 -89 201 105 81 7 -111 -131 -469 -96 -1 210 123 -224 -213 -247 -12
5457 -12 -87 239 143 -95 -207 -140 -5 -268 -94 11 170 -69 6 113 137 -191 35 195 -18 -78 346 362 -257
5480 -257 -84 29 -98 -162 -155 -164 -31 104 139 -146 68 218 -31 -63 150 202 161 3 -20 -51 346 159 65 -158
5504 -158 -82 206 156 160 284 173 69 77 54 -106 -52 -176 153 -41 -88 -108 79 -251 96 -25 176 -190 -237 -115
$$ packed form
5338A26J16j11j9Ll3l61K59k0o5L2K10p0k9K6kl16J94J38K6oj12M2Q3K1J5k19
5364g2K15ll56K66K57l50k4N6M30p70L94K4l23M54k52J58q7lJ22k31L8n1O9q3
5388a22J49m5P8P8j24j65l8K75j97j93L55J0p2m5l35N76k45j35M9l9K92l07k8
5411b28O76k26k31j68J56K57n64K04j87K5J02O7J20p8l3J35l26j26J17R6L54L36
5433D78m06q8J66j30l32J34K14rj16K90r6k4p4j18k0l38L73R5K11q7l47J1l4K35
5457a2p5L26r6k38j12O7J35k63J74J05J59k39P5J07K4l28K26J60k13o0M24J6o19
5480b57J73J13j27o4PrJ33J35L5k85K14J50k49l2K13N2m1j58k3l1L97j87r4k23
5504a58P6K88n0MJ24j11j04Qk3j60N4j24L29j94m7k0J87l30L47j21K01l66m7J22
$$ plain form
5528 -115 -159 -176 134 30 40 137 -7 181 -70 -62 109 -222 -88 -98 -156 115 -262 -144 -110 4 15 -50 -230 -215
5552 -215 -183 -121 184 -15 -313 -63 -117 -26 142 -129 32 -318 -177 154 -150 -7 -19 -14 42 238 74 -61 -78
5575 -78 92 70 27 -3 -108 -89 -259 -191 -33 50 -5 27 -226 -4 -81 -59 -133 -44 -110 21 -109 -152 -48 156 -12
5600 -12 -84 91 138 101 110 172 -46 228 73 -273 396 -83 119 79 255 162 209 -154 90 -77 124 207 175 233
5624 233 -149 -8 166 78 38 123 199 -48 34 118 -10 -24 88 244 183 58 -41 -32 47 19 -56 31 161 93 -71
5649 -71 -75 264 -50 21 83 -38 -3 177 9 59 -64 -64 -66 -46 -78 12 -241 -216 -98 -154 -70 -160 123 -70 327 -295
5675 -295 96 -267 -180 -410 -171 -13 153 -90 -74 -52 181 -247 96 215 284 -6 114 -89 109 -140 13
5696 13 -91 -114 215 -173 97 -26 -1 -161 -134 79 -79 -26 -95 -35 -27 87 60 99 52 -105 -121 84 124 -43 169
$$ packed form
5528a15m4j7L10j04J0R7j44J88k51QJ71l31J34j0n8K71l77J18L4J14J1o5j80J5
5552b15L2O2L05j99k98K50n4R1J68k71J61l50J41L31l04J43j2NN6J96j64j35j7
5575g8J70k2m3l0j05J9j70O8J58Q3n5L2k53K22p7K2p4Q9o6J31j30m3J04K04j68
5600a2p2J75M7l7RO2k18K74j55l46O69m79K02m0J76r3M7l63K44j67K01Q3l2N8
5624B33l82J41J74q8m0Q5P6k47Q2Q4j28j4J12J56o1j25r9RP9k8p5Q7J30o8j64
5649g1mL39l14P1O2j21L5J80j68N0j23%kK0l2R0k53K5J18n6Q4r0K83j93L97o22
5675b95L91l63Q7k30K39J58J66k43J6K2K33m28L43J19O9k90J20k03J98k49J53
5696A3j04k3L29l88K70j23K5j60K7K13j58N3o9O0QJ14k7L9m7j57j6K05M0j67K12
$$ plain form
5721 169 75 -418 -96 -55 18 173 65 81 10 97 -168 399 -79 235 -240 -32 188 -14 25 135 -15 292
5743 292 -60 -57 164 363 36 -126 -121 151 60 -243 -259 37 -9 -45 165 -148 304 -79 -164 -143 -116 260 -20 180
5767 180 128 159 25 -69 7 -128 -105 203 96 -3 2 -127 176 -152 50 -60 56 -360 -457 229 -96 -108 -58 19
5791 19 365 -205 155 -113 56 54 -151 -45 -228 2 -54 -170 -162 136 -188 68 -148 108 -195 -9 -104 97
5813 97 140 37 -152 9 -190 -17 -155 -227 115 202 35 -2 20 -115 -30 -126 -36 -85 -48 -88 -70 -101 -259 66 136
5838 136 -59 -168 88 65 54 -169 -122 113 109 408 -69 342 -11 -178 1 68 117 -46 160 -45 -24 -30 147
5861 147 -93 22 79 172 -139 -229 -45 170 87 22 321 -151 211 -154 275 115 212 -17 122 -32 11 -42 -37
5884 -37 -159 185 30 201 270 334 -23 -218 83 -84 -139 -278 106 246 0 66 28 -116 69 165 -133 42
$$ packed form
5721A69r4m93L22M1P3J55j08J6p1Q7k65N67m78L14m75K08K20k02L9J10j50L07
5743B92l52LK21J99l27j62NK72r1l03j6K96m6l6K10l13M52l83q5K1K7L76k80K00
5767A80n2L1j34r4P6j35K3L08j07r9Nj29L03l28K02j10J16m16r7O86l25j2N0P7
5791A9L46n70L60k68J69kk05J06j83K30n6j16QK98l24K56k16K56l03J86r5K01
5813I7M3j03j89J61j99J73j38p2L42Q7j67l7K2j35Q5r6R0m9L7m0J8l1j58L25P0
5838A36j95j09K56k3j1k23M7K35mK99m77M11l53j67J79O7M9j63K06k05K1oJ77
5861A47k40J15N7R3l11r0J84K15q3o5K99m72L62l65M29j60R7k29J39j54M3n3N
5884c7j22L44j55J71O9O4l57j95L01j67n5j39L84J40k46O6l8j44J85R6k98J75
$$ plain form
5906 42 20 -124 15 -104 314 -40 -46 61 46 -212 -130 5 33 -158 -19 -345 43 70 -266 97 14 153 -77
5929 -77 36 -32 -46 67 -138 -212 210 -105 -170 -257 -214 -9 136 -81 -262 64 -85 -62 97 -238 -117 -4 -89
5952 -89 -92 5 3 175 41 -104 -106 273 -145 155 49 -93 19 144 137 -331 -300 60 148 -229 -180 -250 -63 -105 182
5977 182 201 -114 100 -128 43 -52 -4 31 -184 -57 -105 47 158 220 -118 -146 -86 45 38 105 -32 98 -145 -128
6001 -128 -117 -197 25 -33 95 -11 -199 195 2 -96 -1 99 -43 -41 74 34 463 27 136 172 112 -60 5 -133
6025 -133 -10 188 169 -519 46 -294 8 -197 -318 -312 223 11 -11 23 -6 402 -213 -101 -31 150 -105 -50 -121
6048 -121 -265 -123 210 122 0 -93 -16 -130 -106 -54 -3 -57 22 -114 -71 27 -103 -13 44 99 -54 52 73 -5 92
6073 92 -53 -253 106 -109 37 -9 132 -16 -115 -181 -107 179 -135 27 35 -84 39 -142 86 -208 -285 92 -86
$$ packed form
5906D2k2j44J39j19M18l54oJ07j5k58Q2J35K8j91J39l26L88K7l36L63q3J39k30
5929g7J13o8j4J13k05p4M22l15o5q7M3K05J45k17j81L26j49K3J59l35J21J13q5
5952h9lR7kJ72j34j45kL79m18L00j06j42J12J25pm68L1L60Q8l77M9p0J87m2K87
5977A82J9l15K14k28J71r5M8L5k15J27m8J52J11O2l38k8O0J31pO7j37J30k43J7
6001a28J1q0K22n8J28j06j88L94j93r8R5J00j42KJ15m0M29m36J09L6o0j72O5j38
6025a33J23J98j9o88N65l40L02k05j21ON35k12k2L4k9M08o15J12P0J81k55N5p1
6048a21j44J42L33q8j22r3P7j14K4N2N1n4P9j36M3R8j30R0N7N5j53J06K1p8R7
6073I2j45k00L59k15J46m6J41j48r9o6P4K86l14J62Qj19J23j81K28k94p7L77j78
$$ plain form
6096 -86 167 -12 124 6 -195 -94 -168 -47 -104 192 157 -15 -18 346 -159 25 224 -45 38 -213 167 -33
6118 -33 80 459 -96 155 83 -83 241 -162 -8 68 -172 62 502 216 -36 -24 -73 -32 -167 299 206 48
6140 48 148 131 -111 -30 -33 -232 18 -3 50 -157 139 63 -78 -67 184 -235 1 202 30 12 213 -19 88
6163 88 -157 63 232 43 -36 63 -130 -155 9 -283 337 -112 -194 -157 288 2 -60 208 -296 -186 -110 226 -54
6186 -54 170 -137 -155 -365 401 -33 -274 -50 124 142 -77 79 -148 -298 -62 -15 -21 -175 -79 53 284 -199
6208 -199 -111 -149 -91 185 -131 9 -141 112 -25 22 201 -79 60 216 2 -93 171 89 111 39 -235 11 47
6231 47 -50 506 26 43 253 -189 84 360 -384 -245 146 -11 350 7 -191 -156 220 -81 -130 -314 213 131
6253 131 74 27 103 313 -52 66 316 80 201 146 295 276 255 -17 78 0 -264 3 -77 400 -268 5 -18
$$ packed form
6096h6K53j79J36j18k01J01p4J21n7K96l5j72lL64n05J84J99k69Q3k51L80k00
6118c3J13L79n55K51p2j66L24m03J54P6k40K34M40k86k52J2m9M1j35M66r3j58
6140D8J00j7k42Q1lj99K50k1N3k07K96p6j41J1K51m19K36K01j72j8K01k32J07
6163H8k45K20J69j89p9R9j93k5J64k92O20m49q2L7M45k86o2K68n04J10P6L36k80
6186e4K24l07j8k10P66m34k41K24J74J8k19J56k27j50K36M7oj54R6J32K31m83
6208a99Q8l8N8K76l16J40j50K53j37M7J79k80J39J56k14r5K64q2K2p2k74K46L6
6231D7r7N56m80J7K10m42K73K76p44J39L91j57L61l43j98L5L76l01m9j84N27q2
6253A31n7m7P6K10l65J18K50k36J21n5J49j9k1k72R5p8k64K67q0M77o68K73k3
$$ plain form
6276 -18 166 42 -271 -62 -177 129 83 -46 46 109 -165 -179 -384 36 -8 5 -55 -122 -5 -216 87 158 43
6299 43 -131 -161 -147 -40 98 -110 54 20 5 -99 -5 160 -105 211 -112 -34 4 -241 -92 -135 -379 -252 149
6322 149 72 -241 -361 -21 -117 92 74 27 156 133 -149 155 -105 264 58 -4 -213 -249 -107 -36 136 55 -175
6345 -175 7 71 25 -129 17 117 -123 29 -452 226 30 22 -204 -138 89 -74 91 55 -164 33 -88 40
6367 40 -51 187 -78 27 -12 -5 254 58 272 136 -160 148 227 216 -162 235 238 158 112 -205 -142 142 -228 274
6391 274 213 150 175 -74 143 209 87 160 134 275 223 -6 -244 92 -88 125 123 -102 -10 -14 -45 7 -3 135 150
6416 150 -48 -101 -128 83 -131 -292 -87 309 -1 -53 70 12 32 155 299 -84 -59 -9 -165 241 258 -62 279
6439 279 -53 -82 76 182 -71 137 -14 -375 210 -89 -189 -77 87 -68 -104 -4 25 -1 -35 -156 132 -52
$$ packed form
6276a8J84j24l13K09j15L06m6j29R2O3k74j4k05M20m4J3o0o7J17k11L03P1j15
6299D3j74l0J4J07J38k08J64l4j5j04R4J65k65L16l23P8L8k45J49m3k44J27M01
6322A49p7l13j20L40r6K09j8m7J29k3k82L04k60L69k06o2k09l6J42P1J72q1k30
6345a75J82O4m6j54J46J00k40J52m81O78j96qk26O6K27j63J65l6k19J97j21J28
6367D0r1K38k65J05l9PK59j96K14j36k96L08P9j1l78L97Lq0m6l17O3K84l70N02
6391B74o1o3K5k49K17O6j22P3k6J41n2k29k38L36j80K13kk25R2ml1N2j0J38J5
6416A50j98n3k7K11k14j61K05L96l10n2J23n8K0J23J44l83K5N0j56M06J7l20L41
6439B79l32k9J58J06k53K08j51l61N85k99j00J12J64j55l6J00K9k6l4j21K88j84
$$ plain form
6461 -52 -190 -12 -153 -115 157 -256 267 49 -312 126 166 -143 126 -171 -148 -91 -199 -82 -87 -222 137 -111
6483 -111 -7 131 -122 138 -31 190 175 -28 -26 -108 -167 146 62 91 -2 -58 -126 -28 59 22 -128 243 -99 35
6507 35 101 -205 192 92 -24 -120 -297 109 -76 271 114 18 225 -23 188 90 108 -180 309 -113 -141 -96 -50
6530 -50 -129 164 64 151 -104 -314 188 -1 -130 126 -48 56 -26 94 -23 -11 -59 53 -177 119 141 106 -119
6553 -119 -166 -143 -197 194 4 103 6 33 -255 -58 -34 5 -332 95 98 89 38 -258 -59 158 128 -194 -140 122 -144
6578 -144 56 4 233 175 92 -29 -267 -222 -59 -38 -104 -197 97 -36 5 33 -196 62 178 -57 -55 113 70 31
6602 31 -483 5 67 -321 -73 -128 101 208 44 70 -160 18 29 -39 -97 363 -1 300 573 -50 -55 31 449
6625 449 25 80 -84 32 34 66 -117 -238 56 212 -79 -103 -75 28 4 -103 44 183 200 -152 -120 42 -96
$$ packed form
6461e2j38J78j41L8K72m13N23k18l61M38M0l09K69k97K3N7j08J17nj35L59k48
6483a11J04J38k53K60j69K21j5k03Kq2n9L13q4K9r3n6o8R8Q7l7j50L71l42J34
6507C5O6l06L97j00j16r6j77M06j85L47j57r6K07k48K11r8J8k88M89m22k8M5M6
6530e0p9K93j00Q7k55k10N02j89j29K56j74J04q2J20j17J2m8J12k30K96K2l5k25
6553a19m7K3n4L91j90R9r7K7k88J97K4L9l37M27Lrn1k96J99K17l0l22N4K62k66
6578a44K00n2K29n8q3j21k38M5J63K1o6r3K94j33M1K8k29K58J16k35KJ68m3l9
6602C1n14M88O2l88K48n5K29J07j64K6k30J78J1o8n8M60l64L01K73o23nQ6M18
6625D49m24N5j64J16KL2j83j21K94J56k91k4K8J03k4j07J47J39J7l52L2J62j38
$$ plain form
6648 -96 -95 86 90 229 -25 91 113 -54 -243 155 143 72 -172 88 -4 16 -61 62 169 26 164 33 368 -44
6672 -44 56 -110 -175 61 133 -114 -79 195 45 78 -129 66 -152 190 -389 -199 -162 -239 -169 -21 161 -217 56
6695 56 -253 -52 17 199 21 199 168 -76 335 178 -89 -40 63 -14 -246 -351 -127 181 23 78 -87 -219
6717 -219 12 -45 -252 -88 -168 -236 -101 -157 205 51 141 -135 215 -5 -52 136 240 122 -4 75 -143 -297
6739 -297 -82 -13 -72 72 -27 144 242 41 -51 357 265 224 -199 -77 -124 -132 -15 143 -221 62 227 -73 -206
6762 -206 167 79 192 39 -156 -140 -137 -229 94 -21 34 208 30 66 127 114 -33 8 -8 1 9 -87 -120 -44 -99 57
6788 57 210 -147 -78 -138 -164 -167 69 22 33 -344 168 -23 142 50 -62 88 95 117 -266 -20 117 58 -59 -6 -56
6813 -56 -89 51 48 -128 263 -69 -285 -92 -10 -70 -290 -81 -225 118 -157 -21 -216 149 -49 56 -225 93
$$ packed form
6648i6JJ81MJ39k54J16K2j67j89L98j2p1k44K60r2K0p7J23J07j43J38j31L35m12
6672d4J00j66o5K36P2k47L5K74j50L3k07J95k18L42n79J90L7p7P0J48J82l78K73
6695E6l09K01O9J82j78J78l1k44M11j57k67M9J03p7k32j05K24L08j58N5j65j32
6717b19K31n7k07J64q0o8J35n6L62j54R0k76L50k20m7J88J04j18j26P9k18j54
6739b97K15O9n9J44r9J71R8k01r2M08r2m1m23J22m7qJ17J58l64K83J65l00j33
6762b06L73q8J13j53j95J6Lr2L23j15N5J74j78L6O1j3j47M1j6RQr6l3P6n5J56
6788E7J53l57O9o0k6lK36m7J1l77N12j91J65r2j12J50PK2l83K46J37n9j17N3n0
6813e6l3J40lj76L91l32k16J93Q2o0k20K09j44L43k75J36j95L65j98J05k81L18
$$ plain form
6835 93 86 59 2 -248 48 170 152 -46 -146 -4 71 94 74 -66 107 -191 37 -197 -1 -148 -11 -92 -125 30
6859 30 -53 344 -93 211 211 -131 82 -47 -173 37 -118 13 263 25 -32 -205 229 180 11 110 -107 182
6881 182 -36 100 -89 -56 -31 -14 181 92 314 -59 412 264 139 200 -122 101 -92 288 230 339 -28 -9
6903 -9 107 37 156 -183 294 -46 278 -266 83 -65 9 354 -130 -10 -32 -179 -87 320 19 134 -223 -396
6925 -396 -242 79 -6 -155 -17 -319 -119 -80 -310 -164 99 98 91 -357 58 119 135 -90 76 85 -191 -188 80 -97
6949 -97 84 -137 -23 -163 -393 -231 -224 70 151 -95 -201 -161 -140 -222 -105 75 148 -21 -42 74 -155 -196 47
6972 47 9 50 131 59 5 -92 -16 30 85 -128 65 -143 131 -132 -21 -225 201 271 -127 -35 -43 338 167 -245 239
6997 239 115 294 146 -177 90 305 293 -304 112 -263 -152 -138 -6 123 75 -11 195 -134 -31 15 4 -39
$$ packed form
6835I3pk7n7k50K96J22j8j98j00J42P5K3k0j40J73k98K28k34J96j47J37q1l3J55
6859C0q3L97m37L04%l42K13j29j26K10j55J31K50k38n7j73M34m9j69R9k17K89
6881A82k18J36j89L3K5J7J95q9K22l73M71j48j25O1l22K23j93L80n8J09l67J9
6903iJ16p0J19l39M77l40L24n44L49j48P4L45m84J20k2j47R2M07l01J15l57j73
6925c96J54L21q5j49J38l02K00L9k30J46K63jpm48M15O1J6k25J66Rk76LK68j77
6949i7J81k21J14j40k30J62PK94Q1k46j06M0K1q2J17J80P3j69k1J16k29m1K43
6972D7l8M1Q1p2n4r7P6M6N5k13J93k08K74k63J11k04M26P0l98R2qL81j71m12M84
6997B39j24J79j48l23K67K15j2n97M16l75J11J4J32J29m8q6K06l29J03M6j1m3
$$ plain form
7019 -39 155 -142 -86 143 -147 -65 -14 12 50 153 -53 137 209 79 -211 38 76 178 -20 -335 -38 -58 87
7042 87 157 132 -75 -2 -51 109 155 -27 -166 -68 47 -59 -8 -122 -27 -231 44 -326 -45 -3 5 77 -87 21
7066 21 -277 108 -237 -220 -456 89 225 -172 17 -12 -10 67 3 -155 -36 -71 -397 -31 -57 -175 217 52 109
7089 109 -236 -85 120 181 -24 -307 -109 -123 -106 -87 -25 166 -166 -187 -118 154 -63 -114 186 204 -51 -55 207 -231
7113 -231 20 53 304 -72 -135 -20 37 -193 6 187 357 71 -402 -168 -114 -357 85 219 -86 73 -130
7134 -130 42 -41 -142 89 381 -3 217 -15 52 116 159 25 -93 68 288 180 166 44 23 310 93 -74
7156 -74 71 150 -24 -279 167 213 -303 16 17 201 9 -11 226 295 175 -58 81 221 102 -163 -50 8 177
7179 177 182 -39 -33 -195 -247 3 -48 -105 -180 430 -111 -91 165 188 201 -43 -95 8 42 70 -54 -203 84 281 40
$$ packed form
7019c9J94k97N6K29k90Q2N1K6L8J03k06J90P2j30k90K49L8J02j98l15K97k0J45
7042H7P0k5k07P3m9J60M6j82j39R8J15j06N1j14R5k04K75l70K81M2QP2j64J08
7066B1k98L85l45J7k36N45J36l97J89k9KP7o4j58J19l5l26L66k6j18L92j65N7
7089A09l45J51K05O1k05k83J98j4J7J9O2J91l32k1O9K72k17n1L00J8k55mK62m38
7113b31K51L3K51l76o3J15N7k30J99J81J70k86m73K34N4k43M42J34l05J59k03
7134a30J72q3j01K31K92l84K20k32O7O4M3j34j18J61K20j08j4j22k1K87k17j67
7156g4J45P9j74k55M46M6n16L19JJ84j92k0K37O9j20k33J39J40j19k65J13N8J69
7179A77Nk21Oj62n2K50n1n7p5O10n41K0K56K3J3k44n2J03L4K8j24j49K87J97k41
$$ plain form
7204 40 -125 -17 185 208 4 66 -232 -45 28 -43 59 -63 114 57 189 -21 -61 100 173 -107 24 102 113
7227 113 92 -201 -28 51 105 20 104 -18 -332 -202 51 178 -260 15 -74 -119 189 -228 -141 -125 8 47 -84
7250 -84 -198 24 -2 37 -31 -19 -322 207 16 146 183 287 -95 -127 265 -149 54 -113 185 173 150 50 94
7273 94 -26 76 -127 160 59 -153 155 -77 240 -47 92 355 -143 -92 -117 13 67 -29 -16 199 -180 -21
7295 -21 -99 -361 198 -119 -161 186 -287 -155 27 -4 -113 -42 -154 -374 -68 -202 138 -58 -246 -245 -211 155 2
7318 2 28 1 -19 -110 -200 -351 65 -248 -234 93 -61 135 4 42 101 194 60 -398 -67 -78 -12 116 39 105 -17
7343 -17 -172 313 188 -109 117 -328 -183 -75 -89 -76 -140 83 150 -236 -107 145 186 -61 122 -112 190 -179
7365 -179 -221 168 -150 -11 41 10 -100 236 34 -143 64 131 -310 -164 97 62 148 -105 217 154 -27 -8 355
$$ packed form
7204D0j65J08K02K3k04O2k98J87P3p1J02j22J77n7J32k10m0J61P3k80J31P8J1
7227A13k1k93J73P9N4q5Q4j22l14J30K53J27m38K75q9m5L08m17Q7J6J33L9j31
7250h4j14K22k6L9o8J2l03N29j91J30L7J04l82l2L92m14K03j67K98j2k3j00M4
7273I4j20J02k03K87j01k12L08k32L17k87J39K63m98N1k5J30N4r6J3K15l79J59
7295b1p8k62N59l17m2L47m73J32J82l1j09P1j12k20L06j34L40j96j88JL4L66j53
7318BK6k7k0r1r0j51M16l13J4L27j54J96j31L8N9R3j34m58L31j1O6J28p7O6j22
7343a7j55M85j25k97K26m45J45J08j4J3o4K23O7l86J29K52M1k47J83k34L02l69
7365a79m2L89l18J39N2l1j10L36k02j77K07O7m41J46K61l5Q6k53L22o3j81J9L63
$$ plain form
7388 355 165 -8 -52 123 67 -100 241 -71 -52 380 122 -30 -167 15 53 -35 -86 103 141 -26 -78 179 -69
7411 -69 52 285 155 12 -104 116 -214 185 -133 -77 -108 -171 -223 -148 -3 -210 114 -196 56 87 123 177 86
7434 86 -17 166 -89 -57 -45 5 141 -56 -119 150 -90 -217 -61 78 -163 -73 -125 145 86 -106 -238 -249 76
7457 76 10 -111 -54 -303 -487 -267 -245 -166 280 -44 26 -2 -43 -172 -119 -97 68 255 27 -138 107 -58 -45 108
7481 108 -123 27 -260 -137 7 -102 74 -64 243 -218 -65 -154 3 31 -94 24 -85 -331 -92 17 17
7502 17 -118 -132 -331 80 143 -125 -195 -5 -100 -42 355 -38 -279 209 -194 378 -63 76 87 88 288 -166 95
7525 95 262 136 -235 -141 -207 -137 -95 50 142 -151 188 29 109 -143 -14 74 144 20 233 21 76 -81 -62 255
7549 255 -99 -23 -84 -143 -119 24 -107 31 -120 107 9 -372 -147 -32 -15 -19 44 -151 -182 -118 -285 -114 -16 93
$$ packed form
7388C55j90j73m4J75n6j67L41l12J9M32k58j52j37J82L8q8n1J89L8j67n2K57k48
7411f9J21K33j30j43j16K20l30L99l18N6l1o3n2P5J45k07L24l10K52L1L6N4r1
7434H6j03J83k55L2J2N0J36j97o3K69k40j27J56J39k41R0n2K70n9j92j32j1L25
7457G6o6j21N7k49j84K20K2P9M46l24P0k8m1j29N3K2J65J87k28j65K45j65J3J53
7481A08k31J50k87J23J44j09J76j38L07m61J53q9J57K8j25J18j09k46K39J09%
7502A7j35j4j99M11O3k68p0J90r5N8L97l93k41M88m03N72m41J39J1JK00m54K61
7525I5J67j26l71R4o6P0M2J45R2k93L39j59Q0k52J29Q8P0j24K13k12N5j57J9L17
7549B55l54P6o1n9K4J43j31J38j51K27r8l81K25J15J7mO3j95l1O4j67J71R8J09
$$ plain form
7573 93 106 47 105 14 186 -18 -62 -2 49 -125 -53 49 -11 114 178 -328 35 -139 -68 56 -53 73 -71 -9
7597 -9 -321 -131 -185 66 -258 51 -90 -16 -69 -244 253 -236 -182 145 126 83 -22 40 23 -114 59 69 104 -123
7621 -123 -42 -224 128 222 255 -293 63 -94 67 210 172 223 327 186 92 184 -50 3 268 217 254 -178 -167 -139
7645 -139 -301 -92 -46 -143 -86 225 -100 30 107 -55 136 -199 -40 -88 -88 -88 50 168 240 -149 250 205 90 -230
7669 -230 348 143 25 132 164 108 114 37 -31 -162 292 218 23 246 163 -112 -347 -41 -246 -120 -275 -237 -26
7692 -26 -45 109 102 22 30 -194 -167 -42 -28 -46 67 2 -144 179 -180 -38 50 -417 -55 65 356 -107 -51 78
7716 78 241 6 -6 26 15 -130 14 -138 152 21 75 -230 195 -30 -120 34 -218 -33 208 -114 -80 43
7738 43 -292 42 91 -153 218 -218 -58 -42 112 -34 330 3 285 101 0 -10 -229 32 23 -60 -71 -212 -176
$$ packed form
7573I3J3n9N8r1J72k04m4O0N1j74P2J02o0J25O4n06L63j74P1J24j09J26j44O2
7597il12J90n4K51l24L09j41P4n3j75M97m89N4L27j9m3j05O2j7j37J73J0L5k27
7621a23Q1j82L52R4L3n48L56j57J61J43l8N1J04j41r4R2k34N3K65n1L7m32J1K8
7645a39j62K09M6r7N7L11l25J30P7j62J91l35J59m8%%J38J18P2l89L99m5j15l20
7669b30N78k05j18J07L2n6Op7o8j31M54p4j95K23q3k75k35L06k05J26j55L8K11
7692b6j9J54pq0Qk24K7J25J4j8J13o5j46L23l59J42Q8m67L62J20K91m63N6J29
7716G8J63k35j2L2j1j45J44j52K90j31N4l05M25k25r0J54k52J85K41l22L4J23
7738D3l35L34M9k44L71m36J60J6J54j46L64l27K82j84j01j0k19K61rq3j1j41L6
$$ plain form
7761 -176 -120 -31 188 15 218 -116 -250 -99 -126 -19 -9 -145 -142 63 126 113 172 -26 21 220 63 -28 12 367
7785 367 131 111 49 -316 -115 -120 83 -33 143 74 -68 -80 -365 146 122 -70 -106 -115 -164 197 -17 -356 111 -290
7809 -290 -35 -269 -94 19 -101 103 131 -133 7 64 -143 -175 97 -71 -147 98 -191 55 -70 -14 -242 -16
7831 -16 45 -97 -18 -135 -40 -38 225 108 -58 -16 -132 -388 164 224 94 209 -123 243 -150 35 175 173 216 -149
7855 -149 259 -14 -121 -52 -155 6 -119 -85 15 170 169 54 36 187 -15 -396 52 -28 152 -11 155 181
7877 181 47 269 -284 244 -83 -125 50 163 29 10 -141 -20 260 102 -192 333 100 67 -275 -18 87
7898 87 136 335 27 -236 -249 -73 31 90 39 145 -409 257 49 -10 18 63 -94 -1 -73 54 54 -28 -165 95
7922 95 39 43 173 -281 -69 134 204 101 137 -16 -120 170 324 -63 179 -122 194 -303 -253 35 170 -206
$$ packed form
7761a76N6Q9K19j73K03l34j34J51k7J07J0j36LK05O3j3N9j98M7J99j57r1M0L55
7785C67k36k0o2l65K01nK03j16J76o9j42j2k85N11k4j92l6rm9L61k14l39M67m01
7809b90K55k34J75J13j20K04K8k64J40N7k07l2K72j68p6K45k89K46j25N6k28K26
7831a6O1j42P9j17R5KK63j17j66M2j16k56N52O0j30J15l32L66l93J85J40kM3l65
7855a49M08k73j07O9j03J61j25L4J00J55jj15j8J51k02l81M48q0J80j63J66K6
7877A81j34K22n53N28l27m2J75J13j34j9j51J21K80j58k94N25k33l3l42K57J05
7898H7M9J99l08k63j3J76J04N9n1J06n54O66k08n9K8M5j57R3p2J27%q2j37K60
7922I5n6MJ30m54K12K03P0j03L6j53j04K90J54l87K42l01L16m97N0K88J35l76
$$ plain form
7944 -206 286 -126 -90 -9 -76 -154 243 62 62 -528 -160 -31 -334 -114 -165 -80 -225 10 47 76 370 -176 7
7967 7 -15 -79 56 -201 82 -264 -49 98 236 155 -50 50 288 257 -155 45 -62 10 200 0 -172 43
7989 43 -99 -56 -175 46 290 152 94 -33 5 8 82 -98 -117 67 -106 -66 -140 134 158 88 -271 231 -87 -109
8013 -109 160 140 168 -68 92 41 114 17 32 80 -85 7 236 109 255 47 -187 373 -97 41 15 112 203 31
8037 31 501 -67 372 -30 225 281 280 -196 -4 311 113 -59 -107 -33 -135 -103 160 447 -151 28 -46 -105 -10
8060 -10 -66 -27 -55 47 284 -122 10 129 132 159 -69 -156 -49 -126 3 -72 214 -206 29 -199 -243 152 135 -158
8084 -158 -62 336 111 222 53 -75 -52 -32 -196 93 -346 -246 -92 136 192 9 124 -329 205 303 36 72
8106 72 247 172 102 43 43 -85 -175 -335 78 -150 -184 -47 98 50 -291 14 193 -223 377 -24 155 -210 -65
$$ packed form
7944b06M92m12L6Q1o7p8L97j81%n90L68J29l03K20n1Q5j45K35L7K9K94n46J83
7967Gk2o4J35k57K83l46K15J47J38q1k05J00K38l1m12K00j07P2J90k00j72K15
7989D3j42M3j19K21K44j38n8j27L8LP4j80j9J84j73M0p4K74K4p0l59N02l18k2
8013a09K69k0K8k36J60n1P3r7J5M8j65R2K29j27J46k08k34N60m70J38k6R7R1j72
8037C1M70n68M39m02K55N6jm76J92L15j98j72m8P4j02L2K63K87n98J79p4n9R5
8060a0n6L9k8J02K37m06J32J19LK7k28q7J07p7J29p5K86m20K35k28m4L95j7k93
8084a58R6L98k25J11j69j28K3K0j64K89m39J00J54K28N6j83J15m53N34R8k67L6
8106G2J75p5p0n9%j28r0j60M13k28l4J37J45m8l41L05J79m16O00m01J79l65J45
$$ plain form
8129 -65 166 107 21 179 103 -59 389 196 29 130 -314 201 121 159 148 42 -90 -252 -162 54 -52 27 226
8152 226 -15 -50 -46 -230 -213 -14 149 -65 -184 63 -20 -153 -223 -111 117 -49 -231 146 71 -143 122 254
8174 254 102 46 -30 472 182 313 5 -108 155 65 287 35 32 -276 -124 136 -294
$$ packed form
8129f5K31n9q6J58p6j62M48j93j67J01m44N15q0L8j1j06j32j62R0K16j06P9J99
8152B26k41l5Mj84J7J99J63k14j19K47q3j33p0J12K28j66j82L77p5k14K65J32
8174B54j52n6p6N02k90J31l08j13K63r0K22k52ll08J52K60m30
8191b94
$$ Imaginary data points
##PAGE= N=2
##DATA TABLE= (X++(I..I)), XYDATA
$$ plain form
0 0 0 0 0 0 0 0 0 8 -8 8 -8 13 -16 16 -24 24 -32 39 -46 53 -62 71 -82 94 -109 125 -142 159 -181 204 -230
31 -230 258 -288 323 -361 401 -445 492 -548 609 -672 742 -825 912 -1014 1124 -1250 1396
48 1396 -1562 1758 -1991 2272 -2623 3072 -3667 4504 -5761 7857 -11991 23174 -112363 -314878
62 -314878 69006 252211 -33267 -240837 -76232 -13887 -123142 -53057 135498 70856 -96703
73 -96703 -95543 -80539 -200529 -187434 25748 132760 46464 -11035 -55559 -196293 -256999 -100142
85 -100142 35116 11683 6151 39657 -68497 -215806 -179335 -75098 -76517 -39774 78791
96 78791 23421 -201258 -236730 -49174 29142 -41700 -27807 28384 -59992 -191570 -195859 -140672
108 -140672 -85219 35664 123297 10406 -156179 -154054 -103022 -154329 -137674 29405 85056
$$ packed form
0@%%%%%%%Qj6J6j6K1k9L2m0M8n6P1q5R9j15J33j53J76k03K34k67L01l40L85m34
31b30M88n46O11o84P62q46R37j040J157j281J414j567J737j926K138k374K646
48A396k958L320l749M263m895N695o739Q171j0265J3618j9848L5165j35537k02515
62c14878L83884J83205k85478k07570J64605O2345j09255P0085J88555o4642j67559
73i6703J160J5004j19990J3095K13182J07012q6296n7499m4524j40734o0706J56857
85a00142J35258k3433n532L3506j08154j47309L6471J04237j419L6743J18565
96G8791n5370k24679l5472J87556P8316p0842J3893N6191q8376j31578m289N5187
108a40672N5453J20883Q7633j12891j66585K125N1032n1307J6655J67079N5651
$$ plain form
119 85056 -56434 -121772 -53390 -82998 -168968 -71575 84168 23822 -120613 -98619 -36704
130 -36704 -97671 -112036 19682 69187 -51150 -112849 -50476 -62825 -148544 -96462 57166
141 57166 80327 -20411 -61153 -40526 -67385 -100484 -61088 -5658 4059 4681 7287 -23293 -57918
154 -57918 -45893 -16622 -11228 -10530 -6036 -21014 -40347 -32059 -16421 -15911 -1999 24409 14085
167 14085 -26164 -35155 -16994 -22212 -23798 24752 64455 29511 -18020 -9962 -3372 -39781 -40287
180 -40287 24227 58663 30319 16749 26471 -1569 -37871 -9314 36939 25597 5853 30991
192 30991 36034 -11323 -21209 36721 62577 26729 17358 42851 18702 -32486 -9420 55459 59924
205 59924 31272 44582 50835 -3216 -37285 7290 51749 43016 42804 69637 54289 -1405 -14800
$$ packed form
119H5056j41490o5338O8382k9608q5970R7393J55743o0346j44435K1994O1915
130c6704o0967j4365J31718M9505j20337o1699O2373j2349q5719N2082J53628
141E7166K3161j00738m0742K0627k6859l3099L9396N5430R717O22K606l0580l4625
154e7918J2025K9271N394O98M494j4978j9333Q288J5638N10J3912K6408j0324
167A4085m0249q991J8161n218j586M8550L9703l4944m7531Q058O590l6409n06
180d0287O4514L4436k8344j3570R722k8040l6302K8557M6253j1342j9744K5138
192C0991N043m7357r886N7930K5856l5848r371K5493k4149n1188K3066O4879M465
205E9924k8652J3310O253n4051l4069M4575M4459q733k12K6833j5348n5694j3395
$$ plain form
218 -14800 21708 40033 34058 44435 58977 40295 12050 15288 35720 45875 47651 46588 34239
231 34239 17946 11992 15262 28308 53462 68204 52859 29639 20946 13473 5134 24038 58096
244 58096 63268 45757 41756 38504 12853 -604 24992 49624 40786 33390 43996 39185 16683
257 16683 18362 40729 39099 20705 24237 32873 17246 6085 29262 50720 41132 30508 35297
270 35297 24080 -2055 -3040 20610 31348 27870 35354 43435 28841 4779 -992 7391 11953 14029
284 14029 21503 28392 23779 14269 12438 13544 10198 5336 6402 10399 6606 494 4575 17277 22084
299 22084 14861 9024 4456 -6758 -16923 -12808 -649 7231 14506 21415 15642 -2325 -14819 -16719
313 -16719 -17033 -13710 -2438 5536 4610 3086 1559 -5334 -13964 -13088 -10473 -14421 -18118 -13742 -9120
$$ packed form
218a4800L6508J8325n975J0377J4542j8682k8245L238K0432J0155J776j063j2349
231C4239j6293n954L270J3046K5154J4742j5345k3220q693p473q339J8904L4058
244E8096N172j7511m001l252k5651j3457K5596K4632q838p396J0606m811k2502
257A6683J679K2367j630j8394L532Q636j5627j1161K3177K1458r588j0624M789
270C5297j1217k6135r85K3650J0738l478P484Q081j4594k4062n771Q383M562K076
284A4029P474O889m613r510j831J106l346m862J066L997l793o112M081J2702M807
299B2084p223n837m568j1214j0165M115J2159P880P275O909n773j7967j2494j900
313a6719l14L323J1272P974r26j524j527o893q630Q76K615l948l697M376M622
$$ plain form
328 -9120 -6844 -996 5157 -715 -12922 -19147 -23983 -31113 -27872 -11977 -655 631 1579 -2384 -18152
343 -18152 -30772 -27440 -23069 -25140 -17335 -2079 -1105 -12686 -12490 -8180 -17703 -27557 -21538 -16618 -25100
358 -25100 -24261 -7785 -1151 -8131 -8442 -4446 -16347 -33222 -33149 -24384 -23236 -16322 598 6171 -4393
373 -4393 -11285 -12695 -22899 -32303 -24935 -13815 -12324 -8989 595 74 -10360 -12449 -10444 -18096 -25636
388 -25636 -19362 -11349 -13185 -10280 1544 4725 -5736 -11005 -10813 -18799 -27087 -19994 -6835 -1428
402 -1428 1727 8476 6666 -6472 -15519 -16505 -18546 -19423 -10943 -392 1739 801 2416 836 -5942
417 -5942 -9930 -10227 -12869 -14217 -9186 -1913 725 3199 7780 5776 -4219 -11322 -12264 -11796 -11065 -3215
433 -3215 6779 9672 5128 1418 -1967 -9015 -14315 -12736 -6383 -2016 1369 5385 8430 6267 2118
$$ packed form
328i120K276N848O153n872j2207o225m836p130L241J5895J1322J286R48l963j5768
343a8152j2620L332M371k071P805J5256R74j1581J96M310r523r854O019M920q482
358b5100Q39J6476O634o980l11L996j1901j6875P3Q765J148O914J6920N573j0564
373d393o892j410j0204r404P368J1120J491L335R584n21j0434k089K005p652p540
388b5636O274Q013j836K905J1824L181j0461n269J92p986q288P093J3159N407
402a428L155O749j810j3138r047r86k041q77Q480J0551K131r38J615j580o778
417e942l988k97k642j348N031P273K638K474M581k004r995p103r42M68P31P850
433c215R994K893m544l710l385p048n300J579O353M367L385M016L045k163m149
$$ plain form
448 2118 -1140 -3896 -8425 -10439 -6515 92 3505 5775 9284 10201 4168 -3918 -7542 -7705 -6660 -4221
464 -4221 1212 5992 7976 6829 4367 438 -3172 -4834 -3629 -982 3189 7436 9027 8404 6225
479 6225 2342 -1822 -3705 -3176 -2423 570 5695 8291 7428 7278 8056 4541 -2836 -4733 -1714 -221
495 -221 72 6020 12895 12360 8456 7158 3974 -2200 -3475 2454 4692 2495 6469 12107 7556 -1235
511 -1235 211 6360 2469 -3614 2805 11318 7214 2286 7859 11540 3663 -1663 2174 2514 -2687
526 -2687 895 11996 12889 5935 6626 10628 1839 -8356 -4722 3822 2810 -17 6285 11162 5610
541 5610 796 2784 4349 994 -588 1280 2900 3777 4410 4718 4006 3282 1856 -2050 -3511 -1776
557 -1776 704 3561 8016 7202 203 -1792 1401 -2777 -10393 -4993 7786 7207 -1458 3216 12158
$$ packed form
448B118l258k756m529k014L924O607L413K270L509R17o033q086l624j63J045K439
464d221N433M780J984j147k462l929l610j662J205K647M171M247J591o23k179
479F225l883m164j883N29P53K993N125K596q63j50P78l515p377j897L019J493
495b21K93N948O875n35l904j298l184o174j275N929K238k197L974N638m551q791
511a235J446O149l891o083O419Q513m104m928N573L681p877n326L837L40n201
526b687L582J1101Q93o954O91M002q789j0195L634Q544j012k827O302M877n552
541E610m814J988J565l355j582J868J620Q77O33L08p12p24j426l906j461J735
557a776K480K857M455q14o999j995L193m178p616N400J2779n79q665M674Q942
$$ plain form
572 12158 3398 -7506 -812 5110 -6622 -11686 2617 9079 -1024 -2215 10307 7729 -8886
585 -8886 -8742 2778 -1797 -10000 1952 15244 4712 -7550 765 8393 -2719 -11051 -1076 6567
599 6567 964 -241 6322 6985 1232 649 1544 -3796 -8935 -5488 2167 6220 6563 6075 6695 5835 717
616 717 -5503 -5011 734 1315 1027 7317 10673 3250 -680 7909 9821 -4881 -10794 2414 8448 -308
632 -308 911 14255 12829 314 1113 5328 -5631 -11808 5870 19263 6821 -2271 11172 16792
646 16792 571 -7774 2083 5343 -3353 -1557 9721 9207 2548 7283 15287 8055 -6752 -9331
660 -9331 -492 4694 2655 2852 9756 14315 8019 -543 -1284 286 -3688 -3013 7381 9933 -1599
675 -1599 -2494 13632 14533 -5658 -10941 3338 3691 -10465 -6465 11067 10112 -54 7676 12635 -7119
$$ packed form
572A2158q760j0904O694N922j1732n064J4303O462j0103j191J2522k578j6615
585h886J44J1520m575q203J1952J3292j0532j2262Q315P628j1112q332R975P643
599F567n603j205O563O63n753n83Q95n340n139L447P655M053L43m88O20q60n118
616G17o220M92N745N81k88O290L356p423l930Q589J912j4702n913J3208O034q756
632c08J219J3344j426j2515P99M215j0959o177J7678J3393j2442r092J3443N620
646A6792j6221q345R857L260q696J796J1278n14o659M735Q004p232j4807k579
660i331Q839N186k039J97O904M559o296q562p41J570l974O75J0394K552j1532
675a599q95J6126R01k0191n283J4279L53j4156M000J7532r55j0166P730M959j9754
$$ plain form
690 -7119 -20545 -3660 9054 -4252 -9846 8024 14152 -799 -4892 3097 -2029 -12666 -5804
703 -5804 2638 -6405 -12302 2915 14382 3212 -7652 -4454 -3187 -10083 -11429 -4858 -690 719
717 719 3893 3343 -2922 -7642 -9337 -8459 -5327 -4132 -8232 -8041 2248 7147 -3346 -8595 -1398 -2577
733 -2577 -15405 -14998 -2952 -3522 -9134 2767 13562 -3034 -19508 -6942 4409 -12280 -21564
746 -21564 -1696 9536 -5995 -10861 4361 4211 -13543 -12055 2453 -5654 -20794 -8947 9464
759 9464 2094 -9541 -84 6528 -9193 -19214 -7215 -873 -9198 -7664 5887 5810 -6314 -8208
773 -8208 -1659 -3522 -9734 -8170 -4594 -4732 -3782 906 1158 -1507 -1980 -2632 -7206 -10405 -8711 -5277
789 -5277 -1346 2092 2232 -1926 -2839 -1291 -6237 -11508 -5883 1357 -2612 -7925 409 6569 -2385 -9012
$$ packed form
690g119j3426J6885J2714j3306n594J7870O128j4951m093P989n126j0637O862
703e804Q442r043n897J5217J1467j1170j0864L198J267o896j346O571M168J409
717G19L174n50o265m720j695Q78L132J195m100J91J0289M899j0493n249P197j179
733b577j2828M07J2046n70n612J1901J0795j6596j6474J2566J1351j6689r284
746b1564J9868J1232j5531m866J5222j50j7754J488J4508q107j5140J1847J8411
759I464p370j1635R457O612j5721j0021J1999O342q325J534J3551p7j2124j894
773h208O549j863o212J564L576j38R50M688K52k665m73o52m574l199J694L434
789e277L931L438J40m158r13J548m946n271N625P240l969n313Q334O160q954o627
$$ plain form
805 -9012 -408 1955 -9964 -11659 201 2191 -6195 -632 9679 1004 -12622 -5436 4088 -6604
819 -6604 -14296 1969 11876 -2168 -9459 4385 7586 -9188 -11426 3948 3619 -9759 -5554 7932
833 7932 4856 -4347 450 5072 -4464 -9503 -370 2270 -4848 -668 10045 7015 -3925 -2868 2887
848 2887 -385 -4300 83 2940 1535 3766 5657 1799 -103 4268 4204 -3701 -2877 5214 4271 275
864 275 6126 11240 3423 -2400 3685 4536 -2800 298 10414 7613 846 7856 13023 1297 -5423
879 -5423 7242 11877 -1994 -3785 11894 14012 1416 2815 13818 8112 -3182 2690 10295 2840
893 2840 -225 11622 16017 4320 2219 11012 7916 -2200 1425 11155 8199 2872 9024 13346
907 13346 6779 3120 6233 5834 1716 3723 6726 5360 6460 12292 11222 4474 3825 7211 3666
$$ packed form
805i012Q604K363j1919j695J1860J990q386N563J0311q675j3626P186R524j0692
819f604p692J6265R907j4044p291J3844L201j6774k238J5374l29j3378M205J3486
833G932l076r203M797M622r536n039R133K640p118M180J0713l030j0940J057N755
848B887l272l915M383K857j405K231J891l858j902M371o4p905Q24Q091r43l996
864B75N851N114p817n823O085Q51p336L098J0116k801o767P010N167j1726o720
879e423J2665M635j3871j791J5679K118j2596J399J1003n706j1294N872P605p455
893B840l065J1847M395j1697k101Q793l096j0116L625R730k956n327O152M322
907A3346o567l659L113l99m118K007L003j366J100N832j070o748o49L386l545
$$ plain form
922 3666 -991 3388 8044 6491 6318 9969 7988 1568 2932 6063 1658 -1848 4714 8213 4511
937 4511 3782 8771 7147 -301 130 3751 1058 -2337 3027 8226 5085 2982 5771 4122 -2159 -2994
953 -2994 960 -167 -2395 1760 7073 4522 754 1317 2369 -1323 -4464 -3284 -967 84 1177
968 1177 3113 2952 1607 -178 -2082 -3723 -4331 -4316 -2380 76 1843 814 -351 -240 -2120 -5082
984 -5082 -5730 -4002 -3779 -3056 -174 2065 508 -1447 -1786 -2934 -6352 -7011 -5215 -3551 -2458 -217
1000 -217 1140 -510 -1970 -2716 -5408 -7548 -6946 -4659 -3740 -2733 -178 235 -1731 -3000 -3328 -5775
1016 -5775 -7732 -5824 -3306 -3501 -2418 -90 -148 -2975 -4143 -4800 -6919 -8030 -5047 -2421 -2831 -2122
1032 -2122 272 -775 -4870 -5594 -4416 -7040 -8503 -4531 -1312 -2140 -2404 544 -617 -5370 -6828 -5354
$$ packed form
922C666m657M379M656j553j73L651j981o420J364L131m405l506O562L499l702
937D511p29M989j624p448M31L621k693l395N364N199l141k103K789j649o281q35
953b994L954j127k228M155N313k551l768N63J052l692l141J180K317J051J093
968A177J936j61j345j785j904j641o08J5J936K456J767j029j165J11j880k962
984e082o48J728K23P23K882K239j557j955l39j148l418o59J796J664J093K241
1000b17J357j650j460p46k692k140O02K287R19J007K555M13j966j269l28k447
1016e775j957J908K518j95J083K328n8k827j168o57k119j111K983K626m10P09
1032b122K394j047m095p24J178k624j463L972L219q28k64K948j161m753j458J474
$$ plain form
1048 -5354 -6368 -7887 -4567 -800 -1933 -2978 -869 -1390 -5545 -6873 -4923 -5454 -6482 -3552 -756
1063 -756 -1494 -2481 -1535 -2553 -6418 -7019 -4560 -4647 -5515 -2417 760 -666 -3212 -2149 -2530 -6582 -7403
1080 -7403 -4487 -3348 -4044 -1632 1193 229 -2404 -2512 -3034 -5086 -6132 -3847 -1981 -1773 -754 1368
1096 1368 61 -2292 -2754 -2445 -4142 -4381 -2075 -643 -953 135 2093 796 -1804 -1892 -1195 -2834 -3261
1113 -3261 76 2462 1370 1314 2966 2117 -1557 -2211 -746 -514 -1301 989 3709 3428 1974 2999 2743
1130 2743 340 -566 608 1099 1128 2569 4732 4747 3269 2964 2616 896 220 1825 2776 3094 4301 5502
1148 5502 4229 3062 3805 2908 1285 1206 3119 4057 3646 4900 6323 5150 3669 3516 2513 1450 2017
1165 2017 4389 4806 4400 4915 6160 4728 2005 2468 3442 2217 2091 3818 5172 4261 4268 5184 4197 1943
$$ packed form
1048e354j014j519L320L767j133j045K109n21m155j328J950n31j028K930K796
1063g56p38r87R46j018l865o01K459q7q68L098L177j426k546J063l81m052q21
1080g403K916J139o96K412K825r64k633j08n22k052j046K285J866K08J019K122
1096A368j307k353m62L09j697k39K306J432l10J088J958j297k600q8O97j639m27
1113c261L337K386j092n6J652q49l674o54J465K32p87K290K720k81j454J025k56
1130B743k403r06J174M91K9J441K163J5j478l05l48j720o76J605R51L18J207J201
1148E502j273j167P43q97j623p9J913R38m11J254J423j173j481j53j003j063N67
1165B017K372M17m06N15J245j432k723M63R74j225j26J727J354r11PR16r87k254
$$ plain form
1183 1943 1969 2876 1951 1506 4437 5512 4255 3339 3732 3249 912 -199 1772 3555 2798 2613 3533 3996
1201 3996 2779 1725 1330 1107 704 456 1790 2472 2310 3040 3990 2588 -446 -1073 151 75 -384 1437
1219 1437 3830 2836 1064 825 1151 -79 -1276 -219 1026 1176 789 1456 1940 1777 1432 289 -1401
1236 -1401 -1809 -1188 536 701 1447 2340 2404 1081 -1072 -2558 -1716 -198 500 -324 528 2253 1972 -323
1254 -323 -506 906 -384 -2878 -1663 643 -307 -386 2058 3653 699 -1729 -546 -1778 -3620 -1269
1270 -1269 3011 1904 -1258 871 3063 -773 -4616 -1550 1948 -997 -3368 -62 1975 133 200
1285 200 2075 245 -3250 -3393 -1229 -2073 -2235 812 4061 1450 -1538 -1650 -1732 -3484 -2988 -1004 151
1302 151 -539 -1238 -563 -508 -96 -1196 -2476 -3036 -2258 -2939 -4277 -2180 2083 1991 -828 -2461 -2660 -5006
$$ packed form
1183A943K6R07r25m45K931J075j257r16L93m83k337j111J971J783p57j85R20M63
1201C996j217j054l95k23m03k48J334O82j62P30R50j402l034o27J224p6m59J821
1219A437K393r94j772k39L26j230j197J057J245J50l87O67M84j63l45j143j690
1236a401m08O21J724J65P46Q93O4j323k153j486Q42J518O98q24Q52J725k81k295
1254c23j83J412j290k494J215K306r50p9K444J595k954k428J183j232j842K351
1270a269M280j107l162K129K192l836l843L066L498k945k371L306K037j842O7
1285B00J875j830l495j43K164q44j62L047L249k611k988j12q2j752M96J984J155
1302A51o90o99O75N5M12j100j280n60P78o81j338K097M263r2k819j633j99k346
$$ plain form
1320 -5006 -5044 -2389 -1063 -1689 -931 1219 -1341 -5010 -3844 -180 -1876 -5425 -3773 -948 -2520 -3604
1336 -3604 -110 2345 -1748 -4840 -3643 -3764 -6158 -4530 881 1511 -1608 -1719 -880 -3855 -6585 -2875
1352 -2875 465 -2180 -5087 -1832 586 -1950 -3317 -699 1249 -2939 -5539 -4528 -2672 -2149 -354
1367 -354 2076 950 -1280 -2717 -3468 -3847 -3656 -1015 663 475 -1196 -1594 -1211 -26 -952 -1921 -1135
1384 -1135 -876 -2153 -3341 -453 3311 2313 -334 -128 -305 -3288 -4771 -852 2928 2208 622 1646
1400 1646 976 -2003 -2096 1308 1365 -1036 -481 1603 -85 -1555 1951 4665 1885 -1607 -604 397
1416 397 -1823 -1527 3014 4993 2724 307 548 -503 -2089 -225 2435 1856 234 1098 2307 773
1432 773 -294 1717 2785 1075 -1282 -1335 339 1327 1728 3223 3832 1966 -1552 -1676 -268 413 -102
$$ packed form
1320e006l8K655J326o26P58K150k560l669J166L664j696l549J652K825j572j084
1336c604L494K455m093l092J197j21k394J628N411O30l119j11Q39k975k730L710
1352b875L340k645k907L255K418k536j367K618J948m188k600J011J856N23J795
1367c54K430j126k230j437p51l79J91K641J678j88j671l98L83J185r26r69P86
1384a135K59j277j188K888L764r98k647K06j77k983j483L919L780p20j586J024
1400A646o70k979r3L404N7k401N55K084j688j470L506K714k780l492J003J001
1416C97k220K96M541J979k269k417K41j051j586J864K660n79j622Q64J209j534
1432G73j067K011J068j710k357n3J674R88M01J495O09j866l518j24J408O81n15
$$ plain form
1449 -102 2120 3202 1718 -339 -497 1162 784 451 1339 995 -764 -734 1336 2784 1716 502 1021
1466 1021 190 -1991 -2268 -325 2572 3151 2087 1211 245 -758 -1388 63 1315 1049 468 515 1677
1483 1677 262 -186 1936 2626 416 -1645 -858 630 -363 839 4010 3272 -822 -1013 1134 -197
1499 -197 -2385 665 4165 2455 -773 1183 2215 -369 -874 2300 2059 -1212 -984 2424 2135 121
1515 121 1930 4058 1567 -1832 -567 833 -443 899 3617 3312 543 493 1406 219 -858 1134
1531 1134 2243 771 502 2214 1127 420 2084 2585 17 -1255 580 608 -298 1511 4222 2038
1547 2038 -418 1026 1068 -2114 -1762 2350 2565 -351 1025 3078 553 -1945 927 2502 -914 -2628
1563 -2628 1064 2042 -972 -400 3349 2133 -1979 -1360 768 -1616 -2710 847 3119 -40 -1184 1183
$$ packed form
1449a02K222J082j484k057j58J659l78l33Q88l44j759L0K070J448j068j214N19
1466A021q31k181k77J943K897N79j064q76r66j003o30J451J252k66n81M7J162
1483A677j415m48K122O90k210k061P87J488r93J202L171p38m094j91K147j331
1499a97k188L050L500j710l228J956J032k584n05L174k41l271K28L408k89k014
1515A21J809K128k491l399J265J400j276J342K718l05k769n0R13j187j077J992
1531A134J109j472k69J712j087p07J664N01k568j272J835K8r06J809K711k184
1547B038k456J444M2l182L52M112K15k916J376K053k525k498K872J575l416j714
1563b628L692R78l014N72L749j216m112O19K128k384j094L557K272l159j144K367
$$ plain form
1579 1183 480 -2602 -1878 647 -549 -2002 -20 1231 -573 -929 707 327 -2496 -2071 -926 -1694
1595 -1694 -2033 547 1347 -643 -839 410 -1485 -3421 -1694 104 -1046 -1811 98 761 -1264 -1567
1611 -1567 475 -802 -3254 -1912 274 -1149 -1934 533 1631 -584 -1623 -452 -1190 -3015 -1924
1626 -1924 518 -18 -811 352 1179 -845 -1877 -478 121 -2138 -1791 673 403 -930 211 1832
1642 1832 227 -1977 -986 -556 -1406 -1296 608 1322 -58 462 575 -501 -1452 -818 -617 -784 -242 737
1660 737 926 139 412 723 -707 -1347 -433 -339 -897 69 1099 1237 -285 360 809 -955 -1621 -936 102
1679 102 -544 -209 1056 1369 -148 -207 354 -599 -1770 -908 65 -228 -272 971 693 -231 -582 -591 -1153 -1745
1699 -1745 -656 76 -53 -377 587 633 -844 -1241 -350 -932 -1315 -1121 276 17 -383 91 -126 -880 -1602
$$ packed form
1579A183p03l082P24K525j196j453J982J251j804l56J636l80k823M25J145p68
1595a694l39K580Q00j990j96J249j895j936J727J798j150p65J909O63k025l03
1611a567K042j277k452J342K186j423p85K467J098k215j039J171p38j825J091
1626a924K442n36p93J163Q27k024j032J399N99k259L47K464k70j333J141J621
1642A832j605k204R91M30q50J10J904P14j380N20J13j076r51O34K01j67N42R79
1660G37J89p87K73L11j430o40R14R4n58R66J030J38j522O45M49j764o66O85J038
1679A02o46L35J265L13j517n9N61r53j171Q62R73k93m4J243k78r24l51rn62n92
1699a745J089P32j29l24R64M6j477l97Q91n82l83J94J397k59m00M74k17p54p22
$$ plain form
1718 -1602 -785 -1026 -1565 -1095 299 -85 -530 65 26 -1436 -1476 -831 -670 -1095 -350 545 -93 -507 -53 -20
1738 -20 -1130 -1234 -599 -248 -876 -59 756 301 -107 81 -329 -1108 -1004 -287 124 -150 679 1255 585 -262
1758 -262 376 160 -645 -960 406 758 185 857 1541 1050 90 63 117 -392 -313 990 754 395 1179 1220 609
1779 609 -144 347 476 -124 286 1206 1061 1148 1375 1548 380 -23 393 408 -32 575 1288 1228 651 1687
1799 1687 1476 352 -295 420 480 -1 468 1448 1393 689 1045 891 -276 -205 377 388 -153 226 1343 1082
1819 1082 600 634 556 -365 -506 213 44 50 728 1244 811 306 298 -160 -370 -595 2 72 60 558 824 3
1841 3 36 31 -549 -986 -557 9 -151 78 848 811 -345 -542 -54 -189 -1070 -473 43 -290 -270 1019 1231 10
1863 10 -683 -475 -397 -1216 -566 599 610 -34 300 567 -221 -840 -361 203 -223 -464 108 507 493 246 555
$$ packed form
1718a602Q17k41n39M70J394l84m45N95l9j462m0O45J61m25P45Q95o38m14M54L3
1738b0j110j04O35L51o28Q17Q15m55m08J88m10p79J04P17M11k74Q29N76o70q47
1758b62O38k16q05l15J366L52n73O72O84m91r60k7N4n09P9J303k36l59P84M1o11
1779F09p53M91J29o00M10R20j45Q7K27J73j168m03M16J5m40O07P13o0n77J036
1799A687k11j124o47P15O0m81M69R80n5p04L56j54j167P1N82J1n41L79J117k61
1819A082m82L4p8r21j41P19j69OO78N16m33n05qm58k10k25N97P0j2M98K66q21
1841CL3nn80m37M29N66j60K29P70l7j156j97M88j35q81N97N16l33K0J289K12j221
1863A0o93K08P8q19O50J165J1o44L34K67p88o19M79N64m26k41N72L99j4k47L09
$$ plain form
1884 555 130 -160 -743 -600 -185 265 855 1194 677 589 24 -290 -83 -343 8 288 834 679 694 409 1288
1905 1288 329 -60 29 167 -7 -408 597 1499 894 357 581 498 -804 -682 608 1057 601 597 1029 480
1925 480 -395 -92 673 497 -595 -90 846 371 -34 607 1295 599 -583 -517 -198 -439 -714 390 917
1944 917 544 -160 -8 -379 -947 -800 -349 323 -327 -829 257 273 -802 -439 502 -278 -1467 -1601 -513
1963 -513 20 -285 -390 413 130 -1563 -1261 -922 -911 -972 -5 464 -230 -1150 -886 -398 -963 -1251 -735 -121
1983 -121 -1082 -1644 -546 561 -301 -1083 -646 -342 -1515 -1998 -823 541 161 -525 -64 -286 -1322 -1528
2001 -1528 -354 59 -716 -816 -66 38 -567 -842 835 640 -1078 -1389 -145 132 -1361 -609 1497 1210
2019 1210 -1038 -975 85 -166 -1233 -370 1113 375 -506 -29 821 -233 -651 749 784 -765 -1159 286
$$ packed form
1884E55m25k90n83J43M15M50N90L39n17q8n65l14K07k60L51K80N46j55J5k85Q79
1905A288r59l89Q9J38j74m01J005R02o05n37K24q3j302J22J290M49m56mM32n49
1925D80q75L03P65j76j092N05R36m75m05O41O88o96j182O6L19k41k75J104N27
1944I17l73p04J52l71n68J47M51O72o50n02J086J6j075L63R41p80j189j34J088
1963e13N33l05j05Q03k83j693L02L39J1o1R67M69o94r20K64M88n65k88N16O14
1983a21r61n62J098J107q62p82M37L04j173m83J175J364l80o86M61k22j036k06
2001a528J174M13p75j00P50J04o05k75J677j95j718l11J244K77j493P52K106k87
2019A210k248O3J060k51j067Q63J483p38q81M77Q50j054m18J400L5j549l94J445
$$ plain form
2037 286 759 -245 59 1198 944 -800 -1284 49 282 -245 243 1509 805 -583 -565 92 115 -145 -49
2056 -49 569 384 -336 -191 569 464 65 177 9 -555 -835 -442 1267 1325 -443 -115 830 -368 -1650
2075 -1650 -844 1172 344 -723 133 893 -99 -1035 605 962 -591 -1457 -40 509 -853 -552 1330
2092 1330 1395 -1326 -987 19 -459 -1629 -467 1365 1128 -1068 -799 549 -505 -1104 -335 585 -87
2109 -87 -692 -259 210 -334 -185 464 459 -821 -1137 -372 453 251 -50 893 1033 51 -1006 -421 10 29 -126
2130 -126 781 1211 -274 -482 670 951 52 -129 333 464 18 146 1281 832 457 590 1133 44 -904
2149 -904 -153 1573 1223 364 659 1606 728 -427 675 1066 784 -308 730 1536 762 107 1615 2054
2167 2054 839 -388 316 1127 200 115 1679 2131 646 147 1215 923 -530 -176 1428 1250 -27
$$ packed form
2037B86M73j004L04J139k54j744m84J333K33n27M88J266p04j388J8O57K3k60R6
2056d9O18j85p20J45P60j05l99J12j68n64k80L93J709N8j768L28R45j198j282
2075a650Q06K016q28j067Q56P60r92r36J640L57j553q66J417N49j362L01J882
2092A330O5k721L39J006m78j170J162J832k37k196K69J348j054n99P69R20o72
2109h7o05M33M69n44J49O49nj280l16P65Q25k02l01R43J40r82j057N85M31J9j55
2130a26R07M30j485k08J152K81q99j81M62J31m46J28J135m49l75J33N43j089r48
2149i04P51J726l50q59K95R47q78j155J102L91k82j092J038Q06p74o55J508M39
2167B054j215j227P04Q11r27q5J564M52j485m99J068k92j453L54J604j78j277
$$ plain form
2184 -27 121 1407 1113 142 470 907 179 -412 140 1168 697 185 1353 1306 -68 -590 -32 265 2
2203 2 -170 822 849 85 -43 74 347 -278 -437 -192 -233 2 -171 405 782 226 -232 78 -333 -849 -1044
2224 -1044 -18 117 -273 -264 191 341 -900 -1026 -261 29 -935 -622 426 78 -1100 -441 223 -371 -1430
2243 -1430 -898 -102 -552 -1141 -4 595 -489 -910 -55 -15 -1139 -1257 -314 193 -433 -390 295 -83 -844
2262 -844 -260 -40 -518 -963 -519 206 -127 -245 -105 -82 -541 -677 -561 -585 -311 -542 28 -182 75 231 -425
2283 -425 -485 35 -954 -398 -183 -228 -67 -130 313 82 -349 -679 60 -432 -684 -405 555 239 -422 22 299
2304 299 -551 -659 -308 220 -665 -705 356 262 -315 -596 389 -146 -795 -577 30 -221 -788 133 504 -247
2324 -247 -544 -207 -362 -743 -576 -164 -142 -836 -154 206 -747 -605 -309 -287 -671 -768 1 -332 -641 -162 -36
$$ packed form
2184b7J48J286k94r71L28M37p28n91N52J028m71n12J168m7j374n22N58K97k63
2203Bj72R92K7p64j28J17K73o25j59K45m1K35j73N76L77n56m58L10m11n16j95
2224a044J026J35l90RM55J50j241j26P65K90r64L13J048l48j178O59O64n94j059
2243a430N32P96m50n89J137N99j084m21Q55M0j124j18R43N07o26M3O85l78p61
2262h44N84K20m78m45M44P25l33j18J40K3m59j36J16k4K74k31N70k10K57J56o56
2283d25o0N20r89N56K15m5J61o3M43k31m31l30P39m92k52K79R60l16o61M44K77
2304B99q50j08L51N28q85m0J061r4n77k81R85n35o49K18O07k51n67R21L71p51
2324b47k97L37j55l81J67M12K2o94O82L60r53J42K96K2l84r7P69l33l09M79J26
$$ plain form
2345 -36 -771 -832 -354 -252 -727 -416 -144 -365 -133 -32 -66 -525 -455 -330 -252 -686 28 261 -208 -831 119 66
2367 66 -604 -239 373 -105 -516 -154 630 18 -430 28 428 -91 -83 582 264 -313 164 1096 354 -544 267
2388 267 664 -152 -382 429 767 196 376 989 543 -150 635 932 288 98 821 964 510 483 1364 745
2408 745 121 524 981 219 444 775 1140 433 318 1088 1124 26 713 1024 382 475 987 1434 515 532 1092
2429 1092 932 146 475 1009 520 391 967 1157 581 352 892 666 -81 163 1041 490 136 708 875 165
2449 165 49 542 65 10 20 713 436 -74 265 535 123 -222 117 100 -165 -215 -131 218 -121 15 62 193
2471 193 -234 -165 -413 -417 -158 -71 -82 -170 161 -196 -549 -590 -276 -923 -547 -242 -21 -91 -235 -96 -147 -529 -970
2494 -970 -323 -201 -733 -612 -154 4 -609 -464 -86 -567 -860 -799 -507 -395 -434 -206 56 -345 -460 -115 -155
$$ packed form
2345c6p35o1M78J02m75L11K72k21K32J01l4m59P0J25P8m34P14K33m69o23R50n3
2367F6o70L65O12m78m11L62P84o12m48M58M00n19QO65l18n77M77R32p42q98Q11
2388B67L97q16k30Q11L38n71J80O13m46o93P85K97o44j90P23J43m54k7Q81o19
2408G45o24M03M57p62K25L31L65p07j15P70L6j098O87L11o42R3N12M47r19J7N60
2429A092j60p86L29N34m89j29N76J90n76k29N40k26p47K44Q78n51l54N72J67p10
2449A65j16M93m77n5J0O93k77n10L39K70m12l45L39j7k65n0Q4L49l39J36M7J31
2471A93m27O9k48mK59Q7j1q8L31l57l53m1L14o47L76L05K21p0j44J39n1l82m41
2494i70O47J22n32J21M58J58o13J45L78m81k93O1K92J12l9K28K62m01j15L45m0
$$ plain form
2515 -155 -622 -409 -266 -245 -430 -190 117 -106 -394 -580 -2 -505 -384 -182 -25 -62 -367 -12 -204 -183 -362
2536 -362 -226 25 -383 -291 43 272 -202 -171 167 23 -558 -740 -357 -15 -449 -427 373 -1 -195 -413 -90
2557 -90 18 -561 -504 14 16 -217 -296 94 216 -366 -342 -113 -220 -586 -166 418 1 -318 -97 100 -334 -796
2579 -796 -300 135 231 -485 -315 445 -155 -376 -13 -34 -140 -595 -234 -227 -160 -304 37 103 -514 -643 -102 70
2601 70 -704 -419 118 236 -606 -725 -35 406 -491 -337 58 -292 -692 -326 495 255 -522 -91 129 -140
2621 -140 -897 -262 455 -112 -458 267 560 -213 -742 178 525 -100 -197 104 302 -408 -318 706 794 115 -350
2642 -350 370 260 -186 -70 771 827 189 144 639 651 -382 -141 1093 664 296 199 726 708 227 442 859
2663 859 547 -481 289 966 396 38 759 1170 624 -359 489 1213 255 -4 957 1143 -5 -331 741
$$ packed form
2515a55m67K13J43K1j85K40L07k23k88j86N78n03J21K02J57l7l05L55j92K1j79
2536c62J36K51m08R2L34K29m74L1L38j44n81j82L83L42m34K2Q00l74j94k18L23
2557i0J08n79N7N18Kk33p9L90J22n82K4K29j07l66M20N84m17l19K21J97m34m62
2579g96M96M35R6p16J70P60o00k21L63k1j06m55L61PO7j44L41O6o17j29N41J72
2601G0p74K85N37J18q42j19O90M41q97J54L95l50m00L66Q21k40p77M31K20k69
2621a40p57O35P17n67l46P25K93p73n29R20L47o25r7L01J98p10R0J024Q8o79m65
2642c50P20j10m46J16Q41N6o38m5M95J2j033K41J234m29l68r7N27j8m81K15M17
2663H59l12j028P70O77n70l58P21M11n46r83Q48P24r58k59R61J86j148l26J072
$$ plain form
2682 741 1006 6 167 959 890 -419 -256 888 763 246 -103 799 106 -340 -422 795 721 -131 72 875
2702 875 5 -589 15 797 366 -282 -174 214 -238 -769 178 921 -14 -625 113 90 -576 -759 225 514
2722 514 -373 -651 -149 -74 -837 -1022 163 147 -674 -724 -392 -12 -746 -152 534 -85 -988 -1049 -36 108 -850
2743 -850 -322 351 -240 -1547 -924 209 -687 -821 -2 246 -413 -1471 -499 103 -628 -588 -86 49 -837
2762 -837 -790 -12 361 -227 -885 345 83 -870 -1065 271 795 -329 -277 471 -28 -1086 -643 822 271
2781 271 -97 -204 339 -116 -768 -83 675 251 -482 -15 69 -5 -444 438 1141 151 -389 -42 393 -54 -310
2802 -310 691 815 29 -392 264 254 -343 -327 607 420 -135 -216 300 382 55 -137 854 560 -392 -322 374
2823 374 240 -366 106 697 754 -620 -198 628 135 -284 161 815 -52 -568 183 667 94 -243 199 275
$$ packed form
2682G41K65j000J61P92o9j309J63J144j25n17l49R02o93m46q2J217p4q52K03Q03
2702H75q70n94O04P82m31o48J08L88m52n31R47P43r35o11P38k3o66j83R84K89
2722E14q87k78N02P5p63j85J185j6q21n0L32L80p34N94O86o19r03o1J013J44r58
2743h50N28O73n91j307O23J133q96j34Q19K48o59j058R72O02p31M0N02J35q86
2762h37M7P78L73n88o58J230k62r53j95J336N24j124N2P48m99j058M43J465n51
2781B71l68j07N43m55o52O85P58m24p33M67Q4p4m39Q82P03r90n40L47M35m47k56
2802c10J001J24p86m21O56j0n97J6R34j87n55q1N16Q2l27j92R91k94r52P0O96
2823C74j34o06M72N91N7j374M22Q26m93m19M45O54q67n16P51M84n73l37M42P6
$$ plain form
2843 275 -189 -465 156 620 304 -388 522 418 -558 -398 467 502 -295 -204 299 -7 -517 -209 453 147 -706
2864 -706 -332 347 73 -631 153 646 211 -385 -86 241 -133 -339 121 549 230 -122 109 241 -46 -127
2884 -127 222 393 -215 -199 -11 639 236 -162 281 382 -172 -451 213 435 155 243 587 568 -187 -168 308
2905 308 382 -141 352 762 409 -279 -22 643 478 21 173 498 -76 -40 446 988 342 34 132 200 -29
2926 -29 -54 335 516 342 14 290 378 178 353 236 247 -154 -136 312 272 -245 -218 478 486 -42 -114 212 143 -59
2950 -59 -4 209 33 -270 -261 160 -180 -363 -188 224 -155 -397 -328 433 -244 -474 81 94 -345 -289 -284 -384 -378 -227
2974 -227 -176 -233 -227 -556 -548 -172 -372 -415 -613 -282 -180 -493 -481 -284 -299 -688 -292 -524 -405 -833 -385 -147 -390
2997 -390 -439 88 -89 -596 -658 88 -242 -686 -183 68 -85 -527 -518 -107 -206 -834 -321 5 -199 -301 205 -70
$$ packed form
2843B75m64k76O21M64l16o92R10j04r76J60Q65L5p97R1N03l06n10L08O62l06q53
2864g06L74O79k74p04P84M93m35n96K99L27l74k06M60M28l19l52K31J32k87q1
2884a27L49J71o08J6J88O50m03l98M43J01n54k79O64K22k80Q8L44j9p55J9M76
2905C08P4n23M93M10l53o88K57O65j65m57J52L25n74L6M86N42o46l08R8O8k29
2926b9k5L89J81j74l28K76Q8k00J75j17J1m01J8M48m0n17K7O96Qn28p2L26o9k02
2950e9N5K13j76l03RM21l40j83J75M12l79k42O9P61o77k30N55J3m39N6Nj00OJ51
2974b27N1n7Ol29QL76k00m3j98L31J02l13J2J97j5l89L96k32J19m28M48K38k43
2997c90m9N27j77n07o2P46l30m44N03K51j53m42RM11r9o28N13L26k04j02N06k75
$$ plain form
3019 -70 -301 -269 -38 -426 33 -73 74 47 -104 179 -125 -109 -151 -10 -175 -22 140 60 -166 -29 281 -12
3041 -12 53 389 226 -354 23 668 295 -10 -233 50 154 -178 51 405 30 -14 144 80 102 227 304 228
3063 228 -153 -20 112 7 150 296 252 -34 34 248 250 32 144 2 -77 -224 216 304 334 -65 183 150 10
3086 10 149 -119 -15 195 -55 585 470 144 132 32 -85 59 -41 -136 43 120 -15 -534 35 151 137 13
3108 13 80 335 -114 142 141 -177 -517 61 188 -92 173 319 367 -30 -153 27 206 -79 15 -71 209 21
3130 21 -268 118 144 66 -129 93 -136 86 195 23 39 -232 311 83 -179 336 204 397 104 181 456 333
3152 333 55 457 310 53 -13 224 -49 284 112 81 52 -23 503 -176 225 252 -4 175 308 504 236 34
3174 34 435 454 219 -34 316 -37 152 44 608 276 -126 316 531 261 -232 -7 185 -76 -14 228 494
$$ packed form
3019g0k31L2K31l88M59j06J47k7j51K83l04J6m2J41j65J53J62q0k26J37L10k93
3041a2O5L36j63n80L77O45l73l05k23K83J04l32K29L54l75m4J58o4K2J25P7p6
3063B28l81J33J32j05J43J46m4k86O8K14Kk18J12j42p9j47M40Q8L0l99K48l3j40
3086A0J39k68J04K10k50O40j15l26j2j00j17J44j00r5J79P7j35n19N69J16j4j24
3108A3O7K55m49K56jl18l40N78J27k80K65J46M8l97j23J80J79k85R4q6K80j88
3130B1k89L86K6p8j95K22k29K22J09j72J6k71N43k28k62N15j32J93k93P7K75j23
3152C33k78M02j47k57o6K37k73L33j72l1k9p5N26o79M01K7k56J79J33J96k68k02
3174C4M01J9k35k53L50l53J89j08N64l32m02M42K15k70m93K25J92k61O2K42K66
$$ plain form
3195 494 -202 -161 278 -81 -112 76 384 -442 -303 4 311 133 -141 -187 289 -89 49 -100 -150 -442 -187
3216 -187 -37 -325 -261 -447 -112 -409 -372 -91 -51 -67 -117 -223 -171 -37 -507 -310 -433 -291 -407 -183 -327 -700
3238 -700 -423 -337 -295 -346 -653 -272 -357 -60 -640 -280 -112 -204 -565 -491 -74 -289 -283 -135 -165 -206 -279 -504 255 -216
3262 -216 -653 -124 123 -261 -247 222 192 -417 -358 -228 69 -255 -68 288 441 -220 -562 62 175 -407 -58
3283 -58 163 -388 -382 -250 284 240 19 -50 334 264 -250 -66 366 217 20 275 225 94 -140 171 638 245
3305 245 68 233 342 61 -64 625 694 68 -526 162 240 -314 31 431 578 -78 -87 490 137 -162 -167 263
3327 263 276 81 178 379 262 -317 108 491 473 -217 13 434 149 -244 188 596 70 -187 -24 317 -255
3348 -255 -292 -12 51 -274 -234 67 118 -118 -234 623 -37 -348 -261 219 550 -218 -162 436 214 -447 -480 -90
$$ packed form
3195D94o96M1M39l59l1J88L08q26J39L07L07j78k74m6M76l78J38j49n0k92K55
3216a87J50k88O4j86L35k97L7K81M0j6n0j06N2J34m70J97j23J42j16K24j44l73
3238g00K77Q6M2n1l07L81q5K97n80L60J68r2l61P4M17k15OJ48l0m1p3k25P59m71
3262b16m37N29K47l84J4M69l0o09N9J30K97l24J87L56J53o61l42O24J13n82L49
3283e8K21n51OJ32N34m4k21o9L84p0n14J84M32j49j97K55n0j31k34L11M67l93
3305B45j77J65J09k81j25O89O9o26n94O88P8n54L45M00J47o56rN77l53k99nM30
3327B63J3j95R7K01j17n79M25L83j8o90K30M21k85l93M32M08n26k57J63L41n72
3348b55l7K80O3l25M0L01N1k36j16Q57o60l11Q7M80L31p68N6N98k22o61l3L90
$$ plain form
3370 -90 217 -190 -43 107 -106 -629 -287 298 26 -164 -125 230 -94 -635 4 307 80 -134 -146 -48 -499
3391 -499 -445 -103 283 -87 -382 343 -47 -376 -436 252 296 -215 -663 126 159 -302 -52 361 277 -279 -67 435
3413 435 209 -253 132 402 430 -213 -515 231 142 -289 434 309 292 -219 -112 379 226 76 87 250 -163
3434 -163 -242 166 332 -162 68 320 397 -184 -210 260 238 34 -179 327 96 -585 -34 244 221 -126 101 357
3456 357 51 -504 -155 161 64 -58 42 225 -364 -421 30 159 301 -501 -334 -94 -364 -322 -133 230 14
3477 14 -251 -255 68 -213 -158 205 63 -350 -283 -35 3 -312 -347 346 3 -686 -471 -14 -121 -186 -203 343 85
3500 85 -437 -439 -14 -175 -588 -321 223 -419 -381 -168 -1 -287 -318 91 324 -22 -221 155 101 -68 -321 39
3522 39 518 -77 -280 -102 252 189 -275 14 347 -210 -38 288 13 -23 52 373 -224 -32 281 398 484 -188
$$ packed form
3370i0L07m07J47J50k13n23L42N85k72j90L9L55l24n41O39L03k27k14j2R8m51
3391d99N4L42L86l70k95P25l90l29o0O88M4n11m48P89L3m61K50M13q4n56K12N02
3413D35k26m62L85K70K8o43l02P46q9m31P23j25j7n11J07M91j53j50J1J63m13
3434a63p9M08J66m94K30K52P7n81k6M70k2k04k13N06k31o81N51K78k3l47K27K56
3456C57l06n55L49L16r7j22J00J83n89n7M51J29J42q02J67K40k70M2J89L63k16
3477A4k65mL23k81N5L63j42m13O7K48L8l15l5O93l43o89K15M57j07o5j7N46k58
3500H5n22kM25j61m13K67N44o42L8K13J67k86l1M09K33l46j99L76n4j69k53L60
3522C9M79n95k03J78L54o3m64K89L33n57J72L26k75l6P5L21n97J92L13J17Q6o72
$$ plain form
3544 -188 209 34 109 -245 346 386 271 113 228 454 253 13 211 263 52 -302 106 361 -28 139 260
3565 260 319 38 -246 208 213 372 33 83 310 -79 -152 348 369 -88 249 224 183 -292 77 -42 158 185 28
3588 28 202 60 -227 225 153 100 -176 33 24 -333 -267 -100 339 -62 43 -251 180 43 -167 4 -135 -176
3610 -176 -253 -178 223 19 -171 114 -196 -196 -296 -93 -243 -458 -197 -41 98 -370 -337 -220 -74 272 -222 -42
3632 -42 34 -251 -97 -132 292 -168 70 84 -189 -322 -11 -220 -37 -102 -117 -65 63 70 108 -4 -176 -103 161 16
3656 16 24 -64 95 -135 224 149 -59 187 58 -241 -265 74 343 367 127 186 39 -66 324 163 438 -64 154
3679 154 280 164 -17 159 -20 -180 135 332 239 162 121 405 -76 -144 220 19 12 217 160 571 130 155 340
3702 340 50 145 267 148 240 -162 2 13 208 243 92 148 -142 81 -154 21 94 354 -68 -23 338 -48
$$ packed form
3544a88L97j75P5l54N91M0j15j58J15K26k01k40J98N2k11l54M08K55l89J67J21
3565B60N9k81k84M54NJ59l39N0K27l89p3N00K1m57L37k5m1m75L69j19K00K7j57
3588B8J74j42k87M52p2n3k76K09rl57O6J67M39m01J05k94M31j37k10J71j39m1
3610a76p7P5M01k04j90K85l10%j00K03j50k15K61J56J39m68L3J17J46L46m94J80
3632d2P6k85J54l5M24m60K38J4k73j33L11k09J83o5j5N2J28PL8j12j72P3K64j45
3656A6Qq8J59k30L59p5k08K46j29k99k4L39K69K4k40N9j47j05L90j61K75n02K18
3679A54J26j16j81J76j79j60L15J97r3p7m1K84m81o8L64k01pK05n7M11m41K5J85
3702C40k90R5J22j19R2m02J64J1J95L5j51N6k90K23k35J75P3K60m22M5L61l86
$$ plain form
3724 -48 -269 -99 -356 -61 118 25 98 108 -50 -19 -153 -89 -80 -2 -126 -17 -42 100 -41 -15 -26 -146 -117 83
3748 83 -196 -97 -88 -65 -186 -389 -319 -90 94 24 -140 161 40 109 -129 146 -87 -54 -63 -121 -6 -457 -394 48
3772 48 172 114 196 102 36 -206 -98 111 -1 89 -22 59 65 -6 188 146 -45 42 -12 141 162 219 8 241 258
3797 258 148 21 219 264 192 97 29 318 195 217 135 123 59 172 -25 208 33 91 301 -60 458 177 428
3820 428 42 -161 150 250 135 -40 103 67 -26 29 27 257 106 191 -163 -65 166 201 65 48 58 196 4
3843 4 168 -83 60 184 239 7 265 -199 -343 -30 -201 223 -24 -316 -118 -188 -27 -221 -144 -61 -187 -118
3865 -118 -39 50 61 -418 -110 -436 -513 -238 -97 10 -130 -303 -191 -149 -106 -129 -40 -380 81 -126 1 -184 -440
3888 -440 -437 -140 -201 -135 77 -214 -305 -34 288 204 -248 -106 180 65 -109 -39 190 -8 -188 -46 -39 176 201
$$ packed form
3724d8k21J70k57K95J79r3P3J0j58L1j34O4RP8j24J09k5J42j41K6j1j20K9K00
3748H3k79R9RK3j21k03P0K29J84p0j64L01j21O9k38K75k33L3rn8J15m51O3M42
3772D8J24n8Q2r4o6k42J08K09j12R0j11Q1Op1J94m2j91Q7n4J53K1N7k11K33J7
3797B58j10j27J98M5p2r5o8K89j23K2q2j2o4J13j97K33j75N8K10l61N18k81K51
3820D28l86k03L11J00j15j75J43l6r3N5kK30j51Q5l54R8K31L5j36j7J0J38j92
3843DJ64k51J43J24N5k32K58m64j44L13j71M24k47k92J98p0J61j94P7Q3j26O9
3865a18P9Q9J1m79L08l26p7K75J41J07j40j73J12M2M3k3Q9l40M61k07J27j85k56
3888d40LK97o1O6K12k91r1K71L22q4m52J42K86j15j74P0K29j98j80J42PK15K5
$$ plain form
3911 201 1 -137 -197 -106 -92 -96 322 31 -193 -86 56 -34 105 304 233 66 93 72 350 -1 -72 311 152
3934 152 121 -114 -39 468 71 133 125 136 -165 -178 118 200 -75 237 408 33 157 86 73 28 62 108 299 -308
3958 -308 -86 100 120 -198 -49 393 -168 -49 -35 -121 -50 208 -72 -67 223 -194 -51 131 -195 278 46 173
3980 173 -93 -14 101 304 -181 -220 -7 131 -80 -69 -73 0 -284 -342 225 -351 -348 -114 37 -195 -285 122 387
4003 387 5 -81 -276 263 15 -54 -193 -114 361 -94 -82 166 14 -190 116 146 194 -483 -264 258 289 -154
4025 -154 17 14 -244 -81 27 39 11 -186 203 -196 -290 -328 -29 140 108 -412 -159 217 82 -211 189 194 18
4048 18 -20 -14 27 4 66 481 387 232 103 388 317 65 -78 77 14 21 17 84 409 203 32 279 84 -31 48
4073 48 287 -5 172 111 294 -41 -205 235 326 206 181 109 71 -397 -337 155 35 37 -131 -130 191 -338 -9 349
$$ packed form
3911B01k00j38o0R1J4mM18k91k24J07J42r0J39J99p1j67K7k1K78l51p1L83j59
3934A52l1k35P5N07l97O2qJ1l01j3K96Q2k75L12J71l75J24p1j3m5L4M6J91o07
3958c08K22J86K0l18J49M42n61J19J4q6P1K58k80NK90m17J43J82l26M73k32J27
3980A73k66P9J15K03m85l9K13J38k11J1mP3k84n8N67n76LK34J51k32r0M07K65
4003C87l82q6j95N39k48o9j39P9M75m55J2K48j52k04L06L0M8o77K19N22L1m43
4025a54J71lk58J63J08J2k8j97L89l99r4l8K99J69l2n20K53L76j35k93M00Nj76
4048A8l8OM1k3O2M15r4j55j29K85p1k52j43J55o3PmO7L25k06j71K47j95j15P9
4073D8K39k92J77o1J83l35j64M40R1j20k5p2l8m68O0M92j20Kj68JL21n29L29L58
$$ plain form
4097 349 -17 -22 -93 -23 -82 -164 -427 30 205 -339 -372 260 -9 -4 71 321 184 -321 -186 114 148 -233 -37 -112
4121 -112 -346 -52 -149 -191 -266 -157 125 8 -322 -401 -73 -124 -144 6 -226 147 -373 -135 -82 -95 -22 -111 -29 -35
4145 -35 -491 -108 -64 -56 -97 -25 73 -125 99 -218 90 82 178 -95 130 -132 -45 -41 71 -52 -71 244 -167 -108 92
4170 92 -316 -228 -153 82 204 49 -155 255 155 30 154 151 148 119 19 -34 51 -60 84 27 361 -125 252 178
4194 178 138 303 103 126 331 198 165 -37 127 56 74 228 274 215 -6 -99 231 -126 91 69 63 121 -17 -38
4218 -38 -65 -5 -232 -89 -28 146 94 -6 104 -96 -249 82 30 -16 -21 -191 54 -165 375 8 -97 -247 -174
4241 -174 -126 -156 195 9 357 10 -260 -30 65 -235 -68 -63 -1 -346 -153 -360 -60 -212 -386 -114 2 -36
4263 -36 -243 -204 -108 -244 -39 8 -47 -56 14 -54 64 45 -108 232 170 130 -12 383 111 -174 -116 -147 -3 84 -99
$$ packed form
4097C49l66np1P0n9q2k63M57J75n44l3O32k69NP5K50j37n05J35L00L4l81J96p5
4121a12k34K94r7m2p5J09K82j17l30p9L28n1k0J50k32L73n20K38N3j3P3q9Q2o
4145c5m56L83M4Qm1P2R8j98K24l17L08qR6k73K25k62Q7MJ12j23j9L15m11N9K00
4170I2m08Q8P5K35J22j55k04M10j00j25J24llk9j00n3Q5j11J44n7L34m86L77p4
4194A78m0J65k00K3K05j33l3k02J64p1J8J54M6n9k21r3L30l57K17k2oN8j38k1
4218c8k7O0k27J43O1J74n2j00J10k00j53L31n2m6nj70K45k19N40l67j05j50P3
4241a74M8l0L51j86L48l47k70K30R5l00J67NO2l45J93k07L00j52j74K72J16l8
4263c6k07L9R6j36K05M7n5rP0o8J18j9j53L40o2m0j42L95k72k85N8l1J44Q7j83
$$ plain form
4288 -99 -79 -217 -243 29 -344 102 112 68 82 77 -15 -37 479 243 72 250 61 59 140 167 295 395 1 101 25
4313 25 70 171 283 -160 19 134 228 305 -79 -86 223 432 29 160 57 60 112 5 -173 -59 276 -61 224
4336 224 326 -81 -16 38 237 187 274 268 -173 108 201 -36 -30 -196 142 12 -10 -282 -209 -48 -378 -49 140 -70
4360 -70 28 -196 199 -1 -235 -236 -185 -18 131 -336 -205 -121 -105 164 -153 -86 -299 -266 313 66 -178 -77 -334
4383 -334 -343 -71 -131 -329 -245 -154 15 -238 -96 -108 -30 -150 20 87 -12 -63 -169 -202 -103 85 -162 -180 30 -17 -175
4408 -175 -20 -216 -133 150 96 198 -71 51 149 226 -68 122 182 9 128 -50 168 -260 56 130 202 204 -9
4431 -9 -36 131 -314 -102 269 -70 105 -252 -24 -35 104 -75 97 -5 167 -44 -94 163 290 -342 63 234
4453 234 63 98 -147 176 -55 49 301 -61 161 121 -94 142 274 124 285 -153 162 -49 143 -171 -87
$$ packed form
4288i9K0j38k6K72l73M46J0m4J4nr2k2N16k36j71J78j89kQ1K7J28J00l94J00p6
4313B5M5J01J12m43J79J15R4P7l84pL09K09m03J31j03LN2j07j78J14L35l37K85
4336B24J02m07O5N4J99n0Q7om41K81R3k37Oj66L38j30k2k72P3J61l30L29J89k10
4360g0R8k24L95k00k34jN1J67J49m67J31Q4J6K69l17O7k13L3N79k47k44J01k57
4383c34rK72o0j98Q4R1J69k53J42j2P8j20J70O7r9n1j06l3R9J88k47j8K10m7j58
4408a75J55j96Q3K83n4J02k69J22R8P7k94J90O0j73J19j78K18m28L16P4P2Kk13
4431ik7J67m45K12L71l39J75l57K28j1J39j79J72j02J72k11n0K57J27o32M05J71
4453B34j71L5k45L23k31J04K52l62K22m0k15K36J32j50J61m38L15k11J92l14Q4
$$ plain form
4474 -87 25 -210 -121 -143 -269 19 151 82 130 -173 114 -143 -71 201 95 -157 0 -95 17 -72 58 168 119
4497 119 -158 9 -215 -122 -216 -61 51 103 -363 -331 225 249 -144 -219 -176 78 -188 19 -8 -116 -103 -407 251
4520 251 -543 -235 -42 -200 -86 -130 300 91 -199 -333 176 114 269 -213 -74 181 69 -68 -157 -69 -91 -187
4542 -187 125 -107 -48 -124 89 208 139 94 345 49 145 31 77 45 64 209 -22 5 -14 296 121 228 -120
4565 -120 98 -93 268 -96 217 33 507 325 -65 193 73 -12 28 16 126 99 375 192 -90 228 278 118
4587 118 -153 206 65 52 -29 347 -36 50 -2 -34 7 -146 27 128 18 -37 79 -178 -289 -94 -45 89 -69
4610 -69 -25 -92 45 142 -34 -150 -226 -173 -265 103 -332 144 9 -101 -96 272 -58 93 169 -227 -414 -20 410
4633 410 -304 -239 173 16 101 -110 147 75 18 -177 -154 -19 -31 144 -109 82 -517 14 -25 -106 153 17 -30
$$ packed form
4474h7J12k35Q9k2j26K88J32o9M8l03K87k57P2K72j06k52J57r5J12q9J30J10m9
4497A19k77J67k24R3r4J55J12N2m66L2N56K4l93p5M3K54k66K07k7j08J3l04O58
4520B51p94L08J93j58J14m4M30k09k90j34N09o2J55m82J39K55j12j37q9Q8k2r6
4542a87L12k32N9p6K13J19o9m5K51k96R6j14M6l2J9J45k31K7j9L10j75J07l48
4565a20K18j91L61l64L13j84M74j82l90K58j20q5M0j2J10k7K76j83k82L18N0j60
4587A18k71L59j41j3q1L76l83Q6n2l2M1j53J73J01j10n5J16k57j11J95M9J34j58
4610f9M4o7J37R7j76j16p6N3r2L68m35M76j35j10NL68l30J51P6l96j87L94M30
4633D10p14O5M12j57Q5k11K57p2n7j95K3J35j2J75k53J91n99N31l9q1K59j36m7
$$ plain form
4656 -30 253 -110 -226 -16 149 -34 110 -62 26 -163 -78 217 -258 -24 78 311 126 -74 -66 78 -103 -91
4678 -91 -63 -27 159 45 141 197 145 18 188 411 68 -56 -91 164 -280 -176 85 324 309 233 243 96 87 -68
4702 -68 25 288 29 40 238 254 -192 250 17 39 100 71 74 -122 -60 20 176 114 -15 -41 122 264 61 -12 74
4727 74 -425 123 135 345 202 83 136 172 283 -75 138 -140 -245 -23 155 -191 7 -176 -35 -95 5 -284
4749 -284 76 -96 -227 -82 -19 -370 12 31 -14 -194 -130 -218 12 267 -121 -179 73 -11 -396 111 -74 62
4771 62 29 -27 65 53 -368 25 53 -44 -240 -157 -46 -400 -48 263 -7 26 -106 -18 -116 200 -109 -141 261 50
4795 50 94 30 164 -108 -367 152 -74 249 -98 51 169 6 58 48 -94 11 80 81 -64 270 -63 -7 38
4818 38 -4 64 211 171 -233 373 26 -185 52 292 55 67 190 166 123 139 70 120 199 -147 136 45 40 -130 -179
$$ packed form
4656c0K83l63j16K10J65j83J44j72Q8j89Q5K95m75K34J02K33j85k00QJ44j81J2
4678i1K8L6J86j14R6N6n2j27J70K23l43j24l5K55m44J04K61K39j5p6J0j47rj55
4702f8R3K63k59J1J98J6m46M42k33K2O1k9Lj96O2Q0J56o2j29k6J63J42k03p3Q6
4727G4m99N48J2K10j43j19N3L6J11l58K13k78j05K22J78l46J98j83J41o0J00k89
4749b84L60j72j31J45O3l51L82J9m5j80O4q8K30K55l88n8K52q4l85N07j85J36
4771F2l3n6R2j2m21L93K8r7j96Q3J11l54L52L11k70L3j32Q8r8L16l09l2M02k11
4795E0M4o4J34k72k59N19k26L23l47J49J18j63N2j0j42J05O9Jj45L34l33N6M5
4818C8m2O8J47m0m04O06l47k11K37K40k37J2J23k4m3J6o9N0P9l46K83r1nj70m9
$$ plain form
4843 -179 2 148 -183 -24 -120 63 -53 303 18 -10 -14 -113 155 -62 13 -28 266 -253 -241 155 214 -29 -47
4866 -47 -169 99 -77 -18 -62 -242 -223 -47 99 -80 68 -59 25 -45 -112 64 81 -10 -232 -130 111 -25 -198
4889 -198 -218 -44 -181 -231 -175 -101 -167 -15 -227 -75 -170 -308 -106 -423 -171 -35 20 105 188 -129 -216 42 241
4912 241 -11 -390 -212 -236 141 115 212 -300 -129 -193 55 -101 -90 216 -4 103 -44 -7 153 18 -222 197
4934 197 246 -247 -46 52 159 -250 168 140 -106 246 -55 -76 201 246 100 -263 -72 122 257 338 -164 327
4956 327 206 160 -136 -148 25 10 -64 95 33 134 -3 -57 263 -290 76 -134 130 -6 241 25 12 223
4978 223 -392 -52 132 48 -141 -58 193 212 -146 -74 38 24 -183 15 -9 -1 -207 84 -163 0 -39 149 33
5001 33 133 34 -114 115 -26 56 -183 -109 -58 54 89 99 -183 118 -77 45 -147 -274 12 431 -152 240
$$ packed form
4843a79J81J46l31J59r6J83j16L56k85k8mr9K68k17P5m1K94n19J2L96N9k43j8
4866d7j22K68j76N9m4j80J9J76J46j79J48j27Q4p0o7J76J7r1k22J02K41j36j73
4889a98k0J74j37n0N6P4o6J52k12J52r5j38K02l17K52J36N5Q5Q3l17q7K58J99
4912B41k52l79J78k4L77k6R7n12J71o4K48j56J1L06k20J07j47L7J60j35k40M19
4934A97M9m93K01R8J07m09M18k8k46L52l01k1K77M5j46l63J91J94J35Q1n02M91
4956C27j21m6k96j2J73j5p4J59o2J01j37n4L20n53L66k10K64j36K47k16j3K11
4978B23o15L40J84q4j89Q3K51J9l58P2J12j4k07J98k4Qk06K91k47J63l9J88j16
5001C3J00r9j48K29j41Q2k39P4N1J12L5J0k82L01j95J22j92j27K86M19n83L92
$$ plain form
5023 240 95 -87 7 -404 -260 -29 -102 88 135 -96 3 109 -36 69 -11 -17 209 -66 181 -152 121 -88
5045 -88 -59 58 -8 -18 4 103 -87 56 312 -22 52 298 112 90 -195 -135 -22 235 -34 -9 335 201 122 -52
5069 -52 261 -182 259 46 14 141 297 306 -306 112 286 73 102 -89 301 410 170 261 -98 248 5 284
5091 284 107 -124 101 118 65 291 212 191 209 278 30 -163 151 -42 201 125 17 -27 173 -125 -102 -2 -64
5114 -64 22 -43 16 301 13 126 -167 208 -15 135 -93 -135 -165 213 59 -59 -242 -89 559 42 -145 26
5136 26 -282 -74 121 -138 13 -417 135 30 45 171 -216 -213 106 -34 31 -349 188 -186 -154 -105 -82 -274 -192
5159 -192 -76 186 -161 25 71 -185 305 -23 63 123 44 86 -109 202 216 120 -50 82 -20 282 296 43 21
5182 21 295 -245 -156 12 35 263 158 -194 150 -123 -6 264 30 -106 177 167 287 73 19 435 155 33
$$ packed form
5023B40j45j82R4m11J44K31p3J90M7k31R9J06j45J05q0oK26k75K47l33K73k09
5045h8K9J17o6j0K2R9j90J43K56l34P4K46j86k2k85O0J13K57k69K5L44j34p9j74
5069e2L13m43M41k13l2J27J56Ro12M18J74k13K9j91L90J09k40R1l59L46k43K79
5091B84j77k31K25J7n3K26p9k1J8O9k48j93L14j93K43p6j08m4K00k98K3J00o2
5114f4Q6o5N9K85k88J13k93L75k23J50k28m2l0L78j54j18j83J53O48n17j87J71
5136B6l08K08J95k59J51m30N52j05J5J26l87LL19j40O5l80N37l74L2M9K3j92Q2
5159a92J16K62l47J86M6k56M90l28Q6O0p9M2j95L11J4r6j70J32j02L02J4k53k2
5182B1K74n40Q9J68K3K28j05l52L44k73J17K70k34j36K83j0J20k14n4M16k80j22
$$ plain form
5204 33 323 56 68 -2 -94 189 312 97 -154 -134 192 188 115 83 372 85 192 171 81 -153 293 -80 -10 244
5228 244 -252 24 -549 264 239 6 44 102 -180 -146 17 -58 -263 -74 -266 -94 100 -257 -101 -16 130 -130
5250 -130 -16 -42 148 11 236 -19 -256 -189 167 169 -208 -235 -190 -230 -5 -95 -238 263 -36 -246 -118 -375 -73
5273 -73 -126 -115 139 -27 -97 -63 -176 -245 195 -115 -290 -239 -66 -80 144 -49 -4 53 62 -138 178 21 110 -165
5297 -165 -317 -78 -4 19 130 131 1 302 290 143 -7 97 -27 90 82 -46 92 145 2 114 30 -90 400
5320 400 273 1 -198 -30 190 191 81 204 -152 109 46 -69 292 -12 204 9 62 143 126 97 -65 -12 -219
5343 -219 -24 73 99 203 54 126 83 113 159 -5 -132 -76 88 -15 -8 20 170 202 -252 177 233 42 138 261
5367 261 270 169 255 -182 -9 233 -164 252 319 -29 115 59 156 162 -249 12 -4 -207 -148 -113 -59 -97 -153 239 -38
$$ packed form
5204C3K90k67J2p0r2K83J23k15k51K0L26mp3l2K89k87J07k1r0k34M46l73P0K54
5228B44m96K76n73Q13k5k33L8N8k82L4J63p5k05J89j92J72J94l57J56Q5J46k60
5250a30J14k6J90j37K25k55k37O7L56Kl77k7M5m0K25r0j43N01k99k10J28k57L02
5273g3n3J1K54j66p0L4j13o9M40l10j75N1J73j4K24j93M5N7Rk00L16j57Q9k75
5297a65j52K39P4K3J11Jj30L01j2j47j50J04j24J17qj28J38N3j43J12q4j20M90
5320D00j27k72j99J68K20Jj10J23l56K61o3j15L61l04K16j95N3Q1j7k9j62N3k07
5343b19J95R7K6J04j49P2m3L0M6j64j27N6J64j03PK8J50L2m54M29N6j91R6J23
5367B61Rj01Q6m37J73K42l97M16O7l48J44n6R7Om11K61j6k03N9L5N4l8n6L92k77
$$ plain form
5392 -38 62 -254 -223 -82 -166 -172 46 -74 -183 -62 -10 66 -221 92 -48 -208 39 262 95 131 -127 -36 -31 167
5416 167 -77 109 22 -39 78 -52 -34 46 -389 10 -300 1 -227 79 214 139 57 74 -192 -200 126 170 370
5439 370 304 -107 239 -158 -207 -121 299 96 27 40 23 182 -204 67 260 143 309 191 209 123 180 97 339
5462 339 23 -291 9 240 -72 -50 165 189 -40 126 -40 171 261 69 113 159 -71 -95 241 54 4 -268
5484 -268 36 -151 -13 69 88 22 -235 -214 46 -84 -43 -102 169 -26 -104 -56 -213 -64 -27 313 -43 -172 -346
5507 -346 -40 127 -136 -46 -81 -249 43 -206 -120 -92 -217 170 87 -282 -112 58 -172 -120 110 -428 72 -67
$$ packed form
5392c8J00l16L1J41q4oK18j20j09J21N2P6k87L13j40j60K47K23j67L6k58R1NJ98
5416A67k44J86q7o1J17j30J8Q0m35L99l10L01k28L06J35p5q2J7k66qL26M4K00
5439C70o6m11L46l97m9Q6M20k03o9J3j7J59l86K71J93j17J66j18J8q6N7q3K42
5462C39l16l14L00K31l12K2K15K4k29J66j66K11R0j92M4M6k30k4L36j87n0k72
5484b68L04j87J38Q2J9o6k57K1K60j30M1n9K71j95p8M8j57J49L7L40l56j29j74
5507c46L06J67k63R0l5j68K92k49Q6K8j25L87q3l69J70J70k30N2K30n38N00j39
$$ [...]
8191e3
##END NTUPLES=NMR FID
##END=
