##TITLE=1H_LR-688B-MC2
 DMSO, 8 sc, 
 2.8.2019
##JCAMPDX= 6.0         $$ Bruker NMR JCAMP-DX V2.0
##DATA TYPE= NMR FID
##DATA CLASS= NTUPLES
##ORIGIN= UXNMR, Bruker Analytische Messtechnik GmbH
##OWNER= root
$$ XWIN-NMR		Version 3.5
$$ Fri Aug  2 14:00:32 2019 Russian Standard Time (UT+4h)  she@DPX200
##.OBSERVE FREQUENCY= 200.13155
##.OBSERVE NUCLEUS= ^1H
##.DELAY= (6, 6)
##.ACQUISITION MODE= SIMULTANEOUS
##.ACQUISITION SCHEME= undefined
##.AVERAGES= 8
##.DIGITISER RES= 18
##SPECTROMETER/DATA SYSTEM= spect
##.PULSE SEQUENCE= zg30
##.SOLVENT NAME= DMSO
##.SHIFT REFERENCE= (INTERNAL, DMSO, 0, 15.7039)
##AUDIT TRAIL= $$ (NUMBER, WHEN, WHO, WHERE, WHAT)
$$ ##TITLE= Audit trail, XWIN-NMR		Version 3.5
$$ ##JCAMPDX= 5.01
$$ ##ORIGIN= Bruker BioSpin GmbH
$$ ##OWNER= she
$$ F:/spectra/data/she/nmr/H-F/1/audita.txt
$$ ##AUDIT TRAIL=  $$ (NUMBER, WHEN, WHO, WHERE, WHAT)
(   1,<2019-08-02 13:59:44.09 +0400>,<she>,<DPX200>,
      <created by zg, POWCHK disabled, PULCHK disabled
       configuration hash MD5:
       00 E9 B6 7A A2 85 ED C7 34 08 36 98 17 FE 4E 26
       data hash MD5: 16K
       5A 96 37 BC DF 49 6F 5A D4 AA 92 52 C0 A8 78 45>)
$$ ##END=
$$ 
$$ hash MD5
$$ 46 EF BC 4D 1F 24 C2 D3 B8 8D C3 82 A5 64 8F 68
##$RELAX= 
##$RELAX= 
##$RELAX= 
##$RELAX= 
##$RELAX= 
##$RELAX= 
$$ Bruker specific parameters
$$ --------------------------
##$DU= <F:/spectra>
##$EXPNO= 1
##$NAME= <H-F>
##$PROCNO= 1
##$TYPE= <nmr>
##$USER= <she>
##$AMP= (0..31)
100 100 100 100 100 100 100 100 100 100 100 100 100 100 100 100 100 100 
100 100 100 100 100 100 100 100 100 100 100 100 100 100 
##$AQSEQ= 0
##$AQ_mod= 1
##$AUNM= <au_zg>
##$AUTOPOS= <>
##$BF1= 200.13
##$BF2= 200.13
##$BF3= 200.13
##$BF4= 200.13
##$BF5= 200.13
##$BF6= 200.13
##$BF7= 200.13
##$BF8= 200.13
##$BYTORDA= 1
##$CFDGTYP= 0
##$CFRGTYP= 5
##$CHEMSTR= <none>
##$CNST= (0..31)
1 1 145 1 1 1 1 1 1 1 1 1 1 1 1 1 1 1 1 1 1 1 1 1 1 1 1 1 1 1 1 1 
##$CPDPRG= <>
##$CPDPRG1= <>
##$CPDPRG2= <>
##$CPDPRG3= <>
##$CPDPRG4= <mlev>
##$CPDPRG5= <mlev>
##$CPDPRG6= <mlev>
##$CPDPRG7= <mlev>
##$CPDPRG8= <mlev>
##$CPDPRGB= <>
##$CPDPRGT= <>
##$D= (0..31)
0 1.2 0 0 0 0 0 0 0 0 0 0.03 0 0 0 0 0 0 0 0 0 0 0 0 0 0 0 0 0 0 0 0 
##$DATE= 1564739983
##$DBL= (0..7)
120 120 120 120 120 120 120 120 
##$DBP= (0..7)
150 150 150 150 150 150 150 150 
##$DBP07= 0
##$DBPNAM0= <>
##$DBPNAM1= <>
##$DBPNAM2= <>
##$DBPNAM3= <>
##$DBPNAM4= <>
##$DBPNAM5= <>
##$DBPNAM6= <>
##$DBPNAM7= <>
##$DBPOAL= (0..7)
0.5 0.5 0.5 0.5 0.5 0.5 0.5 0.5 
##$DBPOFFS= (0..7)
0 0 0 0 0 0 0 0 
##$DE= 6
##$DECBNUC= <off>
##$DECIM= 24
##$DECNUC= <off>
##$DECSTAT= 4
##$DIGMOD= 1
##$DIGTYP= 9
##$DL= (0..7)
0 120 120 120 120 120 120 120 
##$DP= (0..7)
150 150 150 150 150 150 150 150 
##$DP07= 0
##$DPNAME0= <>
##$DPNAME1= <>
##$DPNAME2= <>
##$DPNAME3= <>
##$DPNAME4= <>
##$DPNAME5= <>
##$DPNAME6= <>
##$DPNAME7= <>
##$DPOAL= (0..7)
0.5 0.5 0.5 0.5 0.5 0.5 0.5 0.5 
##$DPOFFS= (0..7)
0 0 0 0 0 0 0 0 
##$DQDMODE= 0
##$DR= 18
##$DS= 0
##$DSLIST= <SSSSSSSSSSSSSSS>
##$DSPFIRM= 0
$$ [...]
##$SUBNAM2= <"">
##$SUBNAM3= <"">
##$SUBNAM4= <"">
##$SUBNAM5= <"">
##$SUBNAM6= <"">
##$SUBNAM7= <"">
##$SUBNAM8= <"">
##$SUBNAM9= <"">
##$SW= 24.9336996594482
##$SWIBOX= (0..15)
0 0 2 0 0 0 0 0 0 0 0 0 0 0 0 0 
##$SW_h= 4990.01996007984
##$TD= 16384
##$TD0= 1
##$TE= 0
##$TE2= 300
##$TE3= 300
##$TEG= 300
##$TL= (0..7)
0 120 120 120 120 120 120 120 
##$TP= (0..7)
150 150 150 150 150 150 150 150 
##$TP07= 0
##$TPNAME0= <>
##$TPNAME1= <>
##$TPNAME2= <>
##$TPNAME3= <>
##$TPNAME4= <>
##$TPNAME5= <>
##$TPNAME6= <>
##$TPNAME7= <>
##$TPOAL= (0..7)
0.5 0.5 0.5 0.5 0.5 0.5 0.5 0.5 
##$TPOFFS= (0..7)
0 0 0 0 0 0 0 0 
##$TUNHIN= 0
##$TUNHOUT= 0
##$TUNXOUT= 0
##$USERA1= <user>
##$USERA2= <user>
##$USERA3= <user>
##$USERA4= <user>
##$USERA5= <user>
##$V9= 5
##$VALIST= <valist>
##$VCLIST= <CCCCCCCCCCCCCCC>
##$VD= 0
##$VDLIST= <DDDDDDDDDDDDDDD>
##$VPLIST= <PPPPPPPPPPPPPPP>
##$VTLIST= <TTTTTTTTTTTTTTT>
##$WBST= 1024
##$WBSW= 4
##$XGAIN= (0..3)
0 0 0 0 
##$XL= 0
##$YL= 0
##$YMAX_a= 32930
##$YMIN_a= -19600
##$ZGOPTNS= <>
##$ZL1= 120
##$ZL2= 120
##$ZL3= 120
##$ZL4= 120
##$ABSF1= 10
##$ABSF2= 0
##$ABSG= 5
##$ABSL= 3
##$ALPHA= 0
##$AQORDER= 0
##$ASSFAC= 0
##$ASSFACI= 0
##$ASSFACX= 0
##$ASSWID= 0
##$AUNMP= <proc_1d>
##$AZFE= 0.1
##$AZFW= 0.1
##$BCFW= 1
##$BC_mod= 2
##$BYTORDP= 1
##$COROFFS= 0
##$CY= 11.3945322036743
##$DATMOD= 1
##$DC= 2
##$DFILT= <>
##$DTYPP= 0
##$F1P= 20.1537800932815
##$F2P= 0.134698688090026
##$FCOR= 0.5
##$FTSIZE= 0
##$FT_mod= 4
##$GAMMA= 1
##$GB= 0.15
##$INTBC= 1
##$INTSCL= 1
##$ISEN= 128
##$LB= 0.24
##$LEV0= 0
##$LPBIN= 0
##$MAXI= 10000
##$MC2= 0
##$MEAN= 0
##$ME_mod= 0
##$MI= 1.114404
##$NCOEF= 0
##$NC_proc= 0
##$NLEV= 6
##$NOISF1= 3.799351
##$NOISF2= 2.8
##$NSP= 1
##$NTH_PI= 0
##$NZP= 0
##$OFFSET= 15.70392
##$PC= 1
##$PHC0= -9124.764
##$PHC1= 0.2009716
##$PH_mod= 1
##$PKNL= yes
##$PPARMOD= 0
##$PSCAL= 0
##$PSIGN= 0
##$REVERSE= no
##$SF= 200.130013532006
##$SI= 16384
##$SIGF1= 3
##$SIGF2= 2
##$SINO= 400
##$SIOLD= 16384
##$SREGLST= <1H.CDCl3>
##$SSB= 0
##$STSI= 0
##$STSR= 0
##$SW_p= 3612.71676300578
##$SYMM= 0
##$S_DEV= 0
##$TDeff= 0
##$TDoff= 0
##$TI= <>
##$TILT= no
##$TM1= 0
##$TM2= 0
##$TOPLEV= 0
##$USERP1= <user>
##$USERP2= <user>
##$USERP3= <user>
##$USERP4= <user>
##$USERP5= <user>
##$WDW= 1
##$XDIM= 8192
##$YMAX_p= 0
##$YMIN_p= 0
$$ End of Bruker specific parameters
$$ ---------------------------------
##NTUPLES= NMR FID
##VAR_NAME=  TIME,          FID/REAL,        FID/IMAG
##SYMBOL=    X,             R,               I
##VAR_TYPE=  INDEPENDENT,   DEPENDENT,       DEPENDENT
##VAR_FORM=  AFFN,          ASDF,            ASDF
##VAR_DIM=   8192,          8192,            8192
##UNITS=     SECONDS,       ARBITRARY UNITS, ARBITRARY UNITS
##FACTOR=    0.0002004,     1,               1
##FIRST=     0,             0,               0
##LAST=      1.6414764,     0,               0
##MIN=       0,             -19600,          0
##MAX=       1.6414764,     32930,           0
$$ Real data points
##PAGE= N=1
##DATA TABLE= (X++(R..R)), XYDATA
$$ plain form
0 0 0 0 0 0 0 0 0 0 0 0 0 0 0 0 0 0 0 -7 8 -8 8 -8 8 -8 12 -16 16 -16 20 -24 24 -29 32 -36 40 -44 48 -56 61 -68
40 -68 76 -84 92 -101 112 -124 139 -155 174 -194 220 -251 290 -338 404 -494 628 -851 1289 -2463
60 -2463 12213 32930 4359 -7716 5890 9973 -6592 -7045 6115 8630 3281 7402 7381 -1273
74 -1273 -542 9528 4150 -8194 -1661 12959 7865 -3840 157 6800 4 -4480 1760 2690 -3432
89 -3432 52 6927 404 -8437 -2430 4775 -1740 -8055 -2474 2392 -860 -2849 -1788 -3933 -4403 -29
105 -29 -913 -7541 -5029 4516 2971 -6827 -6240 1736 704 -4832 -2692 1265 -378 -360 2683 -90 -4287
122 -4287 531 5711 -144 -5175 2202 8445 2594 -2422 1934 4210 589 859 4243 2367 287
137 287 4613 6165 -234 -2082 4500 5441 -1597 -2067 4738 5157 -257 -538 2086 41 -1697 1367
$$ packed form
0@%%%%%%%%%%%%%%%%%pJ5j6J6j6J6j6K0k8L2l2L6m4M8n3O1o8P6q4R2j04J17j29
40f8J44j60J76j93K13k36K63k94L29l68M14m71N41o28P42q98J122j479K140l752
60b463J4676K0717k8571j2075J3606M083j6565m53J3160K515n349M121k1q654
74a273P31J0070n378j2344O533J4620n094j1705L997O643o796m484O240R30o122
89c432L484O875o523q841O007P205o515o315N581M866l252j989J061k145m70M374
105b9q84o628K512R545j545r798N87P976j032n536K140L957j643J8L043k773m197
122d287M818N180n855n031P377O243n851n016M356K276l621K70L384j876k080
137B87M326J552o399j848O582R41p038m70O805M19n414k81K624k045j738L064
$$ plain form
153 1367 1829 -2207 -1627 2869 1328 -3904 -2904 1102 -545 -3802 -1850 345 -1450 -2077 -205 -1531
169 -1531 -4436 -2580 785 -1110 -3769 -1093 1560 -1034 -3397 -1396 167 -912 -814 313 -595 -994
185 -994 1663 2501 -789 -2091 1201 2788 378 -321 2189 3215 1638 720 879 860 1750 3124 2108
202 2108 206 1426 3744 2415 -289 416 2582 1887 200 684 1633 1393 1327 1152 -497 -1447 439
219 439 1813 -115 -1746 -121 1344 -297 -2180 -1784 -824 -625 -757 -1225 -1881 -1234 54 -809 -2991
236 -2991 -2658 -446 -219 -1956 -2085 -402 136 -719 -1572 -1868 -1243 239 731 -694 -1250 705 1759 -16
254 -16 -1450 -36 1533 1178 608 822 1072 1423 1939 1186 -293 398 2581 2330 280 626 2689 2385
272 2385 222 -156 983 1252 1081 1492 971 -4 683 1650 166 -1675 -465 1572 622 -1178 -628 616
$$ packed form
153A367M62m036N80M496j541n232J000M006j647l257J952K195j795o27J872j326
169a531k905J856L365j895k659K676K653k594k363K001J563j079R8J127r08l99
185i94K657Q38l290j302L292J587k410o99K510J026j577r18J59j9Q90J374j016
202B108j902J220K318j329k704P05K166o95j687M84R49k40o6j75j649r50J886
219D39J374j928j631J625J465j641j883L96R60J99j32m68o56O47J288q63k182
236b991L33K212K27j737j29J683N38q55q53k96O25J482M92j425n56J955J054j775
254a6j434J414J569l55n70K14K50L51N16p53j479O91K183k51k050L46K063l04
272B385k163l78J139K69j71M11n21r75O87R67j484j841J210K037r50j800N50J244
$$ plain form
290 616 33 -1001 -1113 -1198 -1253 -289 163 -1069 -1707 -336 101 -1757 -2638 -981 353 -411 -1180 -817 -490
309 -490 -512 -474 -946 -1418 -533 871 574 -769 -479 931 764 -566 -724 295 1009 1180 968 530 453 1050
329 1050 1106 84 -126 1269 2108 1194 401 791 1221 940 524 301 266 930 1630 1008 -190 44 1047
348 1047 522 -784 -703 525 801 89 -304 -323 -565 -472 -404 -963 -1231 -280 512 -517 -1618 -1086 -114 -625
368 -625 -1564 -1273 -369 -99 -358 -608 -879 -796 -329 -315 -944 -870 263 878 42 -680 -281 374 318 -173 -95 520
390 520 1032 901 343 118 484 863 588 152 337 1061 1343 825 228 232 673 812 293 -67 514 1149 836
411 836 -19 -160 214 350 7 -171 -84 154 267 102 -370 -693 -312 73 -351 -926 -585 203 110 -740 -1047
432 -1047 -515 -184 -445 -784 -625 -191 -18 -285 -677 -731 -326 -8 -233 -548 -286 349 446 -153 -499 -9 494
$$ packed form
290F16n83j034j12q5n5R64M52j232o38J371M37j858q81J657J334p64p69L63L27
309d90k2L8m72m72Q85J404k97j343K90J410j67j330j58J019P14J71k12m38p7N97
329A050N6j022k10J395Q39r14p93L90M30k81m16k23l5O64P00o22j198K34J003
348A047n25j306Q1J228K76p12l93j9k42R3O8n59k68R51P92j029j101N32R72n11
368f25r39K91R04K70k59k50k71Q3M67J4o29P4J133O15q36p22L99O55n6m91P8O15
390E20N12j31n58k25L66L79k75m36J85P24K82n18n97MM41J39n19l60N81O35l13
411H36q55j41L74J36l43j78Q7K38J13j65m72l23L81L85m24n75L41P88r3q50l07
432a047N32L31k61l39J59M34J73k67l92n4M05L18k25l15K62O35R7n99l46M90N03
$$ plain form
453 494 253 -167 52 578 736 353 137 185 414 578 538 330 340 700 877 459 34 263 701 580 152
474 152 116 437 583 327 10 -146 -6 225 122 -308 -271 114 211 -300 -685 -450 -111 -193 -595 -596 -351 -127
496 -127 -285 -664 -749 -447 -253 -425 -617 -465 -211 -122 -269 -470 -428 -163 40 -128 -340 -129 291 263 -151 -189
518 -189 158 331 220 137 207 354 529 487 188 69 436 690 353 58 384 778 477 73 183 412 357 297
540 297 257 153 125 384 362 -89 -268 134 365 -81 -275 -26 112 -119 -307 -271 -281 -227 -56 -208 -533 -470 -13
563 -13 -99 -601 -665 -187 -28 -344 -504 -314 -123 -183 -272 -418 -356 -59 95 -175 -353 -51 195 75 -152 -107 118
586 118 303 252 48 9 281 432 219 -21 195 494 401 152 166 321 314 289 230 47 87 426 458 -21 -159 216
610 216 357 -40 -254 37 184 48 -58 -142 -229 -130 64 -150 -480 -275 123 -81 -532 -396 55 -45 -435
$$ packed form
453D94k41m20K19N26J58l83k16M8K29J64m0k08J0L60J77m18m25K29M38j21m28
474A52l6L21J46k56l17j56J40K31j03m30L7L85R7n11l85K35L39q2m02jK45K24
496a27j58l79q5L02J94j72j92J52K54Q9j47k01M2K65K03j68k12K11M20k8m14l8
518a89L47J73j11q3P0J47J75m2k99j19L67K54l37k95L26L94l01m04J10K29n5o0
540B97m0j04k8K59k2m51j79M02K31m46j94K49J38k31j88L6j0N4J71j52l25O3M57
563a3q6n02o4M78J59l16j60J90J91o0q9j46O2K97J54k70j78L02K46j20k27M5K25
586A18J85n1k04l9K72J51k13k40K16K99r3k49J4J55pk5n9j83M0L39L2m79j38L75
610B16J41l97k14K91J47j36j06q4q7R9J94k14l30K05L98k04m51J36M51j00l90
$$ plain form
631 -435 -399 -207 -130 -142 -131 -222 -370 -133 104 -142 -354 -40 233 8 -235 -49 202 158 12 36 82 120 283
654 283 264 38 22 262 320 102 68 254 379 248 102 80 199 271 203 38 24 204 247 29 -28 48 103 49 -18
679 -18 -109 -130 11 91 -111 -302 -159 25 -172 -321 -156 -34 -178 -310 -235 -194 -205 -194 -127 -280 -340 -147 -4 -229
703 -229 -282 -120 -49 -148 -105 -26 -71 -112 33 61 -107 -59 239 210 -63 31 301 245 43 103 242 163 159 304 249 11
729 11 134 403 234 -11 156 397 146 -116 105 287 135 -57 24 64 -78 -7 156 41 -177 -67 40 -167
751 -167 -280 -100 55 -164 -306 -178 -105 -224 -217 -91 -162 -287 -196 -29 -108 -232 -146 -35 -115 -284 -170 62 68 -93
775 -93 -182 -45 32 -9 -37 49 77 52 24 63 86 113 129 174 49 -19 162 289 187 41 95 210 103 43 174 245
801 245 159 36 106 119 3 78 142 47 -64 30 125 -3 -146 -84 8 -94 -172 -63 4 -105 -172 -87 -140 -252 -219 -53
$$ packed form
631d35L6J92P7j2J1r1j48K37K37k46k12L14K73k25k43J86K51m4j46K4M6L8J63
654B83j9k26j6K40N8k18l4J86J25j31j46k2J19P2o8j65j4J80M3k18n7P6N5n4o7
679a8r1k1J41Q0k02j91J43J84j97j49J65J22j44j32P5M1j1J1O7j53o0J93J43k25
703b29n3J62P1r9M3P9m5m1J45K8j68M8K98k9k73R4K70n6k02O0J39p9mJ45n5k38
729A1J23K69j69k45J67K41k51k62K21J82j52j92Q1M0j42P1J63j15k18J10J07k07
751a67j13J80J55k19j42J28P3j19PJ26p1j25R1J67p9j24Q6J11q0j69J14K32Oj61
775i3q9J37P7m1k8Q6K8k5k8L9K3K7J6M5j25o8J81J27j02j46N4J15j07o0J31P1
801B45q6j23P0J3j16P5O4r5j11R4R5j28j43O2R2j02p8J09O7j09o7Q5n3j12L3J66
$$ plain form
827 -53 -122 -220 -140 -64 -185 -244 -140 -107 -165 -123 -16 -62 -126 -14 40 -104 -131 77 143 34 -42 121 185 25 27 121 116
854 116 60 145 218 145 132 185 142 18 29 230 232 116 107 162 129 -13 57 122 29 -29 70 110 19 1 30 -36 -151 -146 -50
883 -50 12 -22 -38 -79 -130 -141 -129 -146 -152 -110 -76 -74 -144 -169 -111 -84 -127 -134 -109 -22 0 -35 -30 -32 -52 -138 -72 9 63 45 83 72 0
916 0 -26 117 121 39 74 175 148 71 126 147 117 44 104 134 60 109 175 88 21 11 83 50 -30 40 112 36 -10 -15 8 -89 -93 11
948 11 -42 -136 -99 -4 -56 -150 -138 -82 -138 -184 -152 -79 -76 -80 -64 -162 -176 -110 -29 -71 -102 -38 -8 -2 -70 -41 35 2 -4 -20 67 91 84
981 84 55 54 74 82 82 87 120 130 174 148 98 71 76 111 104 84 127 90 43 43 79 42 21 -2 39 -2 -11 58 51 -20 -103 -75 14 -37 -65
1016 -65 -24 -68 -113 -118 -118 -83 -119 -60 -50 -116 -83 -25 -29 -113 -128 -60 -71 -109 -80 -14 -11 -12 -27 -7 -40 -50 41 54 42 56 80 49 32
1049 32 37 90 49 78 64 117 99 108 111 59 50 52 104 67 108 113 84 54 48 21 19 36 72 56 -2 -23 7 -1 -48 -83 -61 -46 -27 -32 -66
$$ packed form
827e3o9r8Q0P6j21n9J04L3n8M2J07m6o4J12N4j44k7K08O6j09p6J63O4j60KR4n
854A16n6Q5P3p3j3N3m3j24J1K01Kj16rN5l3j42P0O5r3n8R9M0r1j8K9o6j15NR6
883e0O2l4j6m1n1j1J2j7oM2L4Kp0k5N8K7m3pK5Q7K2l5Nkk0q6O6Q1N4j8L8j1p2
916@k6J43Mq2L5J01k7p7N5K1l0p3O0L0p4M9O6q7o7j0P2l3q0P0P2p6m6nK3r7mJ04
948A1n3r4L7R5n2r4J2N6n6m6L2P3LmJ6r8j4O6Q1m2l1O4L0Oo8K9P6l3oj6Q7K4p
981H4k9jK0Q%NL3J0M4k6n0k7NL5pk0M3l7m7%L6l7k1k3M1m1rO9pp1q3K8Q9n1k8
1016f5M1m4m5n%L5l6N9J0o6L3N8mq4j5O8j1l8K9O6Ljj5K0l3j0R1J3j2J4K4l1j7
1049C2NN3m1K9j4N3j8RLn2rKN2l7M1Nk9l0ok7kJ7L6j6n8k1L0qm7l5K2J5J9nl4
$$ plain form
1084 -66 -63 -59 -41 -98 -148 -80 -59 -56 -87 -64 -49 -76 -109 -93 -54 -41 -6 -26 -12 -45 -25 -19 -11 -17 26 75 63 21 52 29 18 32 18
1117 18 16 64 77 141 129 12 39 42 29 77 50 94 66 32 42 19 51 29 17 -19 17 24 59 19 -37 -25 -37 -37 -21 -57 -11 -16
1149 -16 -26 -59 -78 -55 -61 -68 -69 -34 -25 -97 -59 -54 -90 -79 -53 -38 -51 -40 -15 8 -22 -67 -42 -5 -34 8 23 51 48 2 20 -8 46
1182 46 70 85 81 58 55 101 81 28 41 83 85 36 25 53 90 39 2 2 -19 52 32 -5 23 4 61 -23 -70 -36 -44 -44 -48 -33 -37 -38 -43
1217 -43 -33 -70 -57 -65 -30 -42 -52 -25 -35 -92 -77 -41 -67 -28 -6 -8 -64 -42 4 -16 -20 -69 7 10 1 17 52 49 22 -2 4 -8 63 58
1251 58 68 25 60 96 32 59 31 42 41 24 39 22 45 49 42 -26 7 27 26 -30 4 49 8 -33 -13 -33 -60 -24 0 -14 -79 -32
1283 -32 -19 -26 -84 -80 8 -48 -68 -31 -63 -87 -62 -40 -64 -90 -36 23 -5 -20 2 28 -25 -55 9 8 -21 4 63 12 49 28 25 -10
1315 -10 34 110 95 21 48 68 33 13 -6 11 65 69 62 54 4 48 33 -3 -15 -4 27 18 15 29 -9 -19 -20 -10 -25 -36 23 4 8 -41
$$ packed form
1084f6LMJ8n7n0O8K1Ll1K3J5k7l3J6L9J3L5k0J4l3K0OQoM3M9j2m2L1k3j1J4j4
1117A8kM8J3O4j2j17K7Lj3M8k7M4k8l4J0k3L2k2j2l6L6PL5m0n6J2j2%J6l6M6n
1149a6j0l3j9K3opjL5Rp2L8Nl6J1K6J5j3J1K5K3l0m5K5L7k9M2J5K8lm6J8k8N4
1182D6K4J5mk3lM6k0n3J3M2Km9j1K8L7n1l7%k1P1k0l7K8j9N7q4m7L4q%mJ5mjn
1217d3J0l7J3qL5j2j0K7j0n7J5L6k6L9K2kn6K2M6k0mm9P6LrJ6L5lk7k4Oj2P1n
1251E8J0m3L5L6o4K7k8J1jj7J5j7K3Mpo8L3K0jn6L4M5m1m1K0k0k7L6K4j4o5M7
1283c2J3pn8MQ8n6k0L7l2k4K5K2k4k6N4N9k8j5K2K6n3l0O4jk9K5N9n1L7k1ll5
1315a0M4P6j5p4K7K0l5k0j9J7N4Mpqn0M4j5l6j2J1L1rlJ4l8j0jJ0j5j1N9j9Mm9
$$ plain form
1349 -41 -35 -35 -58 -58 -41 -24 -41 -28 -31 -64 -38 -11 -65 -59 -21 26 4 -14 -26 -31 -31 1 11 22 -9 29 60 -23 -31 78 28 6 26 50
1383 50 51 37 43 53 -2 15 32 50 1 59 90 43 -10 3 19 13 5 44 16 20 -39 20 6 -43 -10 13 6 -34 -46 15 -34 -70 -44
1416 -44 -36 -49 -35 -27 -37 -47 -25 -12 -29 -75 -7 0 -35 -50 -27 19 -23 -32 -39 13 27 1 5 -12 5 31 30 38 23 22 60 19 23 16 41 13
1452 13 2 34 19 50 5 49 15 26 11 48 7 -5 -1 20 37 -35 -24 14 18 -27 -8 -19 -11 -28 -15 -6 -54 -54 6 -8 -80 -43 -15
1485 -15 -18 -69 -71 -44 9 -44 -39 -11 -5 -49 -15 -14 -28 -28 -12 -8 -14 -38 0 6 -27 8 50 37 -13 14 40 34 1 23 42 21 45 51 60 20
1521 20 1 93 36 -2 8 62 42 12 10 28 -3 -22 20 39 -12 1 20 -15 -45 -49 -40 -37 -42 -30 13 -10 11 -57 -37 -48 -30 -32 -5
1554 -5 -39 -56 -12 -38 -44 -18 -2 9 9 46 -22 6 -15 9 0 1 21 14 18 6 16 -2 44 27 -7 10 39 46 28 5 25 -8 4 7 15
1589 15 25 -3 16 -6 -14 0 17 -12 -48 -22 17 -6 -20 -16 11 -15 -6 -11 -15 -47 -6 -2 2 -17 -5 8 -16 -7 -24 -3 -9 -39 -3 -10 -10 -17
$$ packed form
1349d1O%k3%J7J7j7J3ll3K6K7n4OL8M7k2j8j2n%L2J0J1l1L8L1q3qJ09n0k2K0K4
1383E0Jj4OJ0n5J7J7J8m9N8L1m7n3J3J6oqL9k8Mn9N9j4m9L3K3pm0j2O1m9l6K6
1416d4Qj3J4Qj0j0K2J3j7m6O8Pl5j5K3M6m2rpN2J4k6Mj7J7K6jQj5jL8m1MpK5k8
1452A3j1L2j5L1m5M4l4J1j5L7m1j2MK1J7p2J1L8Mm5J9j1Qj7J3Rm8%O0j4p2L7K8
1485a5ln1kK7N3n3NK8Om4L4Jj4%J6Mok4L8Ol3L5M2j3n0K7K6ol3K2J9k1K4ORm0
1521B0j9R2n7l8J0N4k0l0kJ8l1j9M2J9n1J3J9l5l0mRLnJ2M3k3K1o8K0j1J8kK7
1554el4j7M4k6oK6J6J1%L7o8K8k1K4rJK0pMj2J0j8M6j7l4J7K9Pj8k3K0l3J2LQ
1589A5J0k8J9k2qJ4J7k9l6K6L9k3j4MK7k6Rnml2M1MMj9J2J3k4Rj7K1ol0L6p%p
$$ plain form
1625 -17 -3 -8 -7 -6 -2 -13 10 -36 -6 -8 -23 -3 5 9 6 33 1 17 34 59 20 15 33 36 8 27 23 18 9 12 -10 -22 -9 7 -2 -2 -17 21
1663 21 20 8 38 19 -12 -15 -51 0 -7 -38 -24 -23 -10 -19 -19 -29 -30 -4 -13 -31 -38 -33 -6 10 20 -16 -35 13 6 1 -19 10 -34 -19 -10 -15 -6 14
1701 14 6 24 8 1 31 20 10 -8 10 26 0 4 36 -4 31 37 -16 -25 8 15 18 -17 -7 28 -32 21 11 -30 22 -25 -9 -6 -21 30
1735 30 -22 -24 0 -23 -16 30 -23 3 -6 -2 -9 -2 -25 3 2 19 -15 -18 15 -3 8 -11 -31 -51 8 13 7 26 18 -10 -17 19 -6 -3 24 -11 10
1772 10 17 -1 20 11 4 16 -3 0 4 -2 24 7 -11 12 20 3 0 3 -3 -4 -20 23 -40 -3 -12 -2 -22 -24 4 11 1 10 -22 -8 -15 -25 -2 -19
1810 -19 -20 -31 -22 -8 -5 -3 -41 -10 -6 -4 27 11 -4 -3 2 4 14 -43 -3 -7 -13 22 -20 -25 -11 -5 -2 7 -25 -3 -7 -2 -12 11 1 -24 24 5 8
1849 8 1 0 -4 25 11 8 -5 -14 -5 -2 3 2 -10 -21 -10 -2 21 -21 16 -3 -18 22 14 -22 36 -8 -19 10 -15 -2 11 -8 -26 -19 3 -10 -32
1886 -32 -23 27 21 15 -13 7 -32 44 16 -16 -9 11 10 -18 5 -11 1 4 8 -4 22 34 11 25 -11 -24 14 8 7 23 -3 8 -10 23 -17
$$ packed form
1625a7J4nJJMj1K3m6L0kj5K0QMlK7l2J6J7K5l9nJ8Lk8J9mnrLk2j2J3J6r%j5L8
1663B1jj2L0j9l1ll6N1pl1J4JJ3r%j0jK6rj8pNK7J6J0l6j9M8pnk0K9m4J5RnRK0
1701A4qJ8j6pL0j1j0j8J8J6k6ML2m0L5On3rL3PLl5J0L5o0N3j0m1N2m7J6Lj5N1
1735C0n2kK4k3PM6n3K6rMpPk3K8jJ7l4lL3j8J1j9k0k0N9NoJ9qk8pL6k5LK7l5K1
1772A0Pj8K1rpJ2j9LMoK6j7j8K3Qj7lLojj6M3o3L7rJ0k0kK8Pj0Rl2J4pj0K3j7
1810a9jj1RJ4LKl8L1MKL1j6j5JNKJ0n7M0moL5m2nJ4OLRl2K2mNj0K3j0k5M8j9L
1849HpjmK9j4lj3rRLNjj2j1J1QK3m2L7j9j5M0ql6N8m4j1K9k5J3J3j9j8PK2j3k2
1886c2RN0ook8K0l9P6k8l2PK0jk8K3j6J2LMj2K6J2k3J4l6j3L8ojJ6k6J1j8L3m0
$$ plain form
1921 -17 -11 19 13 45 52 37 7 15 -18 -3 -13 -3 11 0 -13 19 14 -15 -48 -32 11 -10 -37 -26 -24 1 -3 15 9 -3 -2 27 -1 15 -8
1956 -8 -8 6 21 3 10 22 -1 -4 11 5 -13 14 -1 24 6 -15 -23 3 -20 -6 32 1 5 23 -15 4 17 14 -9 14 9 -2 11 6 43
1991 43 -6 -5 -12 -17 21 -5 18 -14 4 0 -6 -10 -10 18 -27 33 8 -4 19 16 3 -2 6 -21 -45 -20 -23 -34 3 -12 -1 -11 -1 35 12 0
2027 0 21 -18 10 20 3 17 24 -13 -2 16 13 12 28 -8 4 -5 8 -28 7 -21 -5 11 25 -10 20 -4 -2 -7 -15 33 -2 -43 -10 4
2061 4 -21 15 -10 -14 -19 20 6 -19 -20 -7 -16 17 4 6 -3 10 -10 19 -7 -8 -23 10 -1 20 4 8 -7 10 20 -13 -21 -3 -8 -2 13 -6
2097 -6 -1 4 -33 9 18 -31 -13 -25 -1 5 19 7 9 16 31 27 2 25 15 12 17 0 46 -19 -24 -3 27 -9 -3 7 -48 -8 34 -11 -11 -24 9
2134 9 -12 -2 -12 -13 -17 -4 -7 -2 -31 -25 -9 -5 -9 -4 -19 -8 -22 16 24 2 12 6 3 0 -5 -16 13 -25 6 11 -14 13 11 36 -20 31 8 -10
2172 -10 -9 4 2 -9 6 4 -6 16 12 0 -11 7 6 9 9 11 -5 7 -23 -2 4 -21 -36 -14 -5 -3 -1 -28 -38 -16 -29 -29 -11 3 4 -10 36
$$ packed form
1921a7OL0oL2Pj5l0Ql3J5j0J0J4j1j3L2nk9l3J6M3k1k7J1KK5mJ8oj2JK9k8J6k3
1956h%J4J5j8PJ2k3lJ5oj8K7j5K5j8k1qK6k3J4L8l1MJ8l8J9J3lk3K3nj1J3nL7
1991D3m9JpnL8k6K3l2J8mom%K8m5O0k5j2K3lj3nQk7k4K5lj1L7j5J1j0J0L6k3j2
2027@K1l9K8J0j7J4Pl7J1J8ljJ6l6J2rJ3l6L5k8J6J6J4l5L0k4KnqM8l5m1L3J4
2061Dk5L6k5mnL9j4k5jJ3rL3j3KrJ3k0K9k6jj5L3j1K1j6Mj5J7J0l3qJ8nOJ5j9
2097fNNl7M2Rm9J8j2K4OJ4j2KPJ5mk5K3j0lNj7M6o5nK1L0l6OJ0n5M0M2m5%j3L3
2134Ik1J0j0jmJ3lNk9OJ6MmNj5J1j4L8Qk2J0ollnj1K9l8L1Nk5K7kK5n6N1k3j8
2172a0JJ3kj1J5kj0K2mj2j1J8jL%Kj6J2l0K1Ok5j5K2RKKk7j0K2j3%J8J4Jj4M6
$$ plain form
2209 36 -5 26 19 7 6 -3 -38 -15 12 10 12 -2 -10 -12 4 14 34 -23 1 -2 -5 -35 12 -17 -17 11 -16 -18 23 -11 -10 -11 0 10 8 12 29 15
2247 15 13 2 -9 -5 0 -16 -15 -17 -3 -20 -20 -22 -14 -18 -9 -39 7 -12 -20 -5 -12 5 -23 -3 24 -8 -7 -22 11 0 -15 17 25 -5 13 36 5
2284 5 -8 -1 8 -17 7 6 -9 -14 3 -8 6 -11 -13 4 17 -6 -17 -13 13 -9 17 20 -6 3 -16 -6 -6 -12 -1 -18 -19 -32 5 -1 15 -9 -24
2321 -24 8 12 -6 7 -8 -10 14 -42 -13 -6 -18 12 11 -18 9 9 16 -31 18 -23 -16 -19 9 -14 -2 -8 16 -9 -18 -23 11 3 -6 -3 14 3 -8
2358 -8 42 11 14 -11 -2 6 22 6 -19 7 0 11 -18 -30 -5 22 1 -3 39 6 -2 14 -4 -2 5 10 5 7 -20 8 -4 17 -30 -10 12 -2
2394 -2 6 -15 23 -2 9 7 -8 -22 -24 11 -5 13 9 -5 9 3 1 38 2 24 -1 23 10 -3 -6 7 -18 13 -17 25 24 -17 -10 -6 11 -23
2430 -23 -4 -27 -7 -26 -1 24 -15 -33 -8 -10 13 3 18 0 -39 -40 7 22 -18 -10 -11 -35 -4 -2 7 -9 9 -10 7 14 -3 11 22 -12
2464 -12 7 -11 -6 -7 8 -14 -4 5 -2 17 -12 -15 -7 -15 -7 -9 -6 29 -2 2 1 -2 29 -4 -7 -5 -18 -23 -4 10 -28 -12 10 -3 -17 -23 -1 -23 -24
$$ packed form
2209C6m1L1pj2jrl5K3K7kKj4qkJ6J0K0n7K4lll0M7k9%K8k7kM1l4JjJ1J0kMJ7j4
2247A5kj1j1MNj6JkJ4j7%kQmRl0M6j9qJ5pJ7k8K0K7l2Jj5L3j1j5L2Ql0J8K3l1
2284Ej3PRk5K4jj5nJ7j1J4j7kJ7J3k3j1MK6k2K6Lk6Rj9J0%oJ1j7jj3L7oJ6k4j5
2321b4L2Mj8J3j5kK4n6K9Pj2L0jk9K7%Pm7M9m1PlK8k3J2oK4k5rnL4qrLJ7j1j1
2358hN0l1Lk5RQJ6j6k5K6pJ1k9j2K5K7k1mM2l3qJ6j8KPNnKk7K8j2K1m7K0K2j4
2394bQk1L8k5J1kj5j4kL5j6J8mj4J4okL7l6K2k5K4j3j3lJ3k5L1l0M2jm1PMJ7l4
2430b3J9k3K0j9K5K5l9j8K5kK3j0J5j8l9jM7J5m0Qjk4L1KRj6J8j9J7Pj7J4J1l4
2464a2J9j8NjJ5k2J0RpJ9k9lQqQkLL5l1MjlL1l3lKj3nJ9J4l8J6K2j3j4oK2k2j
$$ plain form
2503 -24 -17 25 -7 -22 0 -20 -2 -18 -13 -9 27 13 -16 16 8 12 7 -11 8 -5 24 9 -14 11 -4 -1 -3 11 -17 -19 7 -5 -35 -4 2
2538 2 -7 -10 -13 -5 0 -12 1 24 1 -28 25 4 16 13 -8 1 -8 4 -17 -23 15 -20 -19 5 10 22 -11 -16 -18 21 2 0 1 -16 -3 -11 1 -34 -26
2577 -26 17 12 -1 -3 10 15 -9 4 28 2 1 -2 11 -23 -11 -5 17 -15 -10 -11 -8 -5 -12 15 -1 -21 -20 -4 3 20 3 3 -11 -30 12 13 -16 -10
2615 -10 3 -6 -4 -1 -19 48 17 7 -32 -5 -9 12 13 24 -10 0 -4 -1 6 3 8 14 -22 -1 8 6 -3 3 -9 -32 19 18 11 4 2 4 10 -1 -16 -9 -49
2656 -49 19 9 24 28 6 19 41 -5 26 1 -20 15 -21 3 -20 -27 -19 -23 3 -21 9 21 5 -5 26 32 13 7 -4 -37 -6 -3 -12 -1
2690 -1 -28 -24 -3 17 0 11 -27 -3 9 -25 8 -27 -3 25 31 -2 11 19 26 11 -23 14 19 -3 5 31 2 3 -2 1 29 24 -5 1 13 24
2726 24 26 -7 -24 0 20 6 3 -22 -24 -14 -13 12 4 21 -1 -3 9 -16 8 -17 -15 -10 15 7 -34 33 -21 7 -13 0 29 -1 -5 10 11 -25
2762 -25 -7 -38 24 -19 -29 -13 -29 -4 -3 -10 7 18 43 27 -1 3 25 -13 -6 -1 -15 24 15 -7 11 -2 -7 9 -20 -30 29 -11 8 -48
$$ packed form
2503b4PM2l2j5K2k0J8j6NML6j4k9L2qMnj8J9j3K9j5k3K5j5LkJ4k8kK6j2l0L1O
2538BrllQNj2J3K3k3k9N3k1J2lk1RrJ2k1oL8l5JK4NJ2l3nkL9j9kJj7J3qJ2l5Q
2577b6M3nj3kJ3Nk4J3K4k6jlJ3l4J2OK2l2NjLLpK7j6k0JJ6PJ7j7%j4j9M2Jk9O
2615a0J3rKLj8O7l1j0l9K7mK1JJ1l4J0mLPlNOl6K1RkrOj2k3N1jppkKOj1j5Pm0
2656d9O8j0J5Mk2J3K2m6L1k5k1L5l6K4k3pQmK6k4L0J2j6j0L1Oj9oj1l3L1LrJ1
2690ak7MK1K0j7J1l8K4J2l4L3l5K4K8Ol3J3QPj5l4L7Nk2QK6k9JnLK8nk9OJ2J1
2726B4Kl3j7K4K0j4lk5kJ0JK5qJ7k2kJ2k5K4k5KNK5qm1O7n4K8k0J3K9l0mJ5Jl6
2762b5J8l1O2m3j0J6j6K5JpJ7J1K5j6k8MK2l8PNj4L9rk2J8j3nJ6k9j0N9m0J9n6
$$ plain form
2796 -48 2 -35 -9 -15 -4 -13 -34 -4 31 30 -21 19 -13 -24 9 11 4 -13 -31 -8 -16 -1 -16 -11 16 -1 4 21 -15 -35 18 19 5 23 -4
2831 -4 -33 6 22 -7 -12 2 -4 -8 -9 17 17 -3 29 -18 -33 -16 -5 -21 13 -12 -29 -2 36 5 -3 5 10 -17 10 0 -18 -22 7 10 7 -6
2867 -6 19 8 -6 8 -12 -2 -3 22 -44 32 -1 14 9 -10 33 -9 26 19 -6 12 -7 -4 -6 9 7 -5 11 0 -12 -25 11 4 -2 6 3 -19
2903 -19 -43 -5 23 -7 -30 -13 -3 -1 3 13 2 -24 -11 -23 -10 -12 2 -25 -22 -2 24 -18 -4 16 -10 -20 21 -13 -6 17 -16 -3 -16
2936 -16 6 20 0 -3 -6 7 10 -4 4 10 10 16 -13 14 -10 -7 9 4 6 6 8 -8 -16 21 5 32 -18 6 -16 2 2 2 7 15 -20 -6 -21 23 5
2975 5 -3 -15 -9 -11 1 -10 -13 5 7 15 18 -7 0 9 -11 -1 22 7 14 -16 0 16 -3 -7 13 -15 -4 19 23 -11 -35 7 -8 3 -2 10 22
3012 22 -1 41 7 7 -6 38 3 -1 -6 8 -9 31 -25 2 11 4 -33 -14 5 14 26 24 2 -19 -19 -34 28 -2 -12 6 12 -8 -4 -23 31
3047 31 8 -21 -13 1 -24 -14 1 18 -20 -17 7 3 12 22 -16 -12 -13 14 -13 -30 6 1 6 -6 2 -13 -4 15 -11 -2 -6 -13 12 -25 -10 6 -13
$$ packed form
2796d8N0l7K6oJ1rk1L0L5jn1M0l2j1L3Kpj7j8K3qJ5j5NK7j7NJ7l6k0N3Jj4J8k7
2831dk9L9J6k9nJ4omjK6%k0L2m7j5J7J1j6L4k5j7K7L8l1qQNk7K7j0j8mK9Llj3
2867fK5j1j4J4k0J0jK5o6P6l3J5nj9M3m2L5pk5J8j9LkJ5kj2J6j1j2j3L6poQlk2
2903a9k4L8K8l0k3J7J0KMJ0j1k6J3j2J3kJ4k7LK0K6m2J4K0k6j0M1l4PK3l3J3j3
2936a6K2J4k0llJ3Lj4QO%Ok9K7k4LJ6nK%Kj6qL7j6K7n0K4k2J8%%NQl5J4j5M4j8
2975Eqj2OkJ2j1lJ8KQLk5PRk0J0K3j5Pl0J6J6j9mK0k8J1K3Ml4k4M2j5J1nJ2J2
3012B2k3M2l4%j3M4l5mnJ4j7M0n6K7Rpl7J9J9RJ2kk2k1%j5O2l0j0J8Ok0Mj9N4
3047C1k3k9QJ4k5J0J5J7l8LK4mRJ0l8MjK7k7j7L6nNj2Qj5RJ9k6RmpK5l7J5J6j9
$$ plain form
3084 -13 9 -30 -13 17 -28 -31 -15 20 -15 -4 -22 4 -9 -10 18 24 2 18 -2 -3 -6 -8 3 19 5 -3 -11 1 10 21 0 -14 -16 15 8 10
3120 10 3 -7 -4 27 -3 -9 1 -21 18 -14 -14 11 7 17 2 12 3 4 -19 -13 30 14 -3 24 2 27 -20 -14 -19 -3 18 9 -28 12 6 -3 1
3157 1 -21 -2 0 -25 -1 -25 -24 -7 26 -41 7 15 -4 -18 4 24 5 -8 8 -16 -12 3 24 4 12 9 14 -5 22 5 22 8 -16 -8 2
3192 2 -10 5 -10 -17 -13 4 -21 -20 5 21 -12 3 -8 -28 -2 -8 -15 21 -7 -3 0 23 -4 -19 -34 -1 19 -23 13 6 12 -23 -5 -15 3
3227 3 10 3 5 2 -3 1 -8 8 14 -7 -5 7 20 7 -19 -14 13 -11 1 2 13 2 0 -2 14 -7 8 -1 -29 -19 -17 12 -17 32 3 -9 5 -19
3265 -19 -25 3 9 5 0 19 5 -6 9 16 -3 12 23 -6 14 -7 13 23 19 10 40 7 4 39 -32 7 1 -9 4 -8 -19 -16 7 -35 13
3300 13 18 -5 18 23 -5 1 5 -27 -8 13 17 35 -1 12 -1 4 -17 -14 17 38 -5 1 -12 24 14 -28 9 -8 -23 7 -23 -17 3 7 -8
3335 -8 -39 21 -19 8 7 4 -16 -6 5 13 16 -9 15 -26 0 -6 12 -4 -29 -6 8 -1 -15 22 28 -12 -15 -17 4 30 7 -8 -13 15 6 -3 9
$$ packed form
3084a3K2l9J7L0m5lJ6L5l5J1j8K6j3jK8Ok2J6k0jlkJ1J6j4qqJ2RJ1k1j4kL1pK
3120A0pj0LL1l0oJ0k2L9l2%K5mJ0j5J0rJk3OM3j6j7K7k2K5m7OnJ6K1rl7M0orM
3157Ak2J9Kk5K4k4JJ7L3o7M8Qj9j4K2K0j9j3J6k4MJ5K1k0QlNj9K7j7J7j4k4QJ0
3192Bj2J5j5pMJ7k5JK5J6l3J5j1k0K6opL6k8MLK3k7j5j5L3K0m2L6pOl5J8j0J8
3227CPpKlnMrJ6Ok1KJ2J3j3k6NK7k4J2JJ1j1kkJ6k1J5rk8J0KK9k9M9k9j2J4k4
3265a9oK8OmnJ9j4j1J5Pj9J5J1k9K0k1K0J0mrL0l3lL5p1L9oj0J3j2j1LK3m2M8
3300A3Nk3K3Nk8OMl2J9K1MJ8l6J3j3Nk1LL1K1m3Oj3L6j0m2L7j7j5L0l0OK0Mj5
3335hl1O0m0K7jlk0J0J1QLk5K4m1K6oJ8j6k5K3J4rj4L7Om0lkK1K6k3j5nK8rrJ2
$$ plain form
3372 9 11 -16 -9 -4 -16 -24 2 2 -5 -10 -1 -1 -2 -19 -5 -19 -25 -22 -24 -9 -13 -9 -2 8 -5 -12 27 -15 -14 0 -29 16 17 -13 -6 -13 2 -7 -13 12 45 6
3414 6 -6 6 11 22 -5 14 -28 1 11 -7 12 17 17 -2 -5 -16 16 5 -23 21 13 42 -8 10 6 -1 15 -1 17 -5 6 -10 -23 -5
3448 -5 0 21 5 -4 -16 -17 -20 -33 -16 1 7 -3 -10 1 -8 -15 1 -22 -10 -5 -19 -17 -13 -17 -48 -16 1 -3 44 20 2 16 -1 9 20 8 27
3485 27 -22 -5 -2 -12 -8 -9 -4 5 25 -27 -33 29 27 16 20 20 23 -20 -7 2 -6 -6 20 -24 -24 -30 -1 -46 7 14 -2 -31 -46 -17 7 24 -34 27
3523 27 1 24 15 -14 2 -14 -6 6 3 11 -2 -14 3 7 -1 -6 37 4 1 8 3 2 20 15 -11 -7 0 -6 1 -6 -7 6 -6 38 10 -14 8 5 -27 3
3563 3 11 8 4 2 -11 -21 8 -4 -15 16 8 20 -27 -19 -6 3 17 11 15 -13 0 -4 29 31 -10 25 7 10 25 4 -4 -10 -9 19 0 -4 -13 6 -2 9
3603 9 10 -17 9 -24 -30 20 -15 10 -2 -10 -9 -39 -25 -15 2 -1 10 11 -2 8 -14 32 0 -6 9 -20 -1 -39 -3 -28 27 12 2 -8
3637 -8 21 -8 11 31 -17 11 1 18 -8 8 15 2 -13 -29 7 -17 7 -40 6 -17 3 6 0 -25 -2 23 3 9 37 21 -7 -16 -28
$$ packed form
3372IKk7PNj2qK6%pnR%jj7J4j4oLkJ5mMPJ0j3pL9m2JJ4k9M5Jl0PpJ5roK5L3l9
3414Fj2J2NJ1k7J9m2K9J0j8J9N%j9lj1L2j1k8M4qK9n0J8mpJ6j6J8k2J1j6j3J8
3448eNK1j6rj2jlj3J7J7Oj0pJ1rpJ6k3J2Nj4KMml1L2J7mM7k4j8J4j7J0J1j2J9
3485B7m9J7Lj0MjNRK0n2oO2kj1M%Lm3J3Rq%K6m4%oK9m5N3Pj6k9j5K9K4J7n8O1
3523B7k6K3rk9J6j6QJ2lQj3j2J7MqnM3l3lPnjJ8nk6MPoPpjJ3j2M4k8k4K2ll2L0
3563CQlmkj3j0K9j2j1L1qJ2m7QJ3RJ4oMk8J3mL3Km1L5j8LJ5k1qoJK8j9mrJ9qJ1
3603IJk7K6l3oN0l5K5j2qJl0J4J0J7lJ1Jj3J0k2M6l2oJ5k9J9l8L6k5N5j5j0j0
3637hK9k9J9K0m8K8j0J7k6J6Pj3j5j6L6k4K4m7M6k3K0Lok5K3K5k0OK8j6k8rj2
$$ plain form
3670 -28 18 -13 -11 5 -23 -20 28 -11 -8 5 -4 -2 2 34 13 -12 -6 -4 22 22 0 -13 -16 -9 -14 -1 0 15 -11 -7 -4 9 -2 -9 -16 -5 47 -1 -2
3709 -2 -12 3 8 1 26 -38 8 16 -8 -21 -9 -6 -10 10 -34 -22 14 -7 0 11 0 -45 -4 -32 1 21 6 -25 -1 18 -3 14 2 -27
3743 -27 -7 -26 5 9 19 -3 7 -25 8 10 -32 -8 -1 -10 20 43 -6 7 -18 10 -14 -12 -12 -15 1 -3 -23 19 -3 14 -18 6 -14 -24
3777 -24 0 16 13 -20 15 -17 -7 -5 2 9 -2 10 2 -23 -7 -6 -8 -6 16 4 -4 9 -2 17 -19 15 -3 -16 -10 -7 -1 -6 5 4 8 1 -4 5 30
3816 30 -10 -6 4 3 -3 -9 -7 -16 3 -30 -24 3 -20 11 -22 -7 -27 -1 -19 7 8 -5 29 0 26 5 24 -18 -8 -10 -9 24 -5 -19 -14 -4
3852 -4 -4 -12 -5 8 0 17 1 -6 -20 4 -20 -9 19 -31 -18 -8 4 -8 -2 -22 8 1 -1 -31 3 -13 -22 0 -1 -8 -4 19 -13 -12 -1 6 -7 14
3890 14 -5 -11 26 -17 1 11 9 15 -8 4 9 -1 5 10 -7 -9 11 6 19 13 9 3 8 29 -16 9 -27 -2 13 -24 -33 -25 14 7 7 -48 -23 -45
3928 -45 -19 -10 2 4 11 -40 14 -4 -9 -18 14 -1 -37 4 -13 -24 -9 4 16 -12 -18 -17 -23 6 19 -6 17 19 -19 24 22 -6 -12 16 8 -15
$$ packed form
3670b8M6l1KJ6k8LM8l9LJ3rKML2k1k5OKK6%k2j3lPnJ3JJ5k6MLJ3j1ppJ1N2m8j
3709bj0J5NpK5o4M6Qk4j3J2LmK0m4J2L6k1PJ1j1m5M1k8L3K0j5l1K4J9k1J7j2k9
3743b7K0j9L1MJ0k2J0l2L3Km2K4PrL0K3m9J3k5K8k4K%lJ6mk0M2k2J7l2K4k0j0
3777b4K4J6ll3L5l2J0KPPj1J2qk5J6JkKK2j2qJ3j1J9l6L4j8j3OLOnJ1jMpnRK5
3816C0m0MJ0jooKrJ9l3OK7k3L1l3J5k0K6j8K6Jj3L4k9K6k1J9m2J0kJL3k9j4NJ0
3852d%qPJ3qJ7j6pj4K4k4J1K8n0J3J0J2j2Ok0L0pkl0L4j6rK2jpMK3l2JJ1Pj3K1
3890A4j9oL7m3J8J0kOk3J2Nj0ONj7kK0nJ3omoNK1m5K5l6K5J5l7rQL9p%n5K5k2
3928d5K6RJ2KPn1N4j8nrL2j5l6M1j7j1J5J3J2k8oJoK9J3k5K3Kl8M3kk8oK8qk3
$$ plain form
3964 -15 -10 12 -23 -4 -15 -17 1 -26 1 -2 9 7 2 14 9 -11 -2 8 9 -9 -19 -43 -27 -4 -12 -29 -6 -13 -18 -14 15 16 3 -20 3 17 1
4001 1 -1 2 6 2 -14 3 19 6 21 -4 -11 16 -6 12 21 23 -15 -24 24 6 -2 -10 -32 -7 5 -18 8 -3 1 11 -11 0 -26 18 49 -12
4037 -12 1 14 -5 26 9 5 -3 -15 -24 -20 24 9 -18 -21 -5 4 -13 13 4 -23 -24 8 13 -2 1 7 -11 5 -9 -6 -6 -27 -19 1 11 -33 15
4074 15 -17 -4 -19 11 17 -12 32 10 3 25 -15 -15 -7 26 21 -6 -34 -16 -8 16 -4 17 4 1 -1 7 -10 -7 18 -16 -7 24 -19 -53 -19 6
4110 6 -6 -10 -26 28 13 26 1 -7 7 -11 18 0 16 9 1 30 6 10 23 -29 9 -25 32 8 4 -2 -5 3 24 40 9 -1 -2 3 33 4
4146 4 -2 25 -2 5 35 2 13 2 -4 19 -15 -11 22 1 -5 0 -6 -29 9 -7 -5 -21 -18 4 2 -12 -3 19 -1 3 -16 24 -14 -5 -9 -3 1 -1 4 2
4186 2 13 -6 -19 0 -36 -33 6 -9 -4 -8 7 -11 -11 13 -1 19 -8 -11 12 -2 11 7 16 16 29 -11 7 14 14 5 -7 14 0 13 7 8 18
4223 18 19 6 -16 -16 -7 -6 -36 -3 -19 5 -6 9 -4 10 21 -12 3 -7 12 -16 1 27 41 -3 -30 -15 30 6 2 16 -8 -3 -8 1
$$ packed form
3964a5NK2l5J9j1kJ8k7K7lJ1knJ2nk0RJ0Jj8j0k4J6K3qj7K3pnMK9Jj3k3K3J4j6
4001AkLMmj6J7J6j3J5k5pK7k2J8RKl8rM8j8qqk2K5J2k3K6j1MJ0k2J1k6M4L1o1
4037a2J3J3j9L1j7mqj2rMM4j5k7lJ6Rj7K6rk7jL2Nj5LOj8J6j4L%k1QK0J0m4M8
4074A5l2J3j5L0Ok9M4k2pK2m0%QL3nk7k8J8QK4k0K1j3lkQj7LK5l4RL1m3l4L4K5
4110Fj2mj6N4j5J3k5qJ4j8K9j8J6pqK9k4MJ3n2L8l4N7k4molQK1J6l1j0jNL0k9
4146DoK7k7PL0l3J1j1oK3l4ML3k1oNok3L8j6Kj6LK2kj4RK2k0Mj9M0l8RmOMkNk
4186BJ1j9j3J9l6LL9j5NmJ5j8%K4j4K0k7lK3j4J3mR%J3m0J8P%rj2K1j4J3oJJ0
4223A8Jj3k2%RJl0L3j6K4j1J5j3J4J1l3J5j0J9k8J7K6J4m4k7J5M5k4mJ4k4NnR
$$ plain form
4257 1 4 1 5 -13 9 13 11 -15 -6 -18 -2 -24 -11 14 -3 15 8 31 -8 -7 -36 0 17 3 -9 5 -7 -13 -4 -12 -6 7 -2 -13 -29 30 -27
4294 -27 11 -4 16 -28 -1 1 -11 -6 -3 17 -24 4 3 -9 -15 13 1 -1 -5 16 28 -2 8 16 38 39 9 -6 1 -17 16 5 -40 15 6 9
4330 9 0 3 0 -3 9 21 3 3 4 -22 1 4 16 -2 13 -21 17 22 8 -3 9 22 10 -8 -4 -12 23 15 15 -22 -32 -5 33 3 35 22 -39
4367 -39 0 -21 -7 -3 16 2 -2 -7 4 13 -42 -10 -10 -4 20 -18 4 -15 3 -1 -20 -10 -26 14 2 1 -3 3 15 -6 -3 -3 3 -3 14 -35 -11
4404 -11 -9 3 22 22 5 -2 3 1 -7 -28 0 8 9 6 -13 13 -18 -5 -21 11 -19 -8 -38 17 -8 -15 -4 -13 35 15 -28 -14 5 5 -11 8
4440 8 22 5 -3 -5 -27 4 14 6 6 13 23 -20 -48 -34 8 29 -9 -15 3 -36 -4 -41 -19 -19 -10 -13 -14 -18 -18 -18 -8 -27 3 11 1 -1 2 0 -30
4479 -30 -9 3 1 -6 22 5 -6 0 -29 -2 -8 -32 11 -29 -2 0 -19 -16 -12 0 26 4 25 -3 -15 -2 20 -20 15 -4 -27 4 -28 -3
4513 -3 -1 9 13 -1 26 1 -16 18 2 -20 -3 -4 -38 -12 -28 -19 3 -4 -14 10 1 26 29 15 5 -18 14 17 29 -13 20 11 -15 -7 5 22
$$ packed form
4257ALlMj8K2Mkk6Rj2J6k2J3K5j7J8pK3l9Jk9L6J7j4j2J4j2oRqOJ3rj1j6N9n7
4294b7L8j5K0m4K7Kj2NLK0m1K8jj2oK8j2kmK1J2l0J0QK2Jl0j5Pj8L3j1m5N5rL
4330IrLllJ2J2j8%Jk6K3LJ2j8J5l4L8Nj4j1J2J3j2j8MqL5q%l7j0K7L8l0L2j3o1
4367c9L9k1J4MJ9j4mnJ1Rn5L2%OK4l8K2j9J8mj9J0j6M0j2jmOJ2k1L%OoJ7m9K4
4404a1KJ2J9%j7pNkqk1K8QJlj9K6l1J3j6L2l0J1l0N5k5pJ1rM8k0m3J4J9%j6J9
4440HJ4j7qkk2L1J0q%PJ0m3k8J4M2K1l8oJ8l9L2l7K2%Rljm%%J0j9L0Qj0kLkl0
4479c0K1J2kpK8j7j1Ok9K7ok4M3m0K7Kj9LMJ2K6k2K1k8j2J3K2m0L5j9k3L1l2K5
4513cKJ0Mj4K7k5j7L4j6k2J7jl4K6j6RK2pj0K4rK5Lj4j0k3L2LJ2m2L3rk6QJ2J7
$$ plain form
4549 22 21 9 29 17 -9 23 3 9 1 1 -9 15 -12 -12 -12 -23 1 -8 9 0 24 -4 4 -27 -1 14 7 -23 0 8 20 -2 -1 -5 -2 -9 7 1
4587 1 -12 -18 16 -25 -23 15 -33 8 10 10 0 5 -31 -9 -7 -2 11 -2 2 -1 -8 -38 3 32 -9 34 24 30 -5 3 9 -15 -2 -1 18 9 -20 -3
4625 -3 14 -18 -15 -9 10 -5 4 37 3 -5 -13 8 7 -10 16 -17 -15 4 5 -15 -33 -32 8 4 10 -10 -11 -6 -2 37 -5 -8 9 -8 -20 -7 -18 -17 8
4664 8 10 8 18 -30 -16 -28 -2 5 -12 -5 -23 28 20 4 22 8 2 -21 -6 3 26 8 -4 -17 -4 -9 -14 -22 -5 -11 -9 10 -19 23 6 11 -11
4701 -11 -4 11 -17 -12 -2 2 -10 -1 18 8 -18 25 -9 0 27 21 2 -11 -10 -6 7 -1 -26 -9 -10 -4 -4 6 -40 -1 12 22 -13 -13 1 -16 6
4738 6 15 18 -26 -23 -19 -28 16 -12 -17 16 23 -20 29 -10 -11 25 -33 6 15 -2 3 11 4 20 8 -11 -18 -16 8 -3 5 -6 -41 16 21 -11 7 -17 -20
4777 -20 -12 -18 -18 -25 0 37 -11 -2 -13 9 6 22 -5 -4 10 9 -16 1 -5 -28 2 -1 -17 -18 -15 -2 -8 2 -3 6 27 8 -1 8 0 -29 13 -9 33
4816 33 5 -19 14 5 2 -3 3 15 -21 7 13 -9 -10 -17 -8 -4 -6 -6 8 2 20 13 -11 17 18 7 11 0 25 -21 15 2 18 7 3 -13 -16 1 3
$$ packed form
4549B2jj2K0j2k6L2k0Oq%j0K4k7%%j1K4rJ7rK4k8Ql1K6J5pl0K3QJ2k2JmLpJ6o
4587Aj3oL4m1KL8m8M1K%j0Nl6K2KNJ3j3Mlpl0M1K9m1M3j0Ol5QOk4J3JJ9rk9J7
4625cJ7l2LOJ9j5RL3l4qqK1jj7K6l3KJ9Jk0j8JM0mOk0jNML9m2lJ7j7j2J3j1JK5
4664HKkJ0m8J4j2K6Pj7Pj8N1qj6J8j4ok3J5RK3j8j2j3J3nnqJ7oKJ9k9M2j7Nk2
4701a1PJ5k8NJ0Mj2RJ9j0k6M3l4RK7oj9j3JMJ3qk5J7jO%J0m6L9J3J0l5%J4j7K2
4738FRLm4LMrM4k8nL3Pm3M9l9jL6n8L9Rj7NQpJ6j2j9pKK4j1Qj1l5N7Nl2J8k4l
4777b0Qo%pK5L7m8Rj1K2lJ6k7JJ4jk5J7ok3L0lj6jLJ3oJ0nRK1j9rRqk9M2k2M2
4816C3k8k4L3rlnOJ2l6K8Ok2jpRMk%J4oJ8pk4K8Jj1Mj1K5m6L6j3J6j1mj6lJ7K
$$ plain form
4855 3 34 -7 15 -5 -5 37 25 -17 25 -16 15 -18 4 5 1 -4 19 17 5 3 -12 -14 16 1 1 -1 -22 11 15 -4 -16 30 15 -1 20 19
4891 19 -9 -14 -6 -37 12 23 -1 4 -5 4 -16 -11 20 -20 -38 18 8 0 30 14 15 -4 1 18 6 -9 -13 8 -4 -6 -4 30 -7 -1 -10 33 18
4928 18 2 -27 -21 15 7 -11 22 -1 15 -13 0 7 17 11 -13 2 -16 -16 0 9 -4 -2 -12 2 5 -6 14 -13 -27 -3 7 -13 19 -5
4962 -5 -8 11 6 -21 -4 2 7 9 3 10 6 9 5 -4 -7 -12 -1 13 34 1 5 -2 -16 19 -8 8 -7 -5 5 -29 -13 -16 9 -24 5 21 -5 11 -8
5001 -8 -12 -18 48 5 38 7 -25 11 4 -12 14 -33 20 -7 6 29 -15 0 -9 13 29 23 28 2 15 -4 -9 -10 -17 4 15 12 -15 -8 3 32
5037 32 -14 2 -19 12 -5 39 22 42 4 -7 2 -5 5 6 -12 -22 3 -6 13 6 -21 4 3 -27 -20 -28 -9 0 -7 9 -22 8 -18 2 -27
5072 -27 18 -7 12 -12 -11 12 9 -24 12 12 -16 11 7 -5 16 22 12 5 -22 7 4 -30 -10 17 -12 -21 14 -8 4 -21 -1 1 8 6 13 1
5108 1 27 15 17 4 19 -11 8 -17 20 10 -12 -28 -8 1 5 -3 -27 30 15 -4 -11 -4 -5 18 -10 7 -14 9 -20 24 1 19 -20 -31
$$ packed form
4855CL1m1K2k0%M2j2m2M2m1L1l3K2JmnK3kj2kj5kL0j5%kk1L3Mj9j2M6j5j6K1j
4891A9k8nQl1M9J1k4NrRk0NL1m0j8N6j0qL0j6Jj9NJ7j2j5mK1j2kKL4l7OrM3j5
4928A8j6k9OL6qj8L3k3J6k8J3PJ0ok4J5j8%J6Rj3Kj0J4Lj1K0k7j4K4J0k0L2k4
4962elJ9nk7J7ONKoPmLmrlnJ1J4K1l3Mpj4L5k7J6j5KJ0l4J6lK5l3K9J6k6J6j9
5001hmoO6m3L3l1l2L6pj6K6m7N3k7J3K3m4J5rK2J6oNk6J3j9njpK1J1lk7PJ1K9
5037C2m6J6k1L1j7M4j7K0l8j1RpJ0Jj8j0K5rJ9pk7K5jl0PqJ9RpJ6l1L0k6K0k9
5072b7M5k5J9k4JK3ll3L6%k8K7mj2K1Oj0pk7K9ll4K0K7k9rL5k2J2k5K0KPkPj2
5108AK6j2Kj3J5l0J9k5L7j0k2j6K0RMqk4N7j5j9pPjK3k8J7k1K3k9M4k3J8l9j1
$$ plain form
5142 -31 -27 -18 -9 -10 6 6 -18 24 -18 -3 23 5 11 3 15 2 31 -12 16 8 -1 -6 9 6 1 31 18 14 8 3 14 20 -3 22 -4 22 -4 -13 13
5181 13 -24 2 -39 -16 2 -12 12 -2 -3 -18 14 26 10 8 -6 -27 -23 15 3 -1 -2 15 -4 4 15 -14 -16 10 11 26 -5 15 -3 -20
5215 -20 -6 -3 -16 27 -15 -30 -25 13 3 2 -8 8 9 -3 -12 -18 -5 -12 6 -22 22 12 16 -19 0 17 -4 5 -13 -4 -17 8 16 -32 -22 -5
5251 -5 22 -39 -18 -2 17 11 -2 12 4 1 -21 54 -11 -16 2 -13 -22 -13 -4 -10 11 -28 31 2 48 21 29 4 35 -15 16 0 28 29 0 -14
5287 -14 -9 -13 -11 7 2 2 -13 -24 -9 6 18 2 11 6 -4 -19 2 -25 12 5 -16 -11 7 35 -9 -4 -13 -12 -7 26 9 -4 13 -5 6 -2 5 -23
5325 -23 0 12 0 -25 -2 -17 -1 -25 -13 -32 -6 15 2 -6 -6 18 7 0 -4 -12 4 7 9 25 24 -12 7 5 25 -7 26 -2 17 -50 -11
5360 -11 2 -11 -5 -12 16 -1 -3 -3 -4 -5 2 -29 -13 -7 -1 -8 32 17 4 17 -15 17 39 19 25 11 20 7 -1 7 -5 -4 -2 15 5 -17 13 15 18
5399 18 18 -33 38 26 4 -16 10 26 -11 -3 9 -10 -6 -15 23 7 -6 -16 23 6 -19 5 15 7 13 -2 -24 8 -13 3 -6 -2 -6 1 15
$$ packed form
5142c1MRRjJ6%k4M2m2J5K6j8OqJ2j3K9m3K8qrnJ5lnL0j3monJ1Ok3K5k6K6k6rK6
5181A3l7K6m1K3J8j4K4j4jj5L2J2j6kj4k1ML8j2mjJ7j9QJ1k9kK6JJ5l1K0j8j7
5215b0J4Lj3M3m2j5NL8j0jj0J6Jj2roJ3pJ8k8M4j0Ml5J9J7k1Rj8Rj3K5Qm8J0J7
5251eK7o1K1J6J9oj3J4qlk2P5o5nJ8j5rRRoK1l9N9k9M6k7Qk5L1n0L1j6K8Jk9j4
5287a4NmKJ8n%j5j1J5J5J2j6Rnj0j5K1k7L7pk1NJ8K8m4NrJNL3j7j3J7j8J1qPk8
5325b3K3J2j2k5K3j5J6k4J2j9K6K1j3q%K4j1pmqJ6LKJ6jl6J9kK0l2L3k8J9o7L9
5360a1J3j3OpK8j7k%jjPl1J6OOpM0j5j3J3l2L2K2k0Oj4Rj3qQj2JKJ7j0k2L0KL
5399A8%n1P1j2k2k0K6J6l7QJ2j9MrL8j6j3j0L9j7k5K4J0qOj5k2L2k1J6rMmPJ4
$$ plain form
5434 15 5 30 9 -15 13 -24 -16 2 26 -1 3 3 -10 5 21 -14 -5 48 -19 6 12 -6 -11 16 3 16 26 6 23 16 -3 47 -14 11
5468 11 34 2 3 -7 -2 1 -3 2 6 -15 15 11 11 6 24 -5 13 -14 39 -4 9 -3 2 0 -1 23 -7 -2 1 9 9 10 10 15 -1 18 -25 -18 6 -19
5508 -19 27 8 -21 21 14 -16 32 0 33 25 28 5 -36 33 -1 -30 9 1 -38 14 -13 8 22 3 14 -3 43 -14 -2 31 -6 5
5540 5 13 24 15 -13 21 12 30 21 6 -6 -16 15 -4 11 14 5 4 5 -7 -5 -14 19 12 8 6 29 20 -25 18 17 -10 1 -5 -21 -21 -6 -4 27 -13 -16
5580 -16 -7 -22 8 8 11 -5 2 -3 -1 27 -4 -23 -17 -15 -17 3 17 1 12 3 -7 -12 -6 3 -20 -4 -12 20 -17 2 6 -12 -5 -3 3 -16 -16 11 24 16
5620 16 -1 -3 14 3 -22 18 22 -3 8 1 -13 -8 -6 6 -20 -11 -4 3 7 -26 19 -15 37 -3 -7 24 -7 14 -34 5 24 3 -5 -21 -5 -4
5656 -4 -16 2 11 -20 30 18 -3 -9 3 -23 -7 -24 -5 5 9 15 -8 -9 -11 -6 3 13 -27 -7 -24 7 -13 -13 -10 -8 -6 -1 -20 6 -1 14 1 36
5694 36 0 33 -1 4 3 18 0 12 -3 -2 -7 20 -3 -29 -15 10 -14 -31 -15 18 31 8 -5 20 4 -1 18 -4 -2 -17 2 -3 -20 -22
$$ packed form
5434A5j0K5k1k4K8l7QJ8K4k7M%j3J5J6l5RN3o7K5Oj8nK7j3J3J0k0J7pj9N0o1K5
5468A1K3l2Jj0NLmNMk1L0m%nJ8k9J8k7N3m3J3j2NkjK4l0NLQ%J%Nj6J9m3PK4k5
5508a9M6j9k9M2pl0M8l2L3qLk3m1O9l4k9L9ql9N2k7K1J4j9J1j7M6n7J2L3l7J1
5540EQJ1rk8L4rJ8rj5j2j0L1j9J5LrjJj2KrL3pmkK3rm5M3jk7J1oj6%J5KL1m0l
5580a6Rj5L0%Lj6PnKK8l1j9OKkK0J4j6J1rj0nORk3J6qL2l7J9Mj8PKOj9%K7J3q
5620A6j7kJ7j1k5M0Mk5J1pj4NKJ2k6RPPMl3M5l4N2m0mL1l1K1m8L9J9k1qj6J6J
5656dj2J8Rl1N0j2k1oJ2k6J6j7J9J0MOk3jkNRJ0m0K0j7L1k0%LKKNj9K6pJ5j3L5
5694C6l6L3l4NjJ5j8J2j5JnK7k3k6J4K5k4j7J6L3J3k3j3K5j6nJ9k2Kj5J9nj7k
$$ plain form
5728 -22 13 -11 6 -13 -12 -17 3 12 9 20 3 -28 12 47 5 -25 2 -25 -21 -12 20 17 -24 -16 -2 14 16 -17 2 1 -10 -13 3 4 8 -15 -19
5765 -19 -3 -20 -13 0 5 12 5 8 -40 -17 5 -38 -30 -3 2 -18 3 -41 -7 -14 -22 -2 -7 -6 -10 2 -18 21 -7 6 13 17 3 -21 17 -13 11
5802 11 19 9 -16 -13 -22 15 7 1 42 17 -11 -13 7 1 3 16 5 7 -18 5 15 9 14 -25 -17 -13 -25 -2 -39 -26 -5 -5 -35 -12 5 35 2
5839 2 14 26 7 -23 -6 -19 -14 -29 18 -4 -5 -16 8 32 -15 3 -38 -10 -2 18 2 -17 -9 30 24 19 13 6 -17 -28 -24 -20 5 -19 -7 7
5875 7 14 2 7 6 20 11 22 -18 17 0 -4 4 -13 -9 -20 -20 -9 7 -7 0 -32 9 -12 -25 36 17 -10 -19 5 -9 1 -34 -1 23 7 18
5911 18 7 -2 -31 34 -3 -2 8 -26 -1 -10 -9 8 11 -13 33 -10 -37 -35 -25 6 2 32 0 14 5 -2 32 27 26 29 16 6 17 -3 3 -8 3
5948 3 1 -20 -21 -7 -3 14 -17 -32 -20 -14 -17 -22 12 -27 -10 25 -35 -30 -23 -23 -23 -9 12 10 -6 -21 10 -10 -18 23 -6 -15 0 31 -26 -1 43
5985 43 -23 5 -20 -29 16 13 10 11 0 -14 8 7 -4 -22 -5 20 3 -1 -18 -5 -11 -21 3 -55 -20 10 -22 1 18 0 19 12 -1 15
$$ packed form
5728b2L5k4J7j9JnK0RlJ1j7l1M0L5m2l0K7k7MRL2lm1QJ4J6Kl3J9jj1lJ6JMk3m
5765a9J6j7PJ3NPpLm8K3K2m3QK7Nk0K1m4L4pqK0nJmJ2k0L9k8J3PMj4k4L8l0K4
5802A1Qj0k5LrL7qoM1k5k8kK0oKJ3j1Kk5K3J0oNl9QMj2K3l7J3K1%l0K3J7L0l3
5839BJ2J2j9l0J7j3Nj5M7k2jj1K4K4m7J8m1K8QK0j6j9QL9onopk3j1MMK5k4J2J4
5875GPj2NjJ4rJ1m0L5j7mQj7Mj1%J1J6j4Pl2M1k1j3O1j9k7rK4j4J0l5L3K4j6J1
5911A8j1rk9O5l7JJ0l4K5rJJ7Lk4M6m3k7KJ0L1mL0l2J4rpL4njLj3j0J1k0Oj1J1
5948Ckk1jJ4MJ7l1j5J2OlnL4l9J7L5o0NP%%J4K1kj6j5L1k0qM1k9rJ5L1n7K5M4
5985D3o6K8k5rM5llJj1j4K2jj1j8J7K5j7mj7J3oj0K4n8L5L0l2K3J7j8J9pj3J6
$$ plain form
6019 15 -31 9 -12 -38 5 1 -27 -15 -38 7 -5 35 -6 -9 -27 23 -19 -23 7 12 -30 -5 -23 28 19 0 -20 -8 9 -4 35 -21 14
6052 14 25 9 -6 -6 -8 -24 -4 17 5 -23 -28 0 -3 2 -21 -29 15 14 3 3 6 19 2 0 12 -6 -11 9 7 -5 -5 -25 -28 4 -11 -26 8
6089 8 19 -36 -18 -17 8 0 0 -9 11 -34 4 -15 -20 -2 20 -6 14 12 13 12 -16 22 5 4 -20 -2 12 2 6 4 19 5 10 7 -27 10 -16
6126 -16 -7 14 -28 -7 -3 -6 40 10 1 -19 -16 1 -6 -21 -13 -1 -21 -12 -12 -14 -1 2 -17 -7 1 12 -9 25 22 -10 -3 1 21 -3 0 -17 -1 15
6164 15 -14 -2 15 -29 3 6 17 -19 -26 8 -4 23 -14 -17 21 -14 6 4 19 -15 5 1 -11 4 -18 14 -30 27 -8 -24 -21 -7 -13 -19
6198 -19 -10 18 16 -18 -23 10 -11 -21 -3 -29 5 2 5 0 11 12 14 -30 20 5 6 -17 -12 -6 -22 -10 -29 -7 -7 -12 10 -14 -12 -1 11 16 15 2
6236 2 15 10 5 -14 -12 0 20 -23 -27 -5 24 25 -8 -25 17 -20 -8 -2 -21 12 20 8 12 -18 -6 -22 15 -26 -19 7 -6 -30 21 9 7 -10
6272 -10 10 8 22 13 3 7 14 -1 8 -1 -11 -5 4 -5 -29 -3 -9 10 -32 15 34 -7 0 9 17 -17 19 -17 -2 0 -19 5 12 -7 6 -1 15 22 21
$$ packed form
6019A5m6M0k1k6M3mk8J2k3M5j2M0m1lj8N0m2mL0Nm2K5j8N1rj9k0J2J7j3L9n6L5
6052A4J1j6j5%kj6K0K1j2k8nK8lNk3qM4jj1%LJ3j7kJ2j8nK0kj2%k0lL2j5j5L4
6089HJ1n5J8JK5q%rK0m5L8j9nJ8K2k6K0kJjk8L8j7jk4J8J4j0MkJ5j4Nll4L7k6
6126a6RK1m2K1MlM6l0rk0LJ7pj5QJ2k0R%kJ3Lj9J0QJ1k1L4ll2PMK0k4Lj7J6J6
6164A5k9J2J7m4L2LJ1l6pL4j2K7l7lL8l5K0kJ5l4K0mj2J5k2L2m4N7l5j6LJ4oo
6198a9RK8kl4nL3k1j0J8k6L4lLnJ1JKm4N0j5Jk3NOj6J2j9K2%nK2k4KJ1J2Njj3
6236BJ3nnj9KJ2K0m3mK2K9Jl3j7M2l7J2Oj9L3Qj2Ml0J2j6L7m1PK6j3k4N1j2kj7
6272a0K0kJ4rj0MPj5Rrj0ORrk4K6oJ9m2M7J9m1PRQl4L6l6J5Kj9K4Pj9J3pJ6Pj
$$ plain form
6311 21 0 10 5 -34 27 44 -16 -17 -13 -18 -17 27 -16 -13 -19 -14 12 12 32 7 8 -11 2 -11 24 6 -2 -18 8 1 2 15 -22 6 -16 6 -4
6348 -4 3 -4 25 -9 -1 6 -3 -12 -7 3 0 -3 -15 -24 6 -13 -17 -26 -15 -14 6 4 -25 4 -19 -22 -19 7 -1 14 -6 -5 -29 -2 -3 -35 -13 6 -38 -9
6388 -9 4 8 -29 -10 0 -18 -21 -1 11 -5 9 17 -5 14 4 27 8 -5 7 29 5 -5 -15 7 9 16 25 21 13 7 20 -8 -15 -10 5 4 -30
6425 -30 -61 9 15 7 -36 -6 4 -12 -16 -30 3 -1 -3 4 -2 10 -9 -22 12 10 6 3 -10 8 4 21 28 -10 -12 -30 -8 -6 5 10 -35 23 -13 -3
6463 -3 -10 4 -24 -14 -2 -3 27 5 20 -2 12 20 8 4 -13 8 6 -22 10 -13 34 -7 -8 -19 -48 12 -14 -33 -6 -15 12 -12 19 3
6497 3 8 3 -11 8 3 16 -2 -7 -4 15 5 -30 -15 -16 -19 5 -3 8 18 -29 12 -14 8 10 5 -1 -3 -20 27 11 -10 -30 -21 -8 7 12 0 7
6535 7 12 17 18 -17 -13 -17 -18 11 21 4 -17 0 -3 -8 2 -5 19 25 -22 -10 12 16 5 15 5 -13 -1 -14 11 15 -41 3 9 -28 -26 8 10 28
6573 28 36 -31 8 -11 2 11 -3 13 -8 -22 -15 -26 -32 18 1 -18 -15 -1 -23 -16 -24 9 -16 17 -1 0 -10 0 -34 -17 -17 -18 -9 -15 -33 -39 8
$$ packed form
6311B1k1J0nl9O1J7o0jMnJM4m3LoNK6%K0k5Jj9J3j3L5j8qj6K6pJJ3l7K8k2K2j0
6348dPpK9l4QPrrNJ0llj2rL0j9mrJ1JK0kk9K9k3lLK6qJ5k0Jk4K7jl2K2J9m4K9
6388iJ3Ml7J9J0j8lK0J2j6J4Qk2J9j0K3j9j3J2K2k4j0j0K2KPRmqoJ3k8pNJ5jl4
6425c0l1P0Oqm3L0J0j6mj4L3mkPoJ2j9j3L4kmlj3J8mJ7Pl8kj8K2KJ1Nm5N8l6J0
6463cpJ4k8J0J2jL0k2J5k2J4Qj2mj7K1kk8L2k3M7m1jj1k9O0k6j9K7rK7k4L1j6
6497CNnj4J9nJ3j8nLJ9j0l5J5jlK4qJ1J0m7M1k6K2Knokj7M7j6k1k0RJ3J5Nj2P
6535GNNJl5MmjK9J0j7k1J7lnJ0pK4Om7J2K2Mj1J0j0j8J2j3K5Mn6M4Ol7KL4KJ8
6573B8Qo7L9j9J3Rj4J6k1j4Pj1oN0j7j9LJ4k2PqL3k5L3j8Jj0J0l4J7%jRoj8oM7
$$ plain form
6610 8 -2 8 -8 -2 -13 8 -7 3 6 -26 -4 -28 0 7 -21 2 -4 -4 -29 -30 -14 10 -7 40 -8 11 16 -4 11 0 -4 -12 24 -22 4
6645 4 12 11 -8 14 -35 -4 1 -2 2 -4 -17 -3 15 -22 -37 -3 -10 11 -6 3 19 -42 30 -10 -37 14 1 -23 -7 12 3 -8 -16 -2 10 18
6681 18 -18 -22 -2 -11 3 -16 -9 -26 -19 -19 -2 2 4 -5 7 -10 -15 0 4 -1 37 2 0 15 15 23 3 -33 9 -7 -4 6 4 29 2 5 2 -9 16
6720 16 -22 3 11 9 12 -25 0 3 5 -8 10 -9 9 15 -7 7 -3 -4 13 -5 -14 -15 27 6 -2 18 -6 -15 17 -10 23 3 -9 -21 0 -2
6756 -2 -23 0 1 -21 2 -13 -6 -21 -14 -17 1 6 -11 14 2 7 9 14 2 5 21 17 -11 31 2 2 -8 11 -4 18 2 -5 -20 -20 6 2 -22 8
6794 8 1 -26 9 -12 7 1 -1 -24 6 2 -6 -20 35 8 12 -20 11 10 -6 1 13 17 -8 -34 12 -18 -17 -7 -45 0 5 -19 13 18 24 0 -9 25
6832 25 4 19 -3 20 -9 12 -12 -2 0 -3 7 -17 13 5 -15 1 -6 -1 28 -8 -24 -14 4 -17 34 32 -12 -2 -39 -1 -9 -33 -2 -13
6866 -13 -9 -3 19 21 11 34 8 -5 -1 -35 2 -12 2 23 -4 -6 27 -11 11 -8 11 30 0 24 -18 9 -8 5 2 4 4 2 -1 -8 36 -9
$$ packed form
6610Hj0J0j6Oj1K1j5J0Ll2K2k4K8Pk8K3o%k5jJ6K4j7M7m8J9Nk0J5j1mqL6m6K6
6645DQjj9K2m9L1NlMoj3J4J8l7j5L4pK1j7RJ6o1P2m0k7N1j3k4J6J9rj1qJ4J2Q
6681A8l6mK0rJ4j9Pj7P%J7MKrJ2j7nJ5MnL8l5kJ5%Qk0l6M2j6LJ0kK5k7Llj1K5
6720A6l8K5QkLl7K5LKj3J8j9J8Ok2J4j0jJ7j8rjM2k1qK0k4rL2k7L3k0j2j2K1k
6756bk1K3Jk2K3j5Pj5PlJ8Nj7K5j2NKNj2LJ6mk8M2k9%j0J9j5K2j6pj5%K6mk4L0
6794Hpk7L5k1J9okk3L0mqj4N5k7Ml2L1jj6PJ2Mk5k6M6l0JJ0l8M5Nk4L2NOk4rL4
6832B5k1J5k2K3k9K1k4J0KlJ0k4L0qk0J6pNK9l6j6J0J8k1N1km4J0l7L8qk4L1j1
6866a3MOK2Kj0K3k6j3Ml4L7j4J4K1k7kL3l8K2j9J9J9l0K4m2K7j7J3lK%klpM4m5
$$ plain form
6902 -9 -1 -12 -22 2 12 5 -15 14 -15 -38 -5 5 -1 -11 10 -13 -14 -12 2 -4 -3 45 -2 21 5 -8 28 -23 -4 -24 17 27 9 -18
6936 -18 20 10 3 19 -20 -6 16 -19 -26 -8 6 9 5 -22 11 18 5 12 9 -1 12 14 -6 -15 11 -7 -13 -2 -25 -10 -25 -17 -17 -14 -22 -5 -17
6973 -17 -10 7 2 -31 -14 -5 -10 -24 0 4 -26 -6 -30 -3 -8 -10 8 -3 -1 -9 -5 -28 -5 -17 -12 8 -4 -6 33 -19 -5 20 -5 -4 -11 8 -1 16
7011 16 7 20 -16 1 10 -19 -20 22 12 -10 6 11 -5 -15 23 7 4 -9 1 1 -10 9 2 8 -19 6 7 6 3 -11 19 -18 24 35 3 -16
7047 -16 -1 2 8 -28 -28 -3 1 -10 7 -17 1 2 18 12 36 -11 3 2 -16 1 3 -9 15 22 29 18 32 -2 -8 15 -13 16 -9 -29 -5 12
7083 12 -11 21 -12 12 -3 -18 -1 -30 1 -19 7 8 -14 -21 -7 11 -8 18 -17 16 15 20 20 2 -19 -2 -7 13 -21 1 -3 8 8 13 -1
7118 -1 5 -9 26 -9 9 -1 23 33 -16 -5 -13 1 4 -5 5 -13 19 -14 8 10 13 -43 6 14 1 13 6 -9 -13 11 -24 -12 -10 -12 -4 -14 -33
7155 -33 -24 18 -45 21 -41 -15 -12 1 15 -4 -18 5 -25 -9 -9 5 19 1 15 -11 -23 -2 -13 23 0 -20 -21 3 -11 14 14 -4 16
$$ packed form
6902iQj1j0K4J0pk0K9k9k3L3J0oj0K1k3jKJ4oJM8m7K3j6j3L6n1J9k0M1J0j8k7
6936a8L8j0pJ6l9J4K2l5pJ8J4Lmk7L3Pj3Plj0J3Kk0rK6j8oJ1k3J5j5Q%LqJ7j2
6973a7PJ7nl3J7Rnj4K4Ml0K0k4K7nkJ8j1KqMk3K3j2NK0j2kL9n2J4K5k5JpJ9rJ7
7011A6rJ3l6J7Rk9jM2j0k2J6Nj6j0L8j6lj3J0%j1J9pOk7K5Jjlj4L0l7M2J1l2j9
7047a6J5LOl6%K5Mj1J7k4J8JJ6oK4m7J4jj8J7Kj2K4PPj1J4l4oK3k8K9k5k0K4J7
7083A2k3L2l3K4j5j5J7k9L1k0K6Jk2pJ4J8j9K6l5L3jN%j8k1J7nK0l4K2mJ1%Nj4
7118aOj4L5l5J8j0K4J0m9J1qJ4LrJ0j8L2l3K2KLn6M9Qj3J2pj5mK4l5J2KkQj0j9
7155c3RM2o3O6o2K6LJ3J4j9j4K3l0J6%J4J4j8J4k6j2K1j1L6k3k0jK4j4K5%j8K0
$$ plain form
7188 16 -25 9 12 7 -33 16 4 -11 -46 -14 26 9 -3 -6 2 -1 -11 -14 18 29 8 16 5 -12 18 3 2 -3 2 -28 -14 -1 -17 -27 21
7223 21 -16 -8 1 20 21 -3 4 -9 -13 -11 26 6 -2 29 -6 -8 -17 -9 19 7 -8 -1 7 16 -3 -4 11 -32 21 3 -5 1 -9 -7 17 3 -25 -21 6
7262 6 -35 2 12 -1 15 6 -3 5 -23 -35 -28 -10 1 -6 16 2 -14 4 -17 11 -19 -8 2 4 5 2 4 -5 8 2 11 -36 -7 -17 -10 12 19 -3
7300 -3 -14 10 -2 2 3 17 -5 21 12 23 23 13 -31 12 -1 -32 -6 33 22 10 -5 0 -11 -21 0 -18 -13 -20 3 -34 -16 13 14 6 7 -27
7336 -27 8 -3 6 13 38 39 8 4 -8 17 15 28 10 -23 12 0 -10 8 17 18 -36 16 12 11 17 -11 -8 -18 -13 11 21 -5 22 -1 -35 12
7372 12 28 0 -8 0 12 21 -14 4 8 -12 9 -1 -1 2 8 34 -1 19 -28 -29 -4 -2 -9 1 7 8 -17 6 -12 1 -59 -2 13 -22 -6 -7 -22
7409 -22 -3 44 -11 12 11 24 -10 12 28 8 -9 -13 -2 -3 -26 5 -8 -5 -9 9 9 7 1 5 -3 -9 -25 12 2 29 6 -16 7 -17 -3 12
7445 12 -6 -10 16 -27 -20 -19 -30 17 -1 -10 4 -44 -2 -4 -40 -23 -3 8 -5 -2 8 -31 -1 -1 2 7 39 17 7 17 28 -2 2 18 9 -14
$$ packed form
7188A6m1L4Lnm0M9j2j5l5L2M0j7j2lQlj0lL2J1k1Qj1j7L0j5jnNl0J4J3j6j0M8
7223B1l7QRJ9Jk4Pj3mKL7k0qL1l5krQK8j2j5PQRj9jJ5m3N3j8qOj0KK4j4k8MK7
7262Fm1L7J0j3J6rrQk8j2PJ8J1pK2j4j6J8k1K8l0J1J0KJlKrJ3oRm7K9j0PK2Pk2
7300cj1K4j2MJJ4k2K6rJ1%j0m4M3j3l1K6L9j1j2j5Nj1j0K1j8NpK3l7J8K9JqJl4
7336b7L5j1RPK5Jl1mj2K5kJ3j8l3L5j2j0J8RJn4N2mjOk8Lj0NK4J0k6K7k3l4M7
7372A2J6k8qQJ2Rl5J8Mk0K1j0%LOK6l5K0m7jK5KpJ0OJk5K3j8J3o0N7J5l5J6jj5
7409b2J9M7n5K3jJ3l4K2J6k0j7mJ1jk3L1j3LmJ8%koMqoj6L7j0K7k3k2K3k4J4J5
7445A2j8mK6m3PJj1M7j8rJ4m8M2kl6J7K0J1j3LJ0l9L0%LNL2k2j0J0J1l0MJ6rk3
$$ plain form
7481 -14 -10 13 0 -12 -19 0 -20 -19 -24 4 1 3 9 8 13 23 -10 -8 -14 16 6 -22 -12 -17 7 -14 -20 -12 4 25 -30 -13 9 5 -1 -25 18 -5
7519 -5 7 -14 9 -11 15 10 -25 13 16 -3 -5 34 -19 -20 20 9 35 4 4 -4 7 -16 -26 14 -12 -9 5 -3 25 -4 25 -16 -14 3 10 -33
7555 -33 -16 33 -3 19 -5 7 1 -30 -9 -14 -4 -12 -40 20 23 9 -11 -28 4 17 6 3 -3 12 -8 -4 -19 -16 -5 -19 27 -17 19 10 -24
7590 -24 4 3 -27 -6 -7 -5 -4 12 10 11 7 -9 -2 -8 21 -23 31 18 35 37 -2 8 -5 17 -20 18 15 2 -1 -26 -22 -14 -5 -11 2 25 7 6 21
7629 21 -6 -18 -25 5 2 10 40 -8 -15 -3 -22 -4 -12 1 2 -24 6 30 1 -15 11 3 25 2 -42 -9 7 -14 10 -25 -1 -11 -6 5
7663 5 7 24 9 6 23 7 9 9 2 -8 8 1 15 -11 -6 8 2 -4 -4 11 2 -4 -12 22 -5 -6 2 3 19 12 8 -36 -12 16 -4 -6 -3 11 16 14 16 -20
7705 -20 -6 -12 -6 -41 -12 2 16 -6 -8 30 -8 -3 0 0 -15 -18 -19 -13 -27 31 -1 2 13 8 -8 -28 -7 8 15 -20 -27 3 -12 2 -5 -16 -9 -28
7743 -28 -2 -19 10 -34 -9 3 -42 -21 -11 15 -9 -26 17 -14 3 3 14 5 -28 -4 -11 8 -6 -8 16 0 18 -5 -2 3 2 15 9 -48
$$ packed form
7481a4MK3j3j2pJ9k0JnK8lKOjNJ0l3KoL0j0k8J0nK4k1oQJ6K1n5J7K2mok4M3k3
7519eJ2k1K3k0K6nl5L8Lj9kL9n3jM0j1K6l1%qJ1k3j0M0k6LJ4qK8k9K9m1KJ7Pm3
7555c3J7M9l6K2k4J2ol1K1nJ0qk8O0Lj4k0j7L2J3j1loJ5k0Mj5LJ1j4M6m4L6rl4
7590b4K8jl0K1jKJJ6kJmj6PoK9m4N4j3J7Kl9J0j3K2l7L8lj3lk5MQRoJ3K3j8jJ5
7629B1k7j2pL0lQL0m8pJ2j9J8qJ3Jk6L0K4k9j6K6qK2k3m4L3J6k1K4l5K4j0NJ1
7663EKJ7j5lJ7j6K%pj0J6pJ4k6NJ4oo%J5roqL4k7jQJJ6pmm4K4K8k0kLJ4NkKl6
7705b0J4oOl5K9J4J4k2kL8l8NL%j5ljOj4N8l2LJ1nj6k0K1J5Pl5pL0j5J4pj1Pj9
7743b8K6j7K9m4K5J2m5K1J0K6k4j7M3l1J7%J1rl3K4pJ9j4kK4j6J8k3LNjJ3on7
$$ plain form
7777 -48 -16 -5 21 -12 -4 28 20 18 4 -19 -14 -23 9 -21 -17 -5 4 3 9 6 -17 0 -10 -40 13 -7 -21 -11 -11 -24 -19 5 -1 -5 -7 21 -9 -4
7815 -4 7 -25 2 -2 -2 -9 1 -7 3 21 -15 -19 -14 15 2 11 -12 -18 -1 13 2 14 18 -29 -24 -27 0 25 -37 1 18 12 -17 34 -1 -14 3
7852 3 16 7 20 31 -14 -9 2 1 -2 -1 27 22 6 0 -6 -4 5 -37 17 -12 -5 -14 25 7 20 5 -4 16 4 15 16 -3 -8 18 3 -36 -38 18 6
7891 6 23 21 0 3 39 5 4 -9 -24 -10 25 7 2 12 18 -1 5 -6 -13 13 21 -18 30 -6 9 -17 -21 13 9 3 -14 -20 -12 -6 -3 8 -5 -2 -5
7930 -5 24 2 2 -33 -11 15 9 2 -3 29 22 -20 -28 9 -27 -17 11 -2 13 6 -1 -23 18 -22 20 13 -6 -4 3 -13 -21 3 9 -17 27 7 24
7967 24 17 -13 10 12 28 7 -20 -17 23 13 37 9 -4 1 7 -2 -28 -10 29 -20 -20 -10 -26 18 -12 13 6 -9 1 -34 6 -30 -3 22
8001 22 35 11 -7 1 32 3 35 -16 -4 -11 16 5 -7 22 -24 -7 -7 4 20 -17 0 -5 17 23 9 -3 -20 10 20 -12 6 -3 -11 -1
8035 -1 13 -20 -4 -3 3 -5 2 4 -4 -28 -23 -7 14 21 -28 -14 -18 -26 17 28 -16 -24 -8 -37 -1 -18 -14 -16 1 -4 -3 -12 17 17 8 25 5 20 -10 -22
$$ packed form
7777d8L2J1K6l3QL2qkj4k3NrL2l0MJ2RjOlk3J7j0l0N3k0j4J0%j3NK4omkK8l0N
7815dJ1l2K7m%pJ0qJ0J8l6mNK9j3Rk3oJ7J4j1J2Mm7NlK7K5o2L8J7ok9N1l5j3J7
7852CJ3rJ3J1m5NJ1jlJK8nj6ooKRm2N4k9PrL9j8J3j5rK0j2J1Jj9nK6j5l9kN6j2
7891FJ7kk1LL6l4jj3j5J4L5j8nJ0Oj9Oj1pK6Ql9M8l6J5k6mL4moj7oQOLJ1j3Ll
7930eK9k2%l5K2K6opnL2pm2qL7l6J0K8j3J5ppk2M1m0M2pj9KPj6qK4Ok6M4k0J7
7967B4pl0K3KJ6k1k7LM0j0K4k8j3NOrk6J8L9m9%J0j6M4l0K5pj5J0l5M0l6K7K5
8001B2J3k4j8QL1k9L2n1J2pK7j1j2K9m6J7%J1J6l7J7nK2Oj4j2j7L0J0l2J8rqJ0
8035aJ4l3J6JOqPKqk4NJ6K1Pm9J4mqM3J1m4qJ6k9L6j7MkJ7nJrK9%rJ7k0J5l0j2
$$ plain form
8075 -22 -15 -21 -4 -16 -3 12 -32 -21 -2 -15 -19 -4 -27 1 -1 12 -2 32 15 -10 -4 -5 -4 -13 14 -5 9 14 -30 -33 -25 -20 -24 14 6 -13 -4 3
8113 3 21 0 8 6 -1 -3 -19 -37 -28 -28 8 21 -7 -37 -12 -6 7 14 26 17 19 14 22 1 11 -8 4 -15 1 3 -15 37 -18 5 18 8 0 1
8151 1 23 -9 23 -16 10 7 -13 -4 -8 -11 -10 -17 -3 3 -9 -16 3 -7 -6 18 -24 -10 6 -17 -21 -4 1 -33 -11 -21 -10 -9 -14 8 -29 -11 9
8188 9 18 -12 0
$$ packed form
8075b2PoJ7j2J3J5m4J1J9j3mJ5k3K8kJ3j4L4j7k5OjJrK7j9J4Nm4lQNmL8qj9RP
8113CJ8k1Qkpkj6j8R%L6J3k8l0K5OJ3PJ2rKnQk1J0j9J2j9J6Kj8N2n5K3J3j0qJ
8151AK2l2L2l9K6lk0RmlJpJ4Oj2pJ9j0JK4m2J4J6k3mJ7Nl4K2j0J1JnK2l7J8K0
8188IRl0J2
8191@
$$ Imaginary data points
##PAGE= N=2
##DATA TABLE= (X++(I..I)), XYDATA
$$ plain form
0 0 0 0 0 0 0 0 0 0 0 0 0 0 0 0 0 -8 8 -8 8 -8 8 -9 16 -16 16 -24 24 -24 32 -32 40 -46 48 -56 64 -71 78 -86
38 -86 96 -104 118 -128 143 -158 175 -193 214 -239 269 -302 338 -383 439 -510 602 -725 903 -1181
58 -1181 1689 -2916 12535 2308 -19600 2040 7625 -5416 -7869 9086 10055 1238 442 2608
72 2608 -5239 -4762 3989 1302 -10127 -3422 10032 4058 -10129 -6039 2567 -2766 -8364 -1392 1440
87 1440 -4435 -3252 3117 -2422 -10401 -3950 4455 -1563 -8000 -1537 4407 22 -3425 -1348 -1330 -1815
103 -1815 1942 2115 -3033 -933 7437 5368 -4602 -3546 5624 5144 -1308 590 5528 3691 1686 3856
119 3856 2284 -1427 2479 7269 1903 -3204 3551 9169 2081 -3999 814 4375 374 -662 2845
134 2845 1646 -1378 1517 2958 -2783 -4666 1785 3072 -3757 -4463 2455 2722 -3772 -4383 -529 -1398
$$ packed form
0@%%%%%%%%%%%%%%%qJ6j6J6j6J6j7K5l2L2m0M8m8N6o4P2q6R4j04J20j35J49j64
38h6J82k00K22k46K71l01L33l68M07m53N08n71O40p21Q22r49J112j327J628k084
58a181K870m605J5451j0227k1908K1640N585j3041k453J6955R69q817p96K166
72B608p847M77Q751k687j1429O705J3454n974j4187M090Q606n333n598O972K832
87A440n875J183O369n539p979O451Q405o018o437O463N944m385l447K077J8m85
103a815L757J73n148K100Q370k069r970J056R170m80o452J898M938j837k005K170
119C856j572l711L906M790n366n107O755N618p088o080M813L561m001j036L507
134B845j199l024K895J441n741j883O451J287o829p06O918K67o494o11L854q69
$$ plain form
150 -1398 -3455 -794 316 -3154 -3141 1115 -56 -4968 -3675 1125 39 -3438 -1381 1482 -275 -1694
166 -1694 145 -178 -2435 -454 3041 1342 -1557 871 3570 918 -1532 926 3138 1758 1154 2347
182 2347 1859 1170 2913 3392 345 -769 2595 4049 1271 66 2400 3155 807 -392 320 734 1144
199 1144 1764 633 -1249 -292 1657 177 -2585 -1654 770 -47 -2035 -1483 -283 -737 -1438 -1557 -2411
216 -2411 -2745 -885 361 -1487 -3001 -1252 246 -1411 -3075 -1921 -295 -186 -621 -878 -1086 -446 586
233 586 -108 -1747 -1009 1448 1570 -284 -349 1424 1768 523 -219 224 1101 2200 2197 737 203 1852 2590
252 2590 674 -593 1070 2618 1798 655 832 1137 1043 1080 357 -689 40 1902 1378 -897 -798 1158
270 1158 668 -1658 -1797 -128 229 -401 -452 -777 -1572 -1102 -217 -1358 -2767 -1306 701 -388 -2313 -1623
$$ packed form
150a398k057K661J110l470J3M256j171m912J293M800j086l477K057K863j757j419
166a694J839l23k257J981L495j699k899K428K699k652k450K458K212j380o04J193
182B347m88o89J743M79l047j114L364J454k778j205K334P55k348j199P12M14M10
199A144O20j131j882R57J949j480k762R31K424q17j988N52J200m54p01j19q54
216b411l34J860J246j848j514J749J498j657j664J154J626J09m35k57k08O40J032
233E86o94j639P38K457J22j854o5J773L44j245p42M43Q77J099lj460n34J649P38
252B590j916j267J663J548q20j143J77L05r4L7p23j046P29J862n24k275R9J956
270A158m90k326j39J669L57o30n1l25p95M70Q85j141j409J461K007j089j925O90
$$ plain form
288 -1623 -125 -731 -1871 -1585 -956 -788 -110 219 -910 -1447 -90 495 -1043 -1551 454 1734 602
305 602 -434 144 691 557 474 291 208 1017 2096 1459 33 257 1560 1335 -14 86 1261 1738 1270
324 1270 707 223 159 613 612 -250 -315 887 1324 31 -954 -444 84 -352 -814 -776 -554 -104 159 -576 -1650
345 -1650 -1370 -253 -635 -1742 -1410 -27 57 -930 -1368 -1080 -983 -871 -618 -858 -888 -47 508 -480 -1459 -662
365 -662 426 22 -835 -318 760 797 204 -109 -71 123 512 561 147 279 1191 1432 417 -268 305 1024
385 1024 836 283 369 929 1134 657 52 -89 386 651 282 -84 112 652 597 -120 -689 -548 0 54 -466
406 -466 -690 -187 230 -275 -1143 -1112 -470 -318 -704 -845 -579 -413 -441 -625 -987 -1026 -547 -158 -483 -853 -427
427 -427 264 69 -778 -858 -113 265 0 -289 4 446 484 131 -164 5 449 714 429 132 370 864 758
$$ packed form
288a623J498o06j140K86O29J68O78L29j129n37J357N85j538n08K005J280j132
305F02j036N78N47j34q3j83q3Q09J079o37j426K24J303k25j349J00J175M77m68
324A270n63m84o4M54jq62o5J202M37j293r85N10N28m36m62L8K22M50K63p35j074
345a650K80J117l82j107L32J383Q4r87m38K88R7J12K53k40l0Q41N55r88r79P97
365f62J088m04q57N17J078L7n93l13L8J94L89M9m14J32R12K41j015o85N73P19
385A024j88n53Q6N60K05m77o05j41M75K65l69l66J96N40n5p17n69J41N48N4n20
406d66k24N03M17n05q68L1O42J52l86j41K66J66k8j84l62l9M79L89l25l70M26
427d27O91j95q47q0P45L78k65k89K93M42L8l53k95J69M44K65k85k97K38M94j06
$$ plain form
448 758 138 -103 461 877 501 62 293 740 625 114 -139 29 233 270 103 -101 -92 155 134 -317 -676 -354
470 -354 43 -128 -566 -568 -227 -135 -471 -768 -737 -472 -235 -373 -695 -657 -210 -156 -627 -869 -463 -49 -186 -510
492 -510 -443 -88 100 -153 -402 -309 59 241 48 -115 74 320 327 111 15 187 438 567 337 136 349 685
514 685 529 92 94 488 608 344 180 324 386 377 260 0 -79 232 460 33 -316 -18 323 -62 -475 -310
536 -310 -28 -96 -274 -318 -365 -393 -234 -230 -593 -704 -250 -71 -486 -665 -291 -148 -390 -526 -433 -256 -199 -90 -182
559 -182 -407 -261 166 88 -347 -274 259 362 -8 -93 172 342 238 91 76 225 453 441 193 58 325 541
581 541 333 40 153 407 432 312 73 61 279 354 76 -133 84 372 160 -141 -134 56 22 -93 -160 -283 -189
604 -189 59 22 -384 -460 -48 51 -348 -490 -215 41 -170 -371 -296 -286 -154 -70 -175 -417 -196 194 36 -440
$$ packed form
448G58o20k41N64M16l76m39K31M47j15n11k53J68K04L7j67k04RK47k1m51l59L22
470c54L97j71m38kL41R2l36k97L1K65K37j38l22L8M47N4m71k42M06M14j37l24
492e10O7L55J88k53k49R3L68J82j93j63J89K46Pk16r6J72K51J29k30k01K13L36
514F85j56m37KL94J20k64j64J44O2rj17k60p9L11K28m27l49K98L41l85m13J65
536c10K82o8j78m4m7k8J59Ml63j11M54J79m15j79L74J43k42j36R3J77N7J09r2
559a82k25J46M27p8m35P3N33J03l70q5K65J70j04j47j5J49K28j2k48j35K67K16
581E41k08k93J13K54K5j20k39j2K18P5k78k09K17K88k12l01PJ90l4j15o7j23R4
604a89K48l7m06p6M12R9l99j42K75K56k11k01P5J0J32Q4j05k42K21L90j58m76
$$ plain form
626 -440 -244 246 122 -247 -173 147 185 88 83 40 -15 175 379 134 -30 252 479 195 -53 195 414 306 126
649 126 143 202 229 316 236 -5 4 255 224 -12 -81 100 171 -11 -138 -152 -28 44 -77 -249 -229 -63 -50 -240 -352
674 -352 -194 -106 -204 -289 -251 -244 -118 -67 -247 -360 -196 48 -108 -270 -77 78 -76 -180 -31 70 15 49 133 30
698 30 -38 172 281 52 -34 186 271 144 136 238 235 139 239 250 104 102 348 285 -23 47 325 251 -41 -4 189 135
724 135 2 141 89 -131 -23 171 49 -222 -64 143 -65 -326 -104 140 -74 -265 -167 -97 -184 -170 -25 -116
746 -116 -309 -206 -9 -163 -308 -82 63 -135 -245 -58 27 -55 -78 32 -8 -116 21 132 125 -39 48 174 86
769 86 0 128 294 283 79 21 140 224 163 129 181 201 143 93 121 152 126 138 130 22 2 126 183 41 -101 -59 26
796 26 -34 -98 -30 46 -66 -171 -128 -88 -135 -102 -14 -109 -254 -150 -52 -146 -252 -168 -36 -142 -199 -68 11 -89 -175 -81
$$ packed form
626d40J96M90j24l69P4L20L8r7nm3n5J90K04k45j64K82K27k84k48K48K19j08j80
649A26J7N9K7Q7q0k41RK51l1k36o9J81P1j82j27j4J24P2j21j72K0J66J3j90j12
674c52J58Q8r8q5L8PJ26N1j80j13J64K44j56j62J93J55j54j04J49J01n5L4Q4j03
698C0o8K10J09k29q6K20Q5j27qJ02lr6J00J1j46kK46o3l08P0K78p4k92L7J93n4
724A35j33J39n2k20J08J94j22k71J58K07k08k61K22K44k14j91R8P0q7J4J45r1
746a16j93J03J97j54j45K26J45j98j10J87Q5q2k3J10m0j08J37J11pj64Q7J26q8
769H6q6J28J66j1k04n8J19Q4o1l4N2K0n8n0K8L1k6J2qj08k0J24N7j42j42M2Q5
796B6o0o4O8P6j12j05M3M0m7L3Q8r5j45J04R8r4j06Q4J32j06n7J31P9j00q6R4
$$ plain form
822 -81 -47 -129 -34 99 40 -55 19 104 30 -14 44 140 93 103 167 139 43 122 190 80 44 186 313 144 22 153 251
849 251 60 1 118 159 65 113 162 58 19 58 35 -83 -25 139 108 -67 -95 -17 -45 -144 -75 -18 -132 -190 -72 -36
875 -36 -134 -189 -132 -121 -206 -174 -63 -52 -97 -128 -133 -123 -152 -94 -24 -44 -36 2 20 -19 -54 45 85 3 -11 103 187 144 99 86 99
906 99 72 41 68 169 213 181 129 122 32 66 118 140 52 25 111 88 -3 -2 67 -13 -68 -22 37 5 -46 7 -39 -179 -138 -66 -59
937 -59 -117 -89 -29 -98 -147 -130 -121 -157 -143 -24 -73 -140 -105 -15 -46 -103 -54 -18 -30 -80 22 54 40 41 -11 -13 0 81 132 54 27
968 27 72 160 62 39 96 156 71 89 120 142 179 112 98 63 92 86 87 65 47 31 28 43 -15 -25 -31 7 22 -44 -45 -37 -93 -125 -69 -86
1002 -86 -96 -120 -104 -104 -123 -100 -53 -159 -225 -131 -57 -94 -123 -63 -65 -104 -101 -62 -46 -64 -19 5 -23 -19 73 58 -39 20 69 103 65 63
1034 63 140 124 57 89 112 66 53 116 166 109 76 124 91 26 28 91 78 61 60 56 29 42 19 -9 -57 -25 -4 -19 -25 -54 -31 -79
$$ packed form
822h1L4q2R5J33n9r5P4Q5p4m4N8R6m7J0O4k8r6P9O8j10l6J42J27j69j22J31R8
849B51j91n9J17M1r4M8M9j04l9L9k3j18N8J64l1j75k8P8k8r9O9N7j14n8J18L6
875c6r8n5N7J1q5L2J11J1m5l1nJ0k9N8P0k0QL8J8l9l5R9M0q2j4J14Q4m3m5j3J3
906I9k7l1K7J01M4l2n2pr0L4N2K2q8k7Q6k3r1JO9q0n5M6N9l2n1N3m6j40M1P2P
937e9n8K8O0o9m9J7Rl6J4J19m9o7L5R0l1n7M9L6j2n0J02L2j4Jn2kJ3Q1N1p8k7
968B7M5Q8r8k3N7O0q5J8L1K2L7o7j4l5K9oJk2j8j6lJ5n8j0oL8J5o6jQn6l2N6j7
1002h6j0k4J6%j9K3M7j06o6R4P4l7k9O0kl9LL9J6j8M5K4k8MR2j5r7N9M9L4l8k
1034F3P7j6o7L2K3m6j3O3N0n7l3M8l3o5KO3j3j7jmk7J3k3k8m8L2K1j5ok9K3m8
$$ plain form
1066 -79 -63 -129 -102 -70 -55 -53 -91 -100 -101 -82 -102 -111 -59 -43 -33 -36 -77 -66 -54 -53 -62 -55 -4 28 25 -2 -39 8 2 5 59 105 70 109 67 40
1102 40 41 49 79 60 72 112 101 93 42 86 69 39 64 44 28 46 57 49 -22 -20 -30 -16 -4 -50 -16 -13 -13 -77 -90 -96 -86 -105 -58 -110
1136 -110 -81 -35 -67 -114 -131 -113 -95 -33 -65 -32 5 -33 -34 -94 -58 -20 -13 -3 1 49 20 -7 11 3 6 10 56 77 70 80 68 78 14
1169 14 29 76 104 74 114 64 63 73 21 22 47 51 26 40 70 24 -3 35 -9 -22 -36 -6 33 -39 -27 -16 -28 -50 -51 -67 -35 -4
1201 -4 -38 -34 -85 -72 -51 -118 -63 -76 -46 -29 -48 -58 -21 -36 -15 -48 -30 -13 4 22 -11 -23 22 5 9 16 10 52 48 59 62 54 72 54
1235 54 74 53 3 57 94 16 14 67 77 35 -16 8 23 33 19 17 26 14 33 -10 -28 23 23 -14 -23 -16 -56 -49 -18 3 -58 -58 -4 -33
1269 -33 -52 -74 13 -77 -82 -63 -53 -46 -22 -25 -15 -80 -30 -7 -1 -71 8 19 -17 3 45 33 9 -8 26 21 -13 62 78 26 -1 48 52
1302 52 -7 8 44 74 19 29 46 38 14 31 38 -26 13 66 48 -29 12 -12 22 -32 -43 -36 1 6 2 -36 -24 -24 6 -36 -71 -13 0
$$ packed form
1066g9J6o6K7L2J5Kl8rjJ9k0rN2J6J0lm1J1J2JrPN1L2lk7l7M7oLN4M6l5L9m2k7
1102D0JQL0j9J2M0j1qn1M4j7l0K5k0j6J8J1qp1Kj0J4J2m6L4L%o4j3oJ0j9M7n2
1136a10K9M6l2m7j7J8J8O2l2L3L7l8jo0L6L8PJ0MM8k9k7J8qLMM6K1pJ0j2J0o4
1169A4J5M7K8l0M0n0jJ0n2JK5Mk5J4L0m6k7L8m4j3j4L0L9p2J2J1j2k2jj6L2L1
1201dl4Mn1J3K1o7N5j3L0J7j9j0L7j5K1l3J8J7J7J8l3j2M5j7MPoM2mJ1LqJ8j8
1235E4K0k1n0N4L7p8kN3J0m2n1K4J5J0j4kRj2J9m3j8N1%l7rPm0PL1K1o1%N4k9
1269c3j9k2Q7r0nJ9J0PK4lJ0o5N0K3Op0P9J1l6K0M2j2k4j7L4nl4P5J6n2k7M9M
1302E2n9J5L6L0n5J0J7qk4J7Po4L9N3j8p7M1k4L4n4j1PL7Nml8J2%L0m2l5N8J3
$$ plain form
1335 0 -39 -61 -23 -49 -45 -50 -29 -50 -21 6 -26 -53 -67 -26 4 -19 -22 20 5 33 2 -8 -24 13 14 19 4 37 69 22 14 11 43 19
1369 19 34 77 19 24 59 41 -9 39 38 51 -7 18 45 23 -1 2 11 5 -9 36 0 -63 -22 38 -23 -54 1 -7 -14 -50 -9 -8 -65 -34
1403 -34 16 -11 -51 -50 4 -8 -18 -21 -12 -7 -63 -35 2 -30 6 -16 -9 -14 -31 13 -3 -21 23 59 -29 2 38 76 17 -6 24 16 11 30
1437 30 19 30 30 3 24 18 26 18 47 21 10 36 34 8 8 30 18 -6 -24 21 -21 -1 -23 -10 1 -50 -18 -4 -28 -16 -21 -8 -40 -66
1471 -66 -41 -13 -18 1 -58 -46 -51 -34 -24 -40 -36 -38 0 -8 -62 -12 -10 -11 -5 5 15 15 8 19 15 12 11 38 33 -8 -14 16 35 9 2 39 51 -14
1509 -14 26 43 25 12 -8 34 -20 6 11 39 -10 -24 -1 35 -31 -35 -8 -17 -51 -32 -5 -24 -27 -17 -5 -56 -11 14 -21 -43 -39 -46 -10
1542 -10 -49 -31 -16 -29 -34 -1 -39 -16 -18 13 12 -26 -3 -14 4 -23 9 0 29 -12 8 11 -1 5 11 -3 5 66 28 44 36 20 7 38 10
1577 10 13 8 20 14 -5 -16 -6 -7 23 6 5 -7 -39 -41 -22 1 -20 -20 -22 -61 -15 -15 -7 -39 -41 -3 -12 -15 -35 -20 -53 -19 12 -30 -46 -9 -15
$$ packed form
1335@l9k2L8k6MnK1k1K9K7l2k7j4M1L0k3lM2j5K8l1j0j6L7JNj5L3L2m7qlL2k4
1369A9J5M3n8NL5j8n0M8jJ3n8K5K7k2k4LRoj4M5l6o3M1O0o1l1N5qpl6M1Jn7L1
1403c4N0k7m0JN4j2j0lRNn6K8L7l2L6k2Pnj7M4j6j8M4L6q8L1L6L8n9k3L0qnJ9
1437C0j1J1%k7K1oQqK9k6j1K6kk6%K2j2k4j8M5m2K0k2J3J1n1L2J4k4J2nJ3l2k6
1471f6K5K8nJ9n9J2nJ7J0j6MkL8qn4N0KjOJ0J0%pJ1mljK7nm1oL0J9k6pL7J2o5
1509a4M0J7j8j3k0M2n4K6NK8m9j4K3L6o6mK7rl4J9K7j9lJ0J2n1M5K5l5k2MpL6
1542a0l9J8J5j3nL3l8K3kL1jl8K3j1J8k7L2rK9m1K0Lj2OOj4QO1l8J6qj6j3L1k8
1577A0LnJ2oj9j1J0jL0j7jj2l2kJ9K3k1%kl9M6%Ql2kL8rlk0J5l3L4L1m2j6L7o
$$ plain form
1614 -15 -9 -26 -10 6 -1 -54 5 19 6 10 8 -9 11 15 12 32 7 0 28 4 3 10 38 48 44 2 17 2 23 45 2 -1 -9 14 6 -2 2 -31
1652 -31 5 -15 -16 -35 -11 -11 2 -28 1 -2 0 -21 -44 -6 -22 -6 -38 -21 -39 -11 -22 -20 -19 0 -8 -14 15 -28 -7 -13 47 -8 -1 29 -16
1687 -16 -3 -11 10 10 53 30 -2 11 44 48 0 7 9 46 11 22 21 19 15 -8 0 -2 8 -26 24 -10 -8 -4 3 1 -15 -28 -19 -32 -20 -13 13 -30
1725 -30 0 -18 -11 -10 -14 -1 -52 -16 -2 1 -22 -8 -23 -24 -14 -6 -5 -4 -15 13 -10 -15 -1 23 -5 0 8 11 5 31 -4 30 28 44 30 38 11 41
1763 41 19 -3 17 -2 26 12 5 -5 29 9 24 -7 -18 -13 -4 14 4 -25 -11 -30 -45 -38 -16 -44 -22 23 4 20 0 -32 -25 -29 -23 -16
1797 -16 -40 -18 -8 -25 3 4 3 -11 -15 -13 12 -15 -9 -22 -3 -23 -30 17 12 31 -6 37 -1 18 59 -2 32 -21 47 42 21 22 2 5 7 -15
1833 -15 21 -3 23 31 42 -10 4 24 -2 -7 8 -20 7 5 13 -7 -26 -9 -20 -20 -9 -27 -14 -31 -23 3 7 -5 -16 -11 27 20 1 -48 -24
1868 -24 8 45 18 14 27 -20 23 -6 21 40 -8 32 1 43 28 47 -5 -11 26 29 24 4 -14 2 46 9 -35 4 14 31 0 2 -6
$$ packed form
1614a5Oj7J6J6pn3N9J4j3Mkj7K0MlK0k5pK8k4jPK8J0mm2J5j5K1K2m3lqK3qqMl3
1652c1L6k0jj9K4%J3l0K9lKk1k3L8j6J6l2J7j8K8j1KJJ9qoK9m3K1oO0n5PL0m5
1687a6J3qK1%M3k3l2J3L3Mm8PKL7l5J1jkmk3QkJ0l4N0l4KMPkj6j3Rj3J2PK6m3
1725c0L0j8PJmJ3n1L6J4Lk3J4j5jJ0QJJj1K8k3nJ4K4k8NQLoK6l5L4kJ6j4Qk7L0
1763D1k2k2K0j9K8j4pj0L4k0J5l1j1NRJ8j0k9J4j9j5PK2k8K2M5j9J6k0l2PmOP
1797a6k4K2J0j7K8Jjj4mKK5k7Oj3J9k0pM7nJ9l7M3l8J9M1o1L4n3O8nk1Jk0LKk2
1833a5L6k4K6QJ1n2J4K0k6nJ5k8K7kQk0j9J7j1%J1j8J3j7QK6Mj2j1NL8pj9m9K4
1868b4L2L7k7mJ3m7M3k9K7J9m8M0l1M2j5J9n2oL7Lnk0j8J6M4l7m4L9J0J7l1Kq
$$ plain form
1901 -6 20 -13 24 -24 -14 3 15 -13 1 17 7 3 -5 -18 -10 -38 -9 -17 -16 -29 40 8 -25 -45 -23 -11 -10 -6 -1 -8 27 -6 -4 8 18 6
1937 6 29 -18 35 39 19 28 -6 4 -17 5 13 -5 -6 40 7 30 -13 -5 19 29 6 3 7 -9 3 17 0 -38 0 33 1 -4 -20 -7 -32
1972 -32 -8 9 -8 -20 -36 15 -2 -22 8 31 21 7 -7 1 -20 27 -3 14 -5 9 16 5 -17 2 5 37 7 20 -8 -1 19 6
2004 6 12 38 -3 11 4 1 25 0 -16 -15 -6 -12 -19 18 -21 -30 -6 -6 4 5 -8 10 16 17 -19 -7 -12 -39 -3 -13 -16 -5 14 3 -2 -12 8 -10
2042 -10 9 -8 10 5 -11 6 8 -7 10 20 13 20 26 -6 -2 14 -1 -2 33 19 0 9 32 0 13 1 -6 22 6 29 17 5 -7 -1 -1 -2
2078 -2 -11 -1 25 -11 -12 21 -5 1 -7 -8 5 -12 15 -26 -12 -10 14 -26 -17 -10 -19 -20 1 14 -12 -11 12 -9 -9 13 10 3 -15 23 -2 -35 -35 -6
2116 -6 -7 10 16 18 34 18 10 -3 -21 13 9 -7 -14 2 4 7 17 -3 5 10 -4 -12 -33 -9 -26 -28 -16 4 -29 5 23 5 6 -7 3 0 -25 -19
2154 -19 -26 22 -6 -2 -32 4 -3 -7 14 5 -1 9 47 -12 19 22 15 1 -2 17 12 50 -4 -9 -7 17 4 4 19 -9 10 -15 -6 6 37 -8 20
$$ packed form
1901fK6l3L7m8J0J7J2k8J4J6j0mqj3Qk8K9qJj3O9l2l3k0K2J2JMNpL5l3KJ2J0j2
1937FK3m7N3Mk0Rl4J0k1K2Qj8jM6l3K3m3QK4J0k3lMj6J2J4j7l8L8L3l2nj6J3k5
1972c2K4J7j7j2j6N1j7k0L0K3j0j4j4Qk1M7l0J7j9J4Pj1k2J9LL2l0J3k8PK0j3
2004FOK6m1J4plK4k5j6JRopL7l9rK4%J0Jj3J8OJl6J2nk7L6j0lJ1J9j1nj0K0j8
2042a0J9j7J8nj6J7Kj5J7J0pPOl2MJ6j5jL5j4j9RK3l2J3j2pK8j6K3j2j2j2O%j
2078brJ0K6l6jL3k6OqjJ3j7K7m1J4KK4m0RPrjK1J3k6JK3k1%K2lpj8L8k5l3%K9
2116fjJ7OKJ6j6qj3j8L4mj6pJ6KLJ0k0QNj4qk1K4j7kJ2K0l3L4J8j8Jj3J0lk5O
2154a9pM8k8Ml0L6pmK1roJ0L8n9L1Lpj4lJ9nL8n4nKK4j3%J5k8J9k5RJ2L1m5K8
$$ plain form
2191 20 -1 -20 11 -16 0 -34 17 1 12 -23 -31 -6 0 16 7 11 -26 4 8 -13 -14 -2 20 8 1 13 8 25 5 0 1 11 5 -37 16 -1
2227 -1 17 9 24 15 -2 5 33 5 25 10 15 3 -20 -15 4 13 11 -23 -5 10 5 -22 17 5 6 3 -7 -30 17 9 -2 17 -1 -11 -1 7 -11
2264 -11 33 -3 -15 -26 -25 40 13 -24 -56 -18 6 -23 -18 -11 14 -8 19 -15 34 2 -22 -10 13 13 5 24 11 -7 15 -3 45 29 -7
2297 -7 -7 -10 17 15 -1 21 1 0 4 -14 3 -10 -15 -19 1 34 12 -9 -40 -16 15 -18 -29 -19 2 -2 -17 0 -15 13 6 -9 -15 -36 23 -34
2333 -34 -28 -9 12 -2 -5 -13 -18 5 21 4 13 12 14 30 42 45 -5 4 24 60 10 14 3 5 7 14 -22 13 23 16 10 14 -10 -4 42 7 12 8 5 12 -16
2374 -16 8 -17 -9 -13 -15 -47 2 -5 -24 5 -38 8 -18 -31 -15 6 -25 -24 13 0 -29 24 -17 -8 -6 -17 26 -12 11 -2 -28 14 -10 34
2408 34 -24 10 2 2 1 34 -1 21 21 0 36 5 -17 37 33 16 -5 15 21 12 -9 23 25 5 0 -13 -14 14 -11 6 -31 -21 -22 -32 -14 -2
2444 -2 -6 32 -33 13 -12 16 -24 1 12 -36 16 -4 -12 -15 3 4 8 -5 6 -5 -7 1 9 -27 1 33 6 1 -10 24 1 0 28 6 4 -6
$$ packed form
2191B0k1j9L1k7J6l4N1j6J1l5qK5OJ6rMl7L0Mk1jJ2K2j2pJ2nJ7k0nJJ0om2N3j7
2227aJ8qJ5rj7PK8k8K0j5Nj2k3NJ9Rkl4J8J5nk7L9j2Jlj0k3M7qj1J9j8j0J0Qj8
2264a1M4l6j2j1JO5k7l7l2L8K4k9NPK5k2K7l4M9l2k4J2K3%qJ9j3j8K2j8M8j6l6
2297g%lK7kj6K2k0jMj8J7j3nmK0L3k2k1l1K4L1l3j1J0K1mj5J7j5K8pj5ok1N9n7
2333c4OJ9K1j4lqnK3J6j7RjKJ6J2Ln0RK0L6n0Mj1KKPl6L5J0poMk4OM6l5NmlPk8
2374a6K4k5Qmkl2M9pj9K9m3M6k6j3J6K1l1JL7j3k9N3m1RKj1M3l8K3j3k6M2k4M4
2408C4n8L4q%jL3l5K2%k1L6l1k2N4mj7k1K0Ork1L2Kk0nj3jK8k5J7l7J0jj0J8J2
2444bmL8o5M6k5K8m0K5J1m8N2k0qlJ8JMj3J1j1kQQl6K8L2k7nj1L4k3jK8k2kj0
$$ plain form
2480 -6 33 -11 20 -14 6 23 -23 -6 16 36 17 22 -6 -4 -10 4 9 11 8 -26 -25 -6 1 -19 14 -16 -6 -25 -31 -23 -30 -14 -35 -32 -22 -28 -3
2517 -3 22 -4 8 11 10 -16 -16 -2 -8 22 9 -13 -1 28 -3 28 15 8 24 -24 28 8 -2 -3 45 11 23 17 45 -9 -6 1 44 18 35
2552 35 1 13 -4 -31 22 24 17 -20 -4 12 -12 1 10 9 1 -22 -16 1 1 -3 -6 -29 -6 -40 -17 -3 -2 21 1 -5 -7 8 8 7 -9 12 12 14
2590 14 12 8 1 24 13 -8 13 21 -13 -10 13 11 -2 -7 20 19 5 -11 -7 -12 7 -19 0 -11 -8 16 -2 4 -4 0 -15 -17 -6 -4 -22 -3 -9 19 -22
2629 -22 -13 -17 -18 -17 -16 -30 -4 -21 5 5 -20 -18 -22 42 4 10 11 -1 12 38 7 12 32 -10 31 14 17 7 28 -1 14 -2 10 -4 -1 -17 -8
2666 -8 -8 -17 -44 23 -60 -6 -6 -6 1 0 -10 -17 -23 -26 2 -13 -14 -5 -15 -6 19 -11 24 -6 1 -18 -22 11 -21 -2 -16 4 6 -13 16 -16 -4 37
2704 37 23 -19 22 -1 45 12 -11 15 1 0 0 -1 5 6 -2 16 2 22 -1 -15 9 8 21 -11 33 -30 -13 -27 29 -7 3 -12 -12 -17 -12
2739 -12 -7 -9 -17 4 2 -26 -11 -5 -1 -6 2 -18 -19 16 -19 -6 -8 4 6 18 -4 -12 15 -11 -5 -3 -3 18 17 29 -1 10 -36 14 28 9 28 -11
$$ packed form
2480fL9m4L1l4K0J7m6J7K2K0j9Nk8KoJ4NKll4JJ9Pk0L3l0J0j9oQpJ6k1LJ0oK5
2517cK5k6J2Ljk6%J4oL0j3k2J2K9l1L1j3pJ6m8N2k0j0jM8l4J2oK8n4LPM3k6J7
2552C5l4J2j7k7N3Kpl7J6J6k4J3Rjqk3OJ7%mlk3K3l4K3J4JK3k0okJ5%jj6K1%K
2590A4kmpK3j1k1K1Ql4LK3kj3nK7jj4j6MnJ9k6J9j1LK4j8OqMj5kJ1Kj8J9oK8m1
2629b2RmjJJj4K6j7K6%k5KmO4l8OJj2J3K6l1NK0m2M1j7Lj0K1k9J5j6J2j4Lj6R
2666h%rk7O7q3N4%%Pjj0polK8j5jRj0RK5l0L5l0Pj9mL3l2J9j4K0Kj9K9l2J2M1
2704C7j4m2M1k3M6l3k3K6j4j%jOJqJ8j4K0k3j4K4jJ3l2M4o3J7j4N6l6J0j5%nN
2739a2NkqK1kk8J5OMnQk0jL5l5J3kJ2KJ2k2qK7k6OK%K1jJ2l0J1m6N0J4j9J9l9
$$ plain form
2777 -11 -6 0 -9 17 -9 24 -17 10 -3 3 -25 5 -19 5 -27 -16 -32 3 -7 -4 8 -37 1 -13 -17 -11 -9 -3 -15 -14 -36 -36 -20 -7 11 2
2813 2 4 12 -21 -33 0 5 -13 3 11 19 24 -15 -17 5 -8 11 12 2 5 19 25 5 -3 2 14 11 38 18 20 11 31 8 14 2 -6 -15 6 -2 -16 1
2853 1 -1 1 21 22 0 -17 -25 -7 -12 0 32 6 -36 14 -24 5 -12 -25 21 2 -31 5 -18 -24 -8 0 22 -6 2 1 34 28 26 25 -17 31 -9
2890 -9 9 25 13 -18 -18 2 -7 21 10 30 10 4 -10 8 -22 -33 -13 -10 -8 24 -26 -20 -13 -34 -23 -14 9 -18 2 -3 -25 -31 -16 31 -7 -2
2926 -2 -6 -5 12 25 4 -41 -4 -7 -10 3 -18 -7 -11 -9 5 -9 23 5 -16 22 0 7 -5 4 21 6 11 -9 17 21 12 25 5 12 17 -19 27
2963 27 34 13 2 -9 -4 -30 -9 11 17 -7 -5 -4 21 15 -17 3 1 -32 -30 6 10 8 -8 -6 -5 -4 -16 3 -39 -49 -3 -25 17 35 12 13 8 15
3001 15 3 3 15 37 -8 9 22 -23 14 8 -27 34 2 -1 -17 36 16 6 18 2 0 15 16 -16 -21 -16 -22 -8 21 -1 2 -24 -19 11 -23
3036 -23 15 -43 -27 -19 -30 -10 0 -5 -5 -13 -8 -3 -2 -7 -28 -31 15 -1 -7 -7 10 9 5 -14 1 24 7 2 -5 10 -10 -26 2 -22 -3 -17 9 -1
$$ packed form
2777a1NOrK6k6L3m1K7j3Ok8L0k4K4l2J1j6L5j0LJ2m5L8j4mOKOj2Jk2%J6J3J8r
2813BKQl3j2L3Nj8J6QQNl9kK2j3J9Jj0LJ4Ok0qNJ2lK7k0KrK0k3Oj2qrK1qj4J7
2853AkKK0Jk2j7qJ8nJ2L2k6m2N0l8K9j7j3M6j9l3L6k3oJ6QK2k8QjL3okjm2M8m0
2890iJ8J6j2l1%K0rK8j1K0k0oj4J8l0j1K0LKL2n0OPk1J1RK3k7K0nk2oJ5M7l8N
2926bmJJ7J3k1m5L7llJ3k1J1mKJ4j4L2j8k1L8k2Pj2RJ7j5Nk0K6MrJ3k0PNl6M6
2963B7Pk1j1j1Nk6K1K0Ok4KJK5ol2K0kl3KL6Mkj6KJJj2J9m2j0M6k2M2J8k3JnP
3001A5j2%J2K2m5J7J3m5L7ol5O1l2lj6N3k0j0J2j6kJ5Jl2nNoJ4K9k2Lk6NL0l4
3036b3L8n8J6Qj1K0J0n%qNNJnk1lM6j6o%J7jmj9J5K3j7npJ5k0j6K8k4J9j4K6j0
$$ plain form
3074 -1 13 31 9 -10 10 -3 -3 1 6 2 0 -4 -13 -9 -19 -13 -7 8 8 12 -8 0 -21 -21 -31 7 -3 4 -28 -12 11 -48 10 -25 5 -31 -11 -13 16
3113 16 -20 -22 3 -4 -7 1 -7 12 3 23 -20 13 7 45 23 11 16 17 19 -8 -9 21 19 26 6 -3 33 -4 -7 -15 -16 -11 29 24 4 -10 13 -10 -9 8
3153 8 -46 6 -13 -41 14 -25 -4 -15 -6 -13 -3 6 -16 -24 -27 -22 14 -37 0 36 -17 11 8 -11 12 -9 -1 25 8 16 -2 -8 -11 5 -14 37
3189 37 13 2 16 -39 11 -5 19 1 -11 24 -5 -18 10 21 -5 17 12 -27 -23 6 -3 2 10 1 -11 -4 29 25 -6 -15 -22 -18 -20 0 -4 -33 13
3226 13 -25 -3 -9 -8 -10 20 -10 -2 -16 -3 11 -22 -14 -2 3 15 -17 -13 20 7 7 40 37 36 15 22 24 18 18 -3 6 6 8 -8 28 -14 10 3 -3 1
3266 1 -23 13 -6 -23 -8 -31 -7 6 -30 -11 -20 14 12 -33 -37 -7 -15 -1 11 -32 -24 -26 -36 1 -12 -15 -14 -14 -14 -5 -12 -28 5 -3 20 8 44
3303 44 9 -2 -15 6 1 -17 -22 1 27 7 9 9 -33 20 10 -8 11 -26 9 -3 -24 -23 -14 10 10 -30 -20 -20 -14 -28 -11 -19 -13 -19 -4 4 -19
3340 -19 -20 -29 -14 -6 -31 -17 -6 -19 -25 -21 -6 -17 -26 -12 -13 -15 -22 -9 -3 -18 1 4 -13 2 9 -12 12 0 16 15 -5 22 -10 -1 4 25 3 -4
$$ packed form
3074aJ4J8k2j9K0j3%MNmkmrMj0OOJ5%Mk0Qk1%j0L8j0Pl2J6K3n9N8l5L0l6K0kK9
3113A6l6kK5plQqJ9rK0m3L3oL8k2j2NJKk7jL0kPk0rL6l7lqjNM0nk0j4K3k3JJ7
3153Hn4N2j9k8N5l9K1j1RpJ0Rk2qlNL6n1L7L6n3K8lj9K3k1QK6j7Qj8olJ6j9N1
3189C7k4j1J4n5N0j6K4j8j2L5k9j3K8J1k6K2nl9MK9rNQrj2PL3ml1rpMkK0mk9M6
3226A3l8K2oJkL0l0Qj4J3J4l3QJ2NJ2l2ML3j3%L3ljk1PKo%k1R%Kj6L6m2K4poM
3266Ak4L6j9j7J5k3K4J3l6J9rL4km5mL0qJ4J2m3Qkj0L7j3lJ%%Rpj6L3qK3j2L6
3303D4l5j1j3K1nj8nK3K6k0K%m2N3j0j8J9l7L5j2k1JRK4%m0J0%Oj4J7qOoJ5Qk3
3340a9jrJ5Qk5J4J1j3oMJ5j1rJ4jkpJ3Oj5J9Lj7J5Pk1K4j2J6jk0K7l2RNK1k2p
$$ plain form
3378 -4 -10 36 -5 -12 0 0 14 -43 16 -22 -25 0 -4 -29 5 -9 -23 -37 -33 -10 -16 -19 -19 25 -10 -2 -31 -32 3 -12 -32 -2 17 -12 -12 -6 -34
3415 -34 20 7 -8 10 -1 33 16 -3 22 42 17 -3 3 -10 19 9 34 10 23 -4 -25 26 18 28 40 18 -23 0 -3 -1 1 -3 3 -20
3449 -20 -11 -15 8 -27 -7 -24 -16 -65 10 -7 -17 -12 0 0 -23 -7 -45 -12 26 4 -23 -19 13 12 -3 28 -26 -11 -20 5 28 33 -16 -4 12
3484 12 10 3 2 51 1 8 25 27 26 -9 -20 4 -1 11 -3 26 -36 17 -24 5 -19 0 -21 -3 -28 -8 -17 -17 -30 -15 -16 -13 3 -18 0 -12
3520 -12 -26 -30 5 7 11 3 -5 -3 9 -33 -36 -11 -24 -12 9 8 -10 11 3 -5 3 7 -5 -5 -3 6 24 10 2 13 27 12 18 0 -4 -2 -15 13 -13 18
3560 18 -17 3 11 -11 6 -23 12 -4 -26 -22 -14 -16 5 -1 -30 -17 -25 -19 -4 -20 22 16 -17 -34 -9 4 -5 -31 -23 9 -5 19 -20 -28 -6 6
3596 6 -8 -9 25 12 -7 24 -26 12 -5 -8 20 30 44 8 24 26 -8 -15 8 10 21 -1 4 25 -1 30 23 -24 -12 10 11 -9 -11 -23 -18 -16
3632 -16 -4 -15 -13 2 -25 -31 3 -22 -26 -9 1 -11 3 -19 22 4 -19 -15 -24 -21 -23 -20 14 -7 22 -17 3 12 -3 1 3 3 17 -18 -7 2 -15
$$ packed form
3378doM6m1pJ2%J4n7N9l8lK5mk5L4j4j4j4MK3ol%M4l5Qk9jL5j5k0L0J9k9%Ok8
3415c4N4j3j5J8j1L4j7j9K5K0k5k0Oj3K9j0K5k4J3k7k1N1qJ0J2k2m1K3lKKmOk3
3449b0RmK3l5K0j7Qm9P5j7j0NJ2%k3J6l8L3L8k2k7ML2jj5L1n4J5rK5K3Nm9J2J6
3484A2kpjM9n0PJ7Kjl5j1K4nJ2j4K9o2N3m1K9k4J9k1J8k5K0r%j3J5jLJ6k1J8j2
3520a2j4mL5KMqqKJ2m2lK5j3J2K1jj8K1qqQMj2%KRJ8j4qJ1J4j5Oj8mKj3K8k6L1
3560A8l5K0Qk2J7k9L5j6k2MQkK1ok9J3qOJ5j6M2ol3j7K5J3rk6QL2j4K4l9qK2J2
3596Fj4jL4j3j9L1n0L8j7lK8J0J4l6J6Kl4pK3KJ1k2NK1k6L1pm7J2K2Jk0kj2NK
3632a6J2j1KJ5k7oL4k5mJ7J0j2J4k2M1j8k3MrLkLL4k1K9l9K0Rj5MK%J4l5J1Rj7
$$ plain form
3669 -15 20 8 -23 0 10 5 5 6 -1 -9 24 -31 -16 -22 26 11 -17 6 -19 -5 21 -27 -12 -32 9 -16 -22 -17 -22 -4 -26 -9 17 -5 -27
3704 -27 -31 -13 -8 -19 -30 2 -34 -20 -1 -24 13 23 -2 22 2 -5 26 4 28 -2 20 28 15 0 -5 37 11 -1 15 -12 -9 9 -15
3737 -15 38 0 18 9 -28 14 27 -9 -2 7 -26 24 27 -5 -7 -20 -20 -20 -14 -33 -16 6 -14 10 -13 8 -17 -9 -26 -19 -10 -6 2 17 -16 25 6
3774 6 7 -5 -6 16 -12 -6 3 12 -4 8 -1 24 -14 9 -8 34 -15 13 6 7 17 34 40 33 -32 -7 -7 7 3 2 1 -22 -5 -28 -5 9 -29 31
3812 31 22 2 -2 -10 -16 -26 2 12 18 -16 -19 34 -16 -1 18 -21 -12 16 7 -21 -28 11 -6 9 36 4 12 30 -19 10 7 11 6 8 32 12 24
3849 24 4 3 -11 21 -3 20 -6 -23 13 12 -16 -3 -4 24 -4 -10 -4 -1 6 -1 -22 -16 -23 -41 -24 6 -10 -33 -12 -36 -25 -4 -1 -19 -1 7
3885 7 9 -7 21 -6 7 11 37 6 5 25 2 -16 -33 -4 28 -9 -7 13 6 6 -7 45 -4 -12 18 2 16 -9 -9 32 4 -6 -15 -13 12 13
3921 13 -18 17 4 -5 -8 -23 -14 -22 0 1 -29 -15 22 -10 -17 -7 -20 -10 -19 -17 -46 17 -7 20 20 25 -5 8 -10 -28 -14 -8 16 -15 -11 8
$$ packed form
3669a5L5j2l1K3J0n%JpqL3n5J5oM8j5k8K3k5J4K6m8J5k0M1k5oNnJ8k2J7K6k2k2
3704b7mJ8Nj1j1L2l6J4J9k3L7J0k5K4k0pL1k2K4l0K2Qj3j5nM2k6j2J6k7LJ8k4
3737a5N3l8J8rl7M2J3l6PRl3N0Ll2kj3%%Oj9J7K2k0K4k3K1k5Qj7PRMQJ5l3M1j9
3774FJj2jK2k8ORRj6J2rK5l8K3j7M2m9K8pJJ0J7Opo5K5%J4mjjk3J7k3K3J4l8O0
3812C1rk0mqoj0K8J0Ol4lN3n0J5J9l9RK8rk8pL9j7J5K7l2QJ8m9K9lMnKK4k0J2
3849B4k0jj4L2k4K3k6j7L6jk8J3jK8k8oOLPpk1Opj8J7L0j6k3K1k4J1K1Lj8J8Q
3885GKj6K8k7J3MK6l1jK0k3j8j7K9L2l7KK0p%j3N2m9qL0j6J4k5%M1k8j0rKK5J
3921A3l1L5j3rlj5RqK2Jl0J4L7l2pJ0j3J0rKk9O3k4K7%Nl0J3j8j8J4OK4l1MJ9
$$ plain form
3957 8 -10 0 -5 11 9 16 13 7 26 7 4 30 2 30 0 6 28 36 -4 24 52 19 10 -11 1 4 2 13 -23 -12 27 6 20 -18 -11 3 15
3994 15 -25 -7 -22 -27 -10 -24 -11 -33 18 5 18 -10 -5 1 -9 -11 2 4 -11 -8 31 17 20 29 10 6 0 20 -11 17 53 13 8 31 14 7
4030 7 17 10 -5 3 -14 10 8 6 10 34 29 -20 15 -16 17 -4 -25 -12 2 -29 -30 -24 1 -25 14 -8 22 -37 8 9 -25 -3 -9 -3 -13 -23
4066 -23 2 -3 5 -5 19 -6 -10 2 4 1 -33 1 -13 -32 34 -8 -19 13 28 20 -5 -2 21 23 27 -14 -13 -5 6 -17 -10 19 1 30 -8 10
4102 10 -24 -5 -6 -17 25 16 -15 -20 -17 10 1 12 -20 1 -9 12 20 -4 -23 10 -24 -11 -5 5 18 -47 20 -43 -19 5 18 20 14 4 -20
4137 -20 31 16 18 -2 6 -2 -1 2 25 7 -5 31 2 26 -8 29 30 -5 -15 3 8 6 24 11 19 -11 6 -21 6 -6 -18 6 -55 16 -20
4172 -20 -24 -10 -34 2 -36 -6 -5 -4 -29 -23 -30 -11 -29 -1 -10 18 -3 -33 -1 1 -14 0 0 19 -11 6 16 24 -11 1 16 22 31 15 -8 -2
4208 -2 -1 -5 17 31 29 -25 18 15 19 16 -14 -50 17 -10 16 28 -34 13 -11 -8 -26 5 -19 10 0 -17 7 -46 -26 -12 6 -1 -8 -17 -8 -31
$$ packed form
3957Hj8J0nJ6kPloJ9j9lK6k8K8l0OK2Qm0K8K8l3rk1J2LkJ1l6J1L9k1J4l8PJ4J2
3994A5m0J8j5nJ7j4J3k2N1j3J3k8NOj0kJ3Kj5LL9j4LRj9moK0l1K8L6m0nK3j7p
4030GJ0pj5Qj7K4kkMK4nm9L5l1L3k1k1J3J4l1jOK5k6L9k2L0n9M5Jl4K2oOj0j0
4066b3K5nQj0K4k5mJ2Kll4L4j4j9O6m2j1L2J5qk5LK3KMm1JQJ1k3PK9j8K9l8J8
4102A0l4J9jj1M2rl1nLK7rJ1l2K1j0K1Qk4j9L3l4J3OJ0J3o5O7o3K4K4J3Koj0k4
4137b0N1j5Kk0QqJLK3j8j2L6k9K4l4L7Jl5j0J8NkJ8j3Ql0J7k7K7j2j2K4o1P1l6
4172b0mJ4k4L6l8L0JJk5OpJ9j8K8rK8k1l0L2Kj5J4%J9l0J7J0Ql5J2J5ORj6k3O
4208bJmK2J4kn4M3lMll0l6O7k7K6J2o2M7k4Lj8L1k4K9j0j7K4n3K0J4J8pprRk3
$$ plain form
4244 -31 -20 5 4 20 -15 -34 -6 -45 9 15 -10 15 -6 14 11 -8 -19 10 21 -2 8 -3 0 3 -10 1 11 36 16 6 -4 24 -27
4277 -27 -6 -11 -6 5 -9 -20 26 1 0 9 2 4 -16 -3 -24 -22 -4 1 -6 -19 -56 29 0 -23 -39 6 -8 1 -4 15 27 6 -4 -17 1 -20
4313 -20 29 -21 9 -5 1 -4 17 -4 27 8 3 15 -11 12 -5 10 -11 -26 -18 9 19 14 -18 -13 4 -15 -6 37 11 8 -30 -4 -12 -22 -17
4348 -17 0 16 8 -10 27 4 -37 -15 -22 -22 -39 17 -40 -5 13 -4 -10 9 5 -16 -8 -13 -3 8 -16 -24 -11 11 11 12 24 -10 33 7 22
4383 22 9 10 3 3 -3 -21 7 22 -6 2 5 -6 -34 4 12 -33 -14 -15 14 -5 -19 -27 -11 6 -12 -21 14 1 -6 -22 -9 7 -15 18 -6 -23
4419 -23 13 10 -3 2 -8 17 -19 -2 -4 -5 32 -13 12 6 -18 26 -9 14 35 1 16 28 17 -5 14 29 23 42 25 -4 6 -1 -5 -2 25
4454 25 -8 -13 21 9 24 16 4 -20 -12 -4 -23 -30 -19 -20 -8 4 -27 -14 -6 -4 -8 -27 10 11 -8 -29 -30 -31 0 8 -17 -10 -14 10 4 -13 13 33
4492 33 -8 -1 -2 -11 -12 22 0 1 -3 -14 12 28 45 6 5 18 14 -3 7 4 28 26 22 -20 -7 -8 16 -14 1 30 -19 12 -9 -4 -9 13 1
$$ packed form
4244c1J1K5jJ6l5j9K8l9N4Ok5K5k1K0lj9j1K9J1k3J0j1LLj3J1J0K5k0j0j0K8n1
4277b7K1nNJ1j4j1M6k5jRpKk0J3k1KJ8Npj3l7Q5k9k3j6M5j4RnJ9J2k1j0j3J8k1
4313b0M9n0L0j4OnK1k1L1j9nJ2k6K3j7J5k1j5QK7J0nl2NJ7j9RM3k6ll8K6qj0N
4348a7J7J6qj8L7k3m1K2p%j7N6n7L5J8j7oJ9mk1QnJ0J1k4qJ3K2%JJ2l4M3k6J5
4383B2j3Jp%oj8K8J5k8QLj1k8L8Qm5J9jK9j9j4qJ6J7j8rL5j3pj6J3J6k2L3k4j7
4419b3L6lj3Nj0K5l6J7kjL7m5K5ok4M4l5K3K1l4J5J2j1k2J9J5oJ9j7k9J0pmLK7
4454B5l3nL4j2J5qj2k4QQj9pJ1jJ2J2l1J3QKmj9L7Jj9k1jjL1Qk5PmK4oj7K6K0
4492C3m1PjrjL4k2Jmj1K6J6J7l9jJ3mj7J0lK4kmm2J3jK4l0J5K9m9L1k1NnK2j2
$$ plain form
4529 1 -4 6 -21 -4 2 -8 -15 16 -24 8 12 -27 22 -9 -23 22 -2 8 -9 -12 0 19 -7 1 37 4 -29 27 35 9 10 2 8 -11 -4 16
4565 16 12 10 -23 14 6 4 14 28 -6 11 0 36 -21 -18 -11 -2 32 -15 4 -5 16 -9 -10 -31 9 -29 -21 -16 -3 -2 -8 -10 -24 -25 -6 -4 -17 -2
4603 -2 -46 3 -29 -4 -6 -42 -41 26 33 -20 -14 -16 25 6 18 12 7 2 -8 -3 2 9 -10 20 15 20 -7 22 43 10 5 9 -20 25 -5 -23 -2 11
4641 11 -19 17 -6 17 4 -4 -9 7 17 -14 -14 -10 19 -11 -20 -6 7 -9 -19 9 20 -6 5 0 -6 -23 22 -26 -1 4 -15 32 0 10
4675 10 -20 -18 -14 28 0 6 2 10 8 -8 -6 18 -4 25 26 -3 10 27 23 4 -20 4 29 -35 -6 -20 -26 -24 1 -23 -11 6 -15 -43 -15 -37
4711 -37 -13 -5 -18 -28 7 -24 -14 -46 -14 -8 -28 -8 22 -12 17 5 -12 17 21 21 4 15 9 12 -15 6 -6 -6 6 -24 25 20 -7 26
4745 26 5 -20 25 -13 12 20 8 0 41 -6 18 -9 1 -15 -24 -14 -21 27 18 -8 -12 -22 9 -21 -19 -4 -23 -31 7 -27 -8 -23 -22 -18 -35
4780 -35 -5 13 4 -9 24 -15 -9 6 5 0 19 -13 -30 -17 22 21 22 8 15 -11 3 13 22 14 12 28 7 25 38 -16 -6 -12 -8 15 21 22 30 -11
$$ packed form
4529AnJ0k7J7Oj0pL1m0L2Ml9M9l1j4M5k4J0j7lJ2J9k6QL6l3l3N6Qk6JqOj9PK0
4565A6mkl3L7qkJ0J4l4J7j1L6n7LPRL4m7J9rK1k5jk1M0l8QNJ3Jokj4jJ9Kj3J5
4603bm4M9l2K5kl6JO7Pn3OkM1j9J2onnj0NNPj9L0nNk7K9K1l3nMk9M5l0j8K1J3
4641A1l0L6k3K3j3qnJ6J0l1%MK9l0rJ4J3j6j0K8J1k6J1noj7M5m8K5Nj9M7l2J0
4675A0l0KMM2k8OmQkj6KK4k2K9Jk9J3J7mj9k4K4K5o4K9j4oKK5k4J2J7k1k8K8k2
4711c7K4Qj3j0L5l1J0l2L2Ok0K0L0l4K9j2j7K9M%j7J1oLk7K1j2%J2l0M9nk7L3
4745B6k1k5M5l8K5Qj2qM1m7K4k7J0j6rJ0pM8rk6mj0L1l0KJ5j9qL8l4J9j5JMj7
4780c5L0J8rj3L3l9OJ5jnJ9l2j7J3L9jJj4Pk6J4J0RqkJ6k1J8J3n4J0oMK3OJQm1
$$ plain form
4818 -11 42 37 -7 -26 14 -5 -7 -18 5 17 0 -10 -39 8 -12 -12 -19 1 -13 -29 -14 -21 -18 0 -17 17 -1 10 -24 14 22 -1 22 14
4852 14 -2 15 -18 -8 15 17 30 22 16 19 3 12 5 -11 1 16 11 -5 23 5 -17 16 -4 18 16 -2 -11 -19 -1 -13 39 -19 -7 18 -24
4887 -24 -28 -49 -4 8 -29 -26 -12 -30 -6 -17 -4 -12 -35 -4 -4 1 -19 -16 -4 -2 -7 10 -22 9 23 15 24 12 -4 2 13 24 23 3 -18 23
4923 23 27 1 -2 8 18 28 13 15 4 5 -5 19 26 19 7 29 8 -55 -15 -14 1 1 -12 2 0 -4 -14 -7 13 31 -10 -16 -25 -19 -31 15 -5
4960 -5 -25 -22 -2 -40 -11 1 -7 -6 0 6 -15 -33 19 3 -3 12 13 9 9 -7 27 -17 26 24 3 21 9 29 -18 1 11 21 37 19 -21 15
4996 15 -6 8 30 -2 13 -23 -25 -11 -32 -21 -4 -16 -46 10 -4 -4 -18 -2 10 2 -10 8 -2 -21 -7 -34 -14 1 6 -23 6 9 -6
5029 -6 5 3 27 32 14 -7 25 -15 1 8 28 20 31 30 -8 -2 32 25 19 38 23 -6 -1 -4 -3 -24 4 16 8 29 13 -9 10 -7 4 -12 -19
5066 -19 -1 2 5 4 -2 -9 -15 0 -15 22 -26 5 -9 -11 -17 13 2 -20 23 17 0 3 -16 -20 -5 5 14 20 4 22 0 24 13 -15 1 19 14
$$ packed form
4818a1N3nm4j9M0j9kj1K3J2j7j0k9M7k0%pK0j4j6J5pLJ8j7L4j8J1l4L8Qk3K3q
4852A4j6J7l3J0K3KJ3qoLj6Rpj6J2J5nj6K8j8k2L3k0K2kj8rqJ8j2N2n8J2K5m2
4887b4mk1M5J2l7LJ4j8K4j1J3qk3L1%Nk0LJ2KnJ7l2L1J4qRj2j6OJ1J1jk0k1M1
4923B3Mk6lJ0J0J0j5Kj1Jj0K4Ppj2K2k1o3M0JJ5%j3J4kmj0PK0J8m1orOj2M6k0
4960ek0LK0l8K9J2qJOOk1j8N2j6oJ5Jm%j6L4m4M3kk1J8j2K0m7J9J0J0J6j8m0L6
4996A5k1J4K2l2J5l6kJ4k1J1J7j2l0N6j4%j4J6J2qj2J8j0j9J4k7K0J5Nk9K9Lj5
5029fJ1kK4Nj8k1L2m0J6PK0qJ1jl8OL4poJ9j5k9NlJk1K8J2qK1j6k2J9j7J1j6p
5066a9J8LLjopoJ5j5L7m8L1j4koL0j1k2M3oj7Lj9mJ5J0ROj6J8k2K4j1k8J6J8n
$$ plain form
5103 14 37 6 -12 6 42 20 25 -4 -2 17 -7 26 17 4 4 -11 -15 14 8 28 4 -20 -7 -2 8 7 -31 1 -2 -30 -26 -7 -8 20 -11 6
5139 6 9 20 16 25 -5 -15 -8 15 -18 10 30 6 3 14 21 -4 1 20 34 11 8 -9 26 12 -20 34 16 16 23 24 21 43 11 11 6 3 4 15 5
5178 5 -3 -2 -16 -4 -30 -3 -8 8 -12 8 18 -5 -25 -11 -10 -9 6 4 -17 -28 3 11 -1 4 11 -2 -3 21 -16 -17 12 9 5 22 21 39 32 -9
5216 -9 1 23 12 26 -16 15 23 33 13 2 23 9 0 28 -14 -17 28 -3 7 -13 19 2 3 -16 6 -25 -13 -26 0 2 -17 -13 10 -1
5250 -1 -4 26 -20 1 -22 -40 -30 8 15 12 -12 -29 19 -5 5 0 2 -4 4 34 19 0 12 10 7 37 31 16 -9 8 35 30 13 27 40 36 -4
5287 -4 24 -4 -14 -19 6 21 13 -34 6 14 -15 -11 1 -10 -21 -1 -16 -11 -37 0 -13 5 3 23 -14 -18 5 0 -8 -5 -11 5 -3 6 4 4 30 3
5325 3 -22 12 31 -10 27 -8 8 6 16 5 38 10 32 27 -2 7 16 24 43 8 6 29 -4 -21 -6 -3 -6 -31 9 -12 -1 9 -8 12 -5
5360 -5 -6 14 4 -43 -15 -11 1 -11 7 8 5 1 18 -25 -11 -35 -23 -8 2 -21 15 -13 -7 19 3 -27 -16 -12 -7 26 9 5 -16 3 0 2
$$ packed form
5103A4K3l1j8J8L6k2Nk9KJ9k4L3rj3%j5mK9oK0k4k4J3NJ0jl8L2lk8MJ9jK8l1J7
5139FLJ1mRl0j0PK3l3K8K0k4lJ1Pk5NJ9J4k3lj7L5j4l2N4j8%PJlK2l2%nlJJ1j0
5178EqJj4J2k6K7nJ6k0K0J0k3k0J4JJJ5kk1j1L1Qj2NPj3jK4l7jK9lmJ7jJ8pm1
5216iJ0K2j1J4m2L1QJ0k0j1K1j4rK8m2lM5l1J0k0L2j7Jj9K2l1J2j3K6Kj9MK3j1
5250alL0m6K1k3j8J0L8Plk4j7M8k4J0nKoQL0j5j9J2klL0oj5k5J7K7nj7J4J3mm0
5287dK8k8j0nK5J5qm7M0Qk9MJ2j1j1K0j5Nk6L7j3J8kK0l7mK3nqLoJ6qRk%K6k7
5325Ck5L4J9m1L7l5J6kJ0j1L3k8K2nk9RRQJ9l5kK3l3j7J5Llk5M0k1J1J0j7K0j7
5360ejK0j0m7K8MJ2j2J8JlmJ7m3J4k4J2J5J0k3L6k8OK6j6l0J1MNL3j7mk1J9lK
$$ plain form
5396 2 -12 17 7 2 1 17 0 -4 26 8 5 12 -12 -1 33 29 -12 -2 8 14 41 17 -3 11 -37 -5 10 -11 -10 -22 -9 -25 6 7 -10
5431 -10 -6 -14 14 -11 -31 10 17 -22 -20 26 6 9 -18 34 4 -11 -3 12 0 19 8 20 58 -5 16 17 2 20 30 1 -6 38 16 8 9
5466 9 -8 -11 22 25 16 -7 -8 10 15 -9 -1 -1 -3 -21 -23 -6 16 16 -19 4 -12 -24 -47 -25 -17 -31 -18 -20 -29 1 -48 3 -8 22 -7 -16 -2 -22
5504 -22 1 21 -4 -7 15 3 -16 -9 3 32 5 -8 33 5 -2 17 16 7 6 -17 24 -3 15 25 -22 -19 4 -15 20 17 5 -14 -34 6
5538 6 0 18 -4 -22 -22 -1 -19 -19 -21 27 -7 -19 7 -29 6 -28 -33 -14 -8 -1 -13 -18 -38 6 10 4 -9 -15 15 5 5 3 -3 5 29 9 -4 8
5576 8 23 2 -24 5 11 -18 -5 17 16 20 48 -12 -4 -12 -5 -7 -1 8 2 -4 10 -6 -23 -15 -17 1 -17 -9 -3 7 -26 -19 -36 -11 -9 -7 1 -6 -18 24 -2
5617 -2 14 -5 -7 19 17 3 6 4 17 24 5 27 -8 12 22 -1 20 8 -8 13 25 4 31 10 12 -2 18 5 -23 30 21 14 -8 -13 -8 16
5653 16 8 2 10 7 -9 -5 7 -30 0 11 -23 3 -18 -35 1 13 -22 -19 15 6 -25 -5 19 -5 7 19 -10 5 -15 11 31 12 3 -15
$$ packed form
5396Bj4K9j0njJ6j7mL0j8lPk4J1L4mm1J0J0OK7k4k0J4m8L2J5k1Jj2J3j6L1Jj7
5431a0MqK8k5k0M1Pl9KM6k0Lk7N2l0j5QJ5j2J9j1J2L8o3K1Jj5J8J0k9pM4k2qJ
5466Ij7lL3Lrk3jJ8Nk4Q%kj8kJ7K2%l5K3j6j2k3K2Qj4J3krL0m9N1j1L0k9rJ4k0
5504b2K3K0k5lK2j2j9PJ2K9k7j3M1k8pJ9jrjk3M1k7J8J0m7LK3j9L5lj2j9k0M0
5538FoJ8k2j8%K1j8%kM8l4j2K6l6L5l4nJ9OPj2nk0M4Moj3oL0j0%koQK4k0j3J2
5576HJ5k1k6K9Ok9J3K2jMK8o0QqPkORooJ4j6j7QkJ8j8QOJ0l3Pj7K5KKQpj2M2k6
5617bJ6j9kK6kj4LkJ3Pj9K2l5K0J0k3K1j2j6K1J2k1K7k1Kj4K0j3k8N3rpk2nNK4
5653A6qoQlj6MJ2l7L0J1l4K6k1j7L6J2l5LL4rl1K0K4k4J2J2k9J5k0K6K0j9rj8
$$ plain form
5687 -15 11 23 4 16 1 -16 39 16 9 13 12 40 3 17 16 21 39 3 11 -4 -2 -21 -8 -30 -5 -17 -10 -2 14 -7 -18 4 3 -16 -21 2
5723 2 -9 -2 24 -24 -29 -13 1 -14 -1 -18 -17 5 -35 -9 -10 -33 6 -4 -24 13 -24 -4 28 4 -19 -23 40 31 16 33 1 14 21 22 27
5758 27 15 16 12 9 5 12 -13 28 28 -1 10 19 16 7 5 -19 -9 2 2 9 -5 -12 4 28 -15 4 6 10 -1 -22 -3 -2 -18 3 -7 13 22 -22 9
5797 9 4 -14 -32 1 -5 -2 -5 -20 20 -6 -8 -33 15 14 32 7 29 11 -15 21 27 10 22 19 17 9 7 10 0 -13 33 11 12 4 -14 27 -29 18
5835 18 -5 4 -3 5 1 1 2 -28 -4 -5 0 -14 -19 -14 -34 6 -16 -8 -4 -7 -19 -30 -17 -17 -1 10 -4 0 -15 -22 3 5 -17 -27 -10 -13 -9 31 0 5
5875 5 12 27 2 -4 0 1 20 9 10 27 -11 -17 13 4 -14 20 0 -30 23 -12 0 -10 -7 -10 -6 -7 -22 -11 -36 -25 -14 -7 -15 -39 -27 -11 -10 -23
5913 -23 17 -30 -6 -27 -4 -9 15 -7 -7 15 -20 -18 -7 16 -15 11 -15 0 -14 -8 26 -1 8 0 -4 33 33 -9 10 21 -23 0 -15 27
5947 27 16 -10 -1 7 34 -21 3 -20 -31 2 2 -15 -12 -5 -12 7 -9 -25 0 -26 -11 -9 -8 19 -23 -3 -12 -5 -5 -8 18 2 -4 -5 -5 -4 8 -5
$$ packed form
5687a5K6J2j9J2j5j7N5k3pMjK8l7J4jNJ8l6Qj5Kj9J3k2K5j2PQJ6k1j1K2jj9nK3
5723Bj1PK6m8nJ6J4j5J3j7JK2m0K6jk3L9j0k0L7l7K0L2k4k3mO3rj5J7l2J3PJN
5758B7j2JmlmPk5M1%k9J1Rlrkk4J0J1%Pj4pJ6K4m3J9KMj1k1J9Jj6K1j0K0Rm4L1
5797Inj8j8L3oLlj5M0k6kk5M8jJ8k5K2j8k6L6Oj7J2lkqkLj0j3M6k2Jqj8M1n6M7
5835A8k3RpQm%Jl0K4jNj4nNk0M0k2QMlj2j1J3%J6J1j4Mj5pK5Kk2j0J7lMM0l1N
5875EPJ5k5oMJJ9j1JJ7l8oL0rj8L4k0l0N3l5J2j0LlMjj5J1k5J1J1Pqk4J2J6Jj3
5913b3M0m7K4k1K3nK4k2%K2l5KJ1K3l1K6k6J5j4OL4k7RqmL7%m2J9J1m4K3j5M2
5947B7j1k6RQK7n5K4k3j1L3%j7LPpJ9j6j6K5k6J5KJK7m2K0rP%lK6j6oj%JJ2j3
$$ plain form
5985 -5 8 -11 13 0 -18 -4 -15 -33 17 5 6 25 -2 27 -7 -41 8 26 -15 38 0 -20 -3 6 1 -5 -2 10 4 -1 -3 -37 -27 -54 0
6020 0 -24 6 -3 -22 -14 -8 -17 4 -5 7 7 8 -25 -13 -8 10 4 -6 -7 -1 10 -2 -17 38 11 36 14 -31 11 25 44 12 -2 0 10 18 -4
6057 -4 15 2 32 31 18 10 10 -9 -23 -3 3 -1 12 -2 -5 -16 20 -4 -10 27 -33 14 -11 2 -29 -21 -10 -13 -29 -3 -11 -7 -25 1 -14 -18 -31
6094 -31 -17 -2 -1 17 -27 -7 -27 0 12 10 -19 25 0 -22 11 26 11 27 6 11 -9 12 4 3 -3 34 1 -21 -11 9 -1 3 1 23
6128 23 8 -26 10 14 -10 -8 11 1 16 30 3 -28 -17 -13 6 16 -35 -10 -8 7 -10 -8 -27 -9 -12 39 -45 -13 3 7 -21 -18 -4 1 12
6163 12 -5 -5 21 50 5 -22 14 -2 0 -7 -36 1 -7 14 -20 -18 18 -30 -2 -2 14 5 18 10 -3 17 -2 -10 0 13 4 -13 -16 10 -4 -34
6199 -34 -23 -21 -34 -23 -16 -20 -22 -11 -31 -35 -21 -11 0 -30 -25 14 19 -6 -4 18 10 -23 0 -15 10 -24 12 12 40 15 -23 -5 -9 6 -11 3
6235 3 11 15 6 -2 15 12 22 6 -20 52 -31 0 24 21 5 8 11 0 3 14 -10 -23 4 -18 -3 12 -10 -12 16 -17 -5 11 -1 -13 -38 8
$$ packed form
5985eJ3j9K4j3j8J4j1j8N0j2JJ9k7K9l4l4M9J8m1N3l8k0J7RnoLJ2onkl4J0k7N4
6020@k4L0rj9QOrK1rJ2%Jl3J2NJ8oj0jOJ1j2j5N5k7K5k2m5M2J4J9l2j4KJ0Qk2
6057dJ9j3L0jj3q%j9j4K0OmJ3j4lj1L6k4oL7o0M7k5J3l1QJ1lj6K6qMj8K6j5mj3
6094c1J4J5JJ8m4K0k0K7J2kk9M4k5k2L3J5j5J6k1Nk0K1qjoL7l3k2J0K0j0MkK2
6128B3j5l4L6Mk4KJ9j0J5J4k7l1J1MJ9J0n1K5KJ5j7Kj9J8lN1q4L2J6Mk8LJ4NJ1
6163A2j7%K6K9m5k7L6j6Kpk9L7qK1l4KL6m8K8%J6rJ3qj3K0j9qJ0J3rj7lK6j4l0
6199c4J1Kj3J1PmkJ1k0mJ4J0J1l0NL9Nk5KK2ql3K3j5K5l4L6%K8k5l8J8mJ5j7J4
6235CQMrqJ7lJ0j6k6P2q3L1K4lj6LLj1LJ1k4j3K7k2J5J5k2kK8l3J2J6j2j2k5M6
$$ plain form
6271 8 -16 8 25 12 0 -23 -3 -27 12 10 21 -3 7 15 40 -1 25 50 22 7 -16 -1 24 -2 -10 -15 19 11 -14 42 28 25 -7 9
6305 9 5 4 -20 3 -13 0 23 -8 -17 11 -9 13 18 8 -4 -5 -21 6 -6 1 8 -6 1 -11 -15 -17 -3 14 -17 6 -25 5 -11 0 -28 8
6341 8 1 24 -10 20 -6 8 -29 -4 33 -22 -23 -10 -6 11 15 3 10 11 35 -16 19 -2 -19 8 -24 -15 7 -21 -13 20 -31 29 -13 2 -27
6376 -27 -7 4 6 10 5 10 -9 30 -21 10 -16 11 -30 21 -21 -29 23 -1 -35 -16 -23 -20 4 36 11 8 20 -3 1 9 -5 32 9 17 19 -15
6412 -15 1 5 7 6 2 41 26 -4 14 2 8 -16 -14 -6 6 -5 12 -21 -12 -8 -6 -12 8 10 -23 -29 -11 -20 3 -7 -11 -4 18 -23 -21 -6 6 1 -4 -16
6452 -16 -12 -19 2 -13 -26 -11 -3 1 5 39 -13 18 27 -23 21 5 14 19 9 -6 26 20 -4 -1 24 17 41 16 33 20 14 17 -4 4 12 -6 21 26
6490 26 -12 10 17 -3 24 6 24 7 -34 12 -25 4 -7 18 -43 -3 0 16 -14 -32 -28 -19 -10 -23 -10 6 1 10 2 -36 -32 -3 2 9 32 10
6526 10 9 19 23 24 17 -8 5 11 2 32 -5 19 25 8 22 19 18 17 13 21 -7 5 -5 -5 -10 16 -8 -16 23 -19 3 13 -23 -3 7 -16 14 -33
$$ packed form
6271Hk4K4J7j3j2k3K0k4L9kJ1k4J0QK5m1K6K5k8j5k3J5K5k6qnL4qk5N6j4ll2J6
6305Imjk4K3j6J3K3l1rK8k0K2Nj0j2jj6K7j2PPj4Pj2mkJ4J7l1K3l1L0j6J1k8L6
6341HpK3l4L0k6J4l7K5L7n5jJ3MJ7Mj2PJK4n1L5k1j7K7l2RK2k8QL3n1O0m2J5k9
6376b7K0J1KMnNj9L9n1L1k6K7m1N1m2qN2k4l4J9pLK4L2k5lJ2k3MQj4L7k3QKl4
6412a5J6MKjmL9j5l0J8j2Ok4KQJ2j1J7l3RMKoK0Kl3oJ8rK3j0mPK2m1KJ5J2nnj2
6452a6MpK1j5j3J5QMML4n2L1Rn0M4j6RNj0j5L2ok4LK5pK4k5J7j3oLk1QQj8K7N
6490B6l8K2Pk0K7j8J8j7m1M6l7K9j1K5o1M0LJ6l0j8MRRj3J3J6nRql8MK9NPK3k2
6526A0jJ0MJpk5J3OrL0l7K4Oj7J4ljjmQk8J2j0%nK6k4qL9m2K2J0l6K0J0k3L0m7
$$ plain form
6564 -33 -1 -29 -19 16 -3 18 7 0 -36 -5 8 -9 -11 -17 -22 8 -20 -10 -6 -28 -7 -3 33 13 47 1 18 12 -22 -18 1 16 15 -1 17
6599 17 0 32 22 27 12 8 9 24 12 -22 24 10 -5 -13 13 -25 -8 6 -27 -21 -36 5 -3 -21 -29 -12 -8 -17 -52 6 -9 -15 2 -24 2
6634 2 -5 12 18 -2 -8 1 2 7 20 -2 6 0 23 -8 12 5 24 17 4 -3 22 5 21 17 10 -1 2 29 6 -2 1 6 -13 -22 -2 -2 -8 -2 -29 13 2
6675 2 -1 0 -5 -19 -9 -26 -1 -38 2 -19 -38 -5 -36 -4 -24 -12 1 -30 -6 -9 -12 -9 -9 -6 -19 0 -7 15 7 45 19 11 -2 26 18 0 21
6712 21 36 13 8 48 0 20 15 43 20 2 5 8 20 27 5 14 -16 1 -29 -4 31 -10 -4 4 5 12 -19 -31 -21 -25 -16 -36 3 -13 -19 -3 -23
6749 -23 -18 -42 -20 -7 1 -18 -13 15 8 -1 -19 -1 -2 -16 -12 8 3 -23 22 20 -1 6 18 10 5 5 10 20 6 23 9 -24 36 9 24 32 -7 24
6787 24 0 2 2 3 -12 31 -2 -24 13 -34 -2 -10 -24 -3 -20 -19 13 36 -3 1 -26 12 -11 8 6 3 -5 9 2 -19 -11 7 -20 23 15 33
6823 33 -5 5 1 -3 19 11 16 1 30 4 11 1 -11 4 5 36 12 20 30 37 32 6 10 -6 -21 11 8 -4 2 24 -10 6 -9 3 -13 -1
$$ packed form
6564c3L2k8J0L5j9K1j1pl6L1J3j7konL0k8J0Mk2K1ML6k0L4m6J7ol4MJ9J5jj6J8
6599A7j7L2j0Nj5mJJ5j2l4M6j4j5qK6l8J7J4l3Oj5M1qj8qJ7Mrl5N8j5oJ7k6K6
6634BpJ7Ok0oRJNJ3k2QoK3l1K0pJ9pj3pK5j7J6mpj1LK7k3qLNj9rK0%oOk7M2j1
6675BlJnj4J0j7K5l7M0k1j9L3l1L2k0J2J3l1K4llL%Lj3J9pK2qL8k6qj3K8qj8K1
6712B1J5k3nM0m8K0nK8k3j8LLJ2Pk2Rl0J7l0K5L5m1OQJPl1j2J0mRk0L9j6oJ6k0
6749b3Nk4K2J3Qj9NK8prj8J8jj4MK0nk6M5kk1PJ2qn%NJ0j4J7j4l3O0k7J5Ql9L1
6787B4k4K%Jj5M3l3k2L7m7L2qj4K1j7JL2K3l9Mk7L8k3J9klqJ4pk1QJ8k7M3qJ8
6823C3l8J0mmK2qNj5K9k6Pj0j2J5JL1k4QJ0Pnk6Mj6j5L2lj2OK2l4J6j5J2j6J2
$$ plain form
6859 -1 11 -8 -22 -11 -6 -18 7 -41 -39 1 25 -24 -3 -24 -37 0 23 14 21 -2 -2 25 -11 6 12 45 -1 24 30 3 3 -20 10 10 16 11
6895 11 -1 5 -7 2 26 -13 -4 -3 23 -14 -25 -16 -5 -8 6 -8 -38 -17 -22 17 3 -6 -10 9 -13 18 -11 16 -14 -71 5 5 -10 -6 -6 3 -9
6932 -9 1 0 9 27 4 5 -17 4 4 25 -5 15 -9 8 8 -6 16 12 13 6 20 26 3 36 34 32 -14 7 16 -2 4 13 22 -3 14 6 -12 14 -11
6971 -11 -31 -15 2 -14 -12 -20 10 -6 -21 -22 -31 32 -9 -25 -13 -8 -32 -26 -22 -23 -17 9 -5 -5 -15 3 -37 11 11 13 4 9 31 -7 4 13 24 -15
7009 -15 20 38 36 21 -7 47 12 18 17 7 14 -33 13 -8 -2 3 12 -17 5 0 -19 -38 -14 -5 -24 -17 -7 -25 4 13 -21 13 -28 -31 -16 -19 5
7046 5 2 2 -8 -4 -8 -12 9 -1 4 -11 13 20 -16 31 21 -8 8 8 -5 28 0 -11 0 -5 -8 -6 41 9 -2 14 23 14 28 9 -4 -12 -19 -1
7084 -1 7 0 -8 2 -9 6 0 -40 -19 -8 -24 -6 -5 -16 8 -18 -6 -71 -25 -34 -40 7 -5 7 -21 -3 1 -12 -11 6 -18 18 3 13 12 13
7120 13 -8 18 -12 7 9 -3 21 21 12 1 -2 30 18 21 11 6 7 10 31 27 7 3 -35 -36 -15 8 -27 8 -14 11 5 -11 -22 -27 -32 -33 3 -33
$$ packed form
6859aJ2j9j4J1Nj2K5m8KM0K4m9K1k1j3L7K3rPk3%K7l6J7OL3m6K5Ok7%k3L0%On
6895A1j2Oj2RK4l9RJK6l7j1RJ1lJ4j4l0K1nL9j4rmJ9k2L1k9K7l0n7P6%j5M%Rj2
6932iJ0jRJ8k3Jk2K1%K1l0K0k4J7%j4K2mJpJ4Ok3L3kkm6K1Rj8ORRk5J7qj8K6k5
6971a1k0J6J7j6KqL0j6j5jrO3m1j6J2Nk4OMjOK6j4%j0J8m0M8%KrNK2l8J1RJ1l9
7009a5L5J8kj5k8N4l5Ojj0Pm7M6k1ONRk9K2nj9j9K4Rj9PJ0j8K9Rl4L4m1lJ5lK4
7046El%j0MmmK1j0Nj5K4Pl6M7j0k9J6%j3L3k8j1J1nlKM7l2j1J6RrJ4j9j3qpJ8
7084aQpqJ0j1J5om0K1J1j6J8Jj1K4k6J2o5M6roM7j2J2k8J8Mj3JJ7k4L6j5J0jJ
7120A3k1K6l0J9Kj2K4%rj1lL2j2Lj0nJLK1mk0ml8jK1K3l5L5k2K5oj6j1nnjL6l6
$$ plain form
7158 -33 17 -6 -36 -7 7 -4 46 -15 -8 -48 -22 6 11 10 -1 13 -14 -19 -6 20 30 8 -8 13 3 17 15 -2 2 -4 8 5 18 6
7192 6 18 -3 28 15 31 -21 -14 -16 32 3 -2 14 19 22 11 -9 17 -3 -7 16 3 11 -19 -16 -12 -18 -12 -1 -40 12 0 -26 -21 -17 12 7 -7 1
7230 1 -31 12 1 -2 -19 31 -8 38 9 39 21 22 -12 -5 49 8 7 39 27 15 20 -13 24 -1 8 10 23 4 3 -1 -20 -15 -10 3 10 -21 -15
7267 -15 -25 12 -4 6 -4 -10 5 1 -9 -39 -21 -8 6 2 -8 4 -27 -35 5 -16 -27 -17 5 -11 20 1 0 -5 -26 3 37 5 -7
7300 -7 0 18 14 -9 -4 -14 20 27 -10 32 37 23 1 18 17 34 -1 -3 22 -9 7 22 -16 -15 -8 7 8 2 -7 -5 -3 -13 -6 -28 4 -31 -31 -16 1
7339 1 -29 14 11 2 -2 -18 -16 -9 13 4 3 10 -33 1 13 16 -8 2 -1 12 10 11 19 -9 1 -7 19 1 -15 28 11 4 -1 28 26 8 34 35 25 8
7379 8 19 8 2 20 -16 -7 6 -9 7 7 -18 -8 -14 -9 3 14 10 5 15 -15 -9 3 25 -13 1 -15 11 19 -2 0 -37 -21 -30 -17 21 -10
7415 -10 24 -7 7 10 -12 -10 6 -5 -2 -16 0 17 34 -17 6 -1 27 9 3 3 13 -1 6 8 6 41 14 -10 24 4 8 10 15 13 13 3 7 -10
$$ packed form
7158c3N0k3l0K9J4j1N0o1Pm0K6K8Njj1J4k7nJ3K6J0k2j6K1j0J4kj7MoJ2lJ3j2
7192FJ2k1L1j3J6n2PkM8k9nJ6NLj1k0K6k0mK3j3Ql0LMoOJ1l9N2j2k6NMK9nj4Q
7230Al2M3j1lj7N0l9M6k9L0j8Jl4PN4m1jL2j2j2Nl3L7k5RKJ3j9jmj9NNJ3Pl1O
7267a5j0L7j6J0j0oJ5mj0l0J8J3J4mj0J2l1qM0k1j1J0K2j6L1j9jnk1K9L4l2j2
7300gPJ8mk3Nj0L4Pl7M2Nj4k2J7jJ7l5kK5l1J6J5l8JPJ5JorKKj0Pk2L2l5%J5J7
7339Al0M3lrmj6KPK2rjPm3L4J2Lk4J0lJ3kJQk8J0qK6j8j6M3j7pnK9kj8K6Jj0j7
7379HJ1j1oJ8l6RJ3j5J6%k5J0oNJ2J1mnJ0l0OJ2K2l8J4j6K6Qk1Kl7J6rJ3L8l1
7415a0L4l1J4Lk2KJ6j1Lj4J6J7J7n1K3pK8j8o%J0j4PKkL5k7k4L4k0MKNk%j0Mj7
$$ plain form
7453 -10 4 -10 -24 -14 -6 -8 -8 -17 17 -12 -13 -1 2 -17 11 10 16 -6 8 -14 9 22 26 2 -6 0 12 51 -10 6 -4 13 -2 -6 25 35
7489 35 9 25 41 37 -5 7 -8 10 -30 8 14 -45 -3 18 1 -8 10 -5 32 12 3 -4 12 -25 -18 16 -16 -35 -38 -7 -19 -17 -13 18 -18
7524 -18 -18 -20 -19 -5 -1 6 5 -22 5 28 -1 21 5 12 34 -7 11 20 10 -7 30 34 3 -19 4 5 9 1 15 30 4 -4 7 1 -8 20 -11 26
7562 26 4 -17 29 1 20 15 2 0 -11 -17 -9 -27 14 -6 -4 -11 26 -14 -11 -10 27 7 -15 -11 -4 -6 10 5 -19 -1 12 -9 10 -8 24 -11
7598 -11 -10 -20 2 -17 47 20 -12 8 -9 4 21 34 -16 13 -7 18 -3 -8 -11 15 15 11 0 18 -7 2 6 9 -10 14 0 11 -3 -5 -21
7633 -21 9 4 -16 -6 6 -5 -13 -7 -11 -2 -18 1 -8 -9 30 8 8 11 -7 -16 20 0 -16 12 -6 -7 -8 -8 -6 -15 -2 5 0 -5 -6 18 8 11 23 -13
7673 -13 -19 58 39 15 -21 17 -13 27 25 -1 -15 -3 3 -9 1 -2 -8 4 -25 -26 -22 -26 -18 11 -9 5 -12 -18 -8 2 3 -6 24 13 -19 -1
7709 -1 -26 28 -36 -15 8 5 -13 -14 9 17 14 9 -4 10 5 16 36 11 24 -5 -10 -16 20 3 4 26 -13 24 25 16 25 -17 12 -8 -2 -19 4
$$ packed form
7453a0J4j4j4J0Qk%rL4k9jJ2Lj9K8jOk2J4k2K3J3Mk4qOJ2L9o1J6j0J7j5mL1J0
7489C5k6J6J6mm2J2j5J8m0L8On9M2K1j7rJ8j5L7k0rpJ6l7PL4l2j9lL1j2KML1l6
7524a8%kJJ4MPjk7K7K3k9K2j6PK2m1J8Rj0j7L7Ml1k2K3JMqJ4J5k6qJ1orK8l1L7
7562B6k2k1M6k8J9nj3kj1oQj8M1k0KpL7m0LJL7k0k2MPkJ6nk4J8J3k1J9j8L2l5
7598a1Jj0K2j9O4k7l2K0j7J3J7J3n0K9k0K5k1nlK6%mj1J8k5RMLj9K4j4J1j4kj6
7633b1L0nk0J0J2j1qOmRj6J9rjL9k2%Lj8rL6k0j6K8j8jj%KrJ3PnnjK4j0LJ2l6
7673a3oP7j9k4l6L8l0M0kk6j4J2Oj2J0loJ2k9jMmQK9k0J4j7oJ0J0JrL0j1l2J8
7709ak5N4o4K1K3lj8jK3Qlnj3J4nJ1K0k5J3k9noL6j7JK2l9L7JrRm2K9k0Oj7K3
$$ plain form
7746 4 3 -13 -18 -18 4 -7 -1 -13 19 -20 -23 -18 -10 -21 -15 -15 -8 3 -5 -22 5 0 13 21 -6 32 -13 -13 -12 -28 -7 0 22 -26 -3 4 -10 1 11
7785 11 3 17 -1 -8 0 2 0 -4 9 16 5 32 -10 -15 23 14 -3 4 -5 11 4 -22 16 -3 -35 -37 4 -19 7 -25 11 8 -10 4 -20 4 12 -13
7823 -13 -33 19 -10 -24 10 -7 -21 -41 -11 5 -1 17 -12 -5 2 25 7 15 20 8 35 14 43 7 15 37 23 8 25 -1 19 6 20
7856 20 10 -34 -12 2 -2 -31 11 -24 -1 -17 -31 -2 -14 0 -12 -8 9 18 -14 -4 -41 -15 -23 1 21 -5 5 -2 -14 -16 -21 -7 -11 -2 5
7891 5 -15 -2 12 26 -41 -14 23 22 9 35 6 8 -9 13 5 -5 7 -4 27 35 35 3 -4 -19 3 -7 19 0 -7 11 -30 -15 -2 -18
7925 -18 -10 -7 -5 2 -14 -24 -14 45 -14 -3 2 -19 -6 -23 -12 -10 10 5 -4 0 -13 1 -13 -13 -27 -20 -12 29 -20 -1 -4 -13 -12 -15 4 -10 -5 -10 16
7964 16 3 19 10 10 2 49 27 40 20 -1 6 1 15 13 25 8 -3 9 -3 -7 -14 -14 -7 -2 -19 -13 9 10 -6 -21 -2 -41 -6 -2 -13 -19 -11 -4 0
8003 0 -18 -11 -27 -1 -22 -7 7 1 15 10 -22 1 23 11 19 -3 -47 -7 22 4 26 8 -12 4 -12 2 -1 12 -43 -1 -18 5 9 7
$$ packed form
7746Djj6n%K2j1Oj2L2l9lNQj1O%PJ1qj7K7nJ3Qk7L8m5%Jj6K1PK2m8K3Pj4J1J0
7785A1qJ4j8pQKkmJ3Pj1K7m2nL8rj7PrJ6pk6L8j9l2kM1k3K6l2L6lj8J4k4K4Qk5
7823a3k0N2k9j4L4j7j4k0L0J6oJ8k9PPK3j8QNj2K7k1K9l6QK2j4j5J7k6K0j3J4
7856B0j0m4K2J4mk9M2l5K3j6j4K9j2J4j2MJ7Rl2J0l7K6qK4K0k6J0pj2knJ4mRP
7891Ek0J3J4J4o7K7L7jj3K6k9Kj7K2qj0J2j1L1Q%l2pj5K2j0K6j9pJ8m1J5J3j6
7925a8QLKPj6j0J0N9n9J1Nk1J3j7J1KK0nrMj3J4j4%j4PQM1m9J9lrJlJ9j4NnK6
7964A6j3J6r%qM7k2J3k0k1PnJ4kJ2j7j1J2j2mp%PNj7OK2Jj6j5J9l9L5Mj1oQPM
8003@j8Pj6K6k1J5J4oJ4nl2K3K2j2Qk2m4M0K9j8K2j8k0J6j6J4lJ3n5M2j7K3Mk
$$ plain form
8037 7 7 6 0 -6 5 11 29 38 -8 -4 16 -19 -21 -13 3 -2 -21 10 4 -6 -1 -26 -43 -31 -15 -33 -28 -22 -7 -24 -8 -18 20 -13 -11 -3 26 -34 16
8076 16 19 -19 13 11 22 6 -8 3 -2 8 5 20 7 -1 10 40 19 -24 -8 -29 -28 -5 -16 -24 -5 5 1 -29 -22 3 -11 -41 9 -16 10
8111 10 8 -26 -13 -16 -23 -4 23 4 -13 -20 -42 14 -15 1 -5 -2 32 7 16 14 39 33 2 -3 18 -19 19 22 -7 21 40 -1 7 6 21 11 13
8148 13 14 35 35 16 -23 27 8 -10 -1 6 -9 -36 -21 -20 4 -17 -16 -15 -10 10 4 -22 -13 -28 -4 3 -15 -15 1 23 8 10 9 -8 -25 5 -41
8185 -41 -11 -5 -11 -2 14 7
$$ packed form
8037G%jooJ1OJ8Rm6MK0l5kQJ6nj9L1oj0Nk5j7J2J6j8NOJ5j7J6j0L8l3KQK9o0N0
8076A6Ll8L2kJ1j6j4J1nJ0lJ5j3qJ1L0k1m3J6k1JK3j1qJ9J0ml0PK5j4l0N0k5K6
8111A0kl4J3lpJ9K7j9j7pk2N6k9J6oLL4k5RkK5ol1nK1l7L8Lk9K8J9m1QjJ5j0K
8148A3JK1%j9l9N0j9j8RPj5k7J5JK4k1JJNK0ok6Rj5K4Pj8%J6K2j5Kjj7j7L0m6
8185d1L0OoRJ6p
8191G
##END NTUPLES=NMR FID
##END=
