##TITLE=1H_LR-688B-MC1C3
 CDCl3, 8 sc, 
 19.9.2019
##JCAMPDX= 6.0         $$ Bruker NMR JCAMP-DX V2.0
##DATA TYPE= NMR FID
##DATA CLASS= NTUPLES
##ORIGIN= UXNMR, Bruker Analytische Messtechnik GmbH
##OWNER= root
$$ XWIN-NMR		Version 3.5
$$ Thu Sep 19 14:30:25 2019 Russian Standard Time (UT+4h)  she@DPX200
##.OBSERVE FREQUENCY= 200.1315
##.OBSERVE NUCLEUS= ^1H
##.DELAY= (6, 6)
##.ACQUISITION MODE= SIMULTANEOUS
##.ACQUISITION SCHEME= undefined
##.AVERAGES= 8
##.DIGITISER RES= 18
##SPECTROMETER/DATA SYSTEM= spect
##.PULSE SEQUENCE= zg30
##.SOLVENT NAME= CDCl3
##.SHIFT REFERENCE= (INTERNAL, CDCl3, 0, 15.7039)
##AUDIT TRAIL= $$ (NUMBER, WHEN, WHO, WHERE, WHAT)
$$ ##TITLE= Audit trail, XWIN-NMR		Version 3.5
$$ ##JCAMPDX= 5.01
$$ ##ORIGIN= Bruker BioSpin GmbH
$$ ##OWNER= she
$$ F:/spectra/data/she/nmr/H-F/1/audita.txt
$$ ##AUDIT TRAIL=  $$ (NUMBER, WHEN, WHO, WHERE, WHAT)
(   1,<2019-09-19 14:29:38.48 +0400>,<she>,<DPX200>,
      <created by zg, POWCHK disabled, PULCHK disabled
       configuration hash MD5:
       00 E9 B6 7A A2 85 ED C7 34 08 36 98 17 FE 4E 26
       data hash MD5: 16K
       15 EF 3F 7B 23 1E 7C 4A 57 C1 E5 86 C0 38 D5 FE>)
$$ ##END=
$$ 
$$ hash MD5
$$ C6 47 9B 2F 5D F1 3E BC 31 37 E9 85 5D 1F AD 6C
##$RELAX= 
##$RELAX= 
##$RELAX= 
##$RELAX= 
##$RELAX= 
##$RELAX= 
$$ Bruker specific parameters
$$ --------------------------
##$DU= <F:/spectra>
##$EXPNO= 1
##$NAME= <H-F>
##$PROCNO= 1
##$TYPE= <nmr>
##$USER= <she>
##$AMP= (0..31)
100 100 100 100 100 100 100 100 100 100 100 100 100 100 100 100 100 100 
100 100 100 100 100 100 100 100 100 100 100 100 100 100 
##$AQSEQ= 0
##$AQ_mod= 1
##$AUNM= <au_zg>
##$AUTOPOS= <>
##$BF1= 200.13
##$BF2= 200.13
##$BF3= 200.13
##$BF4= 200.13
##$BF5= 200.13
##$BF6= 200.13
##$BF7= 200.13
##$BF8= 200.13
##$BYTORDA= 1
##$CFDGTYP= 0
##$CFRGTYP= 5
##$CHEMSTR= <none>
##$CNST= (0..31)
1 1 145 1 1 1 1 1 1 1 1 1 1 1 1 1 1 1 1 1 1 1 1 1 1 1 1 1 1 1 1 1 
##$CPDPRG= <>
##$CPDPRG1= <>
##$CPDPRG2= <>
##$CPDPRG3= <>
##$CPDPRG4= <mlev>
##$CPDPRG5= <mlev>
##$CPDPRG6= <mlev>
##$CPDPRG7= <mlev>
##$CPDPRG8= <mlev>
##$CPDPRGB= <>
##$CPDPRGT= <>
##$D= (0..31)
0 1.2 0 0 0 0 0 0 0 0.06 0 0.03 0 0 0 0 0.0002 0 0 0 0 0 0 0 0 0 0 0 0 
0 0 0 
##$DATE= 1568888977
##$DBL= (0..7)
120 120 120 120 120 120 120 120 
##$DBP= (0..7)
150 150 150 150 150 150 150 150 
##$DBP07= 0
##$DBPNAM0= <>
##$DBPNAM1= <>
##$DBPNAM2= <>
##$DBPNAM3= <>
##$DBPNAM4= <>
##$DBPNAM5= <>
##$DBPNAM6= <>
##$DBPNAM7= <>
##$DBPOAL= (0..7)
0.5 0.5 0.5 0.5 0.5 0.5 0.5 0.5 
##$DBPOFFS= (0..7)
0 0 0 0 0 0 0 0 
##$DE= 6
##$DECBNUC= <off>
##$DECIM= 24
##$DECNUC= <off>
##$DECSTAT= 4
##$DIGMOD= 1
##$DIGTYP= 9
##$DL= (0..7)
0 120 120 120 120 120 120 120 
##$DP= (0..7)
150 150 150 150 150 150 150 150 
##$DP07= 0
##$DPNAME0= <>
##$DPNAME1= <>
##$DPNAME2= <>
##$DPNAME3= <>
##$DPNAME4= <>
##$DPNAME5= <>
##$DPNAME6= <>
##$DPNAME7= <>
##$DPOAL= (0..7)
0.5 0.5 0.5 0.5 0.5 0.5 0.5 0.5 
##$DPOFFS= (0..7)
0 0 0 0 0 0 0 0 
##$DQDMODE= 0
##$DR= 18
##$DS= 0
##$DSLIST= <SSSSSSSSSSSSSSS>
$$ [...]
##$SUBNAM2= <"">
##$SUBNAM3= <"">
##$SUBNAM4= <"">
##$SUBNAM5= <"">
##$SUBNAM6= <"">
##$SUBNAM7= <"">
##$SUBNAM8= <"">
##$SUBNAM9= <"">
##$SW= 24.0689530833862
##$SWIBOX= (0..15)
0 0 2 0 0 0 0 0 0 0 0 0 0 0 0 0 
##$SW_h= 4816.95568400771
##$TD= 16384
##$TD0= 1
##$TE= 0
##$TE2= 300
##$TE3= 300
##$TEG= 300
##$TL= (0..7)
0 120 120 120 120 120 120 120 
##$TP= (0..7)
150 150 150 150 150 150 150 150 
##$TP07= 0
##$TPNAME0= <>
##$TPNAME1= <>
##$TPNAME2= <>
##$TPNAME3= <>
##$TPNAME4= <>
##$TPNAME5= <>
##$TPNAME6= <>
##$TPNAME7= <>
##$TPOAL= (0..7)
0.5 0.5 0.5 0.5 0.5 0.5 0.5 0.5 
##$TPOFFS= (0..7)
0 0 0 0 0 0 0 0 
##$TUNHIN= 0
##$TUNHOUT= 0
##$TUNXOUT= 0
##$USERA1= <user>
##$USERA2= <user>
##$USERA3= <user>
##$USERA4= <user>
##$USERA5= <user>
##$V9= 5
##$VALIST= <valist>
##$VCLIST= <CCCCCCCCCCCCCCC>
##$VD= 0
##$VDLIST= <DDDDDDDDDDDDDDD>
##$VPLIST= <PPPPPPPPPPPPPPP>
##$VTLIST= <TTTTTTTTTTTTTTT>
##$WBST= 1024
##$WBSW= 4
##$XGAIN= (0..3)
0 0 0 0 
##$XL= 0
##$YL= 0
##$YMAX_a= 60976
##$YMIN_a= -95328
##$ZGOPTNS= <>
##$ZL1= 120
##$ZL2= 120
##$ZL3= 120
##$ZL4= 120
##$ABSF1= 10
##$ABSF2= 0
##$ABSG= 5
##$ABSL= 3
##$ALPHA= 0
##$AQORDER= 0
##$ASSFAC= 0
##$ASSFACI= 0
##$ASSFACX= 0
##$ASSWID= 0
##$AUNMP= <proc_1d>
##$AZFE= 0.1
##$AZFW= 0.1
##$BCFW= 1
##$BC_mod= 2
##$BYTORDP= 1
##$COROFFS= 0
##$CY= 11.3945322036743
##$DATMOD= 1
##$DC= 2
##$DFILT= <>
##$DTYPP= 0
##$F1P= 20.1720416913024
##$F2P= 0.152960286110954
##$FCOR= 0.5
##$FTSIZE= 0
##$FT_mod= 4
##$GAMMA= 1
##$GB= 0.15
##$INTBC= 1
##$INTSCL= 1
##$ISEN= 128
##$LB= 0.24
##$LEV0= 0
##$LPBIN= 0
##$MAXI= 10000
##$MC2= 0
##$MEAN= 0
##$ME_mod= 0
##$MI= 1.114404
##$NCOEF= 0
##$NC_proc= 0
##$NLEV= 6
##$NOISF1= 3.799351
##$NOISF2= 2.8
##$NSP= 1
##$NTH_PI= 0
##$NZP= 0
##$OFFSET= 15.70392
##$PC= 1
##$PHC0= -9729.87
##$PHC1= 10.80096
##$PH_mod= 1
##$PKNL= yes
##$PPARMOD= 0
##$PSCAL= 0
##$PSIGN= 0
##$REVERSE= no
##$SF= 200.130013532006
##$SI= 16384
##$SIGF1= 3
##$SIGF2= 2
##$SINO= 400
##$SIOLD= 16384
##$SREGLST= <1H.CDCl3>
##$SSB= 0
##$STSI= 0
##$STSR= 0
##$SW_p= 3612.71676300578
##$SYMM= 0
##$S_DEV= 0
##$TDeff= 0
##$TDoff= 0
##$TI= <>
##$TILT= no
##$TM1= 0
##$TM2= 0
##$TOPLEV= 0
##$USERP1= <user>
##$USERP2= <user>
##$USERP3= <user>
##$USERP4= <user>
##$USERP5= <user>
##$WDW= 1
##$XDIM= 8192
##$YMAX_p= 0
##$YMIN_p= 0
$$ End of Bruker specific parameters
$$ ---------------------------------
##NTUPLES= NMR FID
##VAR_NAME=  TIME,          FID/REAL,        FID/IMAG
##SYMBOL=    X,             R,               I
##VAR_TYPE=  INDEPENDENT,   DEPENDENT,       DEPENDENT
##VAR_FORM=  AFFN,          ASDF,            ASDF
##VAR_DIM=   8192,          8192,            8192
##UNITS=     SECONDS,       ARBITRARY UNITS, ARBITRARY UNITS
##FACTOR=    0.0002076,     1,               1
##FIRST=     0,             0,               0
##LAST=      1.7004516,     0,               0
##MIN=       0,             -95328,          0
##MAX=       1.7004516,     60976,           0
$$ Real data points
##PAGE= N=1
##DATA TABLE= (X++(R..R)), XYDATA
0@%%%%%%%%qJ6j6J6j6K4l2L3m1N6o4P2q8J04j20J36j54J78k07K36k67L02l40L80
$$ 0 0 0 0 0 0 0 0 0 -8 8 -8 8 -8 16 -16 17 -24 32 -32 40 -48 56 -64 72 -82 96 -111 125 -142 160 -180 200
32B00m25M79n35N94o63P39q19R08j005J111j231J365j513J676j861K072k311K588
$$ 200 -225 254 -281 313 -350 389 -430 478 -527 584 -647 718 -795 881 -980 1092 -1219 1369
50A369k913L300l770M355n110O123p564R792j3732K2794q0607k9365J27517j3194
$$ 1369 -1544 1756 -2014 2341 -2769 3354 -4210 5582 -8150 14644 -65963 -95328 32189 18995
64A8995k5170J3611J5441o1482l4194K1007K6186K511L8017K3833m5187n7855
$$ 18995 -6175 7436 22877 -38605 -72799 -51792 -25606 -23095 14922 38755 -6432 -64287
76f4287K1031L4800j6473j1642M7117K1780m5321l4152K1754O452k1235J5669
$$ -64287 -43256 -8456 -24929 -36571 10546 32326 -12995 -47147 -25393 -18941 -40176 -24507
88b4507M7129J552l5230j2638N58j8983q18L7427K1298j4694L708J9218k7073
$$ -24507 22622 24174 -11056 -23694 -23136 -42119 -42937 -5510 15788 1094 4802 24020 -3053
101c053n4100L664N0000J4982j6791Q342J6747j9561k6563N660J0988l316J3191
$$ -3053 -57153 -53489 -3489 11493 -5298 3044 19791 230 -26333 -20673 -9685 -13001 190
114A90K4845j1988l6574j982K3476k097j1350K0583K1446j9059k5178N843N813
$$ 190 25035 13047 -23527 -25509 -2033 -4130 -15480 5103 26549 7490 -17688 -11845 -6032
127f032j2372P635L2088O642k3899q350O271j3080j4637J8912K4838m956p963
$$ -6032 -18404 -10769 21319 27961 4062 -4288 1983 -11097 -25734 -6822 18016 13060 5097
140E097J2352j817k8161r292K2856J0293j1962L242J5997q289k1069L804J5505
$$ 5097 17449 15632 -12529 -21821 1035 11328 -634 2608 18605 10316 -10753 -6949 8556
153H556l259n105J3545O106j8676j2271J0897O509n977O367J4818m793j7527j305
$$ 8556 5297 192 13737 19843 1167 -11104 -207 6302 325 6692 21510 16717 -810 -2115
167b115O210o083k642J5935J1858r115r163K885l267j0681K895J3081K195m677
$$ -2115 4095 -1988 -4630 11305 23163 14048 4885 7770 4503 -6178 -3283 9798 11993 7316
181G316M824L366j1158q271Q427O407n688m67Q825j332j1671p93Q790L65l543
$$ 7316 12140 15506 4348 -3923 4504 10911 5223 4756 13581 12249 578 -215 8575 8940 5397
196E397N924M792q295q060L628L013m061L095J0086l53r948k342L278l945l929
$$ 5397 11321 16113 7818 -242 3386 6399 2338 5433 15519 15166 5218 2876 6154 2209 -1720
211a720P669Q238k540m150K007j987p676k40P567J752l609K597L840n691o010
$$ -1720 5949 14187 11647 7497 9504 7517 -159 -399 7168 8920 5311 7908 11748 6057 47
226D7L914M861k821j579M584m33o903r49N034J95k673L650L895n194n609K721
$$ 47 3961 8822 6001 4422 9006 8573 1670 721 5755 5950 3277 6927 10822 5628 19 2740
242B740K136l485M72O450J302n499j846K291k601m056L824N466j649k584K796
$$ 2740 4876 1391 1863 8313 9615 4116 2270 4561 1960 -2096 1728 7194 5545 2961 5757
257E757K14n929k342M982J958l333M36L557j694m795J063L539j660j691K829Q04
$$ 5757 5971 42 -2300 2682 4640 1307 1743 5300 3606 -1189 -126 3413 1753 62 2891 3695
273C695m229k095L516J100k332Q55L277j669m200K00J723j557o90L616K033k837
$$ 3695 -534 -2629 887 1987 -345 510 3787 2118 -2082 -1882 -159 -1716 -2406 1210 3243 406
289D06j681J311j543l136J235L780j33k031J295J285l012k410K167J575j875l51
$$ 406 -1275 36 -1507 -4643 -3408 372 239 -1792 -497 788 -2224 -4634 -2467 -892 -2767 -3118
305c118K311k11k583K21K209o89j814J176J306k245j850J733J469r09n1J833j36
$$ -3118 -807 -1018 -3601 -3380 -1171 -1860 -3674 -2498 -1192 -3437 -5287 -3554 -2085 -2994 -3045 -1212 -1348
322a348k241p64N74p55n58K068J927r65r62N15l78j979j96J719N22q14Q83J133
$$ -1348 -3589 -4353 -3779 -4534 -5092 -3024 -1097 -2062 -3024 -2509 -2887 -4866 -5062 -3343 -2821 -3635 -2752 -1619
340a619j224j515Q65Q96j280q32J673P65j321k82J695N53j193r6O68p31j297J83
$$ -1619 -2843 -4358 -3493 -2597 -3877 -4709 -3036 -2271 -3592 -3874 -2179 -1626 -2819 -2915 -2247 -2978 -4275 -4092
358d092J120J51L18J179N56q54j140j49l91m92O51J218O71j82J95l19p76l83L41
$$ -4092 -2972 -2821 -2503 -1324 -768 -1622 -2762 -2911 -3302 -3794 -3143 -1925 -1254 -1436 -1241 -1560 -2336 -2719 -2378
377b378R1j86M87R68j12n43L93N54o10p95M8L73o0j49Q24P99J75l6r9m68q30n88
$$ -2378 -2287 -2473 -1986 -1018 -1130 -1673 -1280 -726 -1336 -2131 -2083 -1710 -1770 -1919 -1095 -296 -121 -157 -256 -724 -1554 -2142
399b142K74L55K31N59R24L63n34o13l73j4m00NN96P72K55j05j68L3j36n06k27
$$ -2142 -1868 -1513 -1282 -723 201 564 30 -583 -956 -970 -1370 -1365 -769 3 258 153 -15 18 -118 -624 -851
420h51K56K02J41K95L24K19N5k05m38n00l92N4L42L84N82M75L18M7o65p38m40
$$ -851 -595 -393 -252 43 367 586 641 436 -2 -502 -894 -840 -498 -114 468 943 1261 1308 643 -95 -535
441e35K1K12l8O41P14L51l88k16k8l41l77j05L42L47p1N05K99k00m14j23j25k24
$$ -535 -514 -302 -340 301 1015 1366 978 762 734 393 16 -89 253 600 529 1034 1333 1133 719 596 471 247
463B47m10M41N09L00K22J22K2m51m18l63k18M6O43L60L24M60J44l92o16j98nn34
$$ 247 -163 278 787 1087 1309 1431 1453 1002 584 221 3 49 692 1052 1376 1836 1980 1588 972 774 769 235
485B35N5Q19M31k52J46K80j35n08l67L11k62j97L66P34m7k69K60M3o80o24L28
$$ 235 290 1109 1540 1288 1434 1714 1579 1071 704 1015 753 556 922 1656 1609 1340 1600 1643 963 339 667
506F67J80j0L65O65j9k29l5j35o09n37L64K61j05J09O18K10l17k58m5n43l41K95
$$ 667 847 837 1202 1867 1848 1619 1584 1449 840 303 667 928 823 932 1550 1760 1443 1185 1140 597 256 551
528E51K63k00J98N04J39n71k29M56l03n57K10M30q7j35L25L49p30k25K93m33n34
$$ 551 814 614 812 1316 1455 884 655 1111 808 251 461 891 804 669 994 1343 613 388 681 248 -286
549b86K40Q07j4m32M68L95q06p16M48J24o36k1Q28K69n47K17N19n28p31K03M22
$$ -286 -46 761 747 315 783 1178 372 -344 104 228 -408 -429 399 668 121 338 857 329 -402 -199 223
570B23n76k47P57L56o39j49O32k2r28q0O83k18m94N57O47n54n06M73K3q73o7O74
$$ 223 -353 -600 157 513 -126 -275 357 335 -593 -673 10 -208 -702 -145 502 -52 -558 -85 -62 -935 -1002 -328
592c28K07n42K64O91k97n54L0O06q08o07Q24M73n99j29R76K9p29k48O14k88q10
$$ -328 -121 -663 -399 292 -5 -559 -529 77 -731 -1338 -514 -41 -640 -769 207 236 -493 -741 -127 -415 -1225
613a225N78Q79o14m01N45L57p25k87N93L4o40R6Q29l2n69L28M63p07m12K25M63
$$ -1225 -647 232 -382 -783 -238 119 -606 -893 -300 -266 -906 -810 19 -13 -582 -254 209 -498 -910 -685 -222
634b22m65P0P50j07o04J79N28l56q48L73P00l96m11N22M46m40j63M87j94o03J01
$$ -222 -687 -617 133 26 -578 -399 129 -227 -1075 -702 -2 -398 -809 -287 159 -281 -444 43 -151 -754 -653
655f53P33k96m19M85M58n01m12L36K07n52j0P65j04o13L12O35k97p68L71L34l78
$$ -653 80 -216 -635 -150 308 -193 -605 -269 -62 -614 -624 141 37 -576 -264 371 74 -694 -323 11 -367
676c67l41O58J64n33N1Q33k50r30J79O42l29m93L58R22o42m95O55J51n42l85Q09
$$ -367 -708 -50 114 -419 -368 465 215 -715 -536 106 -223 -716 -358 564 -78 -573 82 233 -309 -694 115
697A15P5o20M1N53J40o13L1M34l25k91L08K64m87L1P11L7q22j4O51l30l92J56
$$ 115 190 -430 -389 164 304 -309 -278 156 -169 -460 -152 112 -375 -344 367 404 -418 -432 219 -111 -503 -347
719c47M70k28k63N36J21o96r7Q06k52o16J53Q30k88l41L10L10o01l54O13J73o85
$$ -347 123 -105 -368 168 289 -407 -504 302 50 -566 -413 417 129 -212 98 408 -193 -547 66 239 -446
740d46M4P48J1o07J40M39j98m84L69L76m72l87O76M25o36j95M98J30p52J44M54
$$ -446 -402 346 357 -250 -110 329 131 -353 16 392 -80 -467 209 634 -2 -197 301 431 -321 -177 277
761B77Ln55N92L49n06m49O70R4o53j37O47J14m74P0O01k19n49K97K51k77l70M14
$$ 277 280 -275 317 666 160 -289 381 475 -178 -315 332 446 -28 42 643 424 -125 172 423 146 -224 190
783A90K69k04k96M98Pm22j08M08j04m55L99L05k55l41M71J07l90l77N92r7l47
$$ 190 459 255 -41 457 464 42 -66 342 238 -217 182 487 232 -109 362 469 79 -298 294 197 -150
804a50K35M05j70l13K76K21n40k93N65J92l79j77N78K6n75J53M25k96l91K37L48
$$ -150 85 490 320 7 283 504 -36 -329 236 428 49 -128 450 476 -99 54 479 183 -208 29 377
825C77k57k18L12J77l09k70N17j60m48R1N07q9m92L52L00l88j30O3K80l57j63
$$ 377 120 -98 214 391 82 -188 329 169 -279 -188 319 230 -262 90 390 2 -128 -65 215 -142 -305
846c05K82J48k51J32K77k30k74K00J58k71j14L04J50j37k67K28J78m90J07J35
$$ -305 -23 125 -126 6 283 53 -221 -21 137 -134 -248 56 206 69 -198 30 208 -282 -175 -40
866d0M1k48K37K58k36j93J56J73l40j6K74O0k49L1K78k19j37Q7K49l67l7K11J78
$$ -40 1 -247 -10 248 12 -181 -25 148 -192 -208 66 126 -123 -92 186 -33 -170 -83 166 -201 -238 -27 151
889A51j64j41L04l0j71p6L27j81l02K03K28j85n7K25R4k34q8K04j11k11J27J90
$$ 151 -13 -154 150 120 -51 -127 200 19 -283 -80 148 -37 -94 131 225 -9 -97 107 -4 -215 -88 102
911A02j5j88J40Q9j73J6j07J60k67%K57R9k38K00q5M6j76O8R8r9j02K07P0m4k19
$$ 102 87 -101 39 128 -45 -29 -136 24 -243 -243 14 113 -125 75 -10 36 -140 -72 26 -73 -175 32 102 58 -161
936a61L15j23q3k0J42j5j82K23q4r0P3Q1l6j78q8J84J27k07k1K46o8j22n8R6L4
$$ -161 154 31 -52 -72 70 55 -127 96 12 -78 -5 76 40 -138 -226 -42 85 -122 -143 103 35 -87 -145 -49 -15
961a5j07J14J28j50n4K27r5j23p0J83k1j86J00J44j05o1J48m9o5m0J9qj3N8O1
$$ -15 -122 -8 120 -30 -84 143 48 -75 -145 38 17 -169 -69 75 -30 -91 57 8 -57 -97 -78 -86 -99 -41 20
986B0q6p9J27P8n4o5j08J21j23N6J07K7j44J42q6Rk3q3J70n4m6P2P1o8kJ1N8n8
$$ 20 -66 -145 -18 60 6 -59 -167 -46 -169 -113 -6 21 -123 19 -67 -58 -81 -164 6 -48 -94 -22 49 -19 -21 -10 48 -10
1014a0m3N3K2p2J31Pm1o9J35j09q8J5O6j4J52k6j48J72k49P4J69j91P8n8l1N4
$$ -10 -53 0 22 -50 81 88 47 -22 113 4 -84 -69 -3 -17 135 109 -39 133 -116 -42 127 -64 14 -44 -75 -21
1040b1j0RJ89p6N6o6o7p3J47q3J14j27P6j8n6nk8L8J82j81Q0O1j84J62j39%L5
$$ -21 -31 -22 167 91 147 81 14 -59 88 5 119 -8 68 50 -6 -11 -39 -1 181 0 80 141 -43 119 -20 -20 15
1067A5m0j4L9MJ36n7j31P5plp9Q4j3k1L4k6%r9J41j08k3J21R0j30J0pM0Q0p2%
$$ 15 -25 -39 0 4 140 83 -48 27 20 17 -62 22 9 -12 22 -4 -4 -103 38 -70 -93 28 118 -12 -2 -9 31 111 39 39
1097C9pj1k9M0r4Q7L5o7j1j6j7Km5O4N7j16J74j30J38Mj62N9L1K6r5p3J85o0o0
$$ 39 32 21 -8 32 -62 25 60 -7 -18 -34 -51 -49 -94 -30 27 -89 85 -45 93 97 -65 -6 25 51 -44 -117 68 8 -52
1126e2m7JK6P5l0j41J52j9Q0qL3r3j19Q9m1Q7Oj03J50j29Q0kK4j15j13J17P4R8
$$ -52 -99 -98 -72 3 -27 -168 -16 -35 45 37 70 -23 -142 -53 -94 -7 -1 -104 46 -83 -3 -5 19 -96 -209 -92 -18 80
1154H0j10M2N6k6Pk4K7j33Q6Q5j56R9j29M2j5J19j7j9j16J28J4m3J9o8L2N0M8
$$ 80 -30 12 68 42 49 25 52 -81 5 90 -66 33 -96 -54 -69 50 33 14 -102 26 40 -3 16 -52 -20 30 78
1181G8Mj69R2j3L4o8JP9o9J5n7K5O3j85M4j4J88q7L8q8J43j07n1O9j6K07j55n8
$$ 78 82 -87 5 -8 26 -42 -41 38 -31 -16 -73 -48 15 -170 -126 -140 48 -39 -1 -89 54 -53 -104 -35 -51 156 1 -57
1209e7J07l7O8j41L1nk7R0j17P7J8J00o9J4j37l6J48L3n8nJ27j98R8p8oL7k7l5
$$ -57 50 13 81 -60 -29 -34 -61 29 -88 -11 7 107 38 52 -85 -121 27 60 2 -3 124 -74 24 -54 -60 -23 -50 -85
1237h5O5r0P9J7P6l4m8J2o8K0n0N4k3J85j86m5K04n3n1j12N9kj5m6J66K1n3k1
$$ -85 -20 -110 -31 -14 62 28 -20 -8 -76 -56 -106 -52 -75 110 -76 -121 83 30 -21 -133 -74 -76 -91 -137 29 50 -3 -24
1265b4M2j05K7k3m1R5o6J4M5M1j30J45Q2n8r6P7j10J33m5k3P3j60J59j8J1k9N0
$$ -24 18 -87 -60 -83 -124 -29 -95 -81 -36 5 -125 20 102 44 -52 25 -85 48 3 -20 53 -107 52 34 45 16 66
1292F6j26NR9q1j9k4N1j11K1K12q1m0jJ07k5j29O5L3j60J16P6l5R0j26J6o9j05
$$ 66 -60 -55 44 -37 -56 -80 -29 -140 -119 93 12 -28 -29 78 53 -76 -11 22 -138 -22 54 19 109 -17 -1 -70 -175
1319a75K45l8MK9k4K9j83N3J18ooj10J30n4n3jN7l2R5j25Q9k4j6o0J49j18n4K23
$$ -175 70 32 36 65 41 70 -113 -60 58 52 46 -64 66 12 -41 -42 15 -17 78 -47 42 18 2 -58 91 -27 -81 142
1347A42K0k57J61n6p8K3O0qm3R7J9J10k55Q7N2k15J85q1pN9K4j8r1K8oM0J3j8
$$ 142 162 -95 66 10 -68 -45 15 7 -36 61 80 190 -65 22 74 -141 44 -37 -44 15 39 21 -70 -42 -48 -8 5 -13
1375a3J4K0nj5k5J1J0j33O3Q9L8p8L2k3J10qL9j03j4j31J34J8n2J13o2r2k4N4
$$ -13 1 21 16 1 -24 -13 -3 -136 -73 16 54 -24 8 -15 95 87 126 23 9 -122 12 30 -22 91 29 -63 -87 -33
1403c3m5J09p8L7O0Mj03J05j4l8o6n5J25K8k8k5k5R0q7P3J5l0m6ll3L2PR3Nm5
$$ -33 -78 31 -47 -10 50 54 -49 56 42 4 -62 -117 8 36 8 -17 -42 48 -39 34 49 19 -27 -30 -63 -31 -24 69 74 29
1433B9o8N5j02J90j21P3k6j6K9m7O4j03K0o2R7K9L5p5o9J33p2J9n5J22kj01L8
$$ 29 -39 16 -86 104 -17 56 30 14 43 -4 60 -43 -23 -85 12 41 76 1 -68 65 -7 12 -43 79 77 -24 14
1460A4J32j35M6j01K1O4r8o5M2P3L6l1k1qJP6j01L1M6o7n1J89j35K3O9M4r2J5
$$ 14 146 11 57 -44 -23 41 -57 -122 -80 -7 29 -2 -23 -31 -30 46 -55 -24 22 -45 -96 93 -42 -19 50 94 2 17
1488A7N8R1k87J48n2J1mo2Q1o7J48Mo7M3j65O1l8J04M4r0J8K3j5p9K0J74k07R4
$$ 17 75 166 -121 27 -25 -14 -18 -80 1 -66 82 86 19 62 -103 -42 -80 24 68 -22 -4 19 4 -75 -55 119 -88 6
1516FJ23j99N0j7J82p9m6l7J1J0M6j12R0M7Kj08q6KK8J08n3j9J00m0%N6j48N3
$$ 6 129 -70 -20 -37 145 66 20 -17 -6 4 50 -62 28 75 77 -31 -117 -115 -87 21 -32 -51 49 9 9 65 -83 -30
1544c0J5J1M1o0q7J17j19J80j30n9R0m4K7O3J7j08L4J21j17J33j33K5O5k6m1J00
$$ -30 -15 -4 37 -23 -110 7 -112 68 -62 -121 -31 -75 -48 15 32 -76 -42 79 -38 95 -38 -13 52 26 -15 85
1570H5l9j47N4J20q1qR3Q7j04j97J46M5l5j30K09p7M4p2K02j49j11J4M4R9j70
$$ 85 46 -101 -47 73 -8 -16 77 164 60 -137 9 54 19 -111 98 21 65 -7 195 46 -65 -51 -7 92 -78
1595g8R7n3M0K5o6O6j0j14J97j04P3p8Ro7mJ32r3p2J73l4j42KJ3J4Q3rm5Q4p5
$$ -78 19 -34 6 31 -35 31 21 -93 104 0 73 -5 4 -63 -67 65 -28 -100 73 39 -103 -101 -88 -74 9 0 -45 39 -36
1624c6R6j49J27L6q6J3j1K4K6j89J98m4r7Q9p9N5K5N7n4mR3j31K9qp4k3Q9J78
$$ -36 60 -89 38 74 -12 1 -10 14 40 -149 49 5 -92 -3 -82 -27 -2 55 1 -3 90 -41 -12 -20 -94 -117 -28 150
1652A50j11n9m3K8Q4k5O0j08l4K0P7j8j6l6k9J25m2p9J41j45P9N9kp9%p9R7k4
$$ 150 39 -20 -63 -35 49 24 84 -24 -58 -38 39 21 5 -31 -60 65 23 -56 85 -60 19 78 76 -3 -3 -82 15 -9
1680iqP0m5rQNl4P1N0l0j6n2M7r4J26l8L1q1J11m9n2k1Mk6J00j76R7Q1q5L3J0
$$ -9 -17 53 8 -1 7 12 -22 49 99 69 53 1 48 -46 80 42 73 -8 103 54 2 -19 -15 -41 59 -117 -20 61 -24 9 19
1711A9M7l7l3k4J6m8O7J02j53QK0O6p2j1J27j37J87j26r2J08mk1j4L8J73k45l0
$$ 19 66 29 -4 -28 -12 -60 7 109 -44 -36 -16 50 -22 -33 94 -43 144 18 -74 34 30 9 -5 33 206 -39 -69
1738f9k2J20K2r8J55n2j28rK5J44o4j8rl9O8l7M5p2L0K2J08j57kJ24k2q9rJ02
$$ -69 -91 29 51 -47 108 56 -72 -81 -56 88 24 6 -3 -42 26 -11 34 -38 -8 14 122 -35 -37 87 65 -24 -33 69
1766F9j8j1j0M2q7R6k1k3m3K1j3j8j4N7L2o4j2jQlQ3r3J82Rq3r9l6j3l7J57M2
$$ 69 51 40 30 72 -15 81 60 37 -6 15 2 -16 -30 27 59 -5 -17 -18 -10 -13 70 -23 159 168 85 -14 -50 -63 -100 57 99
1797I9j38L0P7m2j0K5R2j15N5p6o8J56o6J6J03j17p3J47j18l3R3o0J4m3J29q4
$$ 99 -39 -9 68 26 16 41 133 18 73 -3 -71 85 19 35 138 21 -52 95 -23 -56 37 -23 -9 -52 77 -7
1823gJ16j48J02r9Q8k4Mj9k8l4L6MO1m7K0q6K4lQ4j0r9J32o9m3R8J1n9J52j06
$$ -7 109 -39 63 -36 52 28 32 13 -15 -49 -13 -9 52 5 25 -61 -37 -40 44 34 -65 67 -2 -45 53 64 5 157 51
1852E1j52O7P1j58J38K0j08J53j36J02o0N8J7o3R1k41J21l0J28j21J42J8j55J00
$$ 51 -101 -34 37 -121 17 37 -71 82 -54 48 -12 46 63 0 91 -150 -29 -59 69 -52 90 108 -47 53
1876E3p8k2J00j16M6J0j75J49N1k1L5k8J5O6j42o0J52K7q5N5j5M4m9J02n9O3j33
$$ 53 -25 -47 53 -63 -17 -7 -182 -33 18 -3 32 4 19 85 -57 -117 35 62 -23 32 17 61 12 114 55 118 -15
1903a5L5KJ06q8j28R4j8N3o1PN7j73J25Jr4P6N3l7k6K6l8jJ29m0k37J39j2K26
$$ -15 20 22 128 40 -88 6 -12 41 -20 -13 44 -129 -4 -3 -97 -21 32 -5 -31 -5 -43 -44 85 45 -192 -53 -65 161
1931A61j27k8k9r3L2n1K40j59J12n4q1K6J33j2J5j55J60k0j50J66N5r4m0j19K9
$$ 161 34 6 -23 -116 -84 -135 105 -54 58 4 -77 -51 82 70 85 -70 90 70 -80 86 141 47 7 -112 -83
1956h3J73k6q2J4R7j85P3R6j24L8k1K5P2q3N4JLk0r5J23R0k19M1LJ08k8n7K4L2
$$ -83 90 64 -18 -4 93 -92 -19 77 -47 -9 -30 -5 67 -16 38 39 42 22 -73 50 140 -79 -38 -35 73 45 -12 12 44
1985D4j9j4lL8n2o9R3m3K4r2J35J0N2j94J89k13J35pJ3M8j68J49k6o9R9p1R0N8
$$ 44 25 11 8 46 -6 -75 18 -25 -1 -93 42 52 104 -90 99 -114 21 14 27 75 -93 56 30 -39 60 -11 79 137
2013A37j03q1m2l1J12KL7K3n1k7L7o2N8l2R2j01m8R5Q0j4l4j6j7p7J37j21N5k
$$ 137 34 -47 -89 -120 -8 -6 31 54 3 -24 13 -49 9 -23 69 -32 -80 15 95 81 47 31 14 -63 74 -47 8 6
2041Fn8K3mP3o9q8J22j08J33R8j58Nm7l7Q2j0n4K11j31Np8J92q2J4K0j02P7r3
$$ 6 -52 -29 -33 40 -29 -117 5 -103 30 128 -30 -25 -72 -109 -27 -37 -91 120 -11 -6 -84 108 26 40 60 -42 35 -58
2069e8PP9KL4j39J15j15J25NKk9L5oo4N4m3j5mL9k23J73Ll5P6O5O5j55R2L8k05
$$ -58 -51 28 30 64 -75 40 -75 50 55 57 28 63 57 -7 47 4 -11 -15 24 -199 -26 -23 -58 18 83 148 -7 85 123 -82
2099h2k6P2k9R5j30J77p0jK3L1P9j92J58q5m8N7m0J7Q4j42n9J1J08j0m0J04r1
$$ -82 -108 -36 -65 30 -100 77 7 6 29 60 139 -53 105 20 -28 29 -11 6 90 -52 -111 -100 8 -2 -42 62 -29
2126b9k2R2qO3j84J28p9J23j14J0k7n2P8L9m5P1n4O5n4m6L3o0J91j85K1Q4o8m5
$$ -29 -51 41 33 96 -88 40 -39 84 -30 -20 -47 -99 -21 18 -27 44 -10 55 1 -45 -12 -72 119 -66 -45 39 -29 -74
2154g4K13n7j23l3R2j8N0p4Q8J7j21rLL1K81k08m3N2M4j01J6K2mo9J4N2R3j13
$$ -74 139 82 -41 -74 18 0 50 -24 64 81 -40 -49 -46 -15 266 58 15 67 111 10 26 48 44 -25 -11 41 134 21
2182B1q5N6n9J04j4j05N9k6N7j9L8j06K2J67j35n6J78j87m5K67j89J81r9j19J33
$$ 21 -64 -8 -67 37 23 -82 -23 -49 8 -11 27 -79 -57 110 -25 -81 97 -90 -135 132 -57 124 25 -94 39
2207C9q5K06r7j34N5r3M4O7J1p5J56q5ok4LJ0oJ3O4m8O1j75O5L5l1j9OJ31m9K
$$ 39 -46 160 63 -71 -16 -109 -65 2 13 -62 94 9 3 -21 -18 -8 -14 -1 63 15 76 -99 -34 1 -30 -49 -43 88 39 41
2237D1k8n1J30L6j25M2n1N2r4nJ42k7j33j3K2L3J21j19L2nJ6j2k0j8j30J68o7
$$ 41 13 -38 92 128 3 45 -6 46 -48 -53 89 62 -71 -84 -62 -29 92 -27 5 0 16 4 -16 -34 -164 4 -63
2264f3oJ36o4Pl7k0N0MJ8l1p5J58q4l1P2J6o2n9P7pP1q5L8j14O5n5J66j64R5l4
$$ -63 -69 67 3 10 -27 -47 3 7 25 -6 -81 77 -7 -38 34 50 -12 -71 6 -1 70 -15 23 -91 -26 -81 85 -79 16 -18
2294a8m4P5j7mJ07j02ol0l4J35o8j5K2J9k4K0J34j46N0k3k6J6j9m6r4P8l8R1j
$$ -18 -62 13 -4 -8 99 -3 -9 -39 -73 62 -6 -21 1 20 -4 16 150 4 54 31 5 21 2 -44 -138 -60 -98 -7 -8
2323hq0J66o7o2O0m4J51J7j30K6nQ0k08Q3O4m1L3m2J12r5k2P5j47Q5q9P2R0j42
$$ -8 -88 78 11 -51 9 -35 116 133 3 29 24 104 -104 -21 43 2 35 -7 105 10 -12 63 -84 1 -88 -16 74 -68
2351f8P7p2k6pJ11pJ2j19K3J72j86K8J28k7Nn1O2o8OL8l2J6oo2KJ14j70J25m6
$$ -68 9 -63 -89 -96 15 8 20 -99 -76 96 -90 -62 66 39 44 -7 55 -13 -7 31 -1 15 9 -53 -51 63 -107 18 -28
2380b8j3oq1P9L9J20r6M2m0M9nk6J0n9o2L3J07j33P6j8K4k4oO2l8Q7o7q8R5m4
$$ -28 -41 -47 -128 -49 -10 110 14 56 16 65 60 34 44 -15 -77 -44 63 -70 6 -12 12 -12 -18 44 6 93 26 -62 33 -11
2410a1O8j27J44j6N1k55K07p8j9Np1Q6J3j0m6P8p8J44j21qJ03n0K6j28P2n4lJ14
$$ -11 57 -70 74 58 109 -146 61 -17 -36 -31 -102 -16 -3 -13 -59 19 -59 85 -36 -44 59 9 35 -93 -21 -75 -78 36
2438C6k5j48J89n9M7O6pp9L0k6M4o0n2l4L2M1N4j84J98r2j9J02j34J04L1m6k5
$$ 36 11 -137 52 -7 40 106 99 20 50 24 68 8 -44 -78 -46 -5 49 -135 63 -29 -48 54 -80 24 55 9 -16
2465a6j4RK5k0O5j33R2n9njj9J29j49J34J7J2m0l6q6P2j1Jj2p4J27n4J31q3m4
$$ -16 -30 -21 4 -16 49 -84 8 -51 -56 -57 -76 53 -96 38 55 67 27 -9 -95 -23 -34 -33 -45 -119 8 -46 85 2 -42
2494d2rL9j4Rk6k3N6j03J44j53J45j05J68j12j9O5q7Q5m6M6k8O6J5j17p0J61m7
$$ -42 -51 -12 -26 -17 -43 -66 -10 -113 31 -122 23 -82 86 -26 -45 20 -67 18 -28 18 -10 56 71 -46 -116 45 -2
2521bm9L0P8j00k1J02mj29R1m9plM2Jr2K26o6j99K11k6qj8k1o8M5P3p2N9m5P1
$$ -2 -51 -21 57 -43 -64 38 34 -95 -4 -53 -60 -63 -21 -20 -112 114 48 -151 60 34 26 8 -13 -81 -36 37 -35 24 -21 50
2551E0Jr6m9J60j36L6N6Jk06J69P4J2n0L0r1P7j46J66k0j46J06O9n0L4n3k4N6
$$ 50 51 -45 -94 66 -70 -34 22 23 -183 -14 60 72 22 52 -39 38 -108 58 38 -108 -2 67 17 51 -2 -26 30
2578C0n5K2n0K05j93NN4M6k00Q8o5m4J95j02J70j28L0q8P2J35q9L4l0j14R2M9
$$ 30 -25 -3 -53 152 -41 -36 18 64 -136 -48 -113 -157 38 -64 106 -22 8 -80 -8 127 38 72 42 -72 20 69
2604F9n0k6Q5l7J32j81j9L1k3O3j85J58K7K2K9p6j7L3k5J4Rr2J54j41MK7J8L7
$$ 69 19 -7 78 41 173 -8 -27 4 -19 44 -141 17 44 66 95 19 2 35 10 24 33 -59 95 -46 -42 -15 3 40
2632D0J0p8o0O2J05j12Nq0J82j1j66J35q7m9K6J34l6k9q1O3j00J11M4j9On9R5
$$ 40 50 -28 -88 -26 79 -33 -28 -108 74 63 -103 32 -55 -104 -78 56 20 -9 -90 -27 -127 -16 28 9 15 -44 51
2659E1L8j00J17j28lp9O6O9N5j14P2j31J34K3l5j06J1Q4o5p1R6j2J05n9L1o3n0
$$ 51 89 -11 106 -22 -25 -104 -38 31 86 -28 44 -87 47 70 35 -71 -60 24 -41 -112 -16 -28 77 18 49 -14 -64
2686f4QL8J0J21j39ql8P8j3Jn0J04qq4qj0R6j18P1J8M0r8P5m9q1J59j26L0m0L0
$$ -64 -56 -18 -8 113 -26 -34 -72 6 -7 -6 -56 48 40 -44 -52 -62 34 -84 -13 5 45 -53 22 -27 -108 51 -75 -45 -85 -55
2716e5P3q4jp1R8L2m5M3l4J07j27Q1Q7j24j6L2O2n3K3K9q8K1k6J92j28%K5j12
$$ -55 18 -66 -67 -138 -40 -8 -53 -10 -44 63 -64 17 104 -20 -36 -4 58 5 28 57 -31 -10 -36 156 28 28 53 -59
2744e9K1jn0J68K1r2k4R5j19J9p0R1Q6j75K48r7L5j86J0J03l3L9N0o5M5o2n3J12
$$ -59 -38 -39 -89 79 100 8 -16 79 -40 -21 -91 0 86 -89 159 62 97 -89 -79 24 -9 30 80 15 60 -2 -55 57
2772E7Pp3m2N4N8o1P8K7k00M8J22j32L3m9j0J01j3K1M0j83J14nR6o4m1L1Q5l9
$$ 57 64 -9 -51 3 61 0 78 105 -95 -47 75 -57 -24 -73 -83 18 5 26 66 -117 -3 -8 88 24 -17 14 99 60
2800F0j54K6O4N4p9JP9p4N4J2q0N3l5Q9K2j06J18p0Nr4P6j9n4J39j27R0n1M6L3
$$ 60 -94 -68 -4 50 -29 -28 51 -23 31 43 -37 16 -19 70 92 -14 104 34 39 -55 21 2 -52 87 -40 50 -1 45 78
2829G8j11k5n7Q7J2O8j69K60r8L5j7m5Kj02J71o1L6j24%J58k0o2j5PJ8r3PN1l3
$$ 78 -33 -58 -115 -28 -16 52 -117 143 45 80 63 18 20 -82 89 28 64 -60 -60 98 78 16 1 8 26 -67 -60 -9 -42
2858d2J05j17m1P7J6m4J51p4r3J17o1Q9m2lNqn5P1r1K9R4q1%j29K20r8q1O0K7
$$ -42 63 -54 -95 -18 -2 -46 105 31 -62 55 -6 83 41 38 43 35 -20 51 -40 -11 83 2 2 -127 93 -5 -86 -26 1
2887AO0j76N0J07K3j45OJ39n5m1jJ58o1k5J01j54N8k7m1J21l9j48J91j15M2M8
$$ 1 61 -115 -65 42 65 -80 -74 65 10 -31 -32 126 65 40 141 -13 45 18 -23 98 59 -89 102 -13 29 77
2913G7J4p6N2j94Q4N1P3j56J04k8L3l4lOk1o2M1P9M4q4K0N4l5J3k7L6J19l29J36
$$ 77 91 15 67 -127 -43 8 81 -75 29 1 34 0 -3 3 -18 -80 -39 40 84 0 20 74 39 52 25 61 180 -149 -13
2942a3p4M8K17j03J0Kn9Po8J43j35j9M0K3R2k09J20p3J11p4q9J89j26K0J9j7L3
$$ -13 -87 -39 178 75 85 87 28 35 -33 110 -25 -44 -4 19 111 -98 22 -51 60 -14 -103 86 -40 -20 -1 -18 15
2969A5o5oo0Q0O2l7NKK1N9j39K4K3lK5lK2k9K0r4J68j15Q4o8J06j58K4J09r4L5
$$ 15 -50 -56 -116 -36 26 -11 -6 -4 17 76 -63 -39 -16 -19 6 3 25 -4 16 -78 90 -25 59 -9 97 -61 -37 72 -22 13
2999A3j0o3K1J56j40oQ7k15Q9j0M8q8L4J49j46N2R0J6j63Q1N3j07oP0m4P9M3o5
$$ 13 3 -60 -39 117 -23 -29 58 -157 -68 -78 -30 -118 -84 65 -81 -29 61 77 -86 -5 48 -59 -65 5 -39 40 83 18
3027A8Q0q8m6M5M5k9p3L4l7K3n2J49o0Mn7q2J01N2n0J07j36M1J06j10k1R4j23
$$ 18 98 10 -36 9 54 25 -48 -14 -51 -28 -80 69 9 13 -44 -126 -25 27 -23 84 -52 -11 95 -15 -36 58 -65
3054f5J6Q2j25P1n8J32j36j5K28r6j1p2L7j6L3j26J48M7l5j7k9k6pN6j73Q1Q8
$$ -65 -49 33 -92 -21 -79 53 -83 -98 130 34 23 -49 -12 -28 5 -121 27 74 39 22 -7 -33 -40 16 -157 -76 12
3081A2Q0j69O8l4J04K5j04RL2QJ4r4J43p1j25J74j41L9K2N5n4O6p5L9K6j10J80
$$ 12 92 -77 -9 -43 61 86 -18 -9 23 31 45 -49 94 23 -102 72 -69 -30 -8 47 -7 59 -16 23 49 -61 119
3108A19r0j7j18J20l3P8op7o1J70j04l5J02o5n6L8N7o6J61n0j53R3K2J7j70J04
$$ 119 29 12 -106 14 -19 59 53 -24 -85 85 -19 -54 48 -17 -73 -35 22 -44 117 67 -86 7 29 46 -124 -20
3134b0L6j43R5k0J0R1j35L4N2O9q4Mo1R6j06J00l2J02j38l3Q9P8j1Kj22P1k9P
$$ -20 16 -127 -32 -52 -42 49 -86 -52 0 69 -15 -11 -72 24 -82 18 -14 88 -50 -83 6 84 73 75 -47 24 -5 2
3162Bo8Nj21J65n1n8K38j26J2o0j0p8J95j47Q8J8J8j17J2J31K6o3o2R7p4O8j4
$$ 2 -66 -61 -182 -17 -68 -126 112 -14 -2 -62 -72 -150 45 -102 -14 4 22 -95 -83 48 74 11 -51 46 -28 40 26
3189B6m9L4Pl7P9O4j08j0P1j09j8j7J26l1j28R0J7O9k4j01L4k7J41j28J48j34
$$ 26 -23 11 18 -19 60 124 16 6 77 -32 -50 -67 59 28 -100 -10 7 76 52 -49 -15 -42 99 -29 119 -15
3215a5j2P9Q0j65J30j2j01L3o8L0j60M5J86Q1n0p2L8K2j99J28K5J07j48n2L2n
$$ -15 -27 52 132 -33 97 85 -16 17 -51 -21 -181 -136 50 131 81 9 47 69 -130 -2 23 130 -18 -70 -38 -43
3241d3J4m8P9pk8j7kJ06J7o9Kr5J41n9P8M8j34R1kj25k2R8%o3J57m4j25J07j27
$$ -43 -29 -77 2 -5 -33 -50 -52 54 71 2 4 -91 50 -9 69 117 -17 74 72 -53 -75 23 23 -40 117 73 -52 55 -72
3270g2O5P9k6j13KO4k9J8L0m9n5J42p4p1J46n8l8J00q3j2n7J02m4Rj16J43J00
$$ -72 -7 72 46 -67 -65 -1 -30 -12 18 -31 -86 56 -18 -89 57 -1 -39 61 -22 -34 -91 11 -33 -24 -140 3 103
3297A03o2m6N1q1R6o8J39j48L5o2oJ32q3k4J33j54K0J12p1q9P6K0P1j20m0N7p3
$$ 103 41 -5 46 -35 61 -7 132 -16 19 -43 -49 83 0 -24 109 -45 -25 87 16 -73 3 23 94 -26 -66 -9 -82
3324h2J19j47P9J20j2j43M0N5j2J2q5K2m0O9j35Q9R5j14J32j30j9N0%J1N5p8L9
$$ -82 37 -110 -31 89 77 -66 -26 29 17 29 -56 -34 -74 -5 -140 -51 44 -70 62 -68 -87 -37 -37 -26 29 -49 -10
3351a0RM9k9j3Q5j35k2J07p4j5J59k35K49p0k7r0J61n7l7J0k4J22j57J3l7Q4J7
$$ -10 -1 48 19 6 91 -44 -66 41 -33 -48 111 -124 125 55 28 -62 99 42 5 15 -9 113 -44 -31 -68 16 33
3378C3N8j00k9P0j6m0M5o7O4l7R5m1l5J40j77N4j1n7J38l1km6K9%K5Rj02JM8n9
$$ 33 91 -9 -38 32 16 -24 21 -46 18 -19 76 35 0 140 -37 17 6 -51 87 56 54 8 37 37 62 71 -31 -30 18 -41
3408d1oQ4k4m0k2QJ0J47j61J42j3k0J89l07m6J03mj35J21J09j13O7J61j84n0L
$$ -41 -47 37 13 -27 -49 -41 -31 116 -45 97 84 64 253 -54 -100 3 -1 -136 -15 94 -19 48 209 25 -25 -22
3434b2KL7j17J56k2j8j00J60k3m3J2rmM1j15l2P9J9k9M5P4j79N6J06O1m4Jj75
$$ -22 -20 17 -100 56 34 16 -84 76 53 10 22 13 9 50 -65 -97 -18 1 -28 17 91 -88 -32 74 135 91 92 -83
3462h3J86o1j7l4L6J4k10J29LM1j6M3J46j65J64j41NNK1%m3Pl0N6l1q0P7m3K6
$$ -83 103 42 25 -9 27 41 -169 -40 -37 4 -12 31 177 12 176 35 40 45 66 66 23 30 0 56 25 -55 22 -21 5
3491Ek1K0l7qL1M3k6mJ13j43k2R3m2o4MR8o8l4M9K8p0J41j70M8J84j86k2l1R7
$$ 5 -16 4 -33 -41 -10 33 7 3 116 -27 -49 44 2 -62 -58 40 -28 -62 -13 15 -55 86 -84 -36 148 -38 -60 -91 6
3520Fk8R2n4k3M3j49M1j8P7J7n2M1j5pN4r7K8N3O5n3j0r7J34J8L8m8l6q6J5J71
$$ 6 -22 70 16 -7 36 -113 -72 -90 -13 4 -48 -7 -22 -29 25 -72 -44 9 74 21 11 -86 48 66 104 56 20 -66 -51 120
3550A20q8N2k3n0k9R7q9j12K8J3j3Q3k2rJ64n9j6p1P3k4j1J4j18MJ76m9km4Q3
$$ 120 32 84 61 11 -18 79 -10 -122 -94 -81 -94 -11 -33 -42 122 63 47 -24 49 25 14 28 -90 -86 90 41 39 -5 78
3579G8j21J56j08m2l6M2J07l2P8j51J39j85J6O3k1J3oj03P9q2P3j1J4Q4k7n8J76
$$ 78 -43 113 5 -37 -73 -31 76 44 122 -29 110 -75 -59 4 -17 -4 -10 -113 -34 -116 -43 -54 -40 44 17 -41 135
3606A35r1J8jj22k5J92k2j74M2M8j2l6L0M3l6N1m5P3l6j92J33k7Q6J8o5m4J03
$$ 135 44 62 61 -61 -86 106 84 -90 -48 0 -12 -48 -18 25 -11 40 -5 68 32 -160 -27 -54 32 50 -15 -59 44
3633D4l9O1j8L4n1l6L5R4j97J49m1K5k1q2J36n9j12K09j68m0K19j96l3K0RJ94
$$ 44 5 66 48 82 31 -5 30 124 -73 76 35 60 39 -43 93 34 -78 131 -37 -77 142 -54 -87 -67 -58 136
3659A36j36j15L7P0O3p3k8J49j22p5K5L9P6J3m3n8m3n5J93j36Q1j13Q9J5j12J60
$$ 136 0 -115 -78 -8 55 -18 -46 103 -19 -94 -69 -30 46 59 16 -42 -85 -140 53 -83 -2 -115 -26 -11 -123 37
3685C7q9n0N7j9lP7LJ7P0m3j13r3J93j3m7kM7oO0n2j02J00L8j13J16m5n3o5J01
$$ 37 -52 -102 -45 -64 -67 10 13 30 100 57 -56 -149 44 31 -16 -18 29 23 83 31 -71 29 67 -46 70 25 -28 -93 8
3714Hl2K8M8r8P8r4M6J56j23j11P0l2RM1J57j86N6j19J80k36J95o8L1rr5M1nJ02
$$ 8 -24 4 52 -46 32 -62 -16 140 17 -94 -24 -56 -47 -6 151 -35 21 -98 82 -154 41 -27 4 -5 -100 -59 -64 38
3742C8K4j19J43j04J8J12j75o6J82o8PK1K4q4N6M3j20l5J07Kj04O0J63q4m3M0
$$ 38 62 -57 86 -18 0 112 -63 -129 53 -15 -8 13 37 -47 9 52 -68 -103 4 6 -98 -38 125 41 -2 38
3768C8r1J00N7Rj10k4o6J20O7j36pJj11J08J00n2p7N3olQ5k1r6R6r1k0P9p3Q2
$$ 38 -53 47 104 113 3 -21 -87 33 100 -36 -43 -42 -153 -45 55 3 -74 -21 -27 -30 55 34 -62 34 -57 -77 2 -71 11
3797A1q5Q4K8m6L1R1q0n1n2o3J45K3O5r0q1R9j09N8J52k34O4P4m0j9J12j01j9
$$ 11 -74 10 38 -8 23 114 34 -17 -69 -132 13 36 101 11 -70 29 -80 -22 130 -104 -40 34 -6 -25 87 -14 -33
3824c3jnM8L3m2k6K07j32L8p6l6M1j6j7K4J2M5l8o5K9J9k1L3K5j2Q5k28pJ4N4
$$ -33 -34 -39 9 42 0 -26 181 49 87 11 -25 16 0 -17 7 19 64 26 -39 -10 9 -12 21 46 34 119 -109 -116 -102 -48
3854d8Q7n6P1j19N1n0J41j22P1q5K9R3k2q9N8p4Q9Ol6rJ6P8n0p7Qnl3J48q3J13
$$ -48 39 -17 54 -65 -14 -64 77 -45 26 -59 -30 63 41 -48 10 -64 25 31 -5 -14 2 80 30 -47 -39 -44 -77 71 -12 101
3884A01j8p4PJ8J7l2j3M6o5Pq5J21O8r5n6j8J07j47J01m6O4K6n4R5j27J30j51
$$ 101 83 9 16 34 51 19 6 52 -13 -6 -91 30 98 3 -53 -71 36 -111 -10 -56 8 34 -20 75 -52 78 -73
3911g3O7PM2q0J30p6M2n3j12J31M3j08OK9L7M9Kj09O9j2j02M5L0Kr4J67j33kJ36
$$ -73 -6 1 43 -37 93 17 59 6 -106 25 68 -40 -34 -5 32 81 83 -26 43 31 -71 -26 4 6 -88 79 -54 -56 80
3940H0R9k84J83j01Q1m2RK9j35N7k0m0O7l1K6J7j9J3ll3mj9MK5J15j58M6J37j09
$$ 80 179 -105 78 -23 58 16 25 54 -81 -24 -44 -84 -17 -48 -22 -5 -24 -11 -14 -47 -51 -70 -66 -41 74 -84 -38 99 -10
3969a0p4P4Nj65K02r3M6N1l4l6N7P0j29N8P9n2j11p9J29q8J21q9R5j4L8N5p4j01
$$ -10 -84 -10 -5 -170 32 -61 -15 36 2 -34 23 93 -36 22 101 49 -62 -141 -12 -100 21 -68 27 13 51 106 32 -69
3997f9J26r0J8R1j02L9N2j13L5l0J4Q1J5p8KN0j55N6j2k2K8K5n1mJ98n6l7k8J05
$$ -69 57 -33 -15 76 -26 13 65 -48 -13 -43 -29 52 67 -11 -9 41 -114 -58 -70 -92 -64 -39 -90 -94 104 48 11 -17 88
4026H8j7l2j29L6Q9m4j9p4J49j07J29p0P1n7n0O7l4j25J66l0l3J1jM2q0J68l4
$$ 88 71 39 -90 -54 35 -9 -28 -102 47 -60 69 -1 70 13 -37 30 -4 -129 37 7 -26 -15 -16 26 -54 114 80
4053H0o1p5J22j35J9J29k5p8L0J7L2j18m7N9R5O6p5l0L7p1k3R4j14Q2n7J3o5J42
$$ 80 19 -56 66 -69 -50 79 54 -24 6 23 55 -63 -110 -51 44 110 35 5 42 -29 -52 42 -72 10 -47 -34 -99 43
4081D3lr8J6J0J14j77P1rO8o2L1M4j54O2Q7p2N8l8K0J01m5l6M8r0n3J29q7J21
$$ 43 40 -58 -42 -32 82 -95 -24 -33 35 -27 4 48 -106 -44 43 -29 29 -9 11 112 67 31 79 -11 -64 65 -22 99
4109I9r6m8J10r8N5j39J65n8o7J61k6m7k3K3M0l7m8M6M2k4j01J05m7l3J2l9M9
$$ 99 3 -45 65 -33 22 -117 48 -10 -77 84 58 11 -12 11 51 14 -34 12 54 30 -71 34 -13 -46 -34 -73 -24
4136b4j1o5N8qL6j4P4j4j65J58m4Q6j46Q6N6j23n8J93q0l0k0l3P7P2n9Q2j68k7
$$ -24 -35 -100 -42 -50 -14 -28 46 32 -133 25 -19 67 -79 7 63 -60 -118 75 -5 -35 -55 -88 -11 61 2 84 -84 -111
4164a11R2K5j30J43j7o9J24o2j06J16Qo6J00j15L0P4o2k1J43o4j1p4K0m7M2M7
$$ -111 -19 6 -124 19 2 -67 57 -5 -111 5 13 -53 47 -68 -38 36 -26 -47 96 32 21 -53 -33 -80 -38 9
4190IQ2q5J6R3q2kj09M3R5m7K9o3j1o0J33l0mo0KP4Op5Q6j9K0o3r8K08j55R2P7
$$ 9 91 6 22 115 33 31 -78 -35 60 13 42 -21 -32 -92 41 11 7 -53 -51 23 29 -46 40 21 41 -22 -120 88 -67 25 102
4221A02j71n5Q4R7n1j10J59r4O0n4j9l8L2K2qJ47l9p8mj3J6J5r3j9P5Nn2Q9rk6
$$ 102 -69 -124 -40 57 6 -104 55 -39 21 -33 -52 -90 -58 -36 -44 103 64 -14 -18 -31 -15 0 -93 -112 -37 -32 -84 5 -4 -30
4251c0J12j30J12J7n6o5mm4J24L5j46N9M1o5NN8J05l4n5r6K8l2J35p5o1J36j31
$$ -30 82 -48 64 81 25 -40 -44 -88 36 71 -75 -16 25 -40 -35 23 128 94 39 -57 -29 -61 74 -1 -62 74 -57
4278e7j1J16j56MJ05p9R3q2JP9m9KM1Kl5J6K9p7J52j58M5L5R1j02Q6o0N9j46L1
$$ -57 -68 48 -108 -104 1 -78 15 -67 -66 13 -36 -34 7 9 -26 -10 19 -58 94 -64 -19 16 107 5 91 31 90 -56 -25
4307b5N0j12O6P0j60J52j50J34j8o3J61j47J8L5%m6pO5K5J3j64R4Q5n7l0m0MJ09
$$ -25 25 -87 -21 49 -111 41 -109 25 7 -56 105 -42 -24 11 11 -35 -42 23 48 61 -103 -9 76 19 -11 -51 -47 62
4335F2j19o1J38L7o7J6k7mPM4Q6j73o7J65k6K6j09P6l9P6Rp9J1M6J0j12J02oL8
$$ 62 -57 -118 20 57 -10 6 -21 -25 -18 26 112 -61 -128 37 11 37 -72 4 -35 41 50 -29 -18 28 38 -74 28 22 60
4364F0j49R1qL0N5m8l7p8J27n0q4J63r8L8r2O1K3l9p5Q7J7j92K19j55OK15qk2
$$ 60 -89 2 -6 24 79 31 -6 -84 43 -7 -91 72 -26 12 -80 -19 4 -35 -110 -23 -6 -198 21 -134 -128 87 79 57
4392E7j02P9k6o3L2L4pR6K3o0q8%m3N9J3L2j32k2J37o3Q8n3N0R6k77J92q5m9J47
$$ 57 -45 34 8 -55 -23 11 4 100 123 63 -25 -25 -68 -9 4 36 -96 -118 19 -44 44 -9 41 137 -140 52 -33 -82 65
4421F5r2Q0q3k7L3R2q1L8q0J21Nj18J15r4N1pj5k4mL5lL5j52J06j39J69J08k00
$$ 65 -27 53 -30 -57 -24 68 -13 25 -55 66 71 -47 68 -26 25 18 3 -21 -25 10 7 42 -110 -4 -143 26 134 -66
4449f6Q2lM0J10j81j11Q9l9K8N6qL6n7J1N4N1k91J94Q4j35M6j8MO2Kj4l1J33j25
$$ -66 16 13 53 163 -18 -129 -40 -79 -51 5 -3 33 -24 -13 41 92 -199 -5 79 -56 -10 -28 -24 38 40 26 -5 128 3
4478CP1J1j94N2M9j02Q5q1J53j01P2l5n1R6j34M4J8k1O3o1jR0q5J31j6n4r5J12
$$ 3 74 85 -109 -57 -8 -110 -25 -106 47 -54 18 -17 -68 28 -106 -62 -44 -65 -2 -63 -64 26 -59 72 56 2 -93 19
4506A9M4N6m8j04O0j1N3k4o2M8p6O8jL6m4O1n4J9o2L7j12J85m7%q7K1O4n0q5Q1
$$ 19 63 119 71 -33 27 16 69 45 -17 31 -45 23 22 58 14 75 21 40 -22 15 -97 88 41 41 -46 -25 39 -11 -96 -15
4536a5J40j16K9o8k6J21j76P9N9Kn6N7j14Q4K3Q5J6j26O3j35J51j19R1M9j25q2
$$ -15 125 9 38 -30 -56 65 -111 -32 27 29 -27 30 -84 0 23 108 124 -2 61 -74 77 -42 49 98 -27 -109
4562a09J79p5J8J9m3M9N1k5r0J35j52k2J6j9J56k04J11kO1J1J3o8j39J37J41j26
$$ -109 70 -5 13 32 -11 38 89 64 -26 109 -43 -65 -49 -68 88 -116 -5 -7 54 65 78 10 -129 8 149 23
4588B3K0j27MJ43k07K01j57J18j3J7M4j11M8k7N1o9K02k45J60m1r4J9R3N8j09
$$ 23 43 -84 -80 63 -144 57 -100 18 5 22 66 -45 3 -24 27 -42 160 -85 75 34 -60 -41 52 110 1
4613Am3jR6k17J78k5J5N1r2J13j54Q6J0q0J25l3j22J80K9j30p3J62q5LJ63j32
$$ 1 -42 -43 53 -164 14 -11 4 55 -37 76 -78 8 18 -62 63 30 -92 88 117 -13 -86 76 -9 -6 157 25
4639B5j11Q4J8m6J06k6p8K7K8R9j04l3M4j03J94j04j05J25%J9p7n5J5J65j91J38
$$ 25 -86 -2 16 -30 76 50 -28 -1 27 126 22 -11 33 -70 124 20 -85 40 40 59 -18 -73 -58 107 -84 54
4665E4q8K3K9O0l2n9nqJ7n3J56j88J48j39R5J1j3k0k1Q1n8j4N5n2km0K7Q2j8o6
$$ 54 -34 -11 18 78 46 -13 -18 -26 -9 -62 94 -94 54 -85 10 21 8 -12 -33 48 -10 -24 31 -21 -23 -63 -36 46 28 -38
4695c8n0J48L5j22RL8j36J06P4j09L1j0J1L4o9N0J06j31L5L5k9n7J13j7k5n0P9
$$ -38 -88 60 95 -27 -18 20 -116 -10 64 -45 -14 -24 -13 21 -48 2 108 -23 12 47 18 -39 74 57 32 -18 61
4722F1j9p1k0J26m6j2l2K2J9m8K9mo5P8Q2o6k5K2j47N0J03j15J62n1k6j0l9K9
$$ 61 42 -29 -49 77 31 19 -13 9 28 -20 9 5 -60 18 100 34 9 31 -116 -66 37 -78 84 33 7 -3 -42 -13
4750a3J18m3o0j7N5j17rJ03p4L5n2J02j3J18r6j9j05K01k92J12PL8M1m9K03k29
$$ -13 105 62 2 -15 40 -77 -86 17 -57 -22 -74 28 15 133 37 18 -87 114 -178 -66 -59 -21 20 -29 174 -55
4776e5J11j19J40p3Ml0lN7l2j1Mq1kQ4RJ28j39q6P7J20j65k1J46k05J68J2m7j8
$$ -55 56 -63 77 4 8 -22 -25 32 0 -11 -7 -88 -90 -6 3 131 -8 -94 -17 103 -62 -83 63 -142 26 38 -9 -27
4804b7R9j47O6Kp9J69q6K5n4K9p5J90o1n5j3o8R6l3L1j8k1P1p9o%j10J78Q4j34
$$ -27 72 -75 -9 -7 -86 83 -3 22 -32 -3 -78 112 51 -4 -17 -85 11 -22 9 -9 -30 41 -38 -44 -44 -154 24 108 -26
4833b6l7O8l3J50r7k4p3Q9O5k5lOj63K4J59p0o3N6M2lm4O2r2J2R5q8q3R7kP5j12
$$ -26 -63 5 -28 122 25 1 -72 17 82 57 54 60 -103 -79 80 10 -53 3 45 42 -2 60 -32 -20 75 -13 -96 1 -1 74 -38
4864c8J28p6l0K6j8M1Q3j40J34r1j3mm2j5R9J19n0j22L4L8r7o0J29j10J29jp1
$$ -38 90 14 -16 10 -8 33 116 -24 110 19 6 2 -40 -55 44 163 113 -9 25 63 -34 -94 35 -75 54 53 -18
4891a8Q2j30R0L3j03n1K02n2j12L6N4M1L8k4n1k1n5M3Q3p5n5K2L0Q9m0q7M6J6
$$ -18 64 -66 24 57 -46 -97 105 53 -59 -23 31 72 110 86 35 14 -41 2 85 10 -45 -23 7 96 56 -31 15 31
4919C1L9j65R9J0O1j73L7o3J85j37K9Q8J09o2o4r7O4p6N3J2O7j03J7J62r5j49
$$ 31 70 -95 4 14 75 -98 -61 -124 61 -76 -47 41 150 88 24 -73 -9 -85 -32 -20 47 -56 -39 123 28 -121
4945a21J9J32J7L4j84L6J53q3j5L1j8L0M9m8j18J17m1l5j24J37L7j01J68jj24
$$ -121 -102 30 47 81 -103 -67 86 3 -12 19 1 31 80 32 -86 31 -10 -45 -169 -32 5 -96 72 71 -53
4970e3P6j7j7R8q0J10j57j0P5J12k03J36k5J6O7j09j7N7o3k2J9r4J20j15R7j3
$$ -53 23 6 -11 87 7 117 -40 -50 25 137 -66 70 45 61 128 19 2 59 -4 -26 -7 -101 19 -96 1 -12
4996a2n3P9o5J69j5q8n8J3N4KN0q7Rn3J5K1Q1M0j55M3P5j12Q4k3o2N8J01p3j7
$$ -12 -65 14 -51 118 103 15 -43 -30 24 26 76 -11 -2 -55 -40 -19 62 102 -53 -10 65 -47 37 14 -48 10 111 38 21
5025B1pP3q2J27r6l6p7j6J29q7JP3o9J2L0M2K7m9L2L3j82J27p3R0p1olQ6%n3K
$$ 21 14 87 5 132 36 0 -77 -93 36 -51 -50 23 -46 -34 -4 38 65 16 48 81 -101 26 -47 43 -28 -34 -37 49 49 -4 -2
5056bL5l0m1L4l9K4M9j13P6j9J1Rj21J51RN2j00L3o9J05j31Q0L3m8k8n8Q4J36
$$ -2 33 3 -38 -4 -43 -19 30 -83 -7 -26 -15 -6 -127 24 33 85 -15 18 -51 54 -77 3 36 -12 -40 -98 -14 122
5084A22r5P4j26R6n0j5p7N0O0j31P6kk1M4o0N5o7Q9m5kJ7q9P9l4J39o2no7n1P5
$$ 122 27 101 -25 71 21 6 -71 -21 39 -92 -16 -18 -39 5 -55 0 -67 22 -23 -25 -8 -97 -18 -52 87 25 20 -47 -98 -23
5114b3P4q1k2J01o6m5O7k3L9o6ol5J08O0j00Q3j18J9J00p8l2N5r6J03j0M8j15
$$ -23 51 -30 -52 49 -17 -62 5 -18 21 -45 -51 -86 22 82 -18 65 -53 -34 66 -12 -44 11 -85 18 8 56 -59
5141e9M9K2k4RO1j87J87J8r5k3J8N0N4p1Nk7pqL7n8J10K5j62Q2q4J27J7r4M0O
$$ -59 -10 12 -12 -3 58 -129 58 76 -19 -42 -24 26 80 9 14 -13 -20 -28 9 -49 61 86 -76 6 -78 49 66 -28 12 18
5171A8kKk0rK6kj04M9O6p4J03l0J02j65J9M0j6o3J03J0j1p7n0K27j22j5p9J86
$$ 18 16 18 -2 -11 15 13 -91 -42 24 -50 53 23 125 -40 -21 19 3 -60 43 53 42 -35 -85 142 20 5 -74 112
5199A12r7m8N6n0PNJ26j59J09K5n7l1nR3M8j98R3N6j88R3klRp2R2p3K1Q1m9j7
$$ 112 15 -33 23 -27 -20 -15 111 -48 61 86 29 -2 -7 86 134 -64 29 85 -103 -10 -12 -15 -6 -78 14 -59 -38 43 -6 -23
5229b3J23m0oj21J24Q5j61J10j76J50p1pJ19q6jM8j34JLP1l4RJ5R2p0P0j27K5
$$ -23 100 60 54 -67 57 142 -19 91 -85 65 -6 -13 106 20 19 67 -67 -66 -63 8 -26 -17 -2 90 20 90 -37 -12
5257a2O3m7J37j76O7j2j35N7O9JRJ0n6j6M9P3q1Pr2Q0J25pj86nR3J20j79m8M2
$$ -12 51 4 141 -35 32 20 -115 -58 11 12 21 31 -25 -41 8 81 0 7 -85 -5 120 113 -73 -78 15 135 -44 -92 -50
5286e0J85k5n9o6r5J39l8N8j29Q9r0L4Q2q7P4Lm9O8j6j6n2K7P5q0K7kp8M7Q5j50
$$ -50 135 110 51 -15 -110 29 -9 49 -80 9 -81 -47 35 -52 22 25 -24 44 28 12 -40 -13 62 -18 9 7 -71 -24 61 -89
5316h9J10j37J71Rj8q5lP1J08j60m2J35j48P0N3ON8r2MO3J9j40Q9J4J0j11L0K6
$$ -89 21 -116 55 64 46 -39 -42 29 137 -23 -65 70 -78 -8 45 51 109 17 21 84 103 -37 52 66 76 -35 -5 21
5344B1p5qJ4Q9pm4Jj0n0Q5Pn7M4k0m5j16J79N4QJ4oj14Q7k00J45L9L6N7k43Q8
$$ 21 -54 -62 -48 41 34 -10 -9 -19 -69 16 23 -34 10 -10 -55 -171 8 62 70 84 78 -36 51 -149 -4 35 71 128 -115 -27
5374b7M9l3J03Pq6N9krj07l0K09k1j70J01n1nP5n7m8j2J39j00n4K7J27o5j4j4
$$ -27 22 -11 92 99 13 72 70 61 -46 -76 133 112 -58 43 -8 -13 62 5 -43 -55 84 -16 -70 -43 84 19 5 -9
5402ipJ2L2K1Mp0J18o7rk9l4KM9mO8j33O1J2J1q4P0NK0Mj3Qp2RM0r0J14j60K29
$$ -9 -16 -4 28 49 53 -17 101 34 25 -4 -38 -36 13 9 77 -56 5 17 28 -56 14 19 39 43 30 38 -34 -25 15 -75 39 -121 108
5435A08j9p6M7j5oJk0O3j15K2Ro4O8O0k8O4j13j4O5r7J11p3l5O7J6l2qoJ5q3J62
$$ 108 89 13 60 45 39 40 20 83 -32 -10 -1 -65 3 63 35 99 -14 -28 37 -60 51 -22 -57 10 26 -6 -14 -20 -5 -88 74
5466G4J8n1j3l4O4n6N5j9j32P7oK9p4q9J57p0M4R3P6j49L7m4J41k09O8j3k4K3
$$ 74 92 41 28 -6 58 2 57 38 -94 -17 -23 6 -68 -157 0 -70 -26 67 143 -6 31 -13 128 -81 -13 -26 -50 -27
5494b7K6j3MML0K2L0j38J05j10J2QN3J9j3l8L5L5lj22J04Q7n1j13M7K4PL1n1r
$$ -27 -1 -14 -10 -6 24 46 76 -62 43 -67 -55 -47 6 25 12 -26 9 44 41 -81 23 110 59 -54 -7 17 24 55 4 -5
5524eO3p6K8r6n4J94p7J00j56L1M9mK6n8LP5J5r5M6M4o1L6k7j0N8j44N9l9J66
$$ -5 58 -18 10 -86 -140 54 -23 77 -79 -48 1 -3 23 -35 -32 43 58 -37 9 53 -8 28 1 -9 49 -95 -36 -75 91
5553I1q7J07p9q4J7N6k6m7J56j48Q3m0m4l1J18j30J63j42lJ7M1n3J5K9J7m4J40
$$ 91 4 111 32 -52 -35 21 -5 -52 104 -44 39 -1 -45 -76 42 -88 75 -67 -70 -53 -12 -65 -50 -21 -4 -48 92
5580I2n3m6P6n5P4j21J3K5n6P6l7n1J70j97m6N9K24j20n2J00m8m6J2J3p1L7n1
$$ 92 39 -7 69 14 88 -33 -20 5 -51 25 -12 -63 107 -90 -136 -77 147 27 -25 75 27 -19 -7 6 -65 -28 -79
5607g9R5O6p3M2k6K5q1M1qor0N9o2N3N3q9J11L5j02J11j04N0j0PJ58j97N3lQ7
$$ -79 16 82 9 51 25 50 -31 10 2 -4 -94 -35 -97 -44 9 -80 31 66 -36 75 -29 21 11 18 176 -21 32 29 116
5636A16j17J9m9O5j54P2J34j62K4N5jL2Q5j83J09K7K3j45J16j04M6kk3L9q9n5
$$ 116 -1 18 -31 34 -120 -48 86 -76 -52 3 2 34 119 -64 45 72 95 -50 66 -38 8 6 -17 22 -67 -122
5662a22P9J53j31L6J01j72R7%m1Oq7O6MO6j21J06j16M4o1O2M9k9J05j90J03Q9
$$ -122 -43 110 -21 15 116 -56 41 41 0 6 -81 -15 -11 55 -66 40 -76 -32 -93 -31 18 -11 94 -96 7 96
5688I6J0j00O8j14O2Qp4m6J04J5M2r8k5O1lN7j61J1R3j1k1N2r6J32%r3J18m1m6
$$ 96 106 6 74 -40 22 30 -44 -90 14 29 71 -27 -52 9 6 63 -98 -87 6 -5 -26 26 -70 62 62 -31 87 46 0
5717@JQ9k25J18pR3O1r7Rj7p1Q0L3k0m7o3R7N2j35n2J56l8n3O5J9r5J17j34P3
$$ 0 1 90 -135 -17 -24 69 130 33 42 25 -46 34 67 47 0 -63 34 86 -49 -101 55 17 -36 29 48 -47 70 -64 9
5746Ir7J28o0m5J12q5K0J02j40J29j43N9k9O3O3j39LoM4q2J36o3LO8j15R9P1k48
$$ 9 -88 40 -20 -65 47 -38 -18 84 -56 73 -70 -11 -40 23 86 -53 -50 -56 -12 -94 42 -21 -18 50 -65 34 105 -143
5774a43J81j24J01k6rR6j15l0J05j29J06P5j01o7L7L0p3J43o9J6J22j32nJ5M3
$$ -143 38 -86 15 -11 -20 76 -39 -69 36 -93 13 88 -13 -80 -43 -13 -86 57 -12 4 126 -6 -11 4 47
5799D7j08M7km9MM6j70J27Q6m2N8p2Q0j03O1O6o6M5p8R9ko7J1N2Q4j79j1K2Lk6
$$ 47 -61 -14 -16 -65 -61 -15 -185 -58 28 -14 44 -28 52 -51 10 76 10 55 -23 76 74 7 18 70 154 -25 -36 -14 -11 -37
5829c7M8k1o0J11q4J6O4q4Q7j08J30p2L2jJ02r9q6M7M4j17O4L4j6j2n1J04p3l1
$$ -37 11 -10 -70 41 -43 -27 37 -47 40 -68 62 -10 22 21 123 24 -62 -15 29 -88 -24 10 -6 -18 -69 35 -38 -69
5857f9l4K4M0M9k8L5%k3m5J21k7q0Qjj1lL6k6M2L3p7j1M1J71j01j71kJ42o2n4
$$ -69 -103 -79 -39 10 -18 17 17 -6 -51 70 43 -37 -29 -30 -41 -44 -8 -34 8 41 -36 -47 -6 165 64 -107 -109 33 -29 -83
5887h3L8PR2q4%J5R0J5j38P0n3N2j34J15J13j76k2j3K6Q2R4j19j0r2J84KN4j14
$$ -83 -45 -38 54 -30 -30 -15 75 90 -48 22 -31 21 -113 2 115 -61 -83 -96 -70 12 106 -13 -23 -115 69 71 125 11
5915A1k8J6L7j92J38L5mq2O5m9J29k6M1o9k0lm6P1l3J10q5LM8r5l0mR0N0L3p7
$$ 11 -17 -1 36 -156 -18 17 13 -69 -4 -53 76 50 91 22 2 -1 -47 24 -9 101 16 19 67 -28 -58 -62 28 78 111 34
5945C4j32J07q1R2p7R1Rn2m4P1n5L4o5J41l6J3j65J11K1q9J13j36J02J9M5j45
$$ 34 -98 9 -72 20 -57 34 43 -9 -53 18 -37 -3 -68 73 37 50 -115 -4 17 -72 41 -95 7 26 71 -74
5971g4M9J24p8m4P1k5nr5J49n3j21P4N5pk1n0J27j00rl5J91r5l3lP8j56J44j96
$$ -74 -25 99 21 -23 48 23 18 -77 72 19 -102 -28 27 20 -1 -51 76 -24 -33 -68 123 28 -5 -8 70 -86 58 -138
5999a38J09P3L5l5l9O2j36j2Q0j50K06j30J03l1j1O7j05J7k7N1J39j27o4J63j78
$$ -138 -29 44 79 44 5 67 -69 -81 -1 -151 55 -75 28 -3 -14 53 -52 -35 -62 -11 128 1 -63 100 -78
6024g8P4K0j1j8N5j67J67K8Mr9Q0L9o0l6j06M8J71r4J6N0j19K0L5Ool6j29O2P0
$$ -78 -4 16 5 -13 42 -125 42 70 74 -25 55 94 34 -2 -108 -60 111 17 33 83 -36 -16 19 25 19 -17 -146 -84 -14
6053a4J06j01n8j8P2J10j25O4K7j00M2j12J00o6J07l0p2J53p3O6p8mo0J19r3N2
$$ -14 92 -9 -67 -85 -13 97 -28 36 63 -37 5 -107 -7 -73 34 4 -68 85 12 78 0 -4 -64 55 -38 14
6079A4m1J3L0l8j4P1Nj4j00J8J02n5m4N0M1r7J0MO1M6m9J06o3j03P9q9R0P4j60
$$ 14 -27 -14 16 -22 -36 35 40 26 -74 -56 46 -9 -53 -3 38 -59 -49 -45 16 62 13 119 56 -47 32 -57 33 107 -53
6108e3N2l9J62j40M8j5K2pp2K1P7q3n0R7j90J59n3L1l8M2J07j27N6P4r1P0Ko3
$$ -53 -1 -40 122 -18 30 15 37 30 -42 -21 56 -27 -77 20 -170 -11 -64 -33 -71 -29 78 -49 7 81 -10 60 62 -1
6136aqR0N0n0r5P3M2n2r9J11L3j19J18l9q6k1J05k4J3q6M2l2m5J32k6k2O1o8M1
$$ -1 -9 81 131 81 -14 59 101 49 -50 61 94 -25 93 54 -32 -53 52 28 41 -45 -3 -35 -80 52 26 4 65 -3 38
6165C8q6K5N5r4R0r8Q6J8p9O9k11K36q9J01J4l4j26P5k0L3j4K2N0ojq4Q0j9L9
$$ 38 -48 -23 32 -62 28 -70 16 34 -45 24 -187 49 -40 61 75 41 -85 -10 -30 3 -11 11 61 55 54 -30 50 31 70
6194G0o0K1J04l7r7r5mJ69l1R2j44K2p0%J30q6J16j04Q2j21P0m8pQ1l5p1K8l5
$$ 70 10 31 135 98 1 -94 -98 71 40 132 -12 10 -60 -60 70 -16 100 -4 78 -43 27 -21 -28 53 18 -53 -25 -60
6222f0j2P4p3J53o6p1K2Q0j86R6Q0M9j04J8JN0N2Mj8r3J4L5j4MQr0j8J08Q6j50
$$ -60 -72 2 -71 82 16 -55 -33 47 -139 -43 37 86 -18 0 1 51 103 107 89 -4 10 45 31 35 43 -47 -65 43 129 -21
6252b1j6K9j1R2j08Q1l0j8o2J9J48j98K09j43mk2J06mO1q8m9Pj5K0m7M6J8o0O2
$$ -21 -37 -8 -19 73 -35 46 16 -2 -64 -45 103 -95 114 -29 -33 -55 51 47 108 20 -29 -22 -37 -17 -64 -18 0 -60 2
6281BJ1k0K2J29j80J55j01K5j68J24m0qJ33m4q3lJ47J6j80N8o7P1k1j3n8J47q5
$$ 2 13 -7 15 144 -36 119 18 43 -125 -1 -41 -49 84 40 -43 -46 101 117 -63 -5 -72 -1 -22 -35 -93 54 -31
6308c1P0l2J27l5r5OK3JL4Rr4rJ1l5N8LJ4p8Q9K2q2j33J04J82m8j39Q1M1j0Jo8
$$ -31 39 7 134 99 4 10 33 34 68 77 -17 -26 -15 -50 8 11 25 -53 36 58 -24 -157 -53 129 81 -58 23 64 54 55 -13
6339a3R9q8N7L2j35J04o3%K2q2J30j41K8O5n7K2l5OK04j23l8nk0m8J27o8O2q5
$$ -13 86 -2 55 87 -48 56 -7 -7 15 -67 63 -78 -50 15 -42 -20 -55 -49 155 32 -6 -11 -31 -79 48 -20 42 -43
6367d3j8P9M9j29n0J00Q9j17P0n2l0R8M9p0J7j29N0JP1n5P6M3q7o5J01j05M3J60
$$ -43 -61 18 67 -62 -112 -12 77 -40 30 -22 -52 46 95 25 42 -87 -37 -36 35 -20 56 99 12 -53 48 -57 -14 146
6395A46q6p6J25j31P1o6J0m5J7R6o8l5M9N8k6Mj31J18J5jN8j73J02j2L7ml2o2
$$ 146 60 -16 109 -22 49 -17 -7 -52 -35 61 -7 -42 7 65 39 43 -88 30 45 44 102 -71 31 19 56 52 20 -42
6423d2M2j0j9k8J4J03m1k0N0K8j28k4N6P7q2N6k1j1pL6m3K5r4P0O1n8O2o7J47
$$ -42 0 -10 -29 -57 -43 60 19 -1 49 77 -51 -75 -19 58 -24 32 11 0 -7 29 -14 11 -83 -13 48 -10 52 -15 132
6452A32k23P8k8P7k2k8j62J76P3m2n7oJ68p3n5k36J58J35m3q8L7K5Rl9J50l3j00
$$ 132 -91 -13 -41 36 14 -14 -176 0 73 31 -26 -32 136 63 8 -228 -70 65 22 -66 -29 -4 5 -34 116 83 -17
6479a7K1M8J4Rr6O2o6j04J37q0M3J81j15L2j03Oo4l0J27k2J0l6M9L8q5P5l5L6
$$ -17 4 52 66 75 -21 41 -25 -129 8 -72 -29 152 37 69 -34 -28 -92 -122 5 -17 -7 -43 6 44 -41 34 -1 35
6507C5n5q4J27j31P1PL4q1M0J9p7J12k0O0j33M6q7Q5K5JJ5j9mJ9pJ56k21R9k2
$$ 35 -20 -104 23 -108 -37 -30 4 -77 -37 -18 -95 17 -3 57 -76 -30 -117 -32 -7 -6 9 -10 -14 5 -2 154 -67 32 10
6536A0P5q6L5j08J02J1r7O3R2r5K4q5L4kj5K0j3P5j19J51o2p8O8j4L9k7K8j30
$$ 10 85 -1 34 -74 28 39 -58 5 97 2 26 -59 -25 -27 -42 -22 -35 40 -79 72 10 -68 0 -14 25 -2 26 -104
6564a04pR7L5n2p7J58p2l4J05j03R1r0k8L2J40l0J24k53j3J7J31k4q1n7Q7j3J04
$$ -104 -111 -14 21 -31 -108 50 -22 -56 49 -54 37 -53 -81 -49 91 61 185 -68 -81 -64 67 43 -38 -95 -8 -21 83
6591H3Qj8j3q2j30K52m6Pq6N9o9Q7j73J36k2P9j3k2k8j25M5M5N8j21J12j58J63
$$ 83 91 73 60 -22 -152 100 54 61 -25 34 -35 52 -121 15 -7 72 59 37 9 -116 -71 -26 32 -89 23 -135 28
6618B8o0L4O4j35k2L5J20l4o6J24j3j91Q3P6k5j4rK2N3p4M9n8j1r7O8N2l5J38
$$ 28 -32 2 66 -69 -91 -56 64 30 -36 88 75 -116 -33 43 18 4 -5 17 70 -4 45 -13 -24 -121 -53 -1 -36 102
6646A02q5j14K14p2N3%p6k0k4K7o9J02j73R8R7q1N5jk7r9LJ26k5j6kl3J29j18
$$ 102 17 -97 117 45 98 98 22 2 -22 5 -64 38 -135 -37 60 -21 34 33 6 -93 -90 36 11 -5 -7 -40 89 -29
6674b9L3j2k7M7m5jO7j08K30j55J44o6j21O8m0jO1Mo9N6Mj39Q2J01o0n1JN0k0
$$ -29 4 -8 -35 12 -33 -34 33 -75 155 0 144 78 -43 25 -15 -16 45 49 -20 36 40 -99 -17 84 24 -27 -26 24 4
6703DN4o5k9J50j44K9j0l8M3KJ5m7JN0K1JJ7j15m6J71o8r5J29N1j36J33n7j1K0
$$ 4 58 -7 -36 114 -30 -1 -11 -49 -6 -4 11 -36 -35 15 36 37 54 -61 -107 64 -4 -99 30 81 -55 78 21 10 30
6732C0k7m7r4L8J41j54P4J46k13R8m6R0j55K19j08j8L2o4K03j61k0Q2Nj2j7k6
$$ 30 3 -44 -138 -100 41 -113 -39 107 -106 -8 -54 36 -119 100 -8 -26 6 -58 145 -16 -36 46 51 39 22 -4
6758dm6L2K8J43j39k8JJ3j2q9J74j09oqR2q8J79m0J6j80J81n3m9p6j7O3l6N3k4
$$ -4 -50 -18 10 153 14 -14 -13 0 -12 -101 73 -36 -42 -50 42 -46 133 93 109 -71 110 57 8 -68 -85 -22 -58 -5 -29
6787b9PpL7j6m6j1P0q5J5O9M5Pq3j01J06k8lJ31j29l0%J7Q4K9%K6o2k6l2J13j49
$$ -29 -22 -29 8 -8 -54 -65 5 -80 -65 4 49 56 -27 -128 -22 -50 -53 78 -51 -81 -81 -64 20 49 49 75 13 -13 -45 68 -81
6818h1M6l4n1J52j16J92k1l3n9l0Q3mj4k1j52K54p0r3J36j44K3M7M5k4l5pR9J7
$$ -81 -35 -69 -120 32 -84 108 87 54 -5 -35 48 44 30 9 -143 111 41 -52 84 -60 -37 10 55 31 -4 -11 88 105
6846A05j99J91j91J26P0K9j23L2o7K6J11r0M1k7K3l9n5R3Qq4Q7K8o2m0JJ6N5l6
$$ 105 -94 97 -94 32 102 131 8 40 -27 -1 110 20 61 34 57 18 -37 56 64 -20 67 95 33 -7 -6 10 65 29
6874B9j15n3K02n5L5m9r8J42k7k7N7q2J10j06J21j6m5rJ15j73M0l1J43k12J13
$$ 29 -86 -139 63 8 43 -6 -104 38 11 -16 41 -41 69 -37 84 68 23 14 129 -44 -4 -35 108 -104 9
6899In6P7j24R7L8pk1pJ6K8m3k4R4Om9j46J51j06jR9L4q3j3R9m5m5P1o6L7L3l8
$$ 9 -47 30 -94 3 41 34 13 6 22 50 7 -17 77 83 34 -112 39 -67 -68 31 65 -18 -31 68 23 -22 49 -17 20 53 15
6930A5k5R3l4p9N7l8n4L7K0K1j1o5l1J70k8p3Q2j60J98r9M2k4J8n0j9Q7P4j87
$$ 15 -10 83 49 -30 27 -11 -65 -28 -8 13 2 -63 -94 76 48 -25 57 -103 95 -4 38 14 32 -18 -37 50 124 -63
6958f3%R1J0k9m3K8RQl6J1q1N9R5l4Ok2m6%j6Q2J9NJ7j48L7n9O5L3l6P6k1L9q5
$$ -63 -63 28 38 9 -34 -6 3 11 -25 -14 -95 -36 59 25 31 9 -37 -37 -53 29 48 53 70 -78 -41 -100 -35 -2 -38 38 17 56 -29
6991b9L0n6R9om2N5p0Nj0l5O3o2J42j02r2J86r1o1N9k4k5L1M2O7Nk56K32j60J23
$$ -29 1 -55 44 38 -4 51 -19 -14 -24 -59 4 -58 84 -18 -110 76 -15 -76 -17 -41 -66 -35 7 74 79 -177 55 -105 18
7020A8j0j21N0K6J7l1N5J43p5j44N2rJ8m8qL4L8J0J00j43J53o9P0j67K9O4R8j50
$$ 18 8 -113 -63 -37 -20 -51 4 147 72 -72 -20 -29 -11 -59 -67 -33 5 15 115 -28 125 56 126 -41 -12 52 150 0
7048@j38K05j08J05qlr6N9N9n0n2N2l2k4L9KM9j05M0l4j3M3M9m4J0l9L4n6JJ22
$$ 0 -138 67 -41 64 56 53 -43 16 75 25 -27 25 -7 -31 8 10 59 -46 -6 -40 -53 -10 39 -5 5 -34 0 -56 -55 67
7078F7j51O0q1J52p6M6O3o6K2O1QOj10o1J2n2J39l5L0J6J9j85J00kq5K04q3N4
$$ 67 -84 -24 -105 47 -29 17 80 14 36 97 105 111 1 -60 -48 -100 39 4 34 50 69 -116 -16 -18 -103 101 18 72
7106G2n3N8r1O6o5P0K3p4R6j31J09k0p2j1k5N8n5MJ60j79j2R9k3k4n3Q3M6K3j52
$$ 72 19 77 -14 52 -13 57 80 6 102 -29 80 60 -12 -23 -48 10 -45 -41 119 -60 -72 27 4 -20 -73 10 56 79 -73
7135g3J4M4Rm4K8Rm8M8O9j37O0K6L0m1j3O7j59J22m6m8M7J5J47j83N6M3kj1l3
$$ -73 -59 -15 -6 -50 -22 -13 -61 -13 56 -81 -21 5 35 -6 -19 48 -111 11 -35 -83 -36 -21 126 -57 -1 42 40 29 -4
7164dj9kP2p1J27rj07oR5j21j2J13q7O7l0rJ22p5j14o8R2MP1l7K6N5m6r9M7J09
$$ -4 -23 -25 47 -24 103 94 -13 -19 76 -45 -57 56 -31 36 6 -3 119 44 -70 -138 -46 -42 29 -8 18 73 27 -72 -25 84
7194H4r9K9p2M0N8r4L0O9Kr1J06k5k4L9k1q7O6Ol9N3n7P7j58R4J05J7j05J01k13
$$ 84 -15 14 -58 -18 40 -54 -24 45 47 -44 62 37 13 52 31 -56 10 16 -23 30 -27 50 -108 -14 91 108 3 104 -109
7223a09Q1J21q9q0O4l1QK8l1K7k9J0lQ1j04O6P6j47J5k5M3K6l0Q0j3k3R6j40O6
$$ -109 -28 93 4 -76 -12 -43 -35 -7 -38 -11 -40 -30 -33 48 -56 10 86 -61 -46 -71 -28 -2 -32 48 35 12 108 -32 34
7252C4k8J6J37k55J14n9J7M6rq6J38L4p8L0q1p7K00L5j97N9Q9r3O6m7N7r3L0o
$$ 34 6 22 159 -96 18 -41 -24 22 13 -73 65 99 21 51 -30 -107 93 128 -69 -10 79 -14 52 5 62 -31 -1 -7
7280gk8J29O6j12m9n8R9o7l8NP1q6R2J53j39K3j19j3N6M6l2q9O5p5O5K1k0M0J44
$$ -7 -35 94 160 48 -1 -59 40 -27 -65 -60 11 -75 17 170 31 54 -65 -78 -22 24 -8 -97 -32 -107 -42 -21 -41 -1 143
7309A43j13Jm7o6J9P7j41J49p2k0P2l6J9L9J9OM4j74P1j6K0k4j27P5J19J42j69
$$ 143 30 31 -16 -82 -63 14 -127 22 -50 -70 2 -34 -15 24 43 49 93 -81 -10 -26 -6 -30 -157 -82 37 179 10
7336A0K5j0J01j85l4R4J5n1J08p9kL4r6J37J1p4K3NK3p5Pl7Q5J8qM5q6O7j76Q7
$$ 10 35 25 126 -59 -93 1 16 -35 73 -6 -8 26 -70 67 78 4 27 32 55 -20 -13 -50 35 53 45 90 4 71 -105 -18
7366a8m0L1J5l5Qm6R7%j27J43l1JR2j5j13o1J52rq2l2J5N8kj35J81k8m5N4O3J4
$$ -18 -58 -27 -12 -47 -39 -85 12 12 -115 28 -3 -2 90 75 -38 -99 53 44 -38 -70 -55 3 1 -134 47 19 -26 28 91 105
7396A05p5ql9j1P7j21RO8n1Q4lO1n2P1j27j4M2l9j4J30o6j60L7Q2J43n2Mj13q1
$$ 105 30 22 -17 -28 49 -72 -63 5 -46 38 35 96 44 115 -12 -26 16 -23 -37 93 27 -133 -96 -14 129 77 81 -32 -113
7425a13M8P4Q5r3Nj51K67j09K9L3o4R0j32P0j09K25k00p0K38Mj3k29J62RJ4j91
$$ -113 -65 9 94 1 6 -145 122 13 42 75 11 101 -31 39 -70 155 -45 -115 123 127 114 -115 47 56 70 -121
7451a21K1J98Pj15l5J67j59K3l4J10k2j01K7NmM8n7K1K9J9j9J7L8n8m9K1mM0j22
$$ -121 -100 98 105 -10 -45 122 -37 -14 -48 62 40 -61 -34 -29 -33 15 -42 -21 8 27 8 25 63 5 -44 -23 -27 13 -109
7480a09J06J1R1Mj9j00o2OJ23k5l7k1K29l23N8O5m5j1M2K8K9nn0O8j6m0J19n4
$$ -109 -3 8 99 103 84 -16 -78 -72 51 26 -11 -32 197 -126 -68 -3 -48 -59 -17 11 40 35 -15 53 37 -3 116 62
7508F2j88J1P2L6ON7j10O6p0P6Mn9m6N2R0j5M0m2p0M8Pm1P4j59K0q1J43j5L3p6
$$ 62 -126 -115 -43 -7 -1 56 -54 12 -58 18 22 -37 -83 -31 59 44 84 42 -28 20 27 -14 60 -99 -79 -160 -17 -32 1 -75
7538g5m3J26M1j55J28O4j18J38j44J9J5L0j20J28p7J40n5k0L8k7nM0k5j2rp1L7
$$ -75 -118 8 49 -106 22 86 -32 106 -38 -19 -4 26 -94 34 -43 97 42 22 60 33 28 68 43 31 22 -49 -12
7565a2j2Q7J4p1j8n0j05K76j01l2ok7P9j19k7J63j5j47J13J8k8N8M3j10K9o3l1
$$ -12 -24 63 77 6 -12 -62 -167 109 8 -24 -30 -57 22 -97 -124 39 24 -123 -10 8 -20 38 81 -29 0 -63 -94
7592i4K26m1k4r5J47q6o6LL4Q0r2r2L1P3q0J07jm3J3q2K21k05L0mL9j27J60p2
$$ -94 132 91 67 -28 119 33 -33 -30 4 84 -8 -100 -69 4 -76 31 30 -13 0 -82 139 -66 -36 -40 -1 -128 32 -40
7620d0M6N3j3k37J79J06Mq0Q8J1j67O6L1k8L5j35J18N8j47rJ2Q9j8j09k0J09r8
$$ -40 6 59 46 -191 -12 94 98 18 106 117 -50 16 47 19 54 -81 37 95 -52 -61 -49 40 22 -87 -107 2 -96
7647i6J15l1J79j85O4p8J05j03MP5m5p5L5M3m6J98o7n3j43J15O6oj01M6KJ7q3
$$ -96 19 -12 167 -18 46 -32 73 -30 -26 49 4 -71 -36 7 -39 159 92 39 -104 11 77 71 -30 16 18 35 -48
7674d8O8j01O6J0K1l7J3K9N5n5L7M6j35j1MJ35j43o7J37O2j28l1P9L2o5R2j14
$$ -48 20 -81 -15 -5 16 -21 -8 21 76 21 58 104 -31 -42 -38 97 -46 -113 24 86 -42 -73 6 38 -27 65 -49
7701d9l8P7j37K84j97P9Mj3no9j7L9o4K21j19M4R1j04o0N5m9%J04j00P3q4oK4
$$ -49 -87 -10 -147 137 -60 19 23 10 5 -64 -81 -42 -106 115 -4 40 131 27 -33 22 -27 -27 77 -23 50 -34 -40 -16
7729a6M7k0K2p9M5j16K50j00K6n0k4j4P0Qrr1N8p6Q5j39J8J52p3O3M5m4l7j07
$$ -16 31 11 33 -46 -1 -117 133 33 59 9 -15 -29 41 49 40 -51 7 -69 16 -123 -105 47 -26 37 82 38 1 -106
7757a06P6J53q8J53j52j12N5N6n8l9J37l5O1k1o7j17J17Qq5J24o5M0m0k5O3r9
$$ -106 -30 123 35 188 36 -76 -21 35 -23 -62 75 40 101 80 13 -104 13 21 -64 60 -5 35 -5 -30 33 -66
7783f6j4o0K1J68l9J01m2j13L0j1O7K2r4L3j28J30O4r9K6j12NQ8O8q1J37p3k2
$$ -66 -80 -140 -119 49 10 111 69 -44 -14 -25 42 64 -30 3 -125 5 69 -30 -4 -116 -111 -23 45 -36 101 28 6
7810FQ7p5n6J12o8J5nm0L7K7m1j01J35Q3m1o4j02J1L7J10J7q4M5j50J36J0j11
$$ 6 93 18 -38 74 6 21 16 -24 13 40 -1 -102 33 116 75 11 -91 -80 -43 67 84 0 45 -105 31 41 -70
7837g0MR3j8N9r5L6L3M9Lj09P8r0M8k4m9l5N9R5o2On3LJ4P3j44O0l9Q7m8K5M5
$$ -70 -66 27 9 68 -27 9 42 91 94 -15 63 -27 21 -3 -52 -87 -28 67 5 11 -42 -39 -25 48 -96 -36 -75 12 -36 -11 34
7868C4o4R1k24R1J9O8J0M8j53J58kpp5N7j02L9L7j7m4J29j24L7N8q7NJ6Ok0R2
$$ 34 -30 61 -163 -72 -53 15 25 73 -80 78 76 69 -6 51 -51 -12 25 8 -36 93 -31 6 64 -23 -18 -2 4 -16 76
7897G6r5K9r1J01M1j64J57J8j13N5j37J50q5J21p7Q9o9l3k3O4q9PJ86j03L3o2
$$ 76 -19 10 -81 20 61 -103 54 72 -41 14 -123 27 -58 63 -14 75 6 -27 -50 14 -75 -68 118 15 48 -14
7923a4k9N3qm7O2j55K37k21P3OL5j7q6R6M7q3P2m0J54j62J2j06J82o6R8j23l5
$$ -14 -43 10 2 -45 17 -138 99 -122 -49 -43 -8 -25 -111 -15 32 -51 21 -19 135 -27 -15 -121 61 -5 93 -30 -65
7950f5R0k5l2k2o7J1J40p0n0M9J06m3p7p1J30N7K9p7pJ0j04J12nk26J62%R8l8
$$ -65 25 0 -32 -54 -121 -110 30 -40 -90 -41 65 22 -55 -126 4 61 90 13 6 16 -88 24 19 -207 -45 -45 53 15
7978A5o3Q9J1j45P8J01p2l7L8m3J34k04J39MK4Q1q1j51O0K2j0O8r9OQ8n8J6JP
$$ 15 -48 41 52 -93 -15 86 14 -23 15 -28 106 -98 41 45 69 150 69 -82 -22 0 -10 58 -41 -35 53 -5 11 12 19
8007A9J2q2J2r6J31m6RJ23n7l1P6l5m8j01L1P1Q6j35R3j10QN1jrJ5L7l5J2N6q1
$$ 19 31 -51 -39 -135 -4 -50 -41 82 25 -6 70 35 -13 -114 -83 -12 74 -61 32 -78 -70 -19 -20 -29 -14 23 -12 0 56 -25
8037b5K5l1QJ25r3o4j9Q9K4o4l6O9Ko3m5J3j9R1Q8K3m9Jl1o3L2l6N2K4Pq0NJ19
$$ -25 0 -31 -23 102 9 -55 -74 15 39 -25 -61 8 10 -53 -98 -85 -104 -13 75 98 49 50 19 -44 -12 -48 4 28 35 -45 -40 79
8069G9l3r1P4M1q3J9k2Q4m2J20k03J15j10RJ21j15k3J11J48j42n2k5L4j09m0J25
$$ 79 46 -45 29 70 -13 6 -16 68 26 146 -57 58 -52 -43 78 -37 -60 51 199 57 5 -20 14 -95 -135 -10
8095a0J00j20o9P7j0m5O9M0lp7Q6PL6l4k9M8K2n2P2l0j36L%j9N0k4k9J52j69J17
$$ -10 90 -30 -99 -22 -32 -77 -8 32 29 -48 38 45 81 47 18 66 88 36 108 78 -58 -55 -55 -74 -24 -48 -77 75 -94 23
8125B3j26J52k3p7J35j36R6J07j60l3Q4J6k25K20j19Q3O3j57P2M6j09j1J45J3
$$ 23 -103 49 26 -51 84 -52 44 151 -9 -42 42 58 -167 53 -66 17 80 -77 -5 41 -68 -79 66 79
8149G9j2p7j03R7L0o7N7J3J1Q4m3m4p7L6L0m3M2l3J9rJ8%N7j11O0K4o4q7J52O
$$ 79 67 -10 -113 -16 14 -53 4 17 28 112 69 25 -52 -16 14 -29 13 -20 -1 -10 8 8 65 -46 14 38 -26 -113 39 45
8179D5M2j41J03j56J03k0j8r8J89l7J1M7
$$ 45 87 -54 49 -107 -4 -24 -42 -140 49 12 23 70
8191G0
$$ Imaginary data points
##PAGE= N=2
##DATA TABLE= (X++(I..I)), XYDATA
0@%%%%%%%%%%%%%%%%%%%%%%%%%%%%%JkLmLkLmOqQrJ0j0J0j0J0j1J4j6J4j3J2q
$$ 0 0 0 0 0 0 0 0 0 0 0 0 0 0 0 0 0 0 0 0 0 0 0 0 0 0 0 0 0 0 1 -1 2 -2 1 -1 2 -2 4 -4 4 -5 5 -5 5 -5 5 -6 8 -8 6 -7 5 -3
53cJJ3l7Q4j83M23j190O432L4464n3197n4149N6641P1286j3181l6402j272j7390
$$ -3 -2 11 -26 58 -125 298 -892 5540 40004 -13193 -67342 -10701 60585 47404 11002 9730 -7660
70g660l6938J3688M7569N206r370L3333J5148o3614n7364K7646M3381m000O846
$$ -7660 -44598 -30910 16659 21865 12495 45828 60976 -2638 -60002 -32356 11025 7025 13871
83A3871M2847l32n9537k9194K2608R058p521K5921L2807j4036k9823k377m007
$$ 13871 56718 56386 -3151 -32345 -9737 -679 -8200 17721 50528 36492 6669 4292 285
96B85j7685J7544M5905m74m3261p662K5261j0263k9831J7963M4011M110k2495
$$ 285 -17400 144 46049 45575 2314 -5348 19913 9650 -20181 -2218 41793 45903 23408
109B3408o469p924k3781j472K9181J1440j0642J1012J9066k1951l8138L170K4828
$$ 23408 16939 9015 -14766 -16238 12943 24383 13741 24753 43819 21868 -16270 -13100 11728
122A1728m44l555K2236J0307k6012j7752J1784K209j4322R745K5741l836k3031
$$ 11728 11284 7729 29965 40272 14260 -3492 8292 10501 -3821 5924 31665 27829 4798
135D798j49Q862j1580n191K3712J3596k0280j4201J0532j856j9567N166K8530
$$ 4798 4649 13511 1931 -3260 20452 34048 13768 -433 10099 8243 -11324 -6158 22372
148B2372O657j4805o61M828j6388j5740J2784J7011m284k743J1998k63k0320p243
$$ 22372 29029 14224 13563 18391 2003 -13737 -953 16058 11774 9031 21029 20766 446 -6797
162f797J1411K325n541Q841J1574r226j4368L608O329p123j679J2789M030j2051
$$ -6797 4614 6939 1398 10239 21813 12587 -1781 1827 8156 1033 -646 12143 16173 4122
176D122n591M876k045m478R595J1083n799r824J792n06j0360r08J4107P168o160
$$ 4122 -1469 3407 1362 -3116 6479 17562 11763 1939 3731 3225 -7135 -8043 6064 13232 7072
191G072j208L793o769j1074K982Q940o06j977O122J446j0005m938O047J609m781
$$ 7072 5864 9657 2888 -8186 -5204 3736 3130 1153 7275 8721 -1284 -6222 -175 1434 -3347
206c347L296P857l538q533J190M628l085j790O414K750p033l475L198j303m181
$$ -3347 -51 7806 4268 -4265 -3075 1553 -1532 -3322 3092 5842 -1191 -4666 -1468 -2771 -6952
221f952M409P969j738n815R40Q45o493l123O609M503k609K43L588l283p283Q37
$$ -6952 -2543 5426 3688 -2127 -1187 -342 -6835 -9958 -3349 1154 -1455 -1212 2376 -907 -8190 -7353
237g353M853j250j595M980K561o134l986L746J357l601J108N422j288n483M98
$$ -7353 -2500 -3750 -5345 -365 2196 -3938 -7924 -4178 -2821 -6422 -5314 108 -1180 -6663 -6165
252f165L155k084j802M600K923m832l483K900K59l987J094N894R04l848j08J639
$$ -6165 -3010 -5094 -6896 -2296 627 -4205 -7688 -4788 -4529 -8516 -7422 -1528 -624 -4472 -4580 -2941
268b941l468l334L302L602j510n97L293l25n040j009L187L09j927J959K732k040
$$ -2941 -6409 -9743 -6441 -2839 -4349 -4946 -1653 -1978 -7018 -8027 -4840 -4531 -6458 -4499 -1767 -3807
284c807k712J496J368k060k13K929J84l187q0K643p68j620K114K633j972k524
$$ -3807 -6519 -5023 -3655 -5715 -5928 -2999 -2815 -6002 -6082 -3439 -4207 -5827 -3713 -1080 -3052 -5576
300e576J187P09k239j73L551J378j653k04J173j750k635J013K779l18n55J969
$$ -5576 -4389 -3680 -5919 -6092 -2541 -1163 -2816 -3020 -1847 -3597 -6232 -5219 -2440 -2758 -3313 -1344
316a344J069k300j670J387N76j105N93J843m51j203Q21J195r90o87J343O08j799
$$ -1344 -275 -2575 -4245 -2858 -2282 -3387 -2794 -951 -1402 -2605 -1784 -589 -1579 -2266 -923 -315 -2114
333b114m36J299K71p68J092J828o36j726K75L86j426m98K326J683n88m72R45l87
$$ -2114 -2550 -1251 -980 -1748 -656 1172 536 -1190 -915 -529 -1955 -2453 -127 1556 968 496 1441 1054
351A054k121m08J342M54m72Q06J265k62r91L06K80o75m91M10L50l59K80Q33K31
$$ 1054 -1067 -1475 -133 321 -151 655 1920 1658 667 973 1253 578 87 497 847 488 768 1601 1832
370A832j77R9M6p35l96l4J25J09P83R70J17p89j84n9q52q93O47J382K55J40L69
$$ 1832 1655 1754 1800 1065 669 635 760 869 1652 2622 2739 1950 1766 1707 855 -38 609 1991 2246 2386 2755
391B755N1r97o34r8J4k59J05P04M24q3K7M33l9o49m52j1o0j88oO56Q31M4k35m97
$$ 2755 2806 1809 1175 1077 1091 832 937 1641 2065 1982 2009 2442 2403 1754 1302 1291 1231 1043 1037 1693 2524 2568 2333 1836
415A836k59l97m69M5M40O81K86J37l1k94o89m34j95j61M05M61N55K16J12l09j47
$$ 1836 1577 1180 711 756 1196 1877 2163 2300 2269 1975 1286 852 657 496 901 1362 1917 2133 2245 1936 1789
436A789k37o23k81L1K66L71J2L59N89L4o00m20l01k84k62R4P76L01J49J2J5o49
$$ 1789 1552 929 648 679 945 1316 1328 1687 2276 2310 1710 1290 989 705 443 537 1313 1614 1763 1775 1790 1141
458A141p08MR5R5N5O05N12j25k72n6m49m69j03J25J08L13M71J27p0k1j69m70o98
$$ 1141 433 437 532 627 682 1287 1799 1674 1402 1346 897 428 325 450 558 871 1342 1469 1399 1378 1209 739 41
481D1m3K59p0mP89M39m02k57P3m78n56r7M21J79k16N93N45m04q40J03l8m43j39
$$ 41 -2 257 187 183 972 1411 1009 752 825 347 -209 -306 115 294 78 671 1216 812 -28 75 37 -406 -545
504e45M29N52l9l3L83k76o94m6M4n78j22N31M70k76J49M86o5p49m21J52m18j72
$$ -545 -116 436 397 364 747 471 -223 -269 -225 -803 -925 -394 76 -200 -51 435 370 -379 -800 -648 -1066 -1238
526a238N08N41j78L9N12k84p25k75M14q1l58L43N42r2l68K24J04o64m04N23Om30
$$ -1238 -730 -189 -367 -328 184 -100 -825 -1100 -686 -767 -1125 -782 -240 -332 -700 -476 -372 -1036 -1440 -917 -911 -1341
548a341M70P17k32m45M4K80n23n86L60O07m79L2P84K87n95j38K61m87p00L60P63
$$ -1341 -871 -154 -386 -831 -787 -507 -1030 -1616 -1256 -649 -1128 -1096 -312 -25 -620 -758 -497 -984 -1684 -1324 -561
569e61l31k39N91O50q09m13M90P0q46R2P22J3l59L62O57n79o99L76K79n04k05
$$ -561 -892 -1131 -540 110 -699 -1112 -622 -552 -1398 -1306 -584 -571 -930 -568 89 -490 -1189 -813 -534 -1038 -1243
590a243Q96K81n68o7P90l32q16K40N20m34m42Q91N83n95m19P50J10r67j23P00
$$ -1243 -347 -66 -634 -701 89 -243 -1059 -819 -299 -733 -1175 -284 299 -296 -715 35 145 -822 -945 -245
610b45n7m30L82O86l96m75M26K41o67k42O67L65o38J25O74j03p30K05N36m84n81
$$ -245 -302 -732 -350 336 -60 -535 -109 132 -535 -777 -110 255 -383 -258 416 313 -417 -212 324 -160 -741
631g41N54L71k89l2N87P7r67J93O66l44q85N92R36n50m16L26N69o53k91N18j72
$$ -741 -187 184 -105 -137 450 527 -440 -247 419 75 -810 -218 718 168 -248 78 647 -6 -297 221 49
652D9m50K46O87j30p04L67N67m86o30M63M02m74l8O47j40n31P6P43m56p01M51
$$ 49 -401 -155 532 402 -302 65 632 146 -484 -21 381 -93 -131 516 376 -155 -79 664 208 -493 -42
673d2M70k28l94N15M11n57q7O07l77q50L06Q55l23o25K09R46m20p09M19K61n30
$$ -42 428 200 -194 321 732 175 88 695 318 -532 -226 629 306 -319 -110 836 416 -293 126 387 -143
694a43k40Q08J09o10oO53j33o26n9O21k81l51M18L70m21r6M91K2q28O0N84M0o17
$$ -143 -383 425 534 -76 -82 571 438 -188 -247 374 93 -258 160 530 109 13 504 526 -302 -242 342 382 -235
717b35L92L78l09r6K42m0n14L0O20k7o68K01P34j85o36K76L56n08j84M63L55n75
$$ -235 157 535 226 130 372 332 -182 -152 468 441 -227 -26 708 523 -113 163 519 11 -173 290 645 70
739G0j36P90r5o80L3N27k90l60L06M21l64m10O52K79o29l00M61J42n19o7O74k00
$$ 70 -66 724 629 -51 -18 509 219 -141 165 586 222 -188 464 743 114 -186 275 417 -102 -169 505 305
761C05k14K04J87m16m48N62K65n50k03P57K06p36PM78j12m96Q2M76k22m06L49
$$ 305 91 295 482 66 -382 180 445 -105 -308 449 655 -81 -74 404 292 -204 -122 354 132 -274 75
782G5M58n92j70L99J12m30M3M42k56m51L82M46m04l38L41J99m15k41M31J95m38
$$ 75 533 -59 -229 170 282 -148 -105 337 81 -370 12 458 54 -284 57 256 -159 -400 31 226 -212
803b12J66L03m7n58K86K08l49k39L90L58m20k19N74r9n46l1M55j64l48K02N97
$$ -212 -46 257 210 -348 -62 146 -203 -442 -52 306 -114 -333 241 142 -404 -435 20 -144 -492 -290 307
824C07l34m01M25J97n15q1M25Km14J12M30r8k52Q9J70q2l90K64K84j97j53L81
$$ 307 -27 -428 -3 194 -321 -402 23 25 -389 -277 153 55 -197 -108 62 -20 -410 -146 138 -59 -212 169
846A69m1k93P3J88j32k83J70K24p9l62M39J83m85j0K09J98m05L5K22J4j00k6K86
$$ 169 128 -165 -92 96 -36 -319 -149 75 -4 -366 73 256 -229 -239 -30 168 -237 -202 20 34 -66 -92 194
869A94j44k35K05J73l27m4K97J00l10q6M39k01k51J16P3j41q3K96J17k24j58L30
$$ 194 50 -185 20 193 -134 -178 119 219 -91 -177 262 61 -190 -74 -1 -142 -225 71 188 -36 -194 136
891A36O2k76p6K53p3j93J10K47j94mN9O6j35j36R2N8l0oK41o2k35Q6J91k07j07
$$ 136 198 -78 -154 99 26 -167 -57 190 -4 -8 51 117 -18 -154 -62 -4 -34 -40 201 139 -96 -10 181 -26 -133
916a33l3K50k6j44K17l4k84J42J68j17l02K45J35K2k23K13N1j23j48J42M1j72
$$ -133 -166 84 58 -86 131 97 -187 -45 123 6 -296 -51 84 106 -117 96 147 24 -124 18 59 -113
938a13M2J36j7j12O6J32l6k06J61q5n5n7J98l8j4o8L7P7k69K30j5l8k1K8J28p4
$$ -113 -71 65 48 -64 2 134 98 -108 53 -32 -87 -144 54 16 2 -66 -29 48 -221 9 -6 -44 -65 -37 91 17
964A7p9J29jr5OJ22j58nmK57j57K8J4o4m5KN7q5J17r0J45l9j11J21J9p1l2j0R9
$$ 17 -62 67 66 -29 -23 99 -59 -64 -68 189 32 60 74 10 -35 -33 24 -61 56 -34 111 72 -39 82 101 30 -2 -12 87
993H7j11LR0lj5m3P1j00L2kN9M9q9J07j67Q2pj00RK29j17M2k2J0N5OJ8j82J49
$$ 87 -24 -21 69 66 51 8 79 -21 11 9 68 117 28 135 -32 50 43 -57 -48 181 64 106 84 94 149 155 173 -9 140
1022A40r0K6j88J12J52r7L3M0J5l3j55M4o6J44n0R0j00noK8j39Q7O6M2j75J30
$$ 140 50 76 -112 0 152 55 88 128 143 110 -45 -1 -67 77 27 117 17 12 6 34 -105 -18 48 90 -85 45
1048D5n5L8J7j6K1l8p6P9j72J18J47k3l6l0m5J27j57k0P3p5R1Q1J4r6q4K9J5k3
$$ 45 -10 28 45 29 50 12 -64 15 -157 -39 108 85 49 19 -26 101 -56 -76 -3 -78 13 94 108 12 -72 -43 -28 -51
1076e1O7k9L6j8P4j69J70o8r%j05J8m5R7J88j00q1P1n1j05P7L5j27J10n3k6R0
$$ -51 16 -13 23 5 79 -90 80 12 3 3 -102 -84 -129 -32 156 56 -25 46 -5 -110 -33 2 -125 -15 -68 -94 -4
1103dk2k1j4l1J33N3k22N2O2no5M1n3J39m3j5N9j05J39n8o9J40o1j01nQ5j7pm9
$$ -4 -26 -47 -61 -92 41 94 -128 -76 -14 -19 -84 -43 -96 43 0 -15 44 -61 78 20 -49 91 30 -71 -76 9 -8 -15 -64
1132f4K04j94R2j44O4L3J33j83J65K6j34M4m2M0Mj4j31R6J2q0J03j0n5J5j29K47
$$ -64 140 -54 38 -106 -42 -9 124 -59 106 132 -2 42 0 40 44 30 -101 -5 7 -73 30 20 -35 -20 -149 98
1158I8o5j02P7j1J36j79R8p1Q1k3j5o9Jm1J03m5J6Q7q1J09q6j06J48k9n8M4n7
$$ 98 33 -69 8 -3 133 -46 52 -19 62 39 24 -45 -44 -85 18 -27 -11 76 -5 104 18 -88 60 31 -27 17 -40
1185d0KR2p7J2nJ00j46L6M7J8p9PJ14K2j08j1j25J15N2k4k3J04j12J16j86J38
$$ -40 -38 54 -23 -11 -16 84 -62 -26 21 39 -40 -33 81 103 -5 -16 -141 -26 26 2 -21 83 -29 87 -99 39
1211C9M4n0m2L8j5l5l7PO1L8m3j02J41j06R2j55J49j05K0Q9j60J74lJ3r4O9J3
$$ 39 83 33 -9 29 14 -21 -58 -51 10 48 5 -97 44 -62 30 -125 24 -81 -61 28 -132 42 39 52 -42 27 40
1238D0j17L3J63k16k2oR7j0j9M5m6O9j38J29K6q7J71J9j15p9J1J13R4p5p1o6Q0
$$ 40 -77 -44 119 -97 -119 -125 -28 -38 -57 -12 -58 11 -127 2 28 -59 112 131 16 -63 -52 61 155 80 9 -57 23
1265B3j79K14np5j3Kj8R9l6m2J05j83J06R1l8ko3N3J0j02M0J31j83n4O5J02N6
$$ 23 -156 58 53 -22 -35 -33 -51 48 12 -30 75 -108 -2 89 51 49 -14 39 49 -53 -13 118 -65 -119 -54 48 104
1292A04j85J25j29R5J3J09j40j46P7J33m3P1l7j00P2j7q1R1oj4l1J19J08q0r4
$$ 104 -81 44 -85 10 23 132 -8 -154 -77 56 13 84 47 -53 19 2 -79 12 6 -8 -39 80 188 108 14
1317A4J8p2O6p9J37l7K3n5p1Q8kj06O9q8J17p5L9O7j2k2N1o2q6J04q4N8O2o9q
$$ 14 32 -40 26 -53 84 47 70 15 -56 32 30 -76 -7 -95 22 -53 -14 53 41 19 70 8 -78 26 -58 0 62 -7 -15
1346a5l5L1O8k25R3J02j39J86p7j6o8L7k0L1N9L6j02Q7n9Q8qj16n1P9oL9m2M8
$$ -15 -50 -19 49 -176 -83 19 -120 66 -11 -27 -95 -58 -78 -47 12 48 -54 33 -26 62 54 -62 -113 -34 -40 -1 -43 5
1374El6J19j34J09j80Q7R3q0o4l2J70M6n6%q4J2n8J32p2l5O3j09J86r6J2MJ9O
$$ 5 -31 88 -46 63 -117 -30 63 -17 -81 -113 57 103 47 47 -37 -25 -83 49 -23 -58 5 -104 82 -14 -2 2 21 27
1402B7N5qK6j71M4O5K7j05N1j30J77j07mK0k7R5nj2j12R3k7p0J51o1M0j64J65
$$ 27 82 74 100 -71 -27 38 65 -40 11 -119 58 -49 -53 -33 -60 35 30 18 -94 -1 -28 -98 53 -8 32 -132 33
1429C3n2m0J30j41J30j06J20K9j04LP5J8j53O9N7q6lJ9JM0j01J30j10O8l7K6q3
$$ 33 -19 -59 71 -70 60 -46 74 103 -1 2 77 95 -58 11 68 -18 -21 -2 -1 39 -62 68 -42 26 -11 15 -68
1456f8J02p0n8J25j40J78p6k6p1J29J5k7j3o0Q2Om1Q0K1p3O3j37J7Q8QQ4q0j17
$$ -68 34 -36 -94 31 -109 69 -7 -33 -104 25 40 13 0 -60 22 28 -13 67 88 15 78 -59 -42 46 54 138 58 -59
1484e9o4J38rl1k8Q4j00J22j2j20R0L8j7j45R9o2lJ41j6p3N7m3j23K25o2m2N0
$$ -59 -123 15 6 -25 -53 31 -69 53 41 -79 11 49 32 -113 -14 -76 -79 62 46 -27 30 -13 -136 89 27 -15 35
1511C5kl6NN6lj09J8p4J03J7n2P5o5n9M6O6m5J07j23M8K3pl6O4q9P7p5P0k6p4
$$ 35 33 -3 2 58 55 -54 -36 -110 -7 10 -42 33 -32 -91 -45 21 -24 83 -40 8 31 24 -12 52 -37 40 -35 35 9 -65
1541f5J76j44P0M8L7r2k6P7P0j42p3M5k4K9n0K6OpP7m6m4J40l8j50j6J01l7J37
$$ -65 111 -33 37 85 122 30 4 81 151 9 -64 -19 -43 -14 -64 -38 -32 -39 38 -8 -52 88 50 -100 -116 -15 -52 85
1569H5j39Q9q2O5K3j76J60j4k8R3l4J1K5j43O5k5J19j14k2Q8l5j6M3j26J61j03
$$ 85 -54 35 -47 18 41 -135 25 11 -17 76 42 53 78 -65 0 -25 94 -20 -42 46 11 -5 38 -88 73 -30
1595c0k0R7k0k1jKN4n1k3L4o9L4L7j9NK0O0m1j05J05Q4j76J09q4P7N8p3m0L1j49
$$ -30 -50 47 27 6 5 7 61 10 -13 21 -48 -14 23 4 9 29 89 48 -57 48 132 -44 65 -19 58 116 43 3 34 -115
1625a15J35M1j03n5J55k7K0r8L5q4J61N7k1k7k8j26N3Rj23K07n8r3kOK8R4L9j07
$$ -115 20 61 -42 -97 58 31 51 -47 -12 -96 65 122 101 74 46 -80 -27 -18 -141 66 8 -85 -87 -81 -53 41 80 -27
1653b7R4j01J36r3n1J1L7K2K0l3p9J65j36N0L7p1j4J3o7O3J04j1q5n4Q3r0J13
$$ -27 67 -34 102 9 -42 -31 6 28 48 15 -64 101 -35 15 52 -19 -33 -20 -87 -24 80 69 -16 -70 13 -77 36
1680C6o8p%J8N5R1r7o0K8O8j91qOJ17k0Q4m8n3P5j1m3K9o1J17J7r4k9K4K8M4N4
$$ 36 -32 -39 -39 -21 34 125 28 -32 -4 64 -127 -135 -129 -12 -32 52 4 -49 26 15 -28 1 -60 57 74 -20 -49 -25 3 47 101
1711A01j44m1N7r5J64n4j5N2n0p3J55L0j20J17j58J00N8j00o2J07j11J76j81R1
$$ 101 -43 -84 -27 -122 42 -12 -27 25 -25 -98 57 87 -33 84 -74 26 84 -16 -78 29 -82 94 -87 4
1735Dn1Q0J5j12J00q6l8J27j23P6k9K2N7m8L4l0p0QL9PJ3k7j09J36J39j39r6O8
$$ 4 -47 33 48 -64 36 -50 -88 39 -84 -8 -37 -15 42 -6 28 -2 -72 -64 -25 -18 -5 -32 -141 -5 134 -5 -101 -33
1763c3L0qj7Jl1j27K49p1L6K4j1j02J08L8q8R9mr5oJ0j6j1n1P3l0J04O6j25m1
$$ -33 -3 -11 -28 -27 -58 -185 64 -7 29 53 42 -60 48 86 -2 97 93 -2 -8 2 -14 -25 -76 -3 -33 71 137 12 -29
1792b9n0J24n7o4J72J5j61J03j64J32j08O1k3J4O4O3k7o5p0J10p8n2J92k1K8j78
$$ -29 -79 45 -12 -76 96 111 -50 53 -111 21 -87 -26 -49 -35 29 92 65 0 -70 40 -38 -90 102 81 109 -69
1818f9J55K7q3J2q1N9p9P2m2J4k3P3j31Q3n5L8M8m3J8J0J09n1n1M1q4KQk7N4P0
$$ -69 86 113 30 42 -39 20 -59 13 -29 -15 -38 35 -96 -13 -68 -30 18 -25 -7 3 112 61 10 51 -33 -31 -23 -50 4 74
1848G4n7j1o3J01j23P1l3J4J2r3J03L1P6k18J24l4l6J31j63L5L9k2N8j03P3K2
$$ 74 17 6 -57 44 -79 -8 -41 -27 -15 -108 -5 26 102 -116 8 -26 -62 69 -94 -59 -20 -42 16 -87 -14 8
1874HP0O4j30P3r2%O9m1q0J22Q3r4j72Q2j23J56N0k3km4Mk1J29j31J7M7N5j39
$$ 8 78 142 12 85 -7 -7 62 21 -59 63 146 52 -120 -38 -161 -5 45 22 20 -24 -20 -41 88 -43 -26 21 76 -63
1902f3J57j45J80m6n6k6n4l6K03q8j59K59l6j5j45J68q9q8PJ28o9q4PP1M3l3p1
$$ -63 94 -51 129 83 27 1 -53 -89 114 26 -133 126 90 75 -70 98 9 -79 -72 56 -13 -97 -90 -19 24 -9 -80
1929h0J0L3J15j26J06q3n2R3j24O7K0O4K8k38J85o6J08n6m3q7jJ02J23j89Q5O4
$$ -80 -70 -37 78 -48 58 -25 -77 16 -108 -41 -21 43 71 -167 18 -48 60 4 -39 -126 -127 -25 98 -91 -6 58
1955E8j76K19j32J68j29K3O7n1nP8l8p7J4q0O6O9j19J04k0m9q2J04qM7j59J40
$$ 58 -118 101 -31 137 8 31 98 47 42 120 82 5 19 -61 5 74 -45 59 39 -10 -92 12 4 51 -108 32
1981C2r2J30j15Q7l9l4R2L2n5q0J03M9j79L9J21p7L1r3J3J5J68j76J19j53J26
$$ 32 -60 70 -45 42 3 -31 61 93 38 -42 61 110 -69 -30 91 14 45 -48 -35 -20 148 -28 91 -62 64
2006F4j09P5r3J38q2l2o4J00r3J72r7N6N2k8nk1n5q9J03k5N8p2J74j07r6MK5l5
$$ 64 -45 30 -63 75 -7 -39 -103 -3 -96 76 -21 35 87 59 54 33 -22 -111 -8 -33 25 -47 127 20 -76 -72 -47 -82
2034h2K5O8j04k9J25p9O4M4j02l2K16p7l6K6J06k33R0j31L4J4J60m1M9m3K6n4
$$ -82 -57 11 -93 -122 3 -76 -12 32 -70 -102 114 37 1 27 133 -100 -10 -141 -107 -93 67 26 75 32 58 4
2060Dk4J3q1K6O2o2J42j36K5R4j33J97k01P0L4P5r0o0J5n9L5j0j3R4j28J30l5
$$ 4 -20 -7 -88 -62 0 -62 80 -56 -31 63 -70 127 -74 -4 30 105 15 -45 -30 -89 -54 -64 -77 17 -111 19 -16
2087a6o9J03q8Q9q7P1m7J9%Q4j8j06L6Ol8R9R7p8r7J0JK6K8ok5J01p3J3p5OK7
$$ -16 -85 18 -70 19 -68 3 -44 -25 -25 59 41 -65 -29 -23 -61 38 135 57 -40 -30 -29 -3 25 19 -6 95 22 35 -40 -34 -7
2118gn0R3m2M6p0K8J6l9r1L4J9O7m1J02KQp7Mq3K8k4K2m4J45j23K03j86J33j53
$$ -7 -57 36 -6 40 -30 -2 14 -25 -116 -82 -63 4 -37 65 67 75 -2 2 -81 -53 -77 -55 -99 46 -77 126 -60 73 -80
2147h0K5O2o1J74j91P4J3j7l4K3L6L2k6OK8j97N9J24J1q4Q8j18m0n5J31L5l5J99
$$ -80 -55 7 -54 120 -71 3 16 -1 -35 -12 24 56 30 36 64 -133 -74 50 61 -23 65 -53 -93 -148 -17 18 -17 182
2175A82k40J53j14N8QN9p8k7mM4P5k03Q3qOJ0mn0O1r8J68r8K9j23M4k0N5jj21
$$ 182 -58 95 -19 39 47 106 28 1 -3 41 116 -87 -4 -12 -6 4 0 -50 11 -87 81 -17 12 -111 -67 -87 -32 -33 -154
2204a54K38n4J1j5n6k9J41n1Jj47J71q4N2N6j48J1j9Q7j96J33k9J21km9N3p3R8
$$ -154 84 30 41 26 -30 -59 82 31 32 -115 56 -28 24 80 -68 -57 -76 11 -185 -52 -81 40 38 -11 42 -31 67
2231F7j15O9m3M1O0j13N8Km5r3O9oR2o8M3j2n5L2n7J32n2n8okL9M0r3Q0l8mJ6
$$ 67 -48 21 -22 19 79 -34 24 26 -19 -112 -43 -49 43 -25 18 6 -49 -17 -74 58 6 -52 -58 -60 -21 19 -74 6 -32 -36 -20
2262b0R8j07k8J44j01N7j78J50l0M7K1p9L0r8J4Q0q3J63q1o3M1n5J83j21P3r0
$$ -20 78 -29 -57 87 -14 43 -135 15 -15 32 53 -26 4 -94 -80 0 -83 80 -1 -64 -23 -78 105 -16 57 -33
2288c3o0J85p0m9R2P9j17r8J33j57J53r7p1J65j05N2L2m8m0R2l5M9j14M8q6qJ03
$$ -33 -93 92 22 -27 65 144 27 -71 62 -95 58 -39 -110 55 -50 2 34 -14 -54 38 3 52 -62 -14 -100 -108 -5
2315el8J88m9k34Q4O7k4j21J56Kj25K5J60j30K8KPR9j15J11J0j31K6k4m4l1J07
$$ -5 -43 145 96 -138 -54 13 -11 -132 24 26 -99 -74 86 -44 -16 -14 -7 92 -23 88 98 -33 -7 -31 -75 -106 1
2342AjQ6K2j01J24o5o3L5j19J26O3j54J19q6J5n3n6J77j60O3n2n1K44j36O1J0
$$ 1 0 86 108 7 131 66 3 38 -81 45 108 -46 73 -13 2 -51 -107 70 -90 -27 -79 -130 114 -22 39 49
2368D9j57N8L5J8N5p4N2p0p0k1N5J34kj1r7m8R7n5k5N7PN2j1m6k1n9R3p8J67l7
$$ 49 -108 -50 -15 3 58 -16 36 -34 -104 -125 -70 64 62 51 -46 -94 3 -52 -77 -20 -13 39 28 -18 -39 -98 -5 -83 84 47
2398D7o5pK4M2j25N4M6K4j43R5J38j60k3R0O2j92J58r8m2N8J49r6k7Nq3MM8J07
$$ 47 -18 -25 -1 41 -84 -30 16 40 -103 -8 130 -30 -53 37 99 -93 65 -33 -75 -17 132 36 9 14 -69 -65 -17 90
2426I0k01P2m2J20Ol1j8K8q2O5n2J0J42Jj80R0N3k7r5P8n1RO9l4n1r5O9L6N9m5
$$ 90 -111 -39 -81 39 45 14 -4 24 -58 7 -45 -35 107 108 -72 18 71 44 -51 27 -24 -15 54 20 -31 -126 -57 -21 38 -7
2456gj11Q2Q7j1j47J68l8k1m4O9n6M2M8QJ8o9%L9K7m8J12j20l5O0J1j2r1j02J23
$$ -7 -118 -36 51 40 -107 61 23 2 -42 27 -29 13 61 69 87 18 18 57 84 36 148 28 -7 53 64 52 -39 -141 -18
2485a8R8nN0j36l8O2kK2l7j1j8Km6O7N7j20O2r3K7M1K3K0M0J8p9O5p9Ql5J04Q
$$ -18 80 75 125 -11 -49 13 11 33 -4 -15 -33 -31 -77 -10 47 -73 -11 -104 -77 -36 -13 7 47 65 -14 51 -28 -20 -55 49 57
2516E7j1m2K9p4j8J15r2PPmm1J26j69J93j27lM1n9K9jQ8j12L3J30l9k1M8n6J4
$$ 57 46 4 33 -41 -59 56 -36 -29 -22 -26 -67 59 -110 83 -44 -47 -6 -65 -36 -37 51 -61 -28 102 63 42 90 34 48
2545D8j4n0k2j12O8J8J11mj10K7R7n7n2K3K3n4J53j43L5JQ4l0Mj34RQ2J6k6p7
$$ 48 34 -16 -38 -150 -82 -64 47 43 -67 -40 57 0 -52 -29 -6 -60 93 -50 -15 -14 70 40 44 -90 -81 1 17 -9 -86
2574h6J25r5J08k2q2M4M6j11Q1j5r7O0q2J44k3m1K7L2%pK4q8J32l9p6o5J02r0
$$ -86 39 -56 52 30 -52 -8 38 -73 8 -7 -104 -44 -126 18 -5 -46 -19 13 13 6 30 -58 74 35 -41 -106 -4 -94
2602i4pN0l1J39rQo7j6J40j88j8J20P3j83J8Q8L4p8Q5p0L9M5j02p0R7p5M7qJ16
$$ -94 -101 -51 -82 57 48 56 -11 -27 113 -75 -93 27 100 -83 -65 23 57 -21 64 -6 33 78 -24 -94 3 -72 -25 -33 83
2631H3m5J4j62K37q7l4M9j24R2PJ5o9J41r4m4N1L9k37K6R4R0l4K6o3mj7p0J11
$$ 83 38 52 -110 127 40 6 55 -69 23 30 45 -24 117 23 -21 30 69 -168 -142 -48 42 8 34 -29 -33 -50 -120 -9
2659iM8j16N2K0Q4j49R6l2n0J60j24n5J01L5k9Rj54J36o3n3O0M6J5r7k1J35Op5
$$ -9 39 -77 -25 -5 79 -70 26 -6 -56 104 -20 -75 26 61 32 41 -113 23 -40 -93 -33 13 28 -69 -90 45 51 -24
2687b4j1P8j1J1j67J86o4m3Q8Lm2l6Q4q2J0J25o1o1J33j90J07k2o1J09o5J04j06
$$ -24 -35 43 32 43 -124 62 -2 -45 43 46 4 -32 52 -30 -20 105 44 -17 116 -74 33 11 -50 59 -6 98 -8
2714hj0J68j17j68J04kK7M1k8L8j39k7J21l2N7j12J35j79J19l6L7m8K2R2L4j40
$$ -8 -18 150 33 -135 -31 -33 -6 35 7 45 -94 -121 0 -32 25 -87 48 -131 -12 -48 -11 -59 -37 55 89 -51
2740e1j3K75k47Nk9R5q0q4K34q2l1P2p3O6p9k1R1j0rm7jJ11j32J9J6J4M2k05K25
$$ -51 -64 211 -36 -31 -60 35 -45 -129 105 23 -8 64 -9 57 -22 -43 48 38 29 -18 -19 92 -40 -21 -5 9 51 -154 71
2769G1m1o1M2J13j54o5J54no3QM2k3r6L3oK8K2l0l3m7J87r4JL6n6m1P4PR7J4J3
$$ 71 30 -31 11 124 -30 -95 59 54 -9 -1 41 18 -78 -45 -51 -23 -1 -31 -64 -111 76 -18 -17 19 -37 -78 -4 3 100 114 127
2800A27k02o2K07r1m6J35m5q2K8J17n6l8O3m8N4q1l0O6n7OO4l2l8K4K8N3k9m0
$$ 127 -75 -137 70 -21 -67 68 23 -59 -31 86 30 -8 55 7 61 -20 -50 16 -41 -35 29 -3 -41 -17 11 64 35 -5
2828eo7M0J10j52J25j17J07r6j06J61j6l7RL4m7K8J07p2m2j0R6o9mL4k8ko6J00
$$ -5 -72 -32 78 -74 51 -66 41 -55 -161 0 -16 -53 -44 -10 -57 -29 78 6 -36 -46 50 -19 -23 11 -17 -19 -85 15
2856A5o0o3J67j06M0O8r2P9L5q5K9r0P3O9j10K8O1q2N8o0o8j8O3J04r7N9lj54
$$ 15 -45 -108 59 -47 -7 61 -31 48 83 -2 27 -63 10 79 -31 -3 58 -24 34 -26 -94 -112 -49 55 -42 17 14 -140
2884a40J42P1j44L8L1j6j7%N2k9p3R9Qk8KN0jL4n5M1j50J36j52R4k7J1K9K7lq1
$$ -140 2 73 -71 -33 -2 -18 -35 -35 17 -12 -85 14 22 -6 -4 46 45 79 24 65 -85 51 -101 -7 -34 -23 6 33 30 -51
2914e1J01j01M8L0k1pp5J27No2j6PM7l3m3J53K7j94P4j3J00j24j00J09L1k0kn8
$$ -51 50 -51 -3 27 6 -1 -76 51 56 -6 -22 -15 32 -1 -44 109 136 -58 16 3 103 -21 -121 -12 19 -1 -3 -61
2942f1N8Q5o5r5rJ21J1q2Q4KQ6k20Q0l9p1J79j19Q6o6k5L4J8Ql7R9J4j25J00j54
$$ -61 -3 82 17 -78 -87 34 45 -37 47 49 135 -85 -5 -44 -115 64 -55 31 -35 -60 -26 -8 0 -37 62 76 -49 51 -103
2971a03J06n0O8oq1R6m7J1OP5q3p4R4p0Q5o2O4p4M5k5K7P0jj8q0J89k21n4J34
$$ -103 3 -47 21 15 -66 30 -17 -6 0 75 -8 -82 12 -58 27 -35 29 -45 0 -25 2 72 71 53 -27 162 -59 -113 21
3000B1K1o9K8o7M7k5P6j97Q8R4n5P6l9PN8l6l7O7K1j58J46p0N4j48K4k3K6jQ9
$$ 21 42 -27 1 -66 -19 -44 32 -165 -77 17 -38 38 -1 6 64 28 -9 58 79 -79 67 -3 51 -97 -73 -96 -70 -71 18
3029A8n6R0m7Q7j0l2p5M9K4N4K3l43J39O5J11j35J12J4q9q4J00m2j1J45r5J3O
$$ 18 -38 52 5 92 82 50 -25 24 48 102 125 -218 -79 -14 97 -38 74 88 -1 -85 15 -27 -38 107 12 25 31
3056C1r9J10M7o4l5j97K32k0O1o2O4j23Q2j34J17q0N4j7J23k27R4l9J22m7N8q5
$$ 31 -68 42 89 25 -10 -207 25 5 66 4 68 -55 27 -107 10 -70 -16 -33 90 -137 -43 -82 40 -7 51 -34
3082c4M1L7n1o1J51q6l0Q5l0J06m9jo1j13J11q8R7j08M3nJ0J75r6r8K8NJ28j8
$$ -34 7 44 -7 -68 83 -3 -33 52 22 128 79 78 17 -96 15 -73 24 -84 -41 -46 -36 139 43 -55 -27 -22 106 88
3110H8j19j2O8j9L7r8m5J91r0O7j01J17o4j55Q0P0L6j9m1N3l9M1p4%Q2Q3p6j2
$$ 88 -31 -43 25 6 43 -55 -100 91 1 68 -33 84 20 -135 -55 15 51 32 -9 44 5 46 -28 -28 54 137 61 49
3138D9n3n7N9k6MLN1l4J13j25k9Q1q1Qm6R1k9M8j50J93j1o2P8j19J74j90O1pJ27
$$ 49 -4 -61 -2 -28 -24 -21 30 -4 109 -16 -45 36 -45 -37 -83 8 -21 27 -123 70 59 -3 75 -44 130 -60 1 -6 121
3167A21j47M7p6J05l5j0n7J27Oj01m1lJ03r2J9j0mQ4p2K3Q5q3M8n3P1m9P5r5p5
$$ 121 -26 21 -55 50 15 5 -52 75 81 -20 -61 -64 39 -53 -34 -44 -48 36 -36 -13 72 -11 37 -16 55 6 81 -14 -89
3196h9P8q8J47j23M1N5P2p9J00j77Q2J6J2K2M2q8k5J19Jj00k4M7M4j8n5%j07R3
$$ -89 -11 -99 48 -75 -34 21 93 14 114 -63 19 35 47 69 111 23 -2 117 118 18 -6 41 85 67 12 12 -95 -2
3224bm8O4l1J43k14P5L1L1Jm5K9n1K9j00NJ06j9J2j14J80q5j6L0p7O8m6J60j24
$$ -2 -50 14 -17 126 -88 -13 18 49 50 5 34 -17 12 -88 -83 23 4 16 -98 82 -3 -19 11 -66 2 -44 116 -8
3252hK8j35O2R6Mj21q9K87j40J01k3Rj2Nn8L8L3o0l3N7O4j70J0JR9k6n4L2n1J01
$$ -8 20 -115 -53 43 47 -74 -163 124 -16 85 62 71 59 64 6 44 77 17 -16 41 105 -65 -55 -54 45 19 -35 -3 -54 47
3282D7j79J22l0J02j19J5nk7m7Q1N4qM4j00%K8K4k3j9l9L9J24j36q4K48j52Q5
$$ 47 -132 -10 -40 62 -57 -42 -47 -74 -121 -40 14 6 50 -50 -50 -22 2 -21 -40 -79 -40 84 -52 -136 112 -40 45
3309D5j22J10p9j4J46l9K8r4q3J08M3M9j28L0j9k6OR4j05R1m5M6r4Q1J6Rj00J35
$$ 45 -77 33 -46 -60 86 47 75 -19 -102 6 49 98 -30 0 -19 -45 -39 55 -50 41 -4 42 -52 29 45 54 -46 89
3337H9nj16L1R0j54J73p3m5pO0mm2L3L2q3k0J37j04p1N9O1j44J61n3j2Jl3m6M5
$$ 89 84 -32 -1 89 -65 108 35 -10 -17 43 39 -3 30 62 -21 -41 96 -8 -79 -20 41 -103 58 5 -7 -6 -39 -85 -40
3366d0j7J32j94J20lj8M3m1O5K2l7l3j1O6j2j4q6R4J05k03Q5l7J27j56P7mOj58
$$ -40 -57 75 -119 1 -2 -20 23 -18 47 69 32 -1 -12 54 42 28 -58 36 141 -62 23 -14 113 -43 34 30 36 -122
3394a22J34J43j93o4J80r7ok0Kpl6J47j35L3M5k6m2J01m9N3j3j09J28M4j73J50
$$ -122 12 155 -38 -102 78 -19 -25 -45 -43 -50 -86 61 -74 -41 4 -22 -64 37 -12 41 28 -81 47 91 -82 68
3420F8j40J78q1KJ30k02P2j25R0J8kk6P9m5r6j4K4l9l7J60Q3j00PqK8M6o6o7k
$$ 68 -72 106 25 27 157 -45 27 -98 -8 10 8 -18 61 16 -80 -94 -70 -109 -146 14 97 -3 4 -4 24 70 4 -63 -65
3449f5O7q8J39n5j0jl6M0o3R4J02k25J64j01K4Q1q1j0p5O5o5K57j13q1j34J99
$$ -65 2 -86 53 -2 -12 -13 -49 -9 -72 22 124 -101 63 -38 -14 67 -14 -24 -99 -34 -99 158 45 -36 -170 29
3475B9mk6QP6m9r1m5J51n9J8p4N6m1M8Ln5M0K0k4mL3L7N5j7j65J1N5JKo8K7K1
$$ 29 25 -1 7 83 34 -57 -102 49 -10 8 -66 -10 -51 -3 0 -55 -15 5 -19 -23 10 47 102 85 -80 -69 -14 -13 -11 -79 -52 -31
3507c1J57K5j76nn8P6o6j0N3L2L0o9M0L4P5q4q0P0j8N3j32n7J06L8L5j07L2L4
$$ -31 126 151 -25 -30 -88 -12 -78 -88 -35 -3 27 -42 -2 32 107 23 -57 13 -5 48 -84 -141 -35 3 38 -69 -37 -3
3535cq0L2n5R6K9p3J36q5K1k4O2r9K6N8K2n1qR5j56L0o2MQ6k0O6l6j21J74p6J8
$$ -3 -83 -51 -106 -10 19 -54 82 -3 18 -6 56 -43 -17 41 63 12 4 99 -57 -27 -89 -85 1 -19 47 11 -110 64 -12 6
3565Fqj55J94o0O2l7M6r8l0Q1n5J5M7o0J14nj56K7J15q3J5Jj3J40j73J61j74M2
$$ 6 -2 -157 37 -23 39 2 48 -50 -80 1 -54 -39 8 -52 62 57 -99 -72 43 -40 -25 -24 -37 103 -70 91 -83 -41
3593d1J22n6j38O8J24j46O7k2k1RR5k4o1J2r2J36q0l7N2K43p7n6j75J33L7j42
$$ -41 81 25 -113 -45 79 -67 0 -22 -43 -34 61 37 -24 -12 -104 32 -48 -85 -33 210 133 77 -98 35 72 -70
3619g0J28N1k4k4q9J32j25n1J02L1j1mm1K0L8j62J26JkJ02k57K5J99j66J5OQ5
$$ -70 58 109 85 61 -28 104 -21 -72 30 61 50 46 5 25 63 -99 27 28 26 128 -129 -104 95 -71 -56 -50 35
3646C5Lm7P6j01P9j19qK5J37m7p6J01N0k15N0L5j05J9J06K4Rp4J36k27J14R2j18
$$ 35 38 -9 67 -34 45 -74 -82 -57 80 33 -43 58 108 -107 -57 -22 -127 -108 -2 22 31 -43 93 -134 -20 72 -46
3673d6O4o0J21j07R8qjl8O3j03P3l7lqN8q6k7J7J16q9m9L3q1Q0M2l3J4n5J92j68
$$ -46 18 -42 79 -28 70 62 61 23 86 -17 56 19 16 8 66 -20 -47 -30 86 -3 -52 -19 -100 -20 22 -11 3 -52 140 -28
3703b8N4Rn4Q1J0j67Q5m2Q0m9n0J61Q4j40N7p6K3M8j12j20J07L6O9j24qP7n9L9
$$ -28 26 35 -19 62 72 -95 -10 -52 28 -21 -71 90 174 34 91 15 38 86 -26 -146 -39 -3 66 -58 -66 11 -48 -9
3731iM3j1P8j08l4L7N5m0P9p3n5R0k7J2k4K1j15R5m5p8J08J8n2M2M1o4l4J26j05
$$ -9 34 23 101 -7 -41 -4 51 11 90 17 -38 52 25 37 13 34 -81 14 -31 -109 -1 17 -35 7 48 -16 -50 76 -29
3760b9J04j3j46L4J1L0j33J09M2P3j21n1j5J05m1J47j01J0q4QL2l1R0Q5k9j18
$$ -29 75 62 -84 -50 -39 -9 -142 -33 9 82 -39 -90 -105 0 -41 106 5 15 -69 -61 -29 -60 30 115 86 -32
3786c2J77p8j5l5j00J03J4m6n2R0n0Q0J8j20j4oJ54k2k3k20J71JR8k49J03P2o0
$$ -32 145 67 52 17 -83 20 34 -12 -64 26 -24 56 74 -46 -60 -66 88 66 43 -177 -6 -5 93 -156 -53 19 -41
3813d1K0kQ2n2O0j81Q5Mq%L0O3K8j03j8N3N2l4r9J00p9J21q1r5P9O6p5K1N0J1
$$ -41 -21 -23 59 7 67 -114 -29 -25 -33 -33 -3 60 88 -15 -33 20 72 38 -61 39 -40 81 0 -95 -16 50 -25 -4 46 57
3843E7o7j8J00j19O9p6J49n9L1k6k1r3M1L1M3Kr2J24j0q6J7p9J53q9qp4J30j6
$$ 57 -10 -28 72 -47 22 -54 95 36 67 41 20 -73 -32 -1 42 44 -48 76 66 -20 -3 -82 71 -18 -26 -100 30 14
3871A4m2j41J58pM8l4J62j49l1M7Pj32k8J49o6K4J00j59K15j41K0j9k2R8q3P6
$$ 14 -28 -169 -11 -18 30 -4 158 9 -22 25 32 -100 -128 21 -45 -21 79 -80 135 -6 14 -5 -27 71 -12 64
3897F4p7n9P1M2j60j1Q9J35j51l9Q2m1k9R1R8n7%k2l5O9j34M4o3P2M6n1k1J11
$$ 64 -13 -72 -1 41 -119 -130 -41 94 -57 -96 -14 -55 -84 7 105 48 48 26 -9 60 -74 -30 -93 -21 25 -26 -47 64
3925F4j05N7n5M8L6j58J02J30j87j0P0p4J4N9l4L5k3J07o8lqk4rn6J3J42RQ5j48
$$ 64 -41 16 -39 9 45 -113 -11 119 -68 -78 -8 -82 -68 -9 -43 -8 -31 76 8 5 -3 -27 -36 -92 -79 63 72 157 9
3954IN3j7p7M7K8N0n7k5J17j05O2n6r4P5J13j32M1m0k0M6q9J69j19q2J15o7J23
$$ 9 62 45 -32 15 43 93 36 11 128 23 85 29 -65 10 123 -9 32 -8 -28 18 -71 98 -21 -103 12 -55 68
3981F8rj27j0J3P7qo3o6PJ00QM7p8J40o9p8P3Qn4J62j88P1j57R2J76q5m6R2r8
$$ 68 59 -68 -78 -65 12 4 -59 -125 -118 -18 -10 37 -41 99 30 -48 25 33 -21 141 -47 24 -133 -41 135 50 4 96 -2
4010bM1o1J4J10j16k0k5J94j41Q4j1q6N5Q7j04j14J38p3m1Q8q8l7J48kJ1L5q2
$$ -2 39 -22 -8 102 -14 -34 -59 135 -6 78 67 -19 36 123 19 -95 43 -30 -71 17 -71 -108 40 38 49 84 2
4037Bq0J20j84K13k49J89J2L7L1j6j35L9n0O2J6M9q6L2N3m1J08j68R7q5Q4J4j13
$$ 2 -78 42 -142 71 -178 11 23 60 91 75 -60 -21 -71 -9 7 56 -30 2 55 14 122 -46 51 -34 50 64 -49
4064d9O2j13L1L3P2k6j37K10Op3k6o3J61r4p0J22o3K7j34K09jj33J14k1n3M0J1
$$ -49 13 -100 -69 -36 36 10 -127 83 89 16 -10 -73 88 -6 -76 46 -17 10 -124 85 84 -49 65 44 -9 31 42
4091D2pp5M4o1Q6m6n1L1M7Mp8P6M8j08N1l0O8o7J26k05M7Q2j10O4k6Ln8J12p1
$$ 42 35 -40 4 -57 29 -17 -68 -37 10 14 -64 12 60 -48 3 -27 41 -26 100 -105 -58 24 -86 -22 -48 -45 -103 9 -62
4120f2l0J14j21J05K1q3P1o7J26q4n4J76k4o6m8J23nj54L2N7j12O9J48j44j1J16
$$ -62 -92 22 -99 6 27 -56 15 -52 74 -10 -64 112 88 22 -26 97 92 -62 -30 27 -85 -16 132 -12 -23 93
4146I3j26N3j69J77l8J0R9n9n3qJ43k43R2J53j10M6j00P9L5p1K5j27J4Rl9R6o
$$ 93 -33 20 -149 28 -10 0 99 40 -13 -21 122 -121 -29 124 14 60 -40 39 74 3 28 -99 -85 -76 -115 -19 -25
4173b5nj15J03J8P9l5N1j24RQ9KJ3k9m4m4Q5o6J4P5q3pL6m1M1lj5k5J60r3j0M0
$$ -25 -30 -145 -42 -24 55 20 71 -53 -44 45 47 60 31 -13 -57 28 -38 -24 51 -32 -39 -3 -44 -3 -6 -21 -46 114 21 11 51
4204E1j3p8M1MM5k5n7P3j06J32l2J5j74P8L1j0N5J6p0QMj16pR6L2j22J64l5P0
$$ 51 38 -40 1 5 50 25 -32 41 -65 67 35 50 -124 -46 -15 -25 30 46 -24 -16 -12 -128 -135 -39 -7 -129 35 0 70
4233G0K6j54J29o2q8L2L3j1K4nJ02j04K8K1l2j31K27k2j47J5N8Rj0j8po5O1l6
$$ 70 96 -58 71 9 -79 -47 -14 -25 -1 -6 96 -8 20 41 9 -122 105 83 -64 -49 9 18 8 -10 -17 -82 -21 -57
4261e7Q5p9o5J08l5J25j30j19J48K4N1L2n1oq3N0r8O4L8n5J18j32P0l7R6j05M9
$$ -57 28 -51 -116 -8 -43 82 -48 -167 -19 5 56 88 37 31 -52 -2 -100 -36 2 -53 65 -67 3 -34 62 -43 6
4288Fk1Q1r1L8J29k28P3J0N6J1O8j36n6R1o5L2p4M2J01j24J8P0l1R0j97J25J20
$$ 6 -15 66 -25 13 142 -86 -13 -3 53 64 132 -4 -60 31 -34 -2 -76 -34 67 -57 -39 31 0 90 -107 18 138
4315A38q4p6n6K24k19R2l0jlj01J53o4J09m6K0p3p2J08K7q8Q2Lr4k0P0nJL3J31
$$ 138 54 -22 -78 146 -73 19 -11 -12 -15 -116 37 -27 82 36 56 -17 -89 19 46 -42 40 43 -51 -71 -1 -6 -5 28 159
4344A59j78L3M9l9JN5m7K7j0k2j18O6O2o9L8n7J56q8M5j02J66j64J7M0r2n7J08
$$ 159 -19 14 63 24 25 80 33 60 50 28 -90 -24 38 -31 7 -50 106 18 63 -39 127 -37 -20 20 -72 -129 -21
4371b1L2R4j20%m0Q0o2R9K4L6k20R8MM7j06O0O4l2J1j0nKP2j53J45j78L1j7Q2
$$ -21 11 105 -15 -15 -55 25 -37 62 86 122 -98 0 4 51 -55 5 69 37 48 38 33 35 107 -46 99 -79 -48 -65 17
4400A7k3K7j44p1J67J7j57J91j0n8L6J19j36K7L2N3p2l2m1J22j2N1K6j39J3q8
$$ 17 -6 21 -123 -194 -27 -10 -167 24 14 -44 -8 111 -25 2 34 87 15 -17 -58 64 52 103 129 -10 3 -85
4426h5R8J34n1q8m1Q5l5K3M9j48Q6O0j09P4k05J49PMm4O3j6r7J72p3L4r6j9k4
$$ -85 13 147 96 8 -33 52 17 40 89 -59 27 87 -22 52 -153 -4 3 7 -37 26 10 -87 85 12 46 -50 -69 -93
4454i3P8K4p4q2J84pj42J08o6P4n1M2lK2R4Qj06N5m6Q3n0l0j32J41q7R2L7k6j2
$$ -93 -15 9 -65 -147 37 30 -112 -4 -70 4 -47 -5 -8 14 108 116 10 65 19 102 52 22 -110 31 -56 36 73 47 35
4483C5l7J1j70J44Q1m4J3J1M7m9P7j38J79j40N9l3p2L4K2k6j0R1n7MN4r2l2J11
$$ 35 -2 9 -161 -17 64 20 33 44 91 42 119 -19 160 20 79 46 -26 8 30 4 -6 85 28 32 86 -6 -38 73
4511G3mj10K2J14p5Nmj38J09JN3l8k0r5O0JL8j9N9q8N4P5n4j7J04k06Q2m6L0o3
$$ 73 69 -41 -19 95 20 25 21 -117 -8 -7 46 8 -12 -107 -47 -46 -8 -27 32 -56 -2 73 19 2 106 -100 -18 -64 -34 -97
4541i7J36o9QJ55p3j15J30L0j35M9j4k2n2O8n0J0O0rOj4M9k2p5j13K16o2m5Q6
$$ -97 39 -30 -22 133 60 -55 75 105 -30 19 5 -17 -69 -1 -51 -41 19 10 16 2 51 29 -46 -159 57 -5 -50 36
4569C6m2J1nl7J00j68J38k1K6q5k8k3Q4K2O1m8K3O0n6r4K8J12l8N1j73J77r6j2
$$ 36 -6 5 0 -37 63 -105 33 12 38 -47 -75 -98 -14 8 69 21 44 104 48 -46 -18 94 56 107 -66 111 15 3
4597Ck4r0Q3Q2J8q3J6Kk2K3O7j28P5l8J3p2R1r5J7N5lN6q2N6J3j15Q2K1n6P1o5
$$ 3 -21 -111 -28 54 72 -11 5 7 -15 8 75 -53 22 -16 -3 -75 16 -79 -62 -7 -10 46 -36 20 33 -82 0 21 -35 36 -29
4628b9k1J27j44J41l5M7r7N3n6p5J05q1p7J99r2%P5j7l5P1L5p7m1K6L5j54R7j6
$$ -29 -50 77 -67 74 39 86 -11 42 -14 -89 16 -65 -142 57 -35 -35 40 23 -12 59 94 17 -24 2 37 -117 -20 -36
4656c6J9k3L5Q9r2K8l3pQ3j00Q2l4p6J22q8J9J21l1o0j0Q4j35N6k3MQ1l8Mo6M1
$$ -36 -17 -40 -5 84 -8 20 -13 -20 63 -37 45 11 -65 57 -31 -12 109 78 18 8 92 -43 13 -10 -6 75 37 41 -25 16
4686A6o8k8J43k8O7m1q9P7n6J4m4j5J05n0k3R8k5o4N3KrQ8o5j25M1J3K2kO1r8
$$ 16 -52 -80 63 35 102 61 -28 49 -7 7 -37 -52 53 3 -20 78 53 -11 42 44 35 123 58 -67 -26 -13 9 7 68 -30
4716c0K4qK0J8P4n5o0j8M1K4oK8j49K7j7R3n1N9l5j4P0L9o9K5j1L2j09M0k4j11
$$ -30 -6 -14 6 24 98 43 -17 -35 6 30 24 52 -97 -70 -87 6 -45 14 -21 -35 35 74 5 30 19 51 -58 -18 -42 -153
4746a53J65K8k9O5j02N1P4p4N4j14O5O0r0P1j20M1J24j19m9R4K3J4m6oL9Rn7L1
$$ -153 12 40 11 76 -26 25 99 25 79 -35 30 90 0 71 -49 -8 116 -3 -52 42 65 79 33 27 66 75 18 49
4774D9l8n4oQ5j8o2n9L1J10Q1k6j13MJ14j30J24j34L1j6N9o6p8N9O3m5l7N3Q3
$$ 49 11 -43 -49 36 18 -44 -103 -72 38 119 93 -20 -16 98 -32 92 -42 -11 -27 32 -34 -112 -53 10 -35 -72 -19 64
4802F4n0j07J48j54k8N3J73j0l1n1l5j5N5qP0kP3p8J9m4m1k3L7j02PR5n3P7p2
$$ 64 14 -93 55 -99 -127 -74 99 89 58 7 -28 -43 12 4 74 72 145 67 86 42 1 -22 15 -87 -80 15 -38 39 -33
4831c3K2J0%J14O7j64m3j8K3j0R7j75N9P4o6N7J6J22j51o2mk3j9K9K2Q1mj6M1
$$ -33 -11 -1 -1 113 180 16 -27 -45 -22 -32 65 -110 -51 23 -43 14 30 152 1 -61 -65 -88 -107 -78 -56 25 21 5 46
4860D6l2l4L0M7m9j36J70j3p1K5RJ42j23k6J37j20%J09q1l5jJ2k6j25K25j75P9
$$ 46 14 -20 10 57 8 -128 42 29 -42 -17 -8 134 11 -15 122 2 2 111 30 -5 -6 6 -20 -145 80 -95 -16
4887a6N3p3N4J8K0j81J38J0N8p4PP6j02M5N7r7Np0n7K4m2K04n3J3q5J81j36l4
$$ -16 37 -36 18 36 56 -125 13 23 81 7 14 90 -12 33 90 -7 -2 -72 -129 -105 -147 57 4 17 -68 113 -23 -57
4915e7J36k67J44N1o7l7J24J0j4J1j0L5j8k4Rk5p8j4R3o7O5K9L3%r3P8m1N1j20
$$ -57 79 -188 -44 7 -60 -97 27 37 23 34 24 59 41 17 26 1 -77 -91 2 -65 0 29 62 62 -31 47 6 57 -63
4944f3K1J01n9l6K9j08K8J6M5o4J43J7k6n5lJ0J8l1OJ3M2j36J07Kq4R3N4l2q9
$$ -63 -42 59 0 -36 -7 -115 -87 -71 -26 -90 53 70 44 -11 -14 -4 14 -17 -11 2 44 -92 15 17 -67 26 80 48 -41
4973d1O4J7r1o7k0J5J34j1q3J20n2j12J24kJ65j36m2m1j6J44p8L8n1N8p2K5Kk6
$$ -41 23 40 -51 -118 -138 -123 11 0 -83 37 -15 -127 -3 -5 160 24 -18 -59 -75 69 -9 29 -22 36 -36 -11 -9 -35
5001c5M0J2m1n5K3K6LPN9oqom8k9J6J28n7j18J42j00J8L4o8P7l2J4J6RQ4n3r7
$$ -35 5 17 -24 -79 -56 -30 -27 -20 39 33 25 19 -29 -58 -42 86 29 -89 53 -47 -29 5 -63 14 -18 -4 12 21 105 52 -45
5032d5j07J64p1j0R3nN3ml9q9K3J13k3L4p2Jj3K9o8Rk7m8P7k3m8J57j06m5M8K5
$$ -45 -152 12 -59 -69 24 19 72 68 29 -60 -37 76 53 87 15 16 3 32 -36 -27 -54 -102 -25 -48 -96 61 -45 -90 -42 -17
5062a7NQ4k2l5L1J9L0r6P5j35J22r0O7m9P4p2N5q7L2n2P9p6J27o5n1O2KR6p0l9
$$ -17 -12 72 50 15 46 65 95 -1 74 -61 61 -29 38 -11 63 -9 46 -41 -9 -61 18 -58 69 4 -47 15 17 113 43 4
5092Do9O9O4R6k09R1Rm4L7l2l2o8K7o0J12r2J03j0K5Lk8r9J09M3o7p4J00M4j22
$$ 4 -65 4 68 164 -45 46 55 11 48 16 -16 -84 -57 -117 -5 -97 6 -4 21 24 -4 -103 6 49 -18 -92 8 52 -70
5121g0K77j97O9j48K14k21K0O9J7K1mK1j80P8J17n1L3j3n5k4J03p9k6k4q1J98
$$ -70 207 10 79 -69 145 -76 -56 13 30 51 47 68 -112 -34 83 32 65 52 -3 -27 76 -3 -29 -53 -134 64
5147F4p8p6J20j1R1j23o1J48j15J0P9J28j70l1j8J12J7l5j36P7J39Nk06J01j12
$$ 64 -14 -90 30 19 110 -13 -74 74 -41 -31 48 176 6 -25 -43 69 86 51 -85 -8 131 136 -70 31 -81
5172h1J09j1J5j10N1P3l1N8p3k7L9K7N8j83L9%qJ5K2j2L6Nm2J46j17P3q8J57j35
$$ -81 28 17 32 -78 -27 46 15 73 0 -27 12 39 97 -86 -47 -47 -55 -40 -18 -30 6 11 -31 115 -2 71 -17 140 5
5201Ej7j5O8p1O3p9K1Q9k0n6J5L2n5Q1l1j25O6M5m2n9J26l0k8K03k84K46j42l5
$$ 5 -12 -27 41 -30 33 -46 -25 64 44 -12 3 35 -20 61 30 -95 -29 16 -26 -85 41 11 -17 186 -98 148 6 -29
5229b9Q6q1J25r1n8K1J5n6J05oj16J06n9P6j5k2l8J13r6O9j34P3P3j25P4k8P5
$$ -29 57 -24 101 10 -48 -27 -12 -68 37 31 -85 21 -38 38 23 1 -37 76 -20 49 -85 -12 61 -64 10 -18 57
5256E7j8J9k09J32J29j69J03j2j9p1R8p9L7l6oJ49j28j4O7j02Q0n9K7NK4m7J13
$$ 57 39 58 -151 -19 110 -59 44 32 13 -58 40 -39 -2 -38 -44 105 -23 -37 30 -72 8 -51 -24 -19 5 -42 71
5283G1j33P9r1JJ58j50RQ1j61J70p4O4K9n5L6m0j4O1o4J23k5j27N7l6k3J98q0
$$ 71 -62 17 -74 -73 85 -65 -56 25 -136 34 -40 24 53 -2 34 -6 -20 41 -23 100 75 -52 5 -31 -54 144 64
5310F4n9Qn0OL3N8m3k0N4j29J40n3n1P1k9j2K4Mm8N5j42J54o8KJ8Q2m2ll1O9j39
$$ 64 5 13 -37 -31 2 60 17 -3 51 -78 62 9 -42 29 0 -12 12 16 -32 23 -119 35 -33 -31 -13 69 27 24 -7 62 -77
5341g7P7P8j04K1K2oj40O3J09j05O0M5l7k03J60Q6q8M8K4n0P3j07J11j00kqL6
$$ -77 0 78 -26 -5 17 11 -129 -66 43 -62 -2 43 6 -197 -37 49 -39 9 33 -17 56 -51 60 -40 -42 -50 -14
5368a4P5rj03R1k9l3q7j1J05q6J06l4K9k9M9j6Ml7J16m0j50M0Q2j24K2J37M0m0
$$ -14 61 52 -51 40 11 -22 -109 -120 -15 -101 5 -29 0 -29 20 4 8 -29 87 47 -103 -63 19 -105 -83 54 94 54
5396E4n0p4R5l5l2L4P0j03J18r7J01j32j16J76k2M9R8o8q1N5Q4q8r7J24n7l7K5
$$ 54 4 -70 25 -10 -42 -8 62 -41 77 -20 81 -51 -167 9 -13 36 134 66 -15 40 124 36 -61 63 6 -31 -6
5423fm1j4J71j10j1j8M2n0O6K7j21J3l1J11k2m3O0p6jR4k1l3M8L1j87J61l4J7
$$ -6 -47 -61 110 0 -11 -29 13 -37 29 56 -65 -52 -83 28 6 -37 23 -53 -54 40 19 -14 34 65 -122 39 5 22
5451B2o3Q2L5l9m1p4J10k7j81J57L7Nj10R4k9lN7j0j76J02P5Q4j07L8K2k0q5O3
$$ 22 -41 41 76 37 -4 -78 32 5 -176 -19 18 23 -87 7 -22 -25 32 22 -154 -52 23 107 0 38 60 40 -45 18
5479A8K5j1j19J75j19l4O6k1Q8N7j57M9n5k2P7P8j26q0J75r7L9o6P5j4k6l9M2
$$ 18 43 32 -87 88 -31 -65 1 -20 68 125 -32 17 -38 -60 17 95 -31 -111 64 -33 6 -60 15 1 -25 -64 -22
5506b2P5k07J03Q7j5j49Q9J03m3k8L4N6j55K01j90Q5O3r4K2mj19O8J77j70L1l5
$$ -22 53 -154 -51 36 21 -128 -39 64 21 -7 27 83 -72 129 -61 24 87 -7 15 11 -108 -40 137 -33 -2 -37
5532c7R1m7L8J2nj19O9m5L8Q7j19J1L5p0R7k5k9J26j42P9pJ2m7k8l2j0J17o4q2
$$ -37 54 7 45 57 52 -67 2 -43 -5 82 -37 -26 9 -61 36 11 -18 108 -34 45 38 50 3 -25 -57 -67 50 -14 -96
5561i6L7J18p3J21p9l4P1m1M3j15M9%j23J12l7n8Q1R3Lo7rJ34j14k5M2L0q8L5
$$ -96 -59 59 -14 107 28 -6 65 24 67 -48 1 1 -122 -10 -47 -105 -24 69 72 5 -4 130 16 -9 33 63 -25 10
5589A0K6j70J94r5N5j16N1O2k0k7J02k04O2J34k21K13j05m6K0J75j45N0k5j2J36
$$ 10 36 -134 60 -35 20 -96 -45 17 -3 -30 72 -132 -70 64 -157 56 -49 -95 -75 100 -45 5 -20 -32 104
5614A04j61j4K4J38j28NJ07p9j4L2N3j50O0OL4j2m6P1m2j3O9Lj37P6L6K8j36P1
$$ 104 -57 -71 -47 91 -37 -32 75 -4 -18 14 67 -83 -23 -17 17 5 -41 30 -12 -25 44 47 -90 -14 22 50 -86 -15
5642a5R3n5m3J9p5J07Q8j14j5l2O9J4M5j28j7M4J9k3q2J07j26K09j68N0pj6J5
$$ -15 78 23 -20 -1 -76 31 119 5 -10 -42 27 41 86 -42 -59 -15 4 -19 -101 6 -120 89 -79 -29 -36 -52 -37
5669c7m6J20ln9J8j8j54L12r5l7j25J08M9j8oK7k0O1o9P3o2Rn0J1O4lk9M5q5R0
$$ -37 -83 37 34 -25 -7 -25 -179 133 38 1 -124 -16 33 15 9 36 16 77 8 81 19 28 -22 -11 53 50 21 66 -19 71
5699G1m5J7l4K9o1J03Qo8LJm0J45j06M2j27N4mL5m3M0Np0R1j61L02j67k8j4J44
$$ 71 26 43 9 38 -23 80 88 20 23 24 -16 129 23 65 -62 -8 -12 23 -20 20 25 -45 46 -115 187 20 -8 -22 122
5728A22p8j29J76m6K1o8k0r0K24j09k5%L5m4nl9J14j5Nn2j6j2Q3nl7j2O8J14j90
$$ 122 44 -85 91 45 66 -2 -22 -112 112 3 -22 -22 13 -31 -36 -75 39 24 29 -23 -39 -51 32 27 -10 -22 46 160 -30
5757c0m0N3L4k8p3J22oo1R2q7J08Rn3o2M2J8j40Q4J10k3q4K2l3mPN7l2k1j7p2
$$ -30 -70 -17 17 -11 -84 38 32 -29 63 -24 84 93 40 -22 20 38 -102 -18 92 69 -15 7 -26 -30 -23 34 2 -19 -36 -108
5787a08P8m4R2O0m3j90O8L2J50j83J72l1j5N5j29l0J08j8L0J5M4Jj35K1J2Lo4
$$ -108 -30 -74 18 78 35 -155 -87 -55 95 -88 84 53 38 93 -36 -66 42 24 54 69 113 114 -21 0 12 15 -49
5814d9Q7O7o6m7p9O9P7j6j04J16lk7j05P5K8p7M6P6j14k7O7PMM3r5J20K2n3l6
$$ -49 38 105 39 -8 -87 -18 59 43 -61 55 52 25 -80 -5 23 -54 -8 68 -46 -73 -6 1 5 48 -47 73 95 42 6
5843Fk6N2n3N7M9k3q7N6p8P1q2J33%l7k8o7J33n0%j9N8j78K03k5K5j06j7M2O9
$$ 6 -20 32 -21 36 85 62 -25 31 -47 24 -58 75 75 38 10 -57 76 26 26 7 65 -113 90 65 90 -16 -33 9 78
5872G8j74J57p4j09J33J10j81J38m1or4P2k2M6j12k4J69l3n1J72j67O4p0k3L9
$$ 78 -96 61 -13 -122 11 121 -60 78 37 31 -63 9 -13 33 -79 -103 66 33 -18 154 -13 51 -19 -42 -3
5897cp4O0qm5lk2J22r7R4R4r1pok7l9J13j21J8O0l6q6J79K3L6j60Q1J7j14R8p9
$$ -3 -77 -17 -25 -70 -73 -95 27 -70 24 118 27 20 14 -13 -52 61 -60 -42 18 -18 -104 75 98 134 -26 55 72 -42 56 -23
5927b3q0L4K40n1j61J67k70J92j2n1O5j09o2J25kl1K6on4P0Q1j11R5p2%K4r2k2
$$ -23 -103 -69 171 120 -41 126 -144 48 36 -15 50 -59 -121 4 2 -29 -3 -9 -63 7 88 -23 72 0 0 24 -68 -90
5955i0R5P5j18K0k2K5M8j04J06r3k1J0J25r3PJ62l0o8L3j58J31k6N7o3o0L4N9
$$ -90 5 80 -38 -18 -40 -15 33 -71 35 -58 -79 -69 56 -37 -30 132 102 34 67 -91 40 14 71 8 -52 -18 41
5982D1Mj7j21J61r4p2O0J17R5j54l9J0k9jl4R3m6N2k2O9j75m2J24K4J8J6Nl0n5
$$ 41 45 28 -93 68 -26 -98 -38 79 174 20 -19 -9 -38 -39 -73 20 -26 26 4 73 -102 -144 -20 4 22 38 43 13 -42
6011d2Q5l1J6O4j26M9k8p1P1N1n2J28j34j13J75P6j11j80J99K4N5j13r8J55l0
$$ -42 43 12 28 92 -34 15 -13 -84 -13 38 -14 114 -20 -133 42 118 7 -173 26 50 105 -8 -106 49 19
6036A9J1j15J17l7Q1p6O3j03p6J46m1jN0m8pkm6lQ9N2l1Mk5K17k49j3L9l9L7Q9
$$ 19 30 -85 32 -5 76 0 63 -40 -116 30 -11 -12 38 -10 -17 -19 -65 -68 21 73 42 46 21 238 -11 -24 15 -24 13 102
6066A02k8k15N7J55l6m9O5Q2n0p7p8J13j02P1L0K2k29J51n2j4P5p1R8m7L0J16
$$ 102 74 -141 -84 71 35 -14 51 133 83 6 -72 41 -61 10 40 62 -167 -16 -68 -82 -7 -78 20 -27 3 119
6092A19qj13M2k5J1j42J9J59p8q3J26Q3j03J23j60N2k5rj21P5koN8kK4j36J15
$$ 119 111 -2 40 15 26 -116 -97 62 -16 -99 27 110 7 130 -30 22 -3 -12 -133 -58 -60 -66 -8 -10 14 -122 -7
6119gP4j30P7j3K7m5K7k3q9Q2J05r9NK34k40k6Q0N1j07R9p1J15j96R3RJ2m4J4
$$ -7 67 -63 14 1 28 -17 10 -13 -102 -20 85 -14 -9 225 -15 -41 39 90 -17 82 11 126 -70 23 32 44 0 14
6147A4rl0Qk9J51j8m8J08k23J06m3J33j49L5m2NN7j35J43k05J41r3O4M5N3j07
$$ 14 5 -25 -17 -46 105 87 39 147 -76 30 -13 120 -29 6 -36 -31 26 -109 34 -171 -30 -123 -59 -14 39 -68
$$ [...]
8191a3
##END NTUPLES=NMR FID
##END=
