##TITLE=1H_LR-688B-MC1-TFA
 CDCl3, 8 sc, 
 2.8.2019
##JCAMPDX= 6.0         $$ Bruker NMR JCAMP-DX V2.0
##DATA TYPE= NMR FID
##DATA CLASS= NTUPLES
##ORIGIN= UXNMR, Bruker Analytische Messtechnik GmbH
##OWNER= root
$$ XWIN-NMR		Version 3.5
$$ Fri Aug  2 14:21:14 2019 Russian Standard Time (UT+4h)  she@DPX200
##.OBSERVE FREQUENCY= 200.13155
##.OBSERVE NUCLEUS= ^1H
##.DELAY= (6, 6)
##.ACQUISITION MODE= SIMULTANEOUS
##.ACQUISITION SCHEME= undefined
##.AVERAGES= 8
##.DIGITISER RES= 18
##SPECTROMETER/DATA SYSTEM= spect
##.PULSE SEQUENCE= zg30
##.SOLVENT NAME= DMSO
##.SHIFT REFERENCE= (INTERNAL, DMSO, 0, 15.7039)
##AUDIT TRAIL= $$ (NUMBER, WHEN, WHO, WHERE, WHAT)
$$ ##TITLE= Audit trail, XWIN-NMR		Version 3.5
$$ ##JCAMPDX= 5.01
$$ ##ORIGIN= Bruker BioSpin GmbH
$$ ##OWNER= she
$$ F:/spectra/data/she/nmr/H-F/1/audita.txt
$$ ##AUDIT TRAIL=  $$ (NUMBER, WHEN, WHO, WHERE, WHAT)
(   1,<2019-08-02 14:20:10.56 +0400>,<she>,<DPX200>,
      <created by zg, POWCHK disabled, PULCHK disabled
       configuration hash MD5:
       00 E9 B6 7A A2 85 ED C7 34 08 36 98 17 FE 4E 26
       data hash MD5: 16K
       5F 47 80 66 7B 1E 31 F5 8B 05 33 FD D3 F6 35 EF>)
$$ ##END=
$$ 
$$ hash MD5
$$ 18 09 63 F9 49 0B 50 D7 A0 12 30 02 AF AB 3E B3
##$RELAX= 
##$RELAX= 
##$RELAX= 
##$RELAX= 
##$RELAX= 
##$RELAX= 
$$ Bruker specific parameters
$$ --------------------------
##$DU= <F:/spectra>
##$EXPNO= 1
##$NAME= <H-F>
##$PROCNO= 1
##$TYPE= <nmr>
##$USER= <she>
##$AMP= (0..31)
100 100 100 100 100 100 100 100 100 100 100 100 100 100 100 100 100 100 
100 100 100 100 100 100 100 100 100 100 100 100 100 100 
##$AQSEQ= 0
##$AQ_mod= 1
##$AUNM= <au_zg>
##$AUTOPOS= <>
##$BF1= 200.13
##$BF2= 200.13
##$BF3= 200.13
##$BF4= 200.13
##$BF5= 200.13
##$BF6= 200.13
##$BF7= 200.13
##$BF8= 200.13
##$BYTORDA= 1
##$CFDGTYP= 0
##$CFRGTYP= 5
##$CHEMSTR= <none>
##$CNST= (0..31)
1 1 145 1 1 1 1 1 1 1 1 1 1 1 1 1 1 1 1 1 1 1 1 1 1 1 1 1 1 1 1 1 
##$CPDPRG= <>
##$CPDPRG1= <>
##$CPDPRG2= <>
##$CPDPRG3= <>
##$CPDPRG4= <mlev>
##$CPDPRG5= <mlev>
##$CPDPRG6= <mlev>
##$CPDPRG7= <mlev>
##$CPDPRG8= <mlev>
##$CPDPRGB= <>
##$CPDPRGT= <>
##$D= (0..31)
0 1.2 0 0 0 0 0 0 0 0 0 0.03 0 0 0 0 0 0 0 0 0 0 0 0 0 0 0 0 0 0 0 0 
##$DATE= 1564741209
##$DBL= (0..7)
120 120 120 120 120 120 120 120 
##$DBP= (0..7)
150 150 150 150 150 150 150 150 
##$DBP07= 0
##$DBPNAM0= <>
##$DBPNAM1= <>
##$DBPNAM2= <>
##$DBPNAM3= <>
##$DBPNAM4= <>
##$DBPNAM5= <>
##$DBPNAM6= <>
##$DBPNAM7= <>
##$DBPOAL= (0..7)
0.5 0.5 0.5 0.5 0.5 0.5 0.5 0.5 
##$DBPOFFS= (0..7)
0 0 0 0 0 0 0 0 
##$DE= 6
##$DECBNUC= <off>
##$DECIM= 24
##$DECNUC= <off>
##$DECSTAT= 4
##$DIGMOD= 1
##$DIGTYP= 9
##$DL= (0..7)
0 120 120 120 120 120 120 120 
##$DP= (0..7)
150 150 150 150 150 150 150 150 
##$DP07= 0
##$DPNAME0= <>
##$DPNAME1= <>
##$DPNAME2= <>
##$DPNAME3= <>
##$DPNAME4= <>
##$DPNAME5= <>
##$DPNAME6= <>
##$DPNAME7= <>
##$DPOAL= (0..7)
0.5 0.5 0.5 0.5 0.5 0.5 0.5 0.5 
##$DPOFFS= (0..7)
0 0 0 0 0 0 0 0 
##$DQDMODE= 0
##$DR= 18
##$DS= 0
##$DSLIST= <SSSSSSSSSSSSSSS>
##$DSPFIRM= 0
$$ [...]
##$SUBNAM2= <"">
##$SUBNAM3= <"">
##$SUBNAM4= <"">
##$SUBNAM5= <"">
##$SUBNAM6= <"">
##$SUBNAM7= <"">
##$SUBNAM8= <"">
##$SUBNAM9= <"">
##$SW= 24.9336996594482
##$SWIBOX= (0..15)
0 0 2 0 0 0 0 0 0 0 0 0 0 0 0 0 
##$SW_h= 4990.01996007984
##$TD= 16384
##$TD0= 1
##$TE= 0
##$TE2= 300
##$TE3= 300
##$TEG= 300
##$TL= (0..7)
0 120 120 120 120 120 120 120 
##$TP= (0..7)
150 150 150 150 150 150 150 150 
##$TP07= 0
##$TPNAME0= <>
##$TPNAME1= <>
##$TPNAME2= <>
##$TPNAME3= <>
##$TPNAME4= <>
##$TPNAME5= <>
##$TPNAME6= <>
##$TPNAME7= <>
##$TPOAL= (0..7)
0.5 0.5 0.5 0.5 0.5 0.5 0.5 0.5 
##$TPOFFS= (0..7)
0 0 0 0 0 0 0 0 
##$TUNHIN= 0
##$TUNHOUT= 0
##$TUNXOUT= 0
##$USERA1= <user>
##$USERA2= <user>
##$USERA3= <user>
##$USERA4= <user>
##$USERA5= <user>
##$V9= 5
##$VALIST= <valist>
##$VCLIST= <CCCCCCCCCCCCCCC>
##$VD= 0
##$VDLIST= <DDDDDDDDDDDDDDD>
##$VPLIST= <PPPPPPPPPPPPPPP>
##$VTLIST= <TTTTTTTTTTTTTTT>
##$WBST= 1024
##$WBSW= 4
##$XGAIN= (0..3)
0 0 0 0 
##$XL= 0
##$YL= 0
##$YMAX_a= 182373
##$YMIN_a= -269321
##$ZGOPTNS= <>
##$ZL1= 120
##$ZL2= 120
##$ZL3= 120
##$ZL4= 120
##$ABSF1= 10
##$ABSF2= 0
##$ABSG= 5
##$ABSL= 3
##$ALPHA= 0
##$AQORDER= 0
##$ASSFAC= 0
##$ASSFACI= 0
##$ASSFACX= 0
##$ASSWID= 0
##$AUNMP= <proc_1d>
##$AZFE= 0.1
##$AZFW= 0.1
##$BCFW= 1
##$BC_mod= 2
##$BYTORDP= 1
##$COROFFS= 0
##$CY= 11.3945322036743
##$DATMOD= 1
##$DC= 2
##$DFILT= <>
##$DTYPP= 0
##$F1P= 20.1537800932815
##$F2P= 0.134698688090026
##$FCOR= 0.5
##$FTSIZE= 0
##$FT_mod= 4
##$GAMMA= 1
##$GB= 0.15
##$INTBC= 1
##$INTSCL= 1
##$ISEN= 128
##$LB= 0.24
##$LEV0= 0
##$LPBIN= 0
##$MAXI= 10000
##$MC2= 0
##$MEAN= 0
##$ME_mod= 0
##$MI= 1.114404
##$NCOEF= 0
##$NC_proc= 0
##$NLEV= 6
##$NOISF1= 3.799351
##$NOISF2= 2.8
##$NSP= 1
##$NTH_PI= 0
##$NZP= 0
##$OFFSET= 15.70392
##$PC= 1
##$PHC0= -9221.73
##$PHC1= 15.00097
##$PH_mod= 1
##$PKNL= yes
##$PPARMOD= 0
##$PSCAL= 0
##$PSIGN= 0
##$REVERSE= no
##$SF= 200.130013532006
##$SI= 16384
##$SIGF1= 3
##$SIGF2= 2
##$SINO= 400
##$SIOLD= 16384
##$SREGLST= <1H.CDCl3>
##$SSB= 0
##$STSI= 0
##$STSR= 0
##$SW_p= 3612.71676300578
##$SYMM= 0
##$S_DEV= 0
##$TDeff= 0
##$TDoff= 0
##$TI= <>
##$TILT= no
##$TM1= 0
##$TM2= 0
##$TOPLEV= 0
##$USERP1= <user>
##$USERP2= <user>
##$USERP3= <user>
##$USERP4= <user>
##$USERP5= <user>
##$WDW= 1
##$XDIM= 8192
##$YMAX_p= 0
##$YMIN_p= 0
$$ End of Bruker specific parameters
$$ ---------------------------------
##NTUPLES= NMR FID
##VAR_NAME=  TIME,          FID/REAL,        FID/IMAG
##SYMBOL=    X,             R,               I
##VAR_TYPE=  INDEPENDENT,   DEPENDENT,       DEPENDENT
##VAR_FORM=  AFFN,          ASDF,            ASDF
##VAR_DIM=   8192,          8192,            8192
##UNITS=     SECONDS,       ARBITRARY UNITS, ARBITRARY UNITS
##FACTOR=    0.0002004,     1,               1
##FIRST=     0,             0,               0
##LAST=      1.6414764,     0,               0
##MIN=       0,             -269321,         0
##MAX=       1.6414764,     182373,          0
$$ Real data points
##PAGE= N=1
##DATA TABLE= (X++(R..R)), XYDATA
$$ [...]
1892a47j96k24L31O2K75J14l34O55l58J44m07K71n16M17J02J84j26P4k2kj60j07
$$ -147 -343 -567 -236 -174 101 215 -119 536 178 322 -85 186 -330 87 189 373 247 321 299 297 137 30
1914C0n5J25K29j74j1k32M67l55j30KP5L05m16k00L32L7l8j95j25k1l4kK83J50
$$ 30 -25 100 329 155 144 -88 379 24 -106 -104 -29 276 -140 -340 -8 29 -9 -204 -329 -350 -384 -386 -103 47
1938D7m76L42K79l92j17J67Q4k48J09M45l23j2n7M07m74J25J78L52j89j61N42
$$ 47 -429 -87 192 -200 -317 -150 -66 -314 -205 240 -83 -95 -152 255 -219 -94 84 436 247 86 628
1959F28j88k86r1L35l27J51m6K49K1N8k30J23m47j6m1O2K05j85J67K6l86j48n4
$$ 628 440 154 63 398 71 222 176 425 446 504 274 397 -50 -66 -107 -45 160 -25 142 168 -218 -366 -420
1982d20j97M10k19O9n8J69j56K10n40R2J51j75R3L58J01L4j9j90m4K32J56j40
$$ -420 -617 -207 -426 -357 -415 -246 -402 -192 -732 -640 -489 -664 -571 -213 -112 -78 -97 -287 -331 -99 57 -83
2004h3j44J67M93o8n3k69N91m39j59%Q40j72l84L01K05m83k75JM25j12j92M25
$$ -83 -227 -60 433 365 312 43 634 195 36 36 876 704 320 621 826 343 68 69 494 382 190 615
2026F15k31k9j07K6q9j97j94P15m54l33N45l10l9n17J75LP6J21r1k55M06l08m6
$$ 615 384 355 248 274 185 -12 -206 509 55 -278 267 -43 -82 -599 -424 -421 -345 -224 -315 -570 -164 -472 -518
2049e18J75j03R5l93J65L32K72l14j09N31j9k72j48K66Q0r2P9M03k13k79J83L42
$$ -518 -343 -446 -351 -744 -579 -247 25 -289 -398 133 114 -158 -306 -40 40 -52 27 430 217 -62 121 463
2071D63k18QK14M68o01k64M21J60l89k77M86k41j68J24K24l00m4K30r1M3p35K19
$$ 463 245 253 467 935 334 70 491 651 262 -15 471 230 62 186 410 110 66 296 205 248 -487 -268
2093b68P02k43j50j88K7m13M05l98L27j03O7K16k17j4l5J82k1k37k99L24N33p3
$$ -268 434 191 41 -147 -120 -533 -128 -526 -199 -302 -235 -19 -236 -250 -285 -103 -124 -361 -660 -336 197 124
2115A24m30j27L25N3k97K50J79L59l55K77j9j46Q5J78l11j71j97N24m1K49l36
$$ 124 -306 -433 -108 -55 -352 -102 77 436 81 358 339 193 278 456 145 -26 -223 301 260 509 173
2136A73q9M23n83j65L91j53k42M9O62j64m43J40J20J72o32L89M6J54n91L48L3
$$ 173 84 507 -76 -241 150 -3 -245 -196 466 302 -141 -1 119 291 -341 48 94 248 -343 5 38
2157C8k74J4k87M65l49K23L61o4j25q6J70l57o6L0K89K20k61k52N04Q6n94M96
$$ 38 -236 -222 -509 -44 -393 -170 191 127 2 -84 86 -271 -337 -307 -18 202 -59 -311 193 279 -315 181
2179A81j99L2J80k72P4O95o30m4K38Q3n9k93K25K15l70M8M46k60n51j47M66K35
$$ 181 -18 14 194 -78 -4 691 61 17 255 338 279 -14 211 426 56 104 550 290 -261 -408 58 293
2201B93k95m29M40j28l22J53J60L31o55K07K88j35l6o7L39j38m82K15K2j23J2
$$ 293 -2 -431 9 -119 -441 -288 -128 203 -452 -245 43 -92 -128 -195 144 6 -476 -261 -239 -362 -350
2222c50L32J33n7j71J31K31n28J88N91j64j96L7L14j77m50Q1L43l63L95p3K54
$$ -350 -18 115 58 -113 18 249 -279 -91 500 336 140 177 491 314 -136 -55 288 -75 320 247 501
2243E01j64l39L32k05K5j82M25k5N7k56k63K6q6n5l3L25l5j88j77o0L02j92k09
$$ 501 337 -2 330 125 150 -32 393 368 425 169 -94 -68 -154 -209 -242 83 48 -140 -317 -377 -75 -267 -476
2266d76P3j2l7L1K82Q6o6k01J77Nj67j29L85P8Q3q8K30j35J3r7L78l18J72J38
$$ -476 -403 -415 -452 -421 -139 -53 -119 -320 -143 -138 -305 -434 -49 29 112 24 254 119 132 35 413 95 267 405
2290D05R8k06j39L53k34j53N3K21j16j83K05K33k65j03M7k14k1M3m5J13j97j9
$$ 405 503 297 158 511 277 124 177 398 282 99 304 537 272 169 216 2 -19 24 -21 92 -105 -124
2312a24J96l55m7j47K54p2n1L06K5n7k35m9J53k36J94J1j40J37j39L60k35M7R0
$$ -124 72 -283 -330 -477 -223 -295 -346 -40 -15 -72 -307 -356 -203 -439 -245 -234 -374 -237 -376 -16 -251 -204 -114
2335a14n6l21N06J45j01p2J00K34l05k1K72k62n4J75o5J32PL21q4o18K11J19J86
$$ -114 -170 -491 15 160 59 -13 87 321 16 -5 267 5 -49 126 61 193 200 521 437 -181 30 149 335
2358C35k30L0L84m64J11p6j24J62l05L84j45K23l27m06K72j15Q3j86K80R7l61
$$ 335 105 135 519 55 166 90 -34 128 -177 207 62 285 -42 -448 -176 -291 -208 -394 -114 -17 -378
2379c78M97M8m23J12Rm33R3M64n2m11M05O2l91o1N05k97J31K89j87K08j73R9L69
$$ -378 119 167 -256 -144 -135 -568 -475 -11 -63 -474 -69 -7 -398 -459 46 -251 -120 169 -18 190 17 116 485
2402D85l87k2Q6J8K32j25q9J93k34P2j08K16j54m16L47j96J96lP0J5j59k31K75
$$ 485 98 76 162 180 412 287 198 391 157 229 121 337 183 -233 114 -82 114 111 181 196 37 -194 81
2425H1j71J47p3J3j45J06N2m17K04r1R6k13J46R7q9K72j72o0L62l02kK35P2j73
$$ 81 -90 57 -16 -3 -148 -42 10 -407 -203 -294 -198 -411 -265 -168 -257 15 -157 -217 145 -157 -159 76 148 -25
2449b5k27O12k38j55K24l93J84K09l27O1J48o2J50j99q7L53k23J46o3P1J36j98
$$ -25 -252 360 122 -33 191 -202 -18 191 -136 -75 73 11 161 -38 -125 228 5 151 88 159 295 97
2471I7K61j59r3J10p2o8l29M25J35l52j17J86p2n6q0j02J01Q4k61k2K65j93O1
$$ 97 358 199 106 216 144 76 -253 172 307 -45 -162 24 -48 -104 -184 -286 -185 -101 -362 -384 -119 -312 -251
2494b51K2J61j70N6K26q5k43K87J59o8N9k5k23K43j48K4K19k44L91m64K03j2Q1
$$ -251 -229 -68 -238 -182 44 -41 -284 3 162 94 153 128 -95 148 0 24 243 -1 390 -74 129 117 198
2517A98J03l13K09j22k01K88P9n2k58L13j04j94q8N6O8k27J89k83J79m6J7j07
$$ 198 301 -12 197 75 -126 162 241 189 -69 244 140 -54 -142 -86 -18 -245 -56 -339 -160 -206 -189 -296
2539b96L01j30P4O8n23N01mJj86J84M8j79j90J17J26j43J11Q9j40K77K43j2n26
$$ -296 5 -125 -51 17 -506 -5 -9 -8 -194 -10 38 -141 -331 -214 -88 -231 -120 -31 -171 106 349 337 -189
2562a89J71j86L94j39j06J90p1J02J9k84L58R6J17n29K87J76k19J1l48L34j77
$$ -189 -18 -204 190 51 -55 135 64 166 185 -99 259 355 472 -57 230 406 187 198 -150 184 7
2583GK16j64K06l21j11j9j4J98k98M46j7j62P2l89K87R4l71J62j37j29K85M7J42
$$ 7 223 59 265 -56 -167 -186 -200 -2 -300 146 129 -33 39 -350 -63 31 -340 -178 -315 -444 -159 -112 30
2606C0k25p8n4K83k97K53j77k4K50K5k78K36pj10K42J03j16p9J50J6n3J25K52
$$ 30 -195 -273 -327 -44 -341 -88 -265 -289 -39 -14 -292 -56 -63 -173 69 172 56 -23 127 143 90 215 467
2629D67l89K13j71L76j99J01k23J9j04J53or6J28m65L40k1O9j33j88K88k80M5
$$ 467 78 291 120 496 297 398 175 194 90 243 237 141 269 -196 144 123 192 59 -129 159 -121 -76
2651g6p6m1O2m4J11r6l2J6J21q1r6j97N02k80p6j28M19r2j33l4J5J03J33M8R7
$$ -76 -152 -193 -131 -175 -64 -160 -192 -176 -55 -136 -232 -429 73 -207 -283 -411 8 -84 -217 -251 -236 -133 0 48 145
2676A45k07J69j47L15l19P3N6N9jJ07k9P9j41P3N8k80K13j43K5J19k13J26J59
$$ 145 -62 107 -40 275 -44 29 85 144 143 250 221 300 159 232 290 10 223 80 105 224 11 137 296
2699B96j41q5LJ72j84j42L3R4K65l02j03L07k25L6q8o8K21j49j42Q1R3j09j21
$$ 296 155 70 73 245 61 -81 -48 46 311 9 -94 213 -12 24 -64 -132 89 -60 -202 -121 -28 -137 -258
2722b58J35p4j37j27M51O3K2J8P2k55J1j20K71K14l50J75P6j1q9k6O0K0o8K05
$$ -258 -123 -197 -334 -461 -10 53 75 93 165 -90 -79 -199 72 286 -64 111 187 176 87 61 121 141 73 278
2746B78j58J88l35m0J9J11K0LL00p40J93Q5K62p7k83K36m04L79k4K3j49J03Q9
$$ 278 120 308 -27 -67 -48 63 83 86 386 -354 -161 -76 186 109 -174 62 -342 37 13 36 -113 -10 79
2769G9k25M5m0J35j54J95j16K5K80l1k32m5J48l0k98J63K19k92K66J3o1K83k35
$$ 79 -146 -101 -141 -6 -160 35 -81 -56 224 193 -39 -84 64 34 -264 -101 118 -174 92 105 44 327 92
2792I2j33J92j52j2j37J77k34N07l20o0L00j50j60K54J14k47j28K73r6l74J06
$$ 92 -41 151 -1 -13 -150 27 -207 300 -20 -80 220 70 -90 164 278 31 -97 176 80 -294 -188
2813a88J07p6k45J80L22j72j36J09K29j48m77L10k62L64J4o0j04k45K98J53j84
$$ -188 -81 -157 -402 -222 100 -72 -208 -99 130 -18 -495 -185 -447 -83 -69 -129 -233 -478 -180 -27 -211
2834b11J19l86N91j91q2J99P0q5L9j3j0M0Q9J1k52M35n11J55J89J85j31L10l69
$$ -211 -92 -478 113 -78 -160 39 109 24 63 50 40 80 169 180 -72 363 -148 7 196 381 250 560 191
2857A91J8r2J46j23r7M21J9m62j45K36J59l62j21N17m52M66l64q7j73K96j02k57
$$ 191 209 117 263 140 43 464 483 21 -124 112 271 -91 -212 305 -147 319 -45 -132 -305 -9 -111 -368
2879c68N3L83j31J79l66K01N6k15N3K21p9k36o2L35j47K85m84J94q0j5J44M5J92
$$ -368 -315 68 -63 116 -250 -49 7 -208 -155 66 -13 -249 -311 24 -123 162 -322 -128 -208 -223 -79 -34 158
2902A58k77p0K75k37L16k50K40k0r5K57J02q5k08q2o0J13j45M6N82n02K4J35k0
$$ 158 -119 -189 86 -151 165 -85 155 135 40 297 399 314 106 24 -36 77 -68 -22 560 58 82 217 197
2925A97j53K66K5jk00k06O4j71J95j26j48K19k2m32M01k15K49j80j29M19k73M7
$$ 197 44 310 335 334 134 -72 -8 -179 16 -110 -258 -39 -61 -493 -92 -307 -58 -238 -367 52 -221 -174
2947a74N3O0k11J15M5l02L27lK06l25N2J3Q6J98l84K72k03K25k8j78L87l45L5
$$ -174 -121 -61 -272 -157 -112 -414 -87 -90 116 -209 -157 -144 -58 140 -244 28 -175 50 22 -156 231 -114 -79
2970g9K83J55r4j14l03L26j12o9L72l21J14p5j59j8j79N5L23k02M86j26m75J53
$$ -79 204 359 265 151 -152 174 62 -7 365 44 158 83 -76 -94 -273 -218 105 -97 389 263 -212 -59
2992e9L22l48p6PJ79J7Q9j90k32Rr8L03j5%J98j55n0J49J39r2k12J33K91m10j11
$$ -59 263 -85 -161 -154 25 42 131 -59 -291 -282 -380 -77 -92 -92 106 -49 -99 50 189 97 -115 18 309 -101 -212
3017b12j12N86Kj07k85M38n1j29K09l69j75J92J45K13k24k18J84K5j2k1k20j81
$$ -212 -324 262 264 157 -128 310 259 130 339 -30 -205 -13 132 345 121 -97 87 112 100 79 -141 -322
3039c22J22J98j76J25N2p5J67k17p2K14Lq7q4N1j48L37J09k39j9J7J1L7J93k73
$$ -322 -200 -2 -178 -53 -1 -76 91 -126 -198 16 19 -68 -152 -101 -249 88 197 -42 -61 -44 -33 4 197 -76
3063g6o5j40L34j62M85l29J25k92K39L09n42M69j08k20M0J47k28K14L6K43l41
$$ -76 -141 -281 53 -109 376 47 172 -120 119 428 -114 355 247 27 67 214 -14 200 236 479 138
3084A38j39r1J43j58p9J63J07j98J34k6j9Q9k91K46L7j53j96L71J65m23j22K29
$$ 138 -1 -92 51 -107 -186 -23 84 -114 20 -6 -25 64 -227 19 56 -97 -293 78 243 -180 -302 -73
3106g3j09J18k6J52l16J30J46l96j54K89K69n6k74J93P8NJ10P9m11J69P1O6j64
$$ -73 -182 -64 -90 62 -254 -124 22 -374 -528 -239 30 -26 -300 -107 -29 -24 86 165 -246 -77 -6 60 -104
3129a04j2J76P7L0o7J7k7Q9r2j9j27l8pK64l31K44RJ50r7NK07k97q5J6pj46rK84
$$ -104 -116 60 137 167 100 117 90 179 87 68 -59 -97 -104 160 -171 73 82 232 135 140 347 50 -35 -19 -26 -172 -181 103
3157A03R1m74k8Q0K06l39K18j99J08K16q4O0r1j50J94m0jK12j95K22k90M88m31
$$ 103 194 -280 -308 -228 -22 -361 -143 -342 -234 -18 -102 -42 -133 -283 -89 -129 -130 82 -113 109 -181 307 -124
3180a24M03j25j35k8K88l49K72j45n5kk58K46Q5J60R1j45j34M0k08J43l90M33
$$ -124 279 154 19 -9 279 -70 202 57 2 0 -258 -12 73 233 324 179 45 85 -123 20 -370 63
3202F3N1j15k42L29k06L82j9j62j08lj62J89Q2NJ10l39j2OJ21r1O6J01m40K15
$$ 63 114 -1 -243 86 -120 262 243 81 -27 -30 -192 -3 79 84 194 -145 -157 -151 -30 -121 -55 46 -394 -179
3226a79N9M5o3K96l10K44j04k75K26k5j00J26J27j78P2J51j6q9j29PJ78P3j39
$$ -179 -120 -75 -138 158 -152 92 -12 -287 -61 -86 -186 -60 67 -111 -39 112 96 7 -122 -115 63 136 -3
3249cK27j11r4J13q1p7K57o5j54O9J2j9k95J74p5L03j27j08k27K97O2J6o8p1R5
$$ -3 224 113 19 132 51 -26 231 166 12 81 93 74 -221 -47 -122 181 54 -54 -281 16 78 94 26 -45 50
3274E0p7OO4k23L91j72q1J65l6l16K15j24L80m17K16k92K47m7J29p3J84j47J15
$$ 50 -27 -21 43 -180 211 39 -42 123 87 -229 -14 -138 242 -175 41 -251 -4 -51 78 5 189 42 157
3297A57J04l82J83k93L02j13M18m97J48M72k62l39K98k60M30n45K79K37J16m03
$$ 157 261 -121 62 -231 71 -42 376 -121 27 499 237 -102 196 -64 366 -179 100 337 453 50
3317E0j32K16m10L7K40k8K30j81r4j72L20J37l56N0l0J66k50k3j7K86j76K16k14
$$ 50 -82 134 -276 -239 1 -27 203 22 -72 -244 76 213 -143 -93 -123 43 -207 -230 -247 39 -137 79 -135
3340a35l89O72j51J37r7j54L03k03m7k8R1K32k22rJ92m06N62r1j55l02N96k20
$$ -135 -524 148 -3 134 37 -117 186 -17 -64 -92 -1 231 9 0 192 -214 348 257 102 -200 396 176
3362A76k15j7j47L13R6k21p8J01k6k14J72L03k67L6M6j65k5K78J04n06K75l39
$$ 176 -39 -56 -203 110 206 -15 -93 8 -18 -232 -60 243 -24 12 58 -107 -132 146 250 -256 19 -320
3384c20K10L7M4p0K52l1q7J03R6l85q0K51j1J12k89K54j34k2L1J31o6J28k31L31
$$ -320 -110 -73 -29 -99 153 122 35 138 234 -151 -231 20 9 121 -168 86 -48 -70 -39 92 26 154 -77 254
3408B54k12j69M18m21K73j24j60L21j89m8K70Mk60m1M20n67J80L69l23K23k58
$$ 254 42 -127 291 -130 143 19 -141 180 -9 -57 213 217 -43 -84 336 -231 -51 318 -5 218 -40
3429d0K57k6j92l4K3p4J51N0l2R0j20k03r1J91J32p2N2k18M2j18K03J95l15K38
$$ -40 217 191 -1 -35 -12 -86 65 115 83 173 53 -150 -241 -50 82 10 62 -156 -114 -232 -29 166 -149 89
3453H9J44l15J99l61K0J71Jo4J46n4J12n5l8M9J85l68q9J82J23ol1J7k23L07m7
$$ 89 233 -82 117 -244 -224 -53 -52 -116 30 -24 88 33 -5 44 229 -139 -228 -46 77 71 40 57 -166 141 94
3478I4j04L8k41J39nL60m40L60k96k02N63l43j05J26K19j71m2N0r5J28Q4j77K79
$$ 94 -10 28 -213 -74 -79 281 -159 201 -95 -297 266 -77 -182 -56 163 -8 -50 0 -95 33 117 -60 219
3501B19j44j09rk2P0J54j93o2n4J74K4k61K29k74M69m73J61M6Pk3K43r3M5Lr1
$$ 219 75 -34 -43 -65 5 159 -34 -96 -150 24 48 -213 16 -258 211 -262 -101 -55 -48 -71 172 79 124 127 36
3526C6k26L07n7j79L89k95J67k17K9j67K25m2J95j88j9j88OR2K10l5J63j28l1
$$ 36 -190 117 60 -119 270 -25 142 -75 -46 -213 12 -30 165 -23 -42 -230 -224 -132 78 43 206 78 47
3549D7J28j08N2j07L08k45n8P7j36K55m00l8J9M40k08R1l11M61k37j60q9K22K72
$$ 47 175 67 119 12 320 75 17 94 -42 213 -187 -225 -206 234 26 117 -194 267 30 -130 -219 3 275
3572B75k72l7K57q4p8qq5P6k19O4J36J29k38J4M2J85rK8k23J81j38K7J16j52J8
$$ 275 3 -34 223 139 61 53 -32 44 -175 -111 25 154 -84 -70 -28 157 148 176 -47 134 -4 23 139 -13 5
3597Ek15N9J21K93k02k2r8K27j74R6j17k35N05m11J75J61j25J1r6R4j63L6J43
$$ 5 -210 -151 -30 263 61 39 -59 168 -6 90 -27 -262 243 -168 7 168 43 54 -42 52 -111 -75 68
3620F8k6N6P8m78M06m34L54K68j45q8O3P0l80J82J13j03J32Q9l1k79L67r5o1J
$$ 68 42 98 176 -302 104 -330 24 292 147 59 122 192 -188 -6 107 4 136 225 194 -85 282 187 126 127
3644A27j03lj48J91k28L12j01K4k5j65M8J95k3j36m1j55k5L10M0K70j62l93J3
$$ 127 24 21 -127 64 -164 148 47 71 46 -119 -71 124 101 -35 -76 -231 -256 54 94 364 202 -191 -178
3667a78K05j31K25m01M59m23L75k94m5J99k6o3kL33j00k9N5j77L41l88j00J86
$$ -178 27 -104 121 -280 179 -244 131 -163 -208 -9 -35 -98 -100 233 133 104 159 -18 323 -65 -165 21
3689B1m4K54l79J93J29j52j7k9j41L52J16k30J33j12l13L35j75LqJ86j00Q6k21
$$ 21 -23 231 -148 45 174 22 5 -24 -165 187 303 73 206 94 -219 116 -59 -56 -64 122 22 108 -113
3712a13J72r7R6p6J60L4j11J19k40J65l70L3L06j07N8k20J30Q9k12R8mK06l09
$$ -113 59 -38 58 -18 142 176 65 184 -56 109 -261 -228 78 -29 29 -191 -61 28 -184 -86 -90 116 -193
3735a93M71l97J92j26P1j11K7J81n0k3k35M33l69N02k99rK8j33kp7K95m4j98o7
$$ -193 278 -119 73 -53 18 -93 -66 115 65 42 -193 240 -129 373 74 65 93 -40 -42 -119 176 132 -66 -133
3759a33Q6l4J74m6k76N2jJ24ML10j60k99J50m39M92n2J62K58n11J68J25j59k86
$$ -133 -47 -81 93 47 -229 -177 -178 -54 -50 260 100 -199 -49 -488 4 -48 114 372 -139 29 154 -5 -291
3782b91K34K06Lm4L4j35j34J53j63J29L23m99R3J53p9J32K49k24j6j58k6J85j35
$$ -291 -57 149 152 108 142 7 -127 26 -137 -8 315 -184 -91 62 -17 115 364 140 124 -34 -60 125 -10
3805a0n8O6rK75J04j38m08L50k46K5M5K01J6k13j5J13k86M8J94q2K68m35J17J20
$$ -10 -68 -2 -11 264 368 230 -178 172 -74 -49 -4 197 213 0 -15 98 -188 -140 54 -28 240 -195 -78 42
3829D2MN6k5J51k25j96K27o1j31K14k30L39k70m9J34o8o9R2qJ13J13K8n26l0M54
$$ 42 46 102 77 228 3 -193 34 -27 -158 56 -174 165 -105 -154 -20 -88 -157 -65 -73 40 153 181 -345 -375 79
3854G9N9M7j84j01Q4M3K3Q7k90L75l3l80%J88j9J7k3K77n12K74N1j82K65j24l06
$$ 79 138 185 1 -100 -16 27 50 137 -153 222 189 -191 -191 -3 -22 -5 -28 249 -263 11 62 -120 145 21 -285
3879b85M86l75K04l2K18l49P5M6k34L58O6k66J41L2j6p2N5k47K48p6J43k01J37
$$ -285 201 -174 30 -2 216 -133 -58 -12 -246 112 178 -88 53 85 69 -3 52 -195 53 -23 120 -81 56
3902E6o0J22p9k8j24j42L43J6q4q3K62j97J3j39j07M79k65M5j11K47r4O1%l8j84
$$ 56 -4 118 39 11 -113 -255 88 104 20 -63 199 2 15 -124 -231 248 -17 28 -83 164 70 131 131 93 -91
3927i1L21k28k9j65j30N69j73j39j22J29L6R9J80m13L5L17j57j91l4M64k01l17
$$ -91 230 2 -27 -192 -322 247 74 -65 -187 -58 -22 77 257 -156 -121 196 39 -152 -186 278 77 -240
3949b40L3M19j69K19j76n4j19J14o5l3L20nj61k26J08k17J32N21o58L60o8k72
$$ -240 -207 212 43 262 86 32 -87 27 -38 -71 249 244 83 -143 -35 -252 -120 401 -257 103 35 -237
3971b37J34k03L59j72J05pj74K44j15n2rL59m29Q6K37j20R2k9K35j49k76o6m3
$$ -237 -103 -306 53 -119 -14 -21 -195 49 -66 -118 -127 232 -197 -111 126 6 98 69 304 155 -121 -187 -230
3994b30K64J80L6l75O9R6J32j44L2l5%J5k42M43j03l74L05j29MJ71k77L01m96
$$ -230 34 214 250 -125 -56 40 172 28 60 25 25 40 -202 241 138 -236 69 -60 -56 115 -162 139 -357
4017c57N46l8J4j87J70j66K3L7K34m18J83j27j05O9K93J69l93J83J99k97Qj2k
$$ -357 189 151 165 -22 148 -18 5 42 276 -142 41 -86 -191 -122 171 340 -53 130 329 32 40 28 26
4040B6%p1Q5j92J94r5P1Q9j39J61K0j67K5k32J39m4J19k29J90l31ML66P9J10L9
$$ 26 26 -45 40 -152 42 -53 18 107 -32 129 149 -18 7 -225 -86 -130 -11 -240 -50 -381 -377 -11 68 178 217
4065B17l24j70K30K04J5k1j42J00k95r9L68Q4j98K32k27kk25J57Q7qp5O3J17k34
$$ 217 -107 -277 -47 157 172 151 9 109 -186 -285 83 167 -31 201 -26 -28 -253 -96 -9 -17 -92 -29 88 -146
4089a46j4K04J80j86P4K36j24k28K4j95m7P9J3J61j87NO1J94L9l73L87J09k68
$$ -146 -160 44 224 38 112 348 224 -4 20 -175 -222 -143 -130 31 -156 -151 -90 104 143 -230 157 266 -2
4112bo8M4J2l98K87k4J97J43l97K63k93M4J20K3k49L67m10K80J13j19J69k80p0
$$ -2 -70 -26 -14 -412 -125 -149 48 191 -206 57 -236 -192 -72 -49 -298 69 -341 -61 52 -67 102 -178 -248
4135b48J43J42k96O15k41J67Jl73q8r9M74k63m3J84M2j68K00j35R7R7o7r4k94
$$ -248 -105 37 -259 356 115 282 283 -90 -178 -277 197 -66 -109 75 117 -51 149 14 111 208 141 47 -247
4158b47L12m35L21m4OJ03O9kP5j36m1jl4J02j50j09L51j38j87J44K33J0q9j14
$$ -247 65 -370 -49 -93 -87 16 85 83 158 22 -19 -20 -54 48 -102 -211 140 2 -185 -41 192 202 113 -1
4182an8j20N8J61Q4q2k38J66j22J69k03k2N42k63j14P3N4P8k46j66J21O1KJ20
$$ -1 -59 -179 -121 40 124 42 -196 -30 -152 17 -186 -208 334 71 -43 30 84 162 -84 -250 -129 -68 -66 54
4206E4j1M7N0k81j01J57L7RJ76j50j46j63L42k2qj03N8j67K41R1j32j47j26k5
$$ 54 43 90 140 -141 -242 -85 -48 -39 137 -13 -159 -322 20 -2 -10 -113 -55 -222 19 110 -22 -169 -295 -320
4230c20J93J35J33j10k1k5k8J46j0R4J00k19k90L98k04K99k2N2j12l25J16O6k07
$$ -320 -127 8 141 31 10 -15 -43 103 93 187 287 68 -222 176 -28 271 249 301 189 -136 -20 46 -161
4253a61P8K87r7L4K28l20j52J79j26J61j06k67K60P9k25J48r9k9J8r5J34k36M59
$$ -161 -83 204 107 141 369 49 -103 76 -50 111 5 -262 -2 77 -148 0 -99 -128 -110 -205 -71 -307 152
4276A52p5q1O7J79j16l03L24j55oP5l72L23J54q0j6N3n8Q6m25K27L3O9j10R7m
$$ 152 77 -4 63 242 126 -177 147 -8 -14 61 -311 12 166 86 70 123 65 151 -274 -47 -14 55 -55 42 38
4301C8j5J9O2lj04o5K26J8l06N95l33k86L4m1K90p0L1j88O7P3j48J44j08K66l68
$$ 38 23 42 104 101 -3 -68 158 176 -130 465 132 -154 -120 -161 129 59 90 -98 -31 42 -106 38 -70 196 -172
4326a72J64m4m5N7L1Q3P1k27J77J6p8J76k16l5j66J73j4JP0J37j22lr7k75p9K79
$$ -172 -8 -52 -97 -40 -9 74 145 -82 95 111 33 209 -7 -42 -208 -35 -49 -48 22 159 37 34 -63 -338 -417 -138
4352a38J40j60L57m24K48j28K5N10o35J49M8J27l09J99L65n03j92M90l53O1M0
$$ -138 2 -158 199 -225 23 -105 -80 430 -205 -56 -8 119 -190 9 374 -129 -321 169 -184 -123 -83
4373h3N9k14J84k4R6J22k19J13Qp7j61K64r0j16K21k23R2K31k80J8J37k09L43
$$ -83 -24 -238 -54 -78 18 140 -79 34 42 -35 -196 68 -22 -138 83 -140 -48 183 -97 -79 58 -151 192
4396A92p2l21J32K00k8j16j5J31j18K35k95J11q7O3L5p8L50l00J32j16l6o1J99
$$ 192 120 -201 -69 131 103 -13 -28 103 -15 220 -75 36 -51 12 47 -31 319 19 151 35 -1 -62 137
4419A37j13j37K45K50n37K28j38L44l36o5K13J87l81J92k51K77j78p1j17M84n02
$$ 137 24 -113 132 382 -155 73 -65 279 -57 -122 91 278 -103 89 -162 115 -63 -134 -251 233 -269
4440b69K51q6K85k63J28L4j59J41j23k59Q3K62l7k40K23J69l63J54j11L1K30k25
$$ -269 -18 -104 181 -82 46 80 -79 62 -61 -320 -237 25 -12 -252 -29 140 -223 -69 -180 -149 81 -144
4462a44J67J86j50M1j90K87j22J53m7k76N6q4L67j99j85M74n18K79n2K76j66r2
$$ -144 23 209 59 100 -90 197 75 228 181 -95 -39 -123 244 45 -140 334 -184 95 43 319 153 61
4484F1R5l06J63j71K80l38J52R4L5j06J86l68K32l9k2J3p1O13l82M8l20J71k58
$$ 61 156 -150 13 -158 122 -216 -64 30 65 -41 145 -223 9 -30 -52 -39 -110 503 121 169 -151 20 -238
4507b38O2J56K0j03j0ON9J69p4J62o03N99j76l15K24p5L9J52j28j4l5K68k09K6
$$ -238 -176 -20 0 -103 -113 -107 -48 121 47 209 -394 205 29 -286 -62 -137 -98 54 -74 -88 -123 145 -64 -38
4531c8J27j25J60j80o5J91N8k81J22j62J94J52k90K24j48K14m42L01J06r3j01
$$ -38 89 -36 124 -56 -121 70 128 -153 -31 -193 1 153 -137 87 -61 153 -289 12 118 25 -76
4552g6r9L57J4k58J84m5J96l54L2Q0m07M81J02k10rj41J99j3m6J53J36l02K64
$$ -76 -175 182 196 -62 122 77 273 -81 -49 31 -376 105 207 -3 -12 -153 46 33 -13 140 276 -26 238
4575B38j77J45Jl7j56J94m28K26PJ53j45K83j78k50kK39r8j15K90l15K36k33K20
$$ 238 61 206 207 170 14 208 -220 6 13 166 21 304 126 -124 -126 113 15 -100 190 -125 111 -122 98
4598I8N6k25L49k03l5L9j71Q1m22M68j46L52m0k20m3J0J99j72p4M0j34J86k20
$$ 98 154 -71 278 75 40 79 -92 -11 -433 35 -111 241 201 -19 -62 -52 147 -25 -99 -59 -193 -7 -227
4621b27j8M73P8m51K59j61L1L6k02K15J64l03J9p2l3R3L80l4m0K0j82k24J16j40
$$ -227 -245 228 306 -145 114 -47 -16 20 -182 33 197 -106 -87 -159 -192 -99 281 247 207 227 45 -179 -63 -203
4645b03J16J73j16r8M98l18j18J4K42j02m00M13l41K40k11K78J72k49J5j45KK21
$$ -203 -87 86 -30 -128 370 52 -66 -52 190 88 -312 101 -240 0 -211 67 239 -10 5 -140 -138 83
4667H3j97k0P9N6l15m8J34P4M6J82k04J12J91m64J52J48r1j27J31J65l01J36R6
$$ 83 -114 -134 -55 1 -314 -362 -228 -154 -108 74 -130 -18 173 -291 -139 9 -82 -209 -78 87 -214 -78 18
4690A8P7k05J25J45j03L05m56J88l81J87M18l70N2R3j68N1J72P6m5k92K73j16
$$ 18 95 -110 15 160 57 362 -94 94 -287 -100 318 -52 0 93 -75 -24 148 224 179 -113 160 44
4712D4J3K27l27j13K98j80k8K2Rj05R8R2L9N1r0K2K8j86k18K65j08L20k4j7m97
$$ 44 57 284 -43 -156 142 -38 -66 -44 -35 -140 -42 50 89 140 50 72 100 -86 -304 -39 -147 173 149 132 -365
4737c65N51j16M1l9m02L73k52J71K14m1m94M92m34L35k93K54J79P6r9k95Q3L11
$$ -365 186 70 111 72 -330 43 -209 -38 176 135 -359 133 -301 34 -259 -5 174 250 151 -144 -61 250
4759B50n31Q8N11o9k54lk7K70k91K9J49k21K52K07j95j51r4L18m7k67J5j9mK4
$$ 250 -281 -193 318 249 -5 -8 -35 235 -56 -27 122 -99 153 360 165 14 -80 238 191 -76 -61 -80 -84 -60
4783f0J12j31J17o3J4k64K23J68k74N6K13k41j14J47K57l29K58L02m67L19k26
$$ -60 52 -79 38 -25 -11 -275 -52 116 -158 -102 111 -130 -244 -97 160 -169 89 391 -76 243 17
4804A7q0J96Q0k48J15r9J69K4k92O6J05l5J69m9J15j12l06K00Q5R6k38J17N5J37
$$ 17 -63 133 213 -35 80 -19 150 174 -118 -52 53 18 187 138 253 141 -165 35 120 216 -22 95 150 287
4828B87k19L0k22J41m72O22k17l6J3J09L34k49r6K40k08j78q0k12N81j90R1l97
$$ 287 68 98 -124 17 -455 167 -50 -86 -73 36 370 121 25 265 57 -121 -201 -413 168 -22 69 -328
4850c28L49k31J77k39K90o9Q8L3j14k1n7J14j8o5K43m25Q5J0L21r1J76r3k71N20
$$ -328 21 -210 -33 -272 18 -51 37 70 -44 -65 -122 -8 -26 -91 152 -273 -188 -178 143 52 228 135 -136 384
4874C84k08k03j82J17J61P5j42L07k74J15k38j5L4O1r0J99N8k59l7K57j83k83
$$ 384 176 -27 -209 -92 69 144 2 309 35 150 -88 -103 -69 -8 -98 101 159 -100 -137 120 -63 -346
4896c46L71N2lN5k74K25j19n8J17j06P2l04J39M92j95Rl41K69k48K06N7k64J28
$$ -346 25 77 74 129 -145 80 -39 -97 20 -86 -14 -318 -179 313 118 127 -214 55 -193 13 70 -194 -66
4919f6P5j11K0L9L46m4m60K86O7j53m6q8K37r7p3l4J15p8l8o4K98l07J95j10l9
$$ -66 9 -102 -82 -43 303 259 -201 85 152 -1 -47 -135 102 5 -68 -102 13 -65 -103 -167 131 -176 19 -91 -130
4944a30P6J17k97L22m5o4L1J00K7l7k73J11K61k27j48k04K40J70J26Km43L52k27
$$ -130 -54 63 -234 88 43 -21 10 110 137 100 -173 -62 199 -28 -176 -380 -140 30 156 158 -285 67 -160
4967a60K43l09K92J92k94k36M36k49J08k28J16j16R7K57l72N85k44j93K34j76
$$ -160 83 -226 66 258 -36 -272 164 -85 23 -205 -89 -205 -108 149 -223 362 118 -75 159 -17
4987a7J89k51j25L22J25k09j50J32k5j39Nj70K64L07l56K17J53n00K81J21j80
$$ -17 172 -79 -204 118 243 34 -116 16 -9 -148 -143 -313 -49 258 -98 119 272 -228 53 174 -6
5008fK13j13j81J49j00o7J87j22J98j00J09k57o4j8k78M85J1j18J82p6n8Q5J41
$$ -6 207 94 -87 62 -38 -105 82 -40 158 58 167 -90 -154 -172 -450 35 46 -72 110 34 -24 61 202
5031B02k05k01K86l2P6J5l37J38k0J33R4o5j8J20k81K88K99n25J3O2m1J40k55
$$ 202 -3 -204 82 50 126 141 -196 -58 -78 55 149 84 66 186 -95 193 492 -33 -20 42 1 141 -114
5054a14rN6J85Oj52o4J48J94O0m27L83l9j03K04l06R8l08R2R6L0j13N0l0K8k18
$$ -114 -123 -67 118 124 -28 -92 56 250 310 -117 266 227 124 328 22 120 -188 -96 0 30 -83 -33 -63 -35 -253
5079b53M98k30l50M55m16%L40j29M7j47j51M83k86L28k34j33m6N40l44r6J63J10
$$ -253 245 15 -335 120 -296 -296 44 -85 -38 -185 -336 147 -139 189 -45 -178 -224 316 -28 -124 39 149
5101A49m3j9r3M5j62O2J99k73q9K86qj89J96L19l09lL5Q9q2l19K43l64R4j29P02
$$ 149 106 87 -6 39 -123 -61 138 -135 -224 62 54 -135 61 380 71 68 103 192 110 -209 34 -330 -236 -365 337
5126C37m15R3o3J68l61J78j72J74k83M41O5J3k94L28k09j98K86j3k18J94k14J70
$$ 337 -78 15 -48 120 -241 -63 -235 -61 -344 97 162 175 -119 209 0 -198 88 75 -143 51 -163 7
5148GQ2Qk14N3j18L71j28m1q4j87L19k09K59k26j13K83q1J51M21m74m0l7k44J54
$$ 7 89 97 -117 -64 -182 189 61 20 -64 -251 68 -141 118 -108 -221 62 -19 132 553 79 39 2 -242 -88
5172h8J26j40n3R0P9j04Q5J0J79j61O0j13J7j14j32M50j67l50K43j7k92N33l26
$$ -88 38 -102 -155 -65 14 -90 -5 5 184 23 83 -30 -13 -127 -259 191 24 -326 -83 -100 -392 141 -185
5195a85J00J77j58q6j82J3M19j53j58L18J40J5k48k5K25j58O2N6m48M58j22j03
$$ -185 -85 92 -66 -152 -334 -321 98 -55 -213 105 245 260 12 -13 212 54 116 172 -276 182 60 -43
5217d3j2oL19m72K96m7J98l19M4J33l10J82j57J6K55m0k58K94k69q3L32r7L71
$$ -43 -55 -61 258 -214 82 35 233 -86 -42 91 -219 -37 -194 -178 77 37 -221 73 -196 -279 53 -44 327
5240C27l39j13K22l02p4L48j15j95N61l47L9Q3j29J94m6l0j61r8j9J79J24J8J01
$$ 327 -12 -125 97 -205 -279 69 -46 -241 320 -27 12 95 -34 160 114 84 -77 -175 -194 -15 109 127 228
5263B28m99N42K6l41R7K5j01J07k95P3J91K02m86K98J14m4K85m45J98Q6j25k1
$$ 228 -271 271 297 -44 53 78 -23 84 -211 -138 53 255 -231 67 181 137 422 -23 175 261 136 115
5285A15n2M1j05J47Mj00j45K24j18o6L49k94j5j91L69j05P6k32L88j53l40J96
$$ 115 63 104 -1 146 150 50 -95 129 11 -55 294 0 -15 -206 163 58 134 -98 290 137 -203 -7
5307gj00M5P3M06m68K8pl46K97rJ51K22m11J41j43L18j83Q7l67N1K67l6k09K60
$$ -7 -107 -62 11 417 -51 -23 -30 -376 -79 -88 63 285 -126 15 -128 190 7 94 -273 -222 45 9 -200 60
5331F0L27j81j64J94j72k36q1L53j42M3O7J5J6k08K53k21kK48k26j7k47M73k5
$$ 60 387 206 42 236 64 -172 -253 100 -42 1 68 83 99 -109 144 -77 -79 169 -57 -74 -321 152 127
5354A27r4j54J70K9j34o3J52KK08l01K08k07L36k37k55L54l61J89l5N5lJ44n4
$$ 127 33 -121 49 78 -56 -119 33 35 243 -58 150 -57 279 42 -213 141 -220 -31 -66 -11 -14 130 76
5377G6L56l16J15Nl29J18J53k36qo1K55j10Q7k26k6K27k80K98K33l64Ol47L40
$$ 76 432 116 231 236 -93 25 178 -58 -66 -127 128 18 105 -121 -147 80 -200 98 331 -33 -27 -374 -34
5400c4J41k12J10k44R8k5J22p2O9j00K37k8R8n57L84j8j42n6N6j13Q9J51P0l03
$$ -34 107 -105 5 -239 -141 -166 -44 -116 -47 -147 90 62 160 -397 -13 -31 -173 -229 -173 -286 -197 -46 24 -279
5424b79M76k72J20j45M25l78l9Q7j08p2L86l45J30R0l43J52K86j52N7J49j67J14
$$ -279 197 -75 45 -100 325 -53 -92 -5 -113 -185 201 -144 -14 76 -267 -115 171 19 76 225 58 172
5446A72m19L07j01J73o1J60m05J58N3L7j5Jq6J1m5N5q7j1N3J90k71J64j40J12
$$ 172 -247 60 -41 132 71 231 -174 -16 37 74 59 60 -26 -15 -60 -5 -92 -103 -50 140 -131 33 -107 5
5470El56N74l64r2J26ml6J33P8k76J67k5r0L0OL3m2K2p0K47J65k1k96l6L09m83
$$ 5 -351 223 -141 -233 -107 -111 -147 -14 64 -212 -45 -70 -160 -130 -124 -91 -133 -111 -181 66 231 210 -86 -122 187 -296
5496b96N65l11J57k27K65j53On1k06J87J8J51k28K59j46J44m75M66j00k67K78
$$ -296 269 -42 115 -112 153 0 6 -45 -251 -64 -46 105 -123 136 -10 134 -341 125 25 -242 36
5517C6j00j53J89m4J3K01j07k52L58l32L81k62J22n6N8K60k97J08J27m00K99j35
$$ 36 -64 -217 -28 -72 -59 142 35 -217 141 -191 190 -72 50 -6 52 312 15 123 250 -150 149 14
5539A4J75l09l0pJ87n6j93K35R2n8j02K53k96J3K98M0k09J66o0j56K9L99n45J79
$$ 14 189 -120 -150 -157 30 -26 -219 16 108 50 -52 201 -95 -82 216 256 47 213 153 -3 26 425 -120 59
5563E9p0k05L1L81l79J83l4N4j48j00L25m9P2j7J63m37J90J41l26M58j54k03K59
$$ 59 -11 -216 -185 196 -183 0 -34 20 -128 -228 97 48 120 103 266 -171 19 160 -166 292 138 -65 194
5586A94l3J00q8k12J76R9l99RK69j29m3J47j41J10k14L78j02P9l09J74NK4Q3n9
$$ 194 161 261 173 -39 137 236 -163 -154 115 -14 -57 90 -51 59 -155 223 121 200 -109 65 70 94 177 118
5610A18q9Q7l12M66j81j92p8M08m62N20j0j90Nj76J97K22j73j4k84J72j81J76
$$ 118 29 116 -196 270 89 -103 -181 227 -235 285 275 85 90 -86 111 333 160 146 -138 34 -147 29
5632B9l20N41j10q3J0j82K11M7K4j35k22L0L96j8m7k81j45J92r3l4L03k5l04K42
$$ 29 -291 250 140 57 67 -115 96 143 167 32 -190 -160 236 218 171 -110 -255 -63 -156 -190 113 88 -216 26
5656B6j1K37k80J70M0K2l68K93j3n7l09J78q0qK71l04J70P0l62M34q2P5k2n2m1
$$ 26 15 252 -28 142 182 204 -164 129 116 59 -250 -72 -152 -160 111 -193 -23 47 -315 119 37 112 90 38 -3
5681cJ2k7J34j86q5K48k65J60k41J79J85k26m7O6KJ89m6k04P6K25k03K05j36l4
$$ -3 9 -18 116 -70 -155 93 -172 -12 -253 -74 111 -115 -162 -96 -94 95 49 -155 -79 146 -57 148 12 -22
5705b2J69k59L9j75M07j52P3k11J91j27LL08k63J44J02j45r2J61K5l56K83r7J33
$$ -22 147 -112 -73 -248 159 7 80 -131 60 -67 -64 244 -19 125 227 82 -10 151 176 -180 103 6 139
5728A39m51M46k19k50M71J96l35r8K03j42p5K14k07K7K41l02q7L1L94q8j01J4
$$ 139 -312 134 -85 -335 136 332 -3 -101 102 -40 -115 99 -108 -81 160 -142 -229 -198 196 108 7 21
5750B1k58K79M0k03K77l31L19j05o4J98l17J86r3mj3j96M84j56j8J37k39J74j14
$$ 21 -237 42 82 -121 156 -175 144 39 -25 173 -144 42 -51 -55 -68 -264 220 64 46 183 -56 118 4
5773DK1nn7K02q7Q7j94Q9jK4o6k2pp4L31n68M32R6j16k65J64J34k74J45n7p6J15
$$ 4 25 20 -37 165 78 165 -29 60 59 83 17 -5 -12 -86 245 -323 109 205 89 -176 -12 122 -152 -7 -64 -140 -25
5800b5O0j70P3K50j55J78K5Jj99k66J54O8j32J15K82k80P9qJ5j89J99N9k11o2
$$ -25 35 -135 -62 188 33 211 236 237 38 -228 -74 -6 -138 -23 259 -21 58 50 65 -124 75 134 -77 -139
5824a39J67n6J99k74K03Q7n5k61K63j1k97L57n0k57M0J98p4K43l41J33P1p7j79
$$ -139 28 -28 171 -103 100 187 132 -129 134 123 -174 183 133 -124 -84 114 40 283 -58 75 146 69 -110
5847a10J85J55k75K17K57m23O5j17Q8K17l24J34m00L19j04P7J55l17K22J37k41
$$ -110 75 230 -45 172 429 6 71 -46 42 259 -65 69 -331 -12 -116 -39 116 -201 21 158 -83
5868h3K0q6J37l03L33k3k61K34k85L71J06k80j52N96l61J19J99l18K08M0l91J52
$$ -83 -63 -149 -12 -315 18 -5 -266 -32 -317 54 160 -120 -272 324 -37 82 281 -37 171 211 -180 -28
5890b8R4j23m2N91o50L9L67m42K63j5p2o0J24j02j17J50j26J47J36m37J95r7j91
$$ -28 66 -57 -99 492 -158 -119 248 -194 69 54 -18 -78 46 -56 -173 -23 -149 -2 134 -303 -108 -205 -396
5913c96L16pq4J75J41L2j58p7K56k71M9k69K06K78l19R3K01m39K10J19K48k79
$$ -396 -80 -87 -171 4 145 177 19 -58 198 -73 -24 -293 -87 191 -128 -35 166 -273 -63 56 304 25
5935B5j28K24L8k91n1L47l45Q2j03J36M52k51j72m2M6j04KK65j24J46j12J32o5
$$ 25 -103 121 159 -132 -183 164 -181 -99 -202 -66 386 135 -37 -79 -33 -137 -135 130 6 152 40 172 107
5958A07j68K23j52J61m13K71K2k52R0J88j79K59l02Q4j0M7JQ7j19N9K6m30K49
$$ 107 -61 162 10 171 -242 29 51 -201 -111 77 -102 157 -145 -61 -71 -24 -23 64 -55 4 30 -400 -151
5981a51L27n32M69q2O2M9m62K80l2J85k77K25RNk12O9J3O1R2p2K69k30L3J18j18
$$ -151 176 -356 113 31 93 142 -320 -40 -72 113 -164 61 70 75 -137 -68 -55 6 98 26 295 65 98 216 98
6006I8o9j09o4J5J43k9L3k85L97q4K54l96k08K47oO4O4j46o6k8r5K42L4MQ7j04
$$ 98 29 -80 -144 -129 14 -15 18 -267 130 46 300 -96 -304 -57 -63 1 65 -81 -147 -175 -270 -28 6 10 97 -7
6032gK27P7k84k01K25P1l3l07L08J21q4qo82Q48l31p2j17K38n9mJ38k53J11J18
$$ -7 220 297 13 -188 37 108 75 -232 76 197 113 105 -577 271 -60 -132 -249 -11 -70 -74 64 -189 -78 40
6056D0p1K17N2j60q5J24m5j45K50k28K01J4l58m0M60l51Q2J52k07N20m16M6k05
$$ 40 -31 186 238 78 -7 117 72 -73 177 -51 150 164 -194 -234 226 -125 -43 109 -98 422 6 52 -153
6079a53L52k01J13j53J7j16k0N53l38m4k60N03O9m83Km6J46k36K87K3j42l30N69
$$ -153 199 -2 111 -42 -25 -141 -161 392 54 10 -250 253 322 -161 -159 -205 -59 -295 -8 15 -127 -457 112
6102A12k15K44j97K07k06k8J69k10L20j57O9k2R7l04K83j46n3L6K56l50K46k81
$$ 112 -103 141 -56 151 -55 -83 86 -124 196 39 108 86 183 -121 162 16 -37 -1 255 -95 151 -130
6124a30l5K83l93L61k49J82j02P1J80l63L15k40K60l18J60K33n9j54J0j36L2l2
$$ -130 -165 118 -275 86 -163 19 -83 -12 168 -195 120 -120 140 -178 -18 215 156 2 12 -124 -92 -124
6146a24J18J93j94PJ01Rj49N7j7j16J92Q3j59K14j53m37N94o0l95L02j06l07K82
$$ -124 -6 187 -7 0 101 110 -39 18 1 -115 77 160 1 215 62 -375 219 159 -236 66 -40 -347 -65
6169f5J45k49M3j17J98r0M00k59K08m27L50j71K33q9q7J77j89K5R4k49nJ00J49
$$ -65 80 -169 -126 -243 -45 -135 265 6 214 -213 137 -34 199 110 23 200 11 36 130 -119 -124 -24 125
6192A25j30m2J08m27O76o52M87j73K34l39r1L96l34J22l9p9K50K23q5m3N7k15
$$ 125 -5 -47 61 -366 310 -342 145 -28 206 -133 -224 172 -162 -40 -79 -158 92 315 230 187 244 29
6214B9k49J04j99K43K81l00j5K51k03P7J0ko3R4K20o26K81j11K41J26l34L33j43
$$ 29 -220 -116 -315 -72 209 -91 -106 145 -58 19 29 27 -36 58 278 -348 -67 -178 63 189 -145 188 45
6237D5r2n2M7J05J48k85K1O0O2K9j36rK01k1P2l10k51M26q2K06j59J5m5q7K20
$$ 45 -47 -99 -52 53 201 -84 -63 -3 59 88 -48 -57 144 123 195 -115 -366 60 -22 184 25 40 -5 -92 128
6262A28k30P8K05j72Q0P3R1k37q1J0P3m4L15j83k2k56M6K19n3j16J46j53p0L05
$$ 128 -102 -24 181 9 89 162 253 16 -65 -55 18 -26 289 106 84 -172 -126 93 40 -76 70 -83 -153 152
6286A52l08J33j27K90k58L53n68L7L86n8J61l4j57J05N3l60N67l13o4m8L74l36
$$ 152 -156 -23 -150 140 -118 235 -333 -296 90 32 193 159 2 107 160 -200 367 54 -10 -58 316 -20
6308b0P6o1J09k82L09j23L1N8p2j4M4k09J24j36J92MPk76J44N3J00m3J81p8P5
$$ -20 56 -5 104 -178 131 8 39 97 25 11 55 -154 -30 -166 26 30 37 -239 -95 -42 58 15 196 118 193
6333A93j77j85K03j42%J63J34k70O6J46J4lm5l3k35q4M84l07N4L82j74%k06R4
$$ 193 16 -169 34 -108 -108 55 189 -81 -15 131 145 142 97 64 -171 -255 229 -78 -24 358 184 184 -22 72
6357G2k43L11k7j21N6m0l1j4P1j05N5m8R5q4M1J87j13L8j67J29Lk93K76O1K4R2
$$ 72 -171 140 113 -8 48 8 -23 -37 34 -71 -16 -64 31 -53 -12 175 62 100 -67 62 65 -228 48 109 133 225
6383B25j27K66k98N6q5lj63k43M59j43K41l5n7k14J43q3M51m26M4K2N8j46K70
$$ 225 98 364 66 122 37 34 -129 -372 87 -56 185 150 93 -121 22 -61 390 -36 8 30 88 -58 212
6406B12j96p3P6k46K25j26L37M5k01k37J39K22q3k05K96k51J78q7J39n3r2L6k40
$$ 212 16 -57 19 -227 -2 -128 209 254 53 -184 -45 177 94 -111 185 -66 112 25 164 111 19 55 -185
6429a85O2K72j3j20K9J41l68K95k23K17k01K01k06K59j51k71J18J66L13m91M31
$$ -185 -123 149 136 16 45 186 -182 113 -110 107 -94 107 -99 160 9 -262 -144 22 335 -156 275
6450B75l37K96k7j49Q0j38J16R0j20j32j58K14J65j18K85l01o9J05j62k9J05j2
$$ 275 -62 234 207 58 138 0 116 206 86 -46 -204 10 175 57 342 41 -28 77 -85 -114 -9 -21
6472b1k7J95p1j2q8j64K56k59J06M8M7j23j55L87j58L9J17j62l2N9Q5k57N9L40
$$ -21 -48 147 76 64 -24 -188 68 -191 -85 -37 10 -113 -268 119 -39 0 117 -45 -77 -18 67 -190 -131 209
6496B09l1l04L80n5j43R8Q7j80O0j54M1N3J97j44j4K40l94j41J22J24N6m87Q3
$$ 209 178 -126 254 199 56 154 241 61 121 -33 8 61 258 114 100 340 -54 -195 -73 51 107 -380 -297
6519b97K24L6M41n50J87n5j49M65Jj91l04J89l66M87K82l74P7l5k30K91k38n4
$$ -297 -73 -37 404 -146 41 -14 -163 302 303 112 -192 -3 -369 118 400 26 103 68 -162 129 -109 -163
6541a63J72j61L30k54K51k93m4L02j55L20j92N3n3l50J88O9K6J49k92L09j93M5
$$ -163 9 -152 178 -76 175 -118 -162 140 -15 305 113 166 113 -237 -49 20 46 195 -97 212 19 64
6563F4J89m64L46J0k16K87j43q6K05Ok46R8K85k85k09J65J50o5Q1l99OK36k60
$$ 64 253 -211 135 145 -71 216 73 -13 192 198 -48 50 335 50 -159 6 156 91 172 -227 -221 15 -245
6586b45M51k55r3M21l87J55k69J93kj5M09m75R1N8L90m34K99k15n3R5J8k88M15
$$ -245 206 -49 -142 279 -108 47 -222 -29 -31 -46 363 -112 -21 37 427 -7 292 77 24 119 137 -151 264
6609B64k80J0J47n6J78j04l01K17k39K22k15K20j77j45J98L1j84O27l51j02J27
$$ 264 -16 -6 141 85 263 159 -142 75 -164 58 -157 63 -114 -259 -61 -30 -214 413 62 -40 87
6630H7o4J47j24M8j12J01J16J56m03L7K06l12K15l2l61Q6PlPJ94q7j83L34Ok23
$$ 87 23 170 46 94 -18 83 199 355 -48 -11 195 -117 98 66 -295 -209 -202 -205 -198 -4 -91 -274 60 66 -157
6655a57M3J55P9m13L20P8M7O7l14J08J59k50J64j81K29k84M26k16O4p6K51K47
$$ -157 -114 41 120 -293 27 105 152 219 -95 13 172 -78 86 -95 134 -150 276 60 124 48 299 546
6677E46m93j37nL68k11K48l05j11J53k47j09K12K25m83K85R8k42N3K46k20L7K67
$$ 546 53 -84 -89 279 68 316 11 -100 53 -194 -303 -91 134 -349 -64 34 -208 -155 91 -129 -92 175
6699A75l15J27k39N88j47O1m27M50m42oK93r6l00N45k36L26o13K6L39NM5j41k7
$$ 175 -140 -13 -252 336 189 250 -177 273 -169 -175 118 22 -278 267 31 357 -256 -230 109 114 159 18 -9
6722iJ32l02P3K87l41K08J16m19L23nm0K03J5l39K1L27k11k3N8m8J35k46n3P1
$$ -9 123 -179 -106 181 -160 48 164 -255 68 63 23 226 241 -98 -77 250 39 16 74 26 161 -85 -138 -67
6746f7k49N37n02N14J1j65k98L2J53j05K09j39K50k12J37K1l03K06J08j37j45
$$ -67 -316 221 -281 233 244 79 -219 -187 -34 -139 70 -69 181 -31 106 127 -176 30 138 1 -144
6767a44R3r4l4K93Q9l77M31n9j57K03j90K16l19J70K13j18k41Q6n4J75r9j97L25
$$ -144 -51 -145 -179 114 203 -174 257 198 41 244 54 270 -49 121 334 216 -25 61 7 182 83 -114 211
6790B11k6k09q2J88R0p1p1K1K15j30l27J09m8J31R4j62k4J70k28P0q7o5L82q2
$$ 211 185 -24 -106 82 172 101 30 51 266 136 -191 -82 -130 1 95 -67 -91 79 -149 -79 -166 -231 151 69
6814F9J07j97O1j4k44K23%M6j08o2K02p1J31k57K21k80K31J93l95L95j73l4Q4
$$ 69 176 -21 40 26 -218 5 5 51 -57 -119 83 12 143 -114 107 -173 58 251 -144 251 78 44 128
6837A28j40K80J01l79J76m06j5K22J64J29k19L32J9k35k73P7JJ96j10k39L96J05
$$ 128 -12 268 369 -10 166 -240 -255 -33 131 260 41 373 392 157 -116 -39 -38 158 48 -191 205 310
6859C10l58r0J74K6K10l89L34j8m58K53m8J38k23M07k36K03l83P1K51k81Q8J50
$$ 310 -48 -138 36 62 272 -117 217 199 -259 -6 -54 84 -139 268 32 235 -148 -77 174 -107 -19 131
6881A31m29K80R6j26J41j25M54n75K49L1k87M6L49j17j49K13j69K4j86J65J74
$$ 131 -298 -18 78 -48 93 -32 422 -153 96 127 -160 -114 235 118 -31 182 13 37 -149 16 190
6902A90k16j07K04m9R1j02j5r1J11Kk18K67J34k82P1n0j93L71j77L21l36N2JL92
$$ 190 -26 -133 71 22 113 11 -4 -95 16 18 -200 67 201 -81 -10 -60 -253 118 -59 262 -74 -22 -21 371
6926C71l87j61M7r9O19k82j26K54l29J98l48K35k07Q6J94k26J18K7J80k06K16
$$ 371 -16 -177 -130 -229 390 108 -18 236 -93 105 -243 -8 -215 -129 65 -161 -43 -16 164 -42 174
6947A74J91k75j95M23m30lJ70j7pJ98k69j17J78N8J34J61k78N5j22j15J57j47
$$ 174 365 90 -105 318 -112 -115 55 38 31 229 -40 -157 21 79 213 374 96 151 29 -86 71 -76
6969g6J61K01j89j04K42n95L54o3J63R1K22k97M9m9l36K61j63L83j92n8r3M61
$$ -76 85 286 97 -7 235 -360 -6 -69 94 185 407 110 159 110 -226 35 -128 255 63 5 -88 373
6991C73k93R6l58L43m66M16L7j01j64J63l36J60L15m7j56O8r5m7m8K54K3k53K98
$$ 373 80 176 -182 161 -305 111 148 47 -117 46 -290 -130 185 138 -18 50 -45 -92 -140 114 137 -116 182
7014A82j82j04M9j36K14k41M89n00J07M11m58L1k2K52j34J86L5l03k9K24k71o3
$$ 182 0 -104 -55 -191 23 -218 271 -229 -122 289 -169 -138 -160 92 -42 144 179 -124 -153 71 -200 -263
7036b63K08K8l0L15m69O6J02L5L9l71L36k0j33M42m90J11n6j19J66l6N42m99j04
$$ -263 -55 -27 -57 258 -211 -145 -43 -8 31 -340 -4 -24 -157 285 -205 -94 -150 -269 -103 -139 403 -96 -200
7059b00M33R5l57n7L07k48j87K62N0k43J31J82k48J57j08N1rJ32l19L39Mj65K05
$$ -200 233 328 -29 -86 221 -27 -214 48 98 -145 -14 168 -80 77 -31 20 11 143 -176 163 167 2 207
7082B07k81J81P7k88P7L31k90O4J4j93K18l36J25M0j48L35k31J04n1O2n8l7Q8
$$ 207 -74 107 184 -104 -27 304 14 78 92 -101 117 -219 -94 -54 -202 133 -98 6 -45 17 -41 -78 10
7105A0lK5p4J03j29k94K75j00L7j80O09j91k28j36L47M21m38n2K38j60O9m13J66
$$ 10 7 32 -42 61 -68 -362 -87 -187 -150 -330 279 88 -140 -276 71 492 54 2 240 80 149 -264 -98
7128i8l3J11KJ8m6L3l94O19j24l24P2J32R2K29k93K9r1J03K48Ql45k27N04n1l69
$$ -98 -131 -20 -18 0 -46 -13 -407 212 88 -236 -164 -32 60 289 -4 25 -66 37 285 293 -52 -279 225 174 -195
7153a95K48j88mk33J16L76k24J69k09OJ36p9P9J11k43l3j14J53l5P8K18P9q2K
$$ -195 53 -135 -139 -372 -256 120 -104 65 -144 -138 -2 -81 -2 109 -134 -167 -281 -128 -163 -85 133 212 130 132
7177A32j73j61K27k95K29K13J61k11p9k25N2N6jL2L02k60J13l3j14j99K78L0P0
$$ 132 -41 -202 25 -270 -41 172 333 122 43 -182 -130 -74 -75 -43 259 -1 112 79 -35 -234 44 74 144
7200A44n6m8j76J17K69r4k05o8lj71L55J86k92j46K32J96l28rJ04J60l26K14K62
$$ 144 88 40 -136 -19 250 156 -49 -117 -120 -291 64 250 -42 -188 44 240 -88 -97 7 167 -159 55 317
7223C17o08L40K9Rl5r6J24l2j45K42l12j85L36O6k10n8J42m0p5O03m82j17J59
$$ 317 -291 49 78 87 52 -44 80 48 -97 145 -167 -352 -16 50 -160 -218 -76 -116 -191 412 -70 -187 -28
7246b8Q2M1l29K47j00L05k5j20l1j88J87Q6Pj23k36K99j29J83j1Pl06L80Qn01
$$ -28 54 95 -234 13 -87 218 193 73 42 -146 41 127 134 11 -225 74 -55 128 117 124 -182 198 206 -295
7270b95M26n4M9l23J67l0j36L10j17K95j76r8j52J95o7j01K03j06j34R0P1k32
$$ -295 131 77 126 -197 -30 -60 -196 114 -3 292 116 18 -134 61 -6 -107 96 -10 -144 -54 17 -215
7292b15L44N7k80L43k37l14K49P4Q6p4O8l13K98k40K81o3o6m3K10J03j48J19k92
$$ -215 129 186 -94 249 12 -302 -53 21 107 33 101 -212 86 -154 127 64 -2 -45 165 268 120 239 -53
7315e3R6j1l46R4J31k05K43K6M46o19J64j87M82j50k38p6J16K8N9q0L48n00K32
$$ -53 43 32 -314 -220 -89 -294 -51 -25 421 -198 -34 -221 261 111 -127 -203 -87 -59 0 -80 268 -232 0
7338@J08Q8n7l9R9j01j62j63J67K02j60J15m6j85m5J75J60j82k03K99J54k32L00
$$ 0 108 196 139 100 199 98 -64 -227 -60 142 -18 97 51 -134 -179 -4 156 -26 -229 70 224 -8 292
7361B92l76j51K88N4K76m83R7j20j0Q5Q7o2k21J25L77j26l23K68Oj27N0M4k95
$$ 292 -84 -235 53 107 383 -100 -3 -123 -133 -48 39 -23 -244 -119 258 132 -191 77 83 -44 6 50 -245
7384b45L25j13m8J94k81K51J53n22K49K97j96J87j99on9j78K09J91j82J66l43
$$ -245 80 -33 -81 113 -168 83 236 -286 -37 260 64 251 52 46 -13 -191 18 209 27 193 -150
7405a50L65j46k02J82j18k3K53j79K16k68kN26o67R6K01J70k56j05J52k51K05
$$ -150 215 69 -133 49 -69 -92 161 -18 198 -70 -72 454 -213 -117 84 254 -2 -107 45 -206 -1
7426aj49J8m7l10M97J53l40J43J23K95n36J55n8R4j95M57j90j60M1n0j0R6j83
$$ -1 -150 -132 -179 -489 8 161 -179 -36 87 382 -154 1 -57 37 -158 299 109 -51 -10 -60 -70 26 -157
7449a57K57J65q4Kk46n1J99j76J89j48k13K83j09nj3L18k20L09n28L55k38L40
$$ -157 100 265 181 183 -63 -114 85 -91 98 -50 -263 20 -89 -94 -107 211 -9 300 -228 127 -111 229
7471B29k61M1k1J65k0l48O6R7k38M18j44J4N7j11J35j86K21q3j40K84J34n02L13
$$ 229 -32 9 -12 153 133 -215 -149 -52 -290 128 -16 -2 55 -56 79 -107 114 31 -109 175 309 -193 120
7494A20k05j4KK24j24J32k10K98j07k84j05P9M11l29J88J61j16j82R0k5m8k00
$$ 120 -85 -99 -97 127 3 135 -75 223 116 -168 -273 -194 217 -112 76 237 121 -61 29 4 -44 -244
7516b44R7K34j40p4J83M1l98L15k09L09j22j21K25j66j20L09L4j18J34k89Q5j92
$$ -244 -147 87 -53 -127 56 97 -301 14 -195 114 -8 -129 96 -70 -190 119 153 35 169 -120 -35 -227
7538b27K98o6J8J67j65J6K29m27n6L81m41K93P6j42j93N4L00j51K55k96M14p05
$$ -227 71 5 23 190 25 41 270 -157 -213 168 -273 20 96 -46 -239 -185 115 -36 219 -77 337 -368
7560c68K99m3L8k2J13j3j31J14K80k81J24k30K59O6k35J75k2Jq9j83l62O63j11
$$ -368 -69 -112 -74 -96 17 4 -127 -13 267 -14 110 -120 139 205 -30 145 123 124 35 -148 -510 153 42
7583D2r0l1P7l98K76j28K34m9k72L03L4O6k30K11K77j10j3k26j90J30LJ17K3o9
$$ 42 -48 -79 -2 -400 -124 -252 -18 -67 -339 -36 -2 64 -166 45 322 212 199 -27 -217 -87 -84 33 56 -13
7607a3K50M8l04j6k97L52p5L14l83J83n8m2j4L00n55K03K65R2j24k77L3J71j36
$$ -13 237 285 -19 -35 -332 20 -55 259 -124 59 1 -41 -55 245 -310 -107 158 250 126 -151 -118 53 -83
7630h3P1R9k73J16k70J44qLL83j0k11N2Q1l57Q3j73K88R2J38n4K21l54l14L18
$$ -83 -12 87 -186 -70 -340 -196 -204 -201 182 172 -39 13 94 -263 -180 -353 -65 27 165 111 332 -22 -336 -18
7654a8mj66M6K04j49J24m7m0q7R0j60J66R8R4l92J67P9ml1j68L25j07j29P5o9
$$ -18 -22 -188 -142 62 -87 37 -10 -50 -137 -47 -207 -41 57 151 -241 -74 5 1 -30 -198 127 20 -109 -34 -103
7679a03J95j07p9P1L31m89L75k12l4J15j31K06J2l3j74Q2Kj84K17l4L12o11K72
$$ -103 92 -15 -94 -23 308 -181 194 -18 -52 63 -68 138 150 117 -57 25 27 -157 60 26 338 -273 -1
7702aj0k16r6J62L8RK1L59K1l81N0J24P4R7n60R5J44j59M20j74r2j3L64k40L43
$$ -1 -11 -227 -323 -161 -123 -114 -93 266 287 -94 -44 80 154 251 -309 -214 -70 -229 191 17 -75 -88 276 36 379
7727C79k61o5n6P7l22R7L0Q1K47q7k01J77lk57M33l03QJ24K81k37J75m07O1m1
$$ 379 118 53 -3 74 -248 -151 -121 -40 207 120 -81 96 93 -164 269 -34 -26 98 379 142 317 -90 -29 -70
7751g0k31P35m00j36K49j62q3JJ46Ok07L3J55l51J20J82J32k66P8ok8l4J29k6
$$ -70 -301 434 34 -102 147 -15 -98 -97 49 55 -152 -119 36 -315 -195 -13 119 -147 -69 -75 -103 -137 -8 -34
7775c4l8k11L66j98j9J12m2N4Qq5J94p1k20K23p6J50k49%J60L60m69M10m01rj78
$$ -34 -72 -283 83 -115 -134 -22 -64 -10 -2 -87 107 36 -184 39 -37 113 -136 -136 24 384 -85 325 -76 -85 -263
7800b63J73J43p7K8R3j48J30o4nr8j40K41j15N40l98j00k02L6j64K92K57l51R6
$$ -263 -90 53 -24 4 97 -51 79 15 10 -88 -228 13 -102 438 40 -60 -262 -226 -390 -98 159 -192 -96
7823i6K2K45k11j85K72r6J17q8J25lk96K63J25q1k0k20Q9j3K3J27m28M95l62J90
$$ -96 -74 171 -40 -225 47 -49 68 -20 105 102 -194 69 194 113 93 -127 -38 -51 -28 99 -329 166 -196 -6
7847fQo8K13j57k7j0mJ47k08J25R3j3m0P2k89O9r8J89j13K15rj92j21L2J94k38
$$ -6 2 -66 147 -10 -37 -47 -51 96 -112 13 106 93 53 125 -164 -95 -193 -4 -117 98 89 -103 -224 -192 2 -236
7873b36J51k6M6L15n38N5J45j33L15l02J47K31j86J29J14J3m15J05J25k08m2J66
$$ -236 -85 -111 -65 250 -288 -233 -88 -221 94 -208 -61 170 -16 113 227 240 -175 -70 55 -153 -195 -29
7895b9J88o12M41J76k41n1J23m4j22L27j6k60j14M89j30k85K31j57j30K87j4j2
$$ -29 159 -453 -12 164 -77 -128 -5 -49 -171 156 140 -120 -234 255 125 -160 71 -86 -216 71 57 45
7917D5k53L57k31J1N7k06K67l5n1J04k5o7P5P9nO3j10J36l44J21M2K1J5k15K9
$$ 45 -208 149 -82 -71 -14 -220 47 12 -39 65 40 -27 48 127 122 185 75 211 -133 -12 30 51 66 -149 -120
7942a20J80p6M0R6l43L64J13k66MJ37j74K45l5k87J52K19l48J24N9J94j79n6n5
$$ -120 60 -16 24 120 -223 141 254 -12 -8 129 -45 200 165 -122 30 249 -99 25 84 278 99 43 -12
7965a2k42J54P4J74j10K78k96J31j83j7L6j13J4M00m05J73p1J29p2o3J52j11R3
$$ -12 -254 -100 -26 148 38 316 20 151 -32 -49 -13 -126 -112 288 -117 56 -15 114 42 -21 131 20 113
7988A13k43L21j78j10J31o0M40m85o2J92l36M97k46j6J14j02j29j06J35K71j29
$$ 113 -130 191 13 -97 34 -26 414 -71 -133 59 -277 220 -26 -42 72 -30 -159 -265 -130 141 12
8009A2j33j12J37M2L02j76Q5n9P2m19J45J40K04k5j63p3j3o3K75k61l5K78k8j79
$$ 12 -121 -233 -96 -54 248 72 157 98 170 -249 -104 36 240 215 52 -21 -34 -97 178 -83 -118 160 132 -47
8033d7L27l11J18J5m9P6r9q8J24N5k25K98k90R2J26J55k52j80K72n0J06L6l21
$$ -47 280 -31 87 102 53 129 30 -58 66 121 -104 194 -96 -4 122 277 25 -155 117 67 173 209 -112
8056a12K18j44p9J68L5r4M1j80J54m5J37k00O0j9J64M6l3n2j60Lq6L9K80k07R9
$$ -112 106 -38 -117 51 86 -8 33 -147 7 -38 99 -101 -41 -60 104 150 117 65 -95 -92 -178 -139 141 -66 33
8081C3J19k26P1j11l7J43O1r5O2O9j94J55n6L3q5R4O9K49k1p79O21j89Rj00o2
$$ 33 152 -74 -3 -114 -151 -8 53 -42 20 89 -105 50 -6 27 -58 36 105 354 333 -446 175 -14 -5 -105 -167
8106a67J88k70L35k05K59k75K66k82J66ok41L42n2q9j24J14o9J47k36L49k94j48
$$ -167 21 -249 86 -119 140 -135 131 -151 15 9 -232 110 58 -31 -155 -41 -110 37 -199 150 -144 -292
8128b92K51J84l8k97M65l70K10j52J0J6j39J41K07O5j25m7j40K01n6j07j7J79
$$ -292 -41 143 105 -192 273 -97 113 -39 -29 -13 -152 -11 196 261 136 89 -51 150 94 -13 -30 149
8150A49M4k66J8jJ91l65N64Kj65J6l64J83j27n6N56m49M1j2P6O8m2j87n9K70j29
$$ 149 193 -73 -55 -56 135 -230 334 336 171 187 -177 6 -121 -177 379 -70 -29 -41 35 103 61 -126 -185 85 -44
8175d4L3q4o0J03k56J62L3j82K91j10L31m42J88j48K39q7
$$ -44 -11 -95 -155 -52 -308 -146 -113 -295 -4 -114 217 -225 -37 -185 54 -33
8191c3
$$ Imaginary data points
##PAGE= N=2
##DATA TABLE= (X++(I..I)), XYDATA
0@%%%%%%%Qj6J6j6K4l2M0m8N6p2Q6r9J14j33J56j80K08k40K76l15L55m04M60n18
$$ 0 0 0 0 0 0 0 0 8 -8 8 -8 16 -16 24 -24 32 -40 46 -53 61 -72 84 -96 112 -128 148 -167 188 -216 244 -274
31b74N81o51P29q15R08j009J121j244J379j528J691j872K075k299K549k832L153
$$ -274 307 -344 385 -430 478 -531 590 -654 725 -803 888 -984 1091 -1208 1341 -1491 1662
48A662l522L949m452N055n791O717p918R551j1911J5634k2418L8669j45536j49010
$$ 1662 -1860 2089 -2363 2692 -3099 3618 -4300 5251 -6660 8974 -13444 25225 -120311 -269321
62b69321L36901J14793k08957j59820R2153J7758n9105P0404J26985n8113q9404
$$ -269321 67580 182373 -26584 -186404 -94251 -76493 -135598 -65194 61791 3678 -85726
73h5726K4003k6320j35269N6067K49406O9882j76452p8965N2654n7104r2043J29779
$$ -85726 -61723 -88043 -223312 -167245 82161 152043 -24409 -103374 -50720 -107824 -199867 -70088
85g0088J97555j2146j10716o75q053j04732j3971J43063R0453j9877K367p041
$$ -70088 127467 115321 4605 3930 -4123 -108855 -122826 20237 110690 90813 93180 86139
97H6139j09641n5554J17249Q3582p7980k6218J12070O047j55300m1122J35539
$$ 86139 -23502 -79056 38193 121775 43795 17577 129647 135694 -19606 -60728 74811
108G4811O7679n6329j3351J3446p5330o2614N9757N0208l2041L0245R0167n4658
$$ 74811 142490 86161 72810 86256 10926 -51688 8069 58277 26236 56481 146648 91990
120I1990j68089k6415J02573J5435l5799P3517O7826r9900j20314K1236L6769
$$ 91990 -76099 -102514 59 15494 -20305 53212 121038 21138 -99176 -77940 -41171
131d1171m1154K4212J11120L991j12333l3367M3668k7313l4679Q2560P0494p5987
$$ -41171 -82325 -58113 53007 56998 -55335 -88702 -45034 -72347 -107026 -24466 46028 -29959
143b9959p3362M9761L0839n9298R837J07730J3860j00470l3936M2083j2374k4728
$$ -29959 -103321 -53560 -22721 -82019 -72182 35548 49408 -51062 -84998 -42915 -55289 -80017
155h0017P4520Q0535l5454o0516Q724n069n1479J8365R4999L4800l8737q374M380
$$ -80017 -5497 75038 39584 -20932 -12208 -17277 -68756 -50391 44608 79408 40671 32297 36677
168C6677n4489l7750N8171O5498j0057j2946K3761k0832o0465L627N6505J0557
$$ 36677 -17812 -55562 2609 68107 58050 45104 68865 48033 -12432 -8805 47700 58257
180E8257j9411J6107K215n5811k4000N4432L3291k6957k646K5600l6433o7149
$$ 58257 38846 54953 57168 1357 -22643 31789 65080 38123 35477 61077 24644 -42505
192d2505J2990N8248M120j5866K9883O352o7296m5288L1658K4002j6474J7260
$$ -42505 -29515 28733 32853 16987 46870 53222 -14074 -59362 -27704 -3702 -20176 -2916
204b916M1952k3543o1468n667K4523j4521p266M5893K4176m2912l1869J9263L202
$$ -2916 39036 15493 -45975 -51642 -27119 -41640 -48906 -3013 21163 -21749 -53618 -34355 -31153
217c1153k3338J5721L8490j1225l5742M051J4518j5479L115M2742J3157l5473
$$ -31153 -54491 -38770 -280 -11505 -47247 -43196 -28678 -44157 -41042 1700 14857 -20616
229b0616j5445J4619q149j4550L3763M3280q428k4673M949l715k9321N828M8607
$$ -20616 -36061 -21442 -29591 -44141 -10378 32902 24474 -199 4750 1035 -28286 -22458 26149
242B6149J8438j7248L119J1006k9053k7133K8017L5172r560q229K1554l766l8898
$$ 26149 44587 27339 30458 41464 12411 -14722 13295 48467 38907 30678 52232 48466 9568
255I568m640L5575N628k1457Q819J6350k6710k7476K2175K4705j7348j1061J9017
$$ 9568 4928 40503 46131 24674 33493 49843 23133 -4343 17832 42537 25189 14128 33145
268C3145p041m1809q611L0550O020j6336R865J4506k8317l4210P632J5970p858
$$ 33145 26104 -15705 -24316 6234 12254 -4082 5783 20289 -8028 -42238 -34606 -18636 -26494
281b6494J212K4610j593l2999j1728J2459l687r469J9725J9585j4771j8615Q738
$$ -26494 -25282 -672 -2265 -35264 -46992 -34533 -38220 -47689 -27964 -8379 -23150 -41765 -33027
294c3027N708j2724M143K4028J857j8059K303J3408n722m461K2264J5126j5107
$$ -33027 -27319 -40043 -35900 -11872 -10015 -28074 -25771 -12363 -18085 -22546 -282 14844 -263
307b63j0853J2346L087j1688J1533K8894L333j7414j655N303j1802o985K1549
$$ -263 -11116 1230 4317 -7371 4162 33056 36389 18975 17320 22623 10821 3836 25385
320B5385J9281n930n744N980p315j9449O61J7455L036p291M376L038j3919j1729
$$ 25385 44666 38736 32992 38972 31657 12208 12869 30324 33360 26069 30445 33483 19564 7835
334G835P061M019q824k117N985o863j3592K361R178m340p572L889k514j7036p077
$$ 7835 14896 18915 10091 7974 13959 7096 -6496 -4135 5043 703 -6869 -2980 -5494 -22530 -29607
349b9607J2361O135n855K354P854j1061j9979j458J1371K146o8J2829P763j0804
$$ -29607 -17246 -11111 -16966 -14612 -6758 -17819 -37798 -39256 -27885 -25739 -25807 -12978 -5215 -16019
363a6019j0963K647K571l905M406J3394L886n560j34N377p82k069M623M772j122
$$ -16019 -26982 -24335 -21764 -25669 -21263 -7869 -3983 -9543 -9677 -4300 -5082 -7151 -2528 2244 1122
378A122m69L662L006K058N256L437m048n079m9J5j106N929J1422L134o169n224
$$ 1122 653 4315 7321 9379 14635 18072 14024 8945 8896 8911 7805 13734 25156 28290 22121 16897
394A6897k427o786m883N520J1440K783k561k92k703r594p920J678L819q28r24
$$ 16897 14470 7684 2801 8321 19761 22544 19983 19691 16988 7394 -526 1152 4971 4143 3219
409C219L246J237m461l955O91L63m021m372K3J569M38L04K366J890l994o903m128
$$ 3219 6465 7702 3241 -714 -23 340 -3681 -8053 -8030 -6461 -6023 -5719 -3353 -1463 -5457 -12360 -16488
426a6488r2J503K116N882O170k83o608n334k741j720N69N563P851L848n33k421
$$ -16488 -16580 -15077 -12961 -7079 -909 -1192 -7800 -13134 -15875 -17595 -17026 -11463 -3612 236 -297 -2718
442b718k991l554k651Q96L630K934K081J939K594K317k015l088P0N04j764k176
$$ -2718 -5709 -9263 -11914 -11018 -7388 -4454 -2373 -434 2160 4477 2462 -626 -556 -52 -1816 -3992
458c992M918P210K913j684p4j41n049m677K369O275K762L229L565j066p811n347
$$ -3992 926 8136 11049 9365 9291 9150 4101 -576 1793 8068 10830 14059 17624 16558 8747 3400
474C400j93q6j38M357O492J603l137j982k582l927k434Q84R12n11J877L171j236
$$ 3400 3207 3121 2983 7340 13832 15435 12298 10316 7734 3807 1373 2257 3169 2658 4535 7706 6470
491F470k152r42k997o942l123K571J93j804M545O127l925q598j181J624m620k953
$$ 6470 4318 3376 379 -6563 -9686 -7115 -6922 -8726 -4181 1946 -1979 -10577 -11758 -10134 -14754 -17707
507a7707P787O413k577k504J874k267q415o93O518J863j013N691O306l153n862
$$ -17707 -9920 -3507 -6084 -8588 -6714 -8981 -17396 -18089 -11571 -9708 -10721 -5030 1276 -1877 -7739
522g739J126J955l596r97O436M058k46K872M861n81l922R49N75l457O50P029M378
$$ -7739 -6613 -4658 -8254 -9251 -2815 1243 997 3869 8730 8149 4227 5176 5751 2294 2944 9973 14351
539A4351q87K386K483n589p774J456M269k220L76O773J909p547l900K367k684
$$ 14351 13464 15850 18333 12744 4970 6426 10695 8475 8851 15624 17533 9986 6086 8453 5769
554E769n446K686N642k418l217M555J80q947m754L841j358q297J223Q948q93o363
$$ 5769 323 3009 8651 6233 3016 7571 7751 -1196 -5950 -2109 -3467 -11764 -10541 -1593 -2486 -8849
570h849K610L587p400p248M623K051n794J942J1191Q79r001o0O280n158p543O491
$$ -8849 -6239 -2652 -10052 -17300 -12677 -10626 -16420 -14478 -3287 -2408 -11409 -11469 -5189 -10347 -17890 -11399
586a1399J0144k644l559P595K734r157j885R352R43p355M158J0640j713o721N162
$$ -11399 -1255 -3899 -7458 137 2871 -6286 -8171 1181 2124 -5231 -1073 9567 7854 1133 6295
601F295N083p995n322P708M152n666K445J0542j123j0191Q11N519o167o881O281
$$ 6295 11378 3383 -1939 5769 9921 4255 6700 17242 16119 5928 6739 12258 6091 -790 5491
616E491O031o304k009Q026n72j1847j496P963l562p894N252Q977n694p541M727
$$ 5491 11522 5218 3209 11235 10663 -1184 -2680 5283 1721 -6173 -921 8056 2362 -5179 -452
631d52J884r594k239R173O18q660K547Q605m293q365M337M981p701m233R452M242
$$ -452 1432 -8162 -10401 -1228 -610 -9270 -6723 1882 -2411 -10776 -6439 -1458 -9159 -13392 -3940 302
647C02o987R03R988k761j1688J586Q184k469m309Q728N123p516k667Q061n58j0797
$$ 302 -6685 -5782 4206 1445 -10243 -8657 -473 -2942 -7251 1477 6600 -916 -3583 4478 3920 -6877
663f877K971J2194k400j0537M759J0142n179q410N350M232p731j741R623J193
$$ -6877 -3906 8288 5888 -4649 110 10252 5073 -3337 2013 6245 -1486 -3227 6396 7589
677G589q306K233P943n576j0273M034P528m999k899Q151J328r527j82Q796m606
$$ 7589 -717 1516 9459 3883 -6390 -2356 5172 173 -2726 5425 6753 -2774 -2956 5840 1234
692A234r777N396J0426n752p536P354N438q112k907Q569k537j1194N796J3651
$$ 1234 -8543 -3147 7279 1527 -6009 1345 6783 -1329 -4236 4333 1796 -9398 -3602 10049
706A0049n655j2937P774J1440j0139j2207R828R895q012n216R601K075j1305l00
$$ 10049 4394 -8543 -769 10671 532 -11675 -1847 8048 36 -5180 4421 6496 -4809 -5109
720e109J0742k807j1710M631J1025m473q465O268N995q883m868P599J125q240
$$ -5109 5633 2826 -8884 -4253 6772 2299 -6166 102 6097 -2786 -7654 -55 1070 -7170
734g170K573R549k305r328K729O332m586m486M914J819m568K879P041n383q109
$$ -7170 -4597 4952 2647 -6681 -3952 2380 -2206 -6692 -1778 41 -4527 -1648 5393 10 -8099
749h099P066P275q238p318J0590P034q232l196Q204O7r242K420R072m433o882
$$ -8099 -1033 6242 -1996 -9314 1276 8310 78 -3118 5086 5153 -4089 -1669 7403 2970 -3912
764c912Q237P624r772o130R452L250j0703m48J1223k163j1235N262J1450p129
$$ -3912 4325 11949 2177 -3953 5499 8749 -1954 -2402 8821 6658 -4577 685 12135 5006
778E006j2116P141Q396r202p193J0409N194r377k196Q120m815j0732O028J1329
$$ 5006 -7110 31 8427 -775 -7968 2441 7635 -1742 -3938 4182 -633 -11365 -5337 5992
792E992o932j0190R084Q419j1021q156J0838N340j0795l086J0528J190r340L035
$$ 5992 -940 -11130 -2046 6373 -4648 -12804 -1966 3374 -7421 -10507 21 1211 -8129 -5094
806e094R732m410q761M427O296n032j934P970K116p060K82O566l694p126N956
$$ -5094 4638 228 -8533 -4106 2190 -2842 -4776 3194 5310 -1750 -1468 5098 1404 -5722 234
821B34Q116m568m987N929L485o322j394N134j619n219M902N137o377m294Q915
$$ 234 8350 3782 -1205 4724 8209 1887 493 5627 4008 -1211 3691 8828 2451 -1843 7072
836G072L139j1780l744J0311J015j0591R89J1342l040j1020L622Q597p636q175
$$ 7072 10211 -1569 -5313 4998 6013 -4578 -3589 7753 4713 -6307 -2685 5912 -1724 -9899
850i899P819O595q637l639R025K084j0646j146R010k419q679N193J0092m704q504
$$ -9899 -2080 4515 -4122 -7761 1264 3348 -7298 -8444 566 -1853 -10532 -5339 4753 49 -8455
865h455N994O262p213n300P252M261n743o42P052m46n057K480M187m730l412N400
$$ -8455 -2461 3801 -3412 -8712 -1460 2801 -2942 -3584 3468 3022 -2035 445 4632 -98 -3510 1890
881A890M110m910j402O792M04p515J90N272j812l746L386M078m339k966M754L6
$$ 1890 6000 1090 -312 6480 6884 -631 -441 4831 3019 -727 2659 6737 2398 -568 4186 4222
897D222o093K45N754j890n108L329M447m251m800M326K156o764k316O820Q52o022
$$ 4222 -1871 -1626 4128 2238 -2870 459 4906 655 -4145 181 2337 -4427 -6743 77 929 -5093
913e093J495O386k870o849K617M886l855l355N591L160m890k002O219N0o016R36
$$ -5093 -3598 2788 -82 -6931 -4314 572 -3283 -6638 -1047 2113 -2777 -4779 1440 1490 -4526 -3590
929c590N654j185m674L637N500l360m397L640K514m117j092M856P46l327M40L717
$$ -3590 2064 879 -3795 -158 5342 1982 -2415 1225 3739 -378 -1470 3386 4132 805 1245 4962
945D962j887l712J921K348l031j508L910J111l257k07K565j879l892J496K623
$$ 4962 3075 -637 1284 3632 601 -907 3003 4114 857 650 3215 1336 -2556 -1060 1563
960A563k269j980L209J193l745m80L145r94l723J144L636k066k781L484K473m260
$$ 1563 -706 -2686 523 1716 -2029 -2509 636 -358 -4081 -2937 699 -1367 -4148 -664 1809 -2451
976b451k227L410J273l908O37M605k60l837J392L018j626l097L035K690k947j049
$$ -2451 -4678 -1268 5 -3903 -3266 1339 1079 -2758 -1366 1652 26 -3071 -36 2654 -293 -1342
992a342L938J319l737l5L145j242l765J569L936j015l099K558J614k820j944K527
$$ -1342 2596 3915 178 143 3288 2046 -1719 -150 3786 2771 -328 2230 3844 1024 -920 1607
1008A607O41l074jK902n30k825Q57K359k218k589J633J548j071p56J679K51k178
$$ 1607 2248 -826 -827 2075 1545 -1280 -423 1936 -282 -2871 -1238 310 -761 -1517 162 413 -1765
1025a765m16J388n55j597J402J127r68m60J911L06j991j91J548l54j572K451J689
$$ -1765 -2181 -793 -1348 -2945 -1543 -416 -1384 -1844 67 373 -1618 -1809 -261 -615 -2187 264 1953
1042A953j040j326J894M78k550j07K645J64k092Q66K106n80k304Q59J404j456
$$ 1953 913 -413 1481 1959 -591 -698 1947 2111 19 885 2991 2411 107 966 2370 914
1058I14j827J720J773j257j078J113L81k432m81J263j41p73P80M32n08n84K28
$$ 914 -913 807 2580 1323 245 1358 1739 -693 -1174 89 -52 -825 -45 387 -121 -705 -477
1075d77o21j186K79N06K49m70Q91O29j048p67N61Q2q84M95J091J57p10R88J165
$$ -477 -1098 -2284 -2005 -1499 -1250 -1720 -829 -200 -1248 -2015 -1454 -1372 -2256 -1761 -670 -513 -1223 -235 930
1094I30j198p52J102Q88q10k79J181J246p68j173J008J60n54m89J162L83l35N18
$$ 930 -268 -1020 82 970 160 -119 1062 2308 1540 367 1375 1535 981 492 1654 2037 1702 2220
1112B220j4k51p90j08k39k00P9M05J52M8k44p82o49l60k81P1OL01k16J18m92K1
$$ 2220 2206 1955 1165 1057 818 618 697 1102 1254 1302 1058 276 -373 -733 -1014 -943 -937 -636 -852 -734 -1226 -1205
1134a205m88n07m33N71N98n11J4J027K81p44j248P81J074l44l42Q28R67K20o90
$$ -1205 -1693 -2200 -2633 -2062 -1464 -1975 -1961 -934 -653 -1397 -2645 -1864 -790 -1134 -1476 -648 319 539 -151
1153a51k54L76l3L79J99L63L40M56L15K55q37m44N10L06l49j49J186K27r50o42
$$ -151 -405 -29 -62 317 516 879 1219 1675 1990 2245 1408 964 1474 1780 1431 1282 2468 2695 1745 1103
1173A103M89mo41n39N07J96m12l31M42l27p79n57l54M56j36J97j98j90K20l62
$$ 1103 1592 1588 947 408 915 1111 699 368 810 483 -296 -853 -1207 -751 -887 -690 -888 -1078 -858 -1220
1193a220p68m55J12L97J03M55K27L55k16k34m03k55J18J232Q9j79M47R23k47j065
$$ -1220 -1988 -2443 -2331 -1934 -1831 -1376 -1149 -794 -1010 -1244 -1647 -1902 -1784 -552 -463 -642 -195 728 481 -584
1213e84q1J248K3p80R55J019K16q79J6M27p19q3J25L60j65P54M60p86p92J79L95
$$ -584 -665 583 606 -174 781 1800 2016 1137 1153 1580 861 778 903 1263 1098 1852 2312 1526 734 913 1308
1234A308j183l05P18Q31m27n45N6M98j243n99l70J94N06n4J82k19J24k59n32p64
$$ 1308 125 -180 538 1369 942 397 453 951 -292 -891 -1261 -1067 -561 -615 -433 -652 -528 -787 -1319 -2083
1254b083J87P50O98r05M96L17N04r76j35j50L71N26L77k27K98J067k87j507J44
$$ -2083 -1896 -1146 -448 -1353 -857 -540 -36 -1012 -1147 -1297 -926 -400 -23 -250 48 1115 828 -679 -535
1273e35J225K3q96M23J578j87o78k16Q78p06r07L07P27l47J35P18m87q54j50L35
$$ -535 690 713 -183 240 1818 1631 953 737 1615 909 2 309 1036 689 824 1542 1055 201 51 386
1293C86l48j146Q53J516j061p90K10J159j132j301J73J020m17Q3L60J62l92J22
$$ 386 38 -1108 -255 1261 200 -590 -380 779 -353 -1654 -1481 -461 -878 -795 -435 -273 -665 -543
1311e43J11j028Q3R36N57r74J67Q30K67p04m39O14O8l38M09P41K7m16P36m12p49
$$ -543 -432 -1460 -1377 -441 116 -858 -691 139 406 -298 -737 -123 -55 -393 16 757 784 368 1104 692 -57
1332e7K79N92m06q0R05O27j132j044J039O15j658Q8Q65J91j065N04O59p41q93
$$ -57 222 814 408 328 1233 1860 728 -316 723 1338 -320 -232 633 824 -241 263 922 181 -712
1351g12N98M9j374M3J320R75k260N2J408k60j835M78J793o08j198R82J118o08
$$ -712 -114 -65 -1439 -1396 -76 899 -1361 -1309 99 -161 -1996 -1518 275 -333 -1531 -549 569 -39
1369c9j360M66J149j099q4R37M72n76K98O48q89l41J028L86p10n36R49J104j135
$$ -39 -1399 -933 216 -883 -967 -30 442 -134 164 812 -77 -418 610 996 286 -250 699 1803 668
1388F68j80P42k16n28K08J41r29O89J235m97j604o3J249m15j379Q21J287q72j169
$$ 668 488 1230 1014 486 694 835 -94 595 1830 1333 -271 -334 915 500 -879 -58 1229 357 -812
1407h12R60L70j513n53J431J76j648K46J683o55j031K27J401j187j237J661O43
$$ -812 148 518 -995 -1548 -117 59 -1589 -1343 340 -315 -1346 -1119 282 -905 -2142 -481 162
1424A62j313o64K176N23j802n04J357L6n47J18J470o84k72P23K63j165M0J400
$$ 162 -1151 -1815 361 884 -918 -1422 -65 -29 -576 -458 1012 328 56 779 1042 -123 -83 1317
1442A317J22j268M06J114k22r99P4N53n16p26J195M41r43j8N74m31p74K56N50
$$ 1317 1439 171 577 1691 1469 470 544 1097 581 -145 1050 1491 548 530 1104 673 -101 155 705
1461G05o91o75P47N67j018n09O73j16j232R5R23k25n21N46L78p85r5M23K19q53
$$ 705 14 -661 86 653 -365 -874 -201 -317 -1549 -1454 -531 -756 -1277 -731 -353 -1138 -1233 -810 -591 -1444
1481a444M45J542p87j526R33J270r03p73J118P75j113j13J173O64j242L16J210
$$ -1444 -999 543 -244 -1770 -837 433 -470 -1243 -125 650 -463 -576 597 1261 19 335 1545
1498A545r30j212N57J758n70j153J152P05j072j101J086N20r78k89J539m31q43
$$ 1545 615 -597 -40 1718 1148 -5 1147 1852 780 -321 765 1285 307 18 1557 1126 283
1515B83q1P98m22j004L98K30j79o40Q69j24p81l2M94l24q74O4J451p53M0j57N95
$$ 283 202 1000 578 -426 -28 202 23 -617 252 128 -653 -685 -191 -515 -1389 -1325 126 -627 -587 -744 -149
1536a49p13l44O47R1n93L64J119n02o29Q41J66q47q3P36M33n06K06P07N7j137
$$ -149 -862 -1206 -559 -468 -1061 -697 422 -80 -709 132 298 -549 -632 104 537 31 237 944 1001 -136
1556a36M38O47j78n56M73L29m33o5J027m54r08o0O76o31m48J338Q6r22k56K48
$$ -136 302 949 771 215 688 1017 584 519 1546 1092 184 124 800 169 -279 1059 1145 223 -33 215
1576B15l8o62n04J183K5j092O48N48l29q53P23l8p38l60P44K67l03J74k4J03p52
$$ 215 177 -485 -989 194 219 -873 -225 323 -6 -859 -136 -174 -912 -1272 -528 -261 -564 -390 -414 -311 -1063
1597a063M30M88o68K89M69K76J3q40R38l44l71j86R55J35m14O30L93p58r0L66
$$ -1063 -633 -145 -813 -524 -55 221 234 -606 332 -12 -383 -569 386 521 107 737 1130 372 282 648
1617F48k35m98J3J053m10l44P1M84l77j148P88N29r73L03P44p5j088K58O65o94
$$ 648 413 -85 -72 981 571 227 298 782 405 -743 45 574 -399 -96 648 573 -515 -257 408 -286
1637b86o41O94L26k82n65Q91J72j022j51P49n9q62M43Q11J10o37J08N19p23j92
$$ -286 -927 -233 93 -189 -754 137 309 -713 -864 -115 -174 -1036 -593 218 328 -309 -201 318 -405 -597
1657e97N56K97m78K40P30j07o24J86K49k81n91M43R38p00J18K64J81p36k9J04
$$ -597 -41 256 -222 18 748 641 17 203 452 171 -420 23 961 261 379 643 824 88 59 163
1677A63j81l58P14M11o82N1J59j26m27l38O33l18P3j06O65o02l20L26j30j11m06
$$ 163 -18 -376 338 749 67 118 277 151 -276 -614 19 -299 -226 -332 333 -269 -589 -263 -393 -504 -910
1698i10N03rj16J18N50m23n39N6O73o33j20P41N55l88m3K72L7l16N9O4K58k31
$$ -910 -407 -416 -532 -414 136 -287 -826 -770 -97 -730 -850 -109 446 58 15 287 324 8 67 131 389 158
1720A58L33L48l5o17M05j41j63k20P37K11o64M23pj69n26l5L01n56j12M53J73
$$ 158 491 839 804 187 592 451 288 68 805 1016 352 775 768 599 73 38 339 -217 -329 124 297
1741B97k76j77r5l07P2k08K92J08l78L41J80l85l70P55n10k27J30J32J18o8R1
$$ 297 21 -156 -251 -558 -486 -694 -402 -294 -672 -331 -151 -536 -906 -151 -661 -888 -758 -626 -508 -576 -485
1762d85J45j5p5r2K33j09Q0N96L53p28K19K90m07J1L78n1K62p9K96k0k79N5K70
$$ -485 -340 -355 -430 -522 -289 -398 -318 278 631 -97 122 412 5 16 394 343 605 526 822 802 523 578 848
1785H48l09q3K13J96k86m09N65o3l10l04K03o9k39p8N31j53m22k28K64l66j83
$$ 848 539 456 669 865 579 170 735 672 362 58 261 192 -47 -125 406 253 -169 -397 -133 -499 -682
1806f82K78L1Q9k45j56K26q5j52m0K27P6k1L2J15p3k11K62n1J32J38O5k02L45
$$ -682 -404 -373 -284 -529 -685 -459 -544 -696 -736 -509 -433 -454 -422 -307 -380 -591 -329 -380 -248 -110 -45 -247 98
1829I8J03k23J27R6K35l07k28N48j63J1j14N22k85j14K84j51K38q8j49M6J03m85
$$ 98 201 -22 105 201 436 129 -99 449 286 297 183 705 420 306 590 439 677 589 440 486 589 104
1851A04K73l18K73j60M4l12N9J95k77L8L55o49k22L21P5n2J90Om69J04j17l2K14
$$ 104 377 59 332 172 216 -96 -37 158 -119 -81 274 -375 -597 -276 -201 -253 -63 -57 -526 -422 -539 -571 -357
1874c57r7K56m5j80L35k95n9K13J51N5L1L0J49J59j97M2l64J16J3Q3J18K15K95
$$ -357 -454 -198 -243 -423 -88 -383 -442 -229 -78 -23 8 38 187 346 149 191 -173 -57 -44 39 157 372 667
1897F67l11J6k04p0j94L88j99J81k55K33j42J77l16l04j33N27j56k47M13k96L16
$$ 667 356 372 168 98 -96 292 93 274 19 252 110 287 -29 -333 -466 61 -95 -342 71 -225 91
1918I1k81J35k27l33K89M84l72M9J05K0J51k45k38J37k0K26L46J39m27J42P2j60
$$ 91 -190 -55 -282 -615 -326 158 -214 -165 -60 -40 111 -134 -372 -235 -255 -29 317 456 29 171 243 83
1940H3j47r8N94o4p7L7M89l94m45L5J96k35J29K53J80l23p1o1Nj33k10mK68n3
$$ 83 -64 -162 432 368 291 328 817 423 -22 13 209 -26 103 356 536 213 142 81 86 -47 -257 -261 7 -46
1964d6n2L44m15j31n4O6k81R4q1N36j25k03l3O4P6m60K16K53o8R7P1J86n8o2J31
$$ -46 -98 246 -169 -300 -354 -288 -569 -475 -556 -20 -145 -348 -381 -317 -241 -701 -485 -232 -300 -203 -132 54 -4 -66 65
1989F5l15K51k28M71k33N5M20m16J09j16Q7J00K52K6k69n4N09k19q7n81M84K24
$$ 65 -250 1 -227 244 11 66 486 70 179 63 150 250 502 528 259 205 714 495 408 -173 311 535
2011E35j81k17K33j45j05j53K46k86m76N34r3K18l38k27L51l05K36p4j47k36J05
$$ 535 354 137 370 225 120 -33 213 -73 -549 -15 -108 110 -228 -455 -104 -409 -173 -247 -394 -630 -525
2032e25L43K03k52j07J64k38r6k5J07K93l56Q34k49j96N5j39j19M16K39j62j57
$$ -525 -182 21 -231 -338 -174 -412 -508 -533 -426 -133 -489 345 96 -100 -45 -184 -303 113 352 190 33
2053C3K67K57k08m1j22J91j53L8N3N31m12L02k02m06%P3J90l60J55K55j98Nl07
$$ 33 300 557 349 308 186 377 224 262 315 846 434 736 534 128 128 201 391 31 186 441 243 248 -59
2076e9K50j44o73J10O04l20j45K38K66j00n25J99NJ45m45N84J4m8m68R6J98p8
$$ -59 191 47 -626 -516 88 -232 -377 -139 127 27 -498 -299 -294 -149 -594 -10 4 -44 -512 -416 -218 -296
2098b96l3M32l31j67K16L38k8j45m7k5rqJ1M50J57r1k55j99K03o7P0k76L26J38
$$ -296 -329 103 -228 -395 -179 159 131 -14 -61 -86 -95 -103 -92 358 515 424 169 -30 173 106 176 -100 226 364
2122C64o8j40K94l65K51j93R0k70J41J04J28m1m35J96j64k74j30O62p2n95K23
$$ 364 296 156 450 85 336 143 233 -37 104 208 336 295 -140 56 -108 -382 -512 150 78 -517 -294
2143b94N31k57n33K51K44j57n16O02K2L4m23K90L38j51n10L33M58n08K31K59n4
$$ -294 237 -20 -553 -302 -58 -215 -731 -129 -107 -73 -496 -206 132 -19 -529 -196 262 -246 -15 244 190
2164A90j44L3l7J76j73K2M44j09l17j03M10k94K6j57L34J56m34j85K98j36P1k70
$$ 190 46 79 42 218 45 67 511 402 85 -18 392 98 124 -33 301 457 23 -162 136 0 71 -199
2186a99nK11J69l28l28O13J9l41k15L85o46M77j19L53j04l28L55k0l12jJ29M29
$$ -199 -204 7 176 -152 -480 133 152 -189 -404 -19 -665 -188 -307 46 -58 -386 -31 -51 -363 -364 -235 194
2208A94l81J06J98k62r9M7M55j2k20p4K91J19m27L06J38q3j90O6P0n3n0K98K9
$$ 194 -187 -81 117 -145 -244 -197 258 246 26 -48 243 362 -65 241 379 296 106 172 242 189 139 437 466
2231D66n32J43J97M5j71R5p6j60K19k80Q7k41kj76L57k04j38L51j97m8j10k6K11
$$ 466 -66 77 274 319 148 243 167 7 226 -54 33 -208 -210 -386 -29 -233 -371 -20 -217 -265 -375 -401 -190
2254a90k16J10K71j53N5j4M8l7J8o2K4j0K20j83M3L32N3l76j5J20L55m37K71L2
$$ -190 -406 -296 -25 -178 -123 -137 -89 -126 -108 -170 -146 -156 64 -119 -76 256 309 -67 -82 38 393 -44 227 259
2278B59L73l91j72M18m29J70j03J03N5m85M74K10k30k39k6L07l64k03K26J12p4
$$ 259 632 241 69 487 58 228 125 228 283 -202 272 482 252 13 -13 294 -70 -273 -47 65 -9
2299ij57L72l64k82K32j6J71l56M41k1j70J71j06L4m04J3L59L5O7P2Jk95Q9O2
$$ -9 -166 206 -158 -440 -208 -224 -53 -409 32 11 -159 12 -94 -60 -464 -451 -92 -57 10 82 83 -212 -123 -61
2323f1O4M0J58J47j05l11J74%j01R6J10J04k28nL47M3l25K87j33N9l83K38P6K1
$$ -61 3 43 201 348 243 -68 106 106 5 101 211 315 87 82 429 472 147 434 301 360 -23 215 291 312
2347C12j33J79Rl37o9J51k44j14r3L05J39j49j96K89k09j48N9n4q6R6L15l16o1
$$ 312 179 358 367 30 -39 112 -132 -246 -339 -34 105 -44 -240 49 -160 -308 -249 -303 -389 -293 22 -294 -355
2370c55j48J34j14P7J29J92N5j19K9N05j70l74J42j5J70L7K3r2L2P6M9k73L88
$$ -355 -503 -369 -483 -406 -277 -85 -30 -149 -120 385 215 -159 -17 -32 138 175 198 106 138 214 263 -10 378
2393C78k47nJ06J28J83l47k99Q2J44j56J47p5J97m76L67j16q7L2q9J96j85nJ24
$$ 378 131 126 232 360 543 196 -103 -21 123 -33 114 39 236 -240 127 11 -76 -44 -133 63 -122 -127 -3
2416cj54l0J94j93p5P9k35J20J65M3j98jJ73k86jL49j80K40j4q0K3K03Ol57L01
$$ -3 -157 -187 7 -186 -261 -182 -417 -297 -132 -89 -287 -288 -115 -401 -402 -53 -233 7 -7 -87 -64 139 145 -212 89
2441H9j42J65k72j25L05J26j61K19K00k51l70P24l89K04j33j28L40k95l5j43J64
$$ 89 -53 112 -160 -285 20 146 -15 204 404 153 -217 507 118 322 189 61 401 106 71 -72 92
2462I2k47j75K10n2n9K01J16o4k4l93N60j94j88J99j08J14k77J9P1J54PO6l25
$$ 92 -155 -330 -120 -172 -231 -30 86 22 -2 -395 165 -29 -217 -18 -126 -12 -289 -270 -199 -45 -38 28 -297
2485b97J63K34j58J24K3O6l47K72Q7K6J37l13J36k07K43k41J92J48Ok02J25kk4
$$ -297 -134 100 -58 66 89 155 -192 80 167 193 330 17 153 -54 189 -52 140 288 294 92 217 215 191
2508A91k33K99k85J03P2k04K87j01o6M7Qj25R0m16J36L2R2lj03R9l23K45L7o6
$$ 191 -42 257 -28 75 147 -57 230 129 63 110 118 -7 83 -333 -197 -165 -73 -76 -179 -80 -403 -158 -121 -187
2532a87j19o3L52j33J60j4M6l54L45P8m09L07k23L24J05k06O5l92J23L15o9K39
$$ -187 -306 -369 -17 -150 10 -4 42 -312 33 111 -298 9 -214 110 215 9 74 -318 -195 120 51 290
2554B90j34j02J70k8p8m2K55j18Q0O6jj10l3j37K07p6j18K2n5Q1j11N2j45K9l02
$$ 290 156 54 224 196 118 76 331 213 293 359 358 248 215 78 285 209 91 113 58 139 28 80 -65 -36 -338
2579c38Pl5K18q9J69N4l03K36m16L32O3j82K86l2j31O9M1k2J90k59k92K02J03
$$ -338 -331 -366 -148 -237 -68 -14 -317 -81 -497 -165 -102 -284 2 -30 -161 -92 -51 -73 117 -142 -434 -232 -129
2602a29p1L19M22l67O3j91k5N9K02j1J86L2j31j34k04M12j20K3k25O7L4K4P2l34
$$ -129 -200 119 541 174 237 46 21 80 282 271 457 489 358 224 20 432 312 335 110 177 211 235 307 -27
2626b7l9N6L81k19q6L05k92k24Q0ok88Q4m5l5P1J66J8J12l86KR3K74j82k32R3
$$ -27 -66 -10 371 152 66 371 79 -145 -65 -71 -359 -275 -320 -355 -284 -118 -100 12 -374 -372 -279 -5 -187 -419 -326
2651c26j85L61J55J92n31K90j78K29qp0J67k0L6l27J11O25m45k1J55j1L4p2J04
$$ -326 -511 -150 5 197 -334 -44 -222 7 -1 -71 96 76 112 -215 -104 521 76 55 210 199 233 161 265
2674B65r2J38j08K21%%l68J47L7P5j80nP7K4k70J38J97j61j42P2n5j85O4J13j04
$$ 265 173 311 203 424 424 424 56 203 240 315 135 130 207 231 -39 99 296 135 -7 65 10 -175 -111 2 -102
2699a02q3K0L35m44J11J61k13l64L21K73m50L45K6J54j17nJ67m5O6m43K86j03
$$ -102 -185 -165 170 -274 -163 -2 -215 -579 -258 15 -435 -90 -64 90 -27 -32 135 90 156 -287 -1 -104
2721a04j17N29k06J16l28R8L52m66L73l59K66q4J66j73O4l1J70k03K8L74j13q6
$$ -104 -221 308 102 218 -110 -12 340 -126 247 -112 154 70 236 63 127 96 266 63 91 465 352 266
2743B66m00J3K3j19j41N28m32N9J71j38K24p6m51J89L66k59k07M57j35k95J87
$$ 266 -134 -121 -98 -217 -358 170 -262 -203 -32 -170 54 -22 -473 -284 82 -177 -384 73 -62 -357 -170
2764a70J63n3J33k02J71k2j54L80j46J54l73K09P5m4l96M26N9j38J12q5J3R9j38
$$ -170 -7 -60 73 -129 42 20 -134 246 100 254 -119 90 165 121 -275 151 210 72 184 99 112 211 73
2787G3K06j48N1k58Q2j2n4j46p8L49J2j58K21k78O0j7j96J79J99j02l58L20J41
$$ 73 279 131 182 -76 6 -6 -60 -206 -284 65 77 -81 140 -138 -78 -95 -291 -112 87 -15 -373 -53 88
2810H8l03J12J65j13l35K32J72j37k53L09j53K08j46j16L08K5j90L08j09R7k47
$$ 88 -215 -103 62 -51 -386 -154 18 -119 -372 -63 -216 -8 -154 -270 38 63 -127 181 72 169 -78
2831g8J32J04r9M2r9L74l5j48N9K7k26L20k3l29j57L22m4kp0J6J21J05jm64l0
$$ -78 54 158 59 101 2 376 341 193 252 279 53 373 350 21 -136 186 142 140 70 86 207 312 311 -153 -183
2856a83K52j09J77n28J99M8k88N0K08M7j56J46j57L2l30M09op0q1J9K75j31j57
$$ -183 69 -40 137 -391 -192 -144 -432 -382 -174 -127 -283 -137 -294 -262 -592 -183 -189 -259 -340 -321 -46 -177 -334
2879c34N39j97j13Q3N4L1k57J70J19K10o43M28J8J6J67k16K00q6L59n72M01j31
$$ -334 205 8 -105 -22 32 63 -194 -24 95 305 -338 90 108 124 291 75 275 189 548 -24 377 246
2901B46j31L19k92J0k01K01J15l68L79j12n6j5OQ9m84K66j11K31M0k15jJ28O7
$$ 246 115 434 142 152 -49 152 267 -101 278 166 110 95 101 190 -294 -28 -139 92 132 -83 -84 44 111
2924A11l74N8l13L44L6q6j84P2J74K3J4Pj31J19j0M7R9k4l63K51N3J49k6K4J42
$$ 111 -263 -205 -518 -174 -138 -224 -408 -336 -162 -139 -125 -118 -249 -130 -140 -93 6 -18 -381 -130 -77 72 46 70 212
2949B12k61L88k86K2j05L19M1m75L77K37j56j7j45J80j05k07r7%J08L7P0R4j22
$$ 212 -49 339 53 75 -30 289 330 -145 232 469 313 296 151 331 226 19 -78 -78 30 67 137 231 109
2972A09j74L2J37k68q4J82L9q7L73n57K08J8k1l5J71Pk59j18L7J07K31n1J81j82
$$ 109 -65 -33 104 -164 -248 -66 -27 -114 259 -298 -90 -72 -93 -128 43 50 -209 -327 -290 -183 48 -3 178 -4
2996dk28j07O49l99K16j36L48k27l20L11lj25j13J47M6l49M37k1P5K10o75L26
$$ -4 -232 -339 310 -89 127 -9 339 112 -208 103 100 -25 -138 9 55 -294 143 122 197 407 -268 58
3018E8L34l58j49l9L38k78J12L34o14K93j43K48j38J66l54J17L3K1N0j70K06j64
$$ 58 392 34 -115 -154 184 -94 18 352 -262 31 -112 136 -2 164 -190 -73 -40 -19 31 -139 67 -97
3040i7k10Q6J28p3J80m5k5o5m8j14M51l58l0J38M92l92O6l7n6J7O7K95p3l91K57
$$ -97 -307 -221 -93 -166 14 -31 -56 -121 -169 -283 168 -190 -220 -82 410 18 84 47 -9 8 75 370 297 -94 163
3065A63j7k71J08K45j72p9pN5l4J24j21k51L74M8J27j27l74J08M1Q5j04j78K99
$$ 163 146 -125 -17 228 56 -23 -30 25 -9 115 -6 -257 117 165 292 165 -209 -101 -60 25 -79 -257 42
3088D2m9Q1j82l48K24J70J47k43J9O0Mj82K44rq4J68l57L18J4OJ2n9j03L36m9
$$ 42 -7 74 -108 -456 -232 -62 85 -158 -139 -79 -75 -257 -13 -22 -106 62 -295 23 37 43 55 -4 -107 229 180
3113A80m96L99n6J70j82k1K47o9J5j34J95l94L23p0Q7K60m54P5p2j53J60Mj88
$$ 180 -316 83 27 197 15 -6 241 172 187 53 248 -146 177 107 194 454 0 75 3 -150 10 14 -174
3136a74j2K50j65q7K45j52l30M14j35j09L36n11M35p1K1j58K19k13j50L85j29
$$ -174 -186 64 -101 -188 57 -95 -425 -11 -146 -255 81 -430 5 -66 -45 -203 16 -197 -347 38 -91
3157i1j75K14J42j34j95k22M90J12k67R5R2k00K2j09M78j00m55M52pk0J37M2j36
$$ -91 -266 -52 90 -44 -239 -461 29 141 -126 -31 61 -139 -117 -226 252 152 -303 149 142 122 259 301 165
3180A65j32K2J41N1k31K23l4R3l41k27M97l48J93k33K42o3j1J25j40K44k89O1
$$ 165 33 55 196 247 16 239 205 298 -43 -270 227 -121 72 -161 81 18 7 132 -8 236 -53 8
3202Hj94J0R8N0%jp7J26j79K92m74J6N35k47k88L28N4J73l84P7J73N9k23J20J9
$$ 8 -186 -176 -78 -28 -28 -29 -106 20 -159 133 -341 -325 210 -37 -325 3 57 230 -154 -77 96 155 -68 52 71
3227G1O0J33k75o0L78j17o5J54l02j72J9J3K17MLo1p0q1L46n86M90j13J88j13
$$ 71 131 264 -11 -71 307 190 125 279 -23 -195 -176 -163 54 58 61 0 -70 -151 195 -391 99 -14 174 61
3251F1k19K39J27k21l4N1O1o9K00J1k73q9P6j93L56J10l08K56k28J18j77J59l16
$$ 61 -158 81 208 -13 -47 4 65 -4 196 207 -66 -155 -79 -272 84 194 -114 142 -86 32 -145 14 -302
3274c02L19p4m3K95m07J05J50j27J10J26j97M9l7j7K16l1Kq9k10K94k39j5J83
$$ -302 17 -57 -100 195 -212 -107 43 -84 26 152 -45 4 -33 -50 166 135 137 48 -162 132 -107 -122 61
3297F1j08K2o0J03Jp9k6K14j61r2K52m4k10P4p9J38K49l43l0o0J54l1Q9j92K17
$$ 61 -47 -25 -85 18 19 -60 -86 128 -33 -125 127 83 -127 -53 -132 6 255 -88 -118 -178 -24 -55 34 -158 59
3322E9j25J12l77N24j67J9J27o6j31q1J23L38k12oj55n2J00R0j41kK4N0L3l74
$$ 59 -66 46 -331 193 26 45 172 106 -25 -106 17 355 143 137 -18 -70 30 120 -21 -23 1 51 84 -290
3346b90N09k43J14j36N3p6L08Q3j83m4M1nj75J41k47K18o0L07k47j90J48K6L2
$$ -290 219 -24 90 -46 7 -69 239 322 139 95 136 131 -44 97 -150 68 8 315 68 -122 26 52 84
3369H4m4m6J4r2K3J80j83j87J38J69p9M7O1m7o5k7K60j05J41k65J85l11K07j37
$$ 84 40 -6 8 -84 -61 119 -64 -251 -113 56 -23 24 85 38 -27 -54 206 101 242 -23 162 -149 58 -79
3393g9M6J52j09j59J5J05l25M83j35J63j34k84J79j78K59j3J60jj82K07j91k8
$$ -79 -33 119 10 -149 -134 -29 -354 129 -6 157 23 -261 -82 -260 -1 -14 146 145 -37 170 -21 -49
3415d9O6k7j68J63j41J08J22P6j73J13J18k46q8N8j98K03r8L29o2n7n0n3J94m0
$$ -49 17 -10 -178 -15 -156 -48 74 150 -23 90 208 -38 -126 -68 -266 -63 -161 168 106 49 -1 -54 140 100
3439A00K4l01J41j88M05j51K5j85q8L26J24q4k48K52Q1l66K90j39j82P5K9J60
$$ 100 124 -177 -36 -224 181 30 55 -130 -218 108 232 148 -100 152 233 -133 157 18 -164 -89 -60 100
3461A00p3M6l29M45j1K9l65J10n7K7L63l96K07j11j40L70l73Q9OJ50k8k6k51J16
$$ 100 27 73 -256 189 178 207 -158 -48 -105 -78 285 -111 96 -15 -155 215 -158 -69 -63 87 59 33 -218 -102
3485a02K7J4J32J25j96j49M83m45Oo7K13l2%j12J01J88k0k07m3n4L72j43J08J07
$$ -102 -75 -61 71 196 0 -149 334 -111 -105 -172 41 9 9 -103 -2 186 166 -41 -84 -138 234 91 199 306
3509C06l09k02K04P1l18J13L98k34L8N7l24N29l10l7j19J99j46k9L10k01m30N27
$$ 306 -3 -205 -1 70 -248 -135 263 29 67 124 -200 329 19 -18 -137 62 -84 -113 197 -4 -434 93
3531I3j03J9J96l68J43r6J07j52L00p9p9j47K7K05j72J77K3o5P3k49m9j00O9K45
$$ 93 -10 9 205 -163 -20 -116 -9 -161 139 60 -19 -166 -139 66 -106 71 94 29 102 -147 -196 -296 -227 18
3555A8J18k73L21k61O9l2K21L3k66%Rj32nJ39K73k54L0K84n00L28M8l95M24l63
$$ 18 136 -137 184 -77 -8 -40 181 214 -52 -52 -43 -175 -180 -41 232 -22 8 292 -208 120 168 -227 197 -166
3579a66J98J85j44j95M9m8O4L72l00l2%p9JJ13m5P2k65L56n10N42O6m26j70K79
$$ -166 32 217 73 -122 -73 -121 -57 315 15 -17 -17 -96 -95 18 -27 45 -220 136 -374 168 234 -192 -362 -83
3603h3J97K3k13J61%j54L18j31j13P7K93l56m8k3R2J23k75l8J87j46Q2L9P4L5
$$ -83 114 137 -76 85 85 -69 249 118 5 82 375 19 -29 -52 40 163 -112 -150 37 -109 -27 12 86 121
3627A21j41q4NK07p6k6l11L44K1J29N2k6j77j85j22K46J10p9j30J76K62p19L67
$$ 121 -20 -104 -99 108 32 6 -305 39 60 189 241 215 38 -147 -269 -23 87 8 -122 54 316 -403 -36
3650c6r3j14N25n37M8L41j29L7k33J60o3J52J00k09j6J22l9p8r4O8OJ74j96P6
$$ -36 -129 -243 282 -255 -207 134 5 42 -191 -31 -94 58 158 -51 -67 55 16 -62 -156 -88 -82 92 -104 -28
3674b8J75j16j15j8J78o8K5N8O1j45J5j81P7J03K70m25N8O6J41j47n4K2J93k20
$$ -28 147 31 -84 -102 76 8 33 91 152 7 22 -159 -82 21 291 -134 -76 -10 131 -16 -70 -48 145 -75
3698g5%J10o7L5l7P1n01K15J76Q9k11K37Q3j5j18P8k20J26j68K60p4J64m15L54
$$ -75 -75 35 -32 3 -34 37 -464 -249 -73 16 -195 42 125 110 -8 70 -150 -24 -192 68 -6 158 -257 97
3722I7J12j16L3p6J71j16j68K1M3q9Ro4Q0k99K67O9J83M0N3j57k30K96m1k20J23
$$ 97 209 93 126 50 221 105 -63 -42 1 -88 -79 -143 -63 -362 -95 -26 157 197 250 93 -137 159 118 -102 21
3747B1Q3p2LN6l07J65j44Q0M7QJ27j7j90M98l36J26m0M5k04k07L88k80n3L94l96
$$ 21 104 32 35 91 -216 -51 -195 -115 -68 -60 67 50 -140 358 22 148 108 153 -51 -258 130 -150 -203 191 -205
3772b05N0R1J4N0l55L9M55k2o2n9j1J00N9l67J71N4K98k58m1j23p7L00l40L57
$$ -205 -155 -64 -50 0 -355 -316 139 117 55 -4 -15 85 144 -223 -52 2 300 42 1 -122 -199 101 -239 118
3796A18Qk72K92j51K04j30j60j72N18j70k77K55k57K92Qj76K05m28L70j92J68
$$ 118 126 -146 146 -5 199 69 -91 -263 255 85 -192 63 -194 98 106 -70 135 -293 77 -115 53
3817E3m3L6P4p9j61r4P53l87q0Rk60N64l77j75p8J82q4M5k18K70N6j1n0R8K2N9
$$ 53 10 46 120 41 -120 -214 539 152 72 81 -179 385 8 -167 -245 -63 -147 -102 -320 -50 6 -5 -55 43 65 124
3843A24l12K27j69J95J21m74L63K82q5k66O1o6K12k51L1J51k89J46L6N8J49l48
$$ 124 -188 39 -130 65 186 -288 75 357 272 6 67 1 213 -38 -7 144 -145 1 37 95 244 -104
3865a04J86L1j12p3L21m47P6J98L2k98J31O2N3o4p1Q0J06k91R9J16j11m7K94l27
$$ -104 82 113 1 -72 249 -198 -122 76 108 -190 -59 3 56 -8 -79 1 107 -184 -85 31 -80 -127 167 -160
3889a60o1J42K43l3q8O6J51l07lJ5k5r4J67N9j91J41J06p1j4P8j57L51k35k11
$$ -160 -221 -79 164 131 43 109 260 -47 -50 -35 -60 -154 13 72 -119 22 128 57 43 121 -36 315 80 -131
3913a31K19j90n3nK70J66m55J40J67l86J08O7M5l3J5P3p1l1K70K5k54L6J9P6j27
$$ -131 88 -102 -155 -160 110 276 -179 -39 128 -258 -150 -83 -38 -71 -56 17 -54 -85 185 210 -44 -8 11 87 -40
3938d0M18n97J50J40k3j63K73k50k0K03l8o0q9q7K19M1r5J7l9J7L7K21m14K13
$$ -40 378 -219 -69 71 48 -115 158 -92 -112 91 53 -7 -96 -183 36 77 -18 -1 -40 -23 14 235 -179 34
3962C4K10r6l20J09N1jk5j46J78j80K08j78J1K42j68J84l09L42m17K94r6J96N
$$ 34 244 148 -172 -63 -12 -13 -38 -184 -6 -186 22 -156 -145 97 -71 113 -196 146 -271 23 -73 123 128
3985A28k65J69k9p6O6K56k31j60L31j84J58k93J52K23m04K10L0k37O9K78m11M11
$$ 128 -137 32 3 -73 -7 249 18 -142 189 5 163 -130 22 245 -159 51 81 -156 -87 191 -220 191
4007A91k04M9j15J96l24L83m00K53j95L2K40o1r9J84k04kK44j00N6m35L29k2K5
$$ 191 -13 36 -79 117 -207 176 -224 29 -166 -134 106 45 -54 130 -74 -76 168 68 124 -311 18 -4 21
4030B1O1j45M8K78l85J50K17j84J23l85J38r0J32o0O4mj70K82J36k64K21j22l9
$$ 21 82 -63 -15 263 -122 28 245 61 184 -201 -63 -153 -21 -81 -17 -21 -191 91 227 -37 184 62 23
4053B3n4j39K02L9K79m58J77j49J53J1q6K71j15j03m5L50k95J01j56O1K42j67
$$ 23 -31 -170 32 71 350 -108 69 -80 73 84 -2 269 154 51 6 356 61 162 6 67 309 142
4075A42l78K86O2r5K89l70J11l6M2p8Q5k55J47K57q0N6l45J73j6j69K45J72m14
$$ 142 -236 50 112 17 306 -64 47 11 53 -25 60 -195 -48 209 129 185 -160 13 -3 -172 73 245 -169
4098a69N7L23j09k70J71Q9j16l2L45j43l67m4K78N6o9j51L04P6k12o8J14l66M13
$$ -169 -112 211 102 -168 3 92 -24 -56 289 146 -221 -265 13 69 0 -151 153 229 17 -51 63 -303 110
4121A10j32K19k27m7J2J7R5j61k5J81j2j34J20q8j91L88j80M8J18j71k8K5j63
$$ 110 -22 197 -30 -77 -65 -48 47 -114 -139 42 30 -104 16 -72 -263 125 -55 -7 111 -60 -88 -63 -226
4144b26K61r6J04J69j72j40J63k06J46LQ5l1J7j19J31J56m5l66J18o9Qq6Q5K06
$$ -226 35 -61 43 212 40 -100 63 -143 3 6 91 60 77 -42 89 245 200 -166 -48 -117 -109 -195 -110 96
4168I6j47j22J63r3J70J08m58J26nP3K74k41L7j33k06L82j48J05j38O2K85l04
$$ 96 -51 -173 -10 -103 67 175 -283 -157 -162 -89 185 -56 -19 -152 -358 24 -124 -19 -157 -95 190 -114
4190a14L25j36m78L86K51l95K65l13K16k00p9K99k86K50K4R1j5n9n1K01kj33l19
$$ -114 211 75 -403 -17 234 -161 104 -209 7 -193 -272 27 -259 -9 15 106 91 32 -19 182 180 47 -272
4213b72K36nK30j88k27K3J90k80o8L79qK4j92K38j49K67l31K42j23J57Kp4J57
$$ -272 -36 -41 189 1 -226 -203 -13 -293 -361 18 10 34 -158 80 -69 198 -133 109 -14 143 145 71 228
4236B28p7j98rJ82k03j2l9M13m85K23L4N4l07J7R9K09l5M2j6o8q7j33K69k34o4
$$ 228 151 -47 -56 126 -77 -89 -128 285 -200 23 57 111 -196 -179 -80 129 94 136 120 52 -35 -168 101 -133 -197
4261a97l3J40k7r5J30K68j38k13L45j55o1K45k77j06O7q3R2J2M2J15j14R7j67
$$ -197 -230 -90 -117 -212 -82 186 48 -165 180 25 -36 209 -68 -174 -107 -190 -98 -86 -44 71 -43 54 -113
4284a13J15j97M47j91k06R4P3J35P1j18n6qk17Q9LJ23j28j52L70m6J54m94L1K11
$$ -113 2 -195 252 61 -145 -51 22 157 228 110 54 46 -171 -82 -79 44 -84 -236 134 88 242 -252 -221 -10
4308a0J6K04M2k11j82L9L7K71m7N6k11l49K89L9K2mK37l33j69K6L34j29j80L85
$$ -10 6 210 252 41 -141 -102 -65 206 159 215 4 -345 -56 -17 5 1 238 -95 -264 -238 96 -33 -213 172
4332A72q0j57P9l78L06J77j37l25N15p3k32L32l55M04j62j28J78L4j05J32k44
$$ 172 92 -65 14 -364 -58 119 -18 -343 172 99 -133 199 -156 248 86 -42 136 170 65 197 -47
4353d7J23k67N57m27j98L66L0J11n86J97L70l52K79k43o7R0L63m08L8j08L31j42
$$ -47 76 -191 366 -61 -259 107 137 248 -338 -141 229 -123 156 -87 -154 -64 299 -109 -71 -179 152 10
4375A0Qj74j3K52K04k00M9j87j36R3K75j84l65J73K29j35m0P5j18O9o7M69m93
$$ 10 18 -156 -169 83 287 87 136 -51 -187 -94 181 -3 -368 -195 34 -101 -141 -66 -184 -115 -182 287 -206
4398b06K95m06J86J66n8j43K39K19k04l2R4o5j19j15J84J71l37K34N9j29O3j22
$$ -206 89 -317 -131 35 -23 -166 73 292 88 56 150 85 -34 -149 35 206 -131 103 162 33 96 -26
4420b6K57k12j61J05K2N3j36p2L31k72K49j3k69J24J07O1j36J67l94K24k53J70
$$ -26 231 19 -142 -37 -15 38 -98 -170 161 -111 138 125 -144 -20 87 148 12 179 -215 9 -244 -74
4442g4J76j52j07J95r8J94j33J21R3lk8K22n62L1M3L68j43k63J15K88j56j37J23
$$ -74 102 -50 -157 38 -60 134 1 122 215 212 184 406 -156 -125 -82 286 143 -120 -5 283 127 -10 113
4465A13O3n33M42j85M95k27l48L2o3L81m73K35M03m32J3j3J52K83l21Q2m6j22
$$ 113 176 -357 85 -100 395 168 -180 -148 -211 170 -303 -68 335 -97 -84 -97 55 338 17 99 53 -69
4487f9J95p7l7l67k4M66j73J48M2l44J40J77R3k13J03K7j79j36L91j8q6P1J2o5
$$ -69 126 49 12 -355 -379 87 -86 62 104 -240 -100 77 170 -43 60 87 -92 -228 163 145 59 130 142 77
4511G7ok75L04k8j9n4k4L8j6K45j94l5j16R3k0j03L18j57m7j6M5J65k11j6Q1l34
$$ 77 71 -204 100 72 53 -1 -25 13 -3 242 48 13 -103 -10 -30 -133 185 28 -19 -35 10 175 -36 -52 29 -305
4537c05J65K63L2M8k65M05m40R6K30m17J69j66J42O1N2Q0l14J1J68M5j94JR4R9
$$ -305 -140 123 155 203 -62 343 -97 -1 229 -188 -19 -185 -43 18 70 150 -164 -153 15 60 -134 -133 -39 60
4561F0J77k08l9K1K47j31l93J21L76k87J52k70Q5K95j92J22j0l50K88q6J08k61
$$ 60 237 29 -10 11 258 127 -266 -145 231 -56 96 -174 -89 206 14 136 126 -224 64 -22 86 -175
4583a75K20j0J80j13k11ml1lP7J69k3K16j12j97PJ47O5j15q4K53l99J34J70j3
$$ -175 45 35 215 102 -109 -113 -144 -147 -70 99 76 292 180 -17 -10 137 202 87 3 256 -143 -9 161 148
4607A48k01M55l59k33J00pj72P4J11n5J89j1k7j80K85P0r6M0J64k66m47N34r7
$$ 148 -53 402 43 -190 -90 -97 -269 -195 -84 -139 50 39 12 -168 117 187 91 131 295 29 -418 116 19
4630A9L1k6q6k06K22O2q1P3Q4p3J80j02l48K37K91k53J92k32Q4k81M26k04M8k93
$$ 19 50 24 -62 -268 -46 16 -65 8 92 19 199 97 -251 -14 277 24 216 -16 68 -213 213 9 57 -236
4654b36K68m32M83m8r4K39o26M53j78J71j21r0J8j97K28K13j04KJ6j19k01M96
$$ -236 32 -400 83 35 -59 180 -446 7 -171 0 -121 -211 -193 -390 -162 51 -53 -51 -35 -154 -355 141
4676A41L6j96O9l9o2Q5n7n3l0K67k03J02J1rj45N6j49j51M09l2O6l79L61p6J38
$$ 141 177 -19 50 11 -51 34 -23 -76 -106 161 -42 60 71 62 -83 -27 -176 -327 82 50 116 -263 98 22 160
4701A60J00l39R9n2o0J43j90PN4N9oj40Q8R0q0K12J47m17K52j66Q5j63L31n23
$$ 160 260 -79 20 -32 -92 51 -139 -132 -78 -19 -25 -165 -77 13 -67 145 292 -125 127 -39 46 -117 214 -309
4725c09L07J77j70j36Q3M0k11K75k26k14M06J65m84K84o0J59j01m8K13j53lj66
$$ -309 -2 175 5 -131 -48 -8 -219 56 -170 -384 22 187 -297 -13 -73 86 -15 -63 150 -3 -6 -172
4747a72M25k14J77L4k36j24K04P1o9k19K3J42k97K78M2n9j85K79j54J95n6J63
$$ -172 253 39 216 250 14 -110 94 165 96 -123 -100 42 -255 23 65 6 -179 100 -54 141 85 248
4769B48l0j57j88k06R4K75p2m7P5J47j70Kk66L68l14K53N1j39k20L31N3J7m2j84
$$ 248 218 61 -127 -333 -239 36 -36 -83 -8 139 -31 -29 -295 73 -241 12 63 -76 -296 35 88 105 63 -121
4793a21J03J07k88J73J55O6J08n53K95j01N8L65k27j04j23oJ51L7k16Q5P5J87
$$ -121 -18 89 -199 -26 129 195 303 -250 45 -56 2 367 140 36 -87 -93 58 95 -121 -36 39 226
4815B26n12K3J02M06j85k19O7K07j01j74J44J09l16j17L55j15rJ25M4j11K48k64
$$ 226 -286 -263 -161 245 60 -159 -92 115 14 -160 -16 93 -223 -340 15 -100 -109 16 60 -51 197 -67
4837f7L6K1R5Q0l48K8O4Q4J5j41L00l66j34L97l01K66j68m9L28o0K3j03O1j13
$$ -67 -31 -10 85 165 -183 -155 -91 -7 8 -133 167 -199 -333 64 -237 29 -139 -188 140 80 103 0 61 -52
4861e2O3k06J8J35r7J92l91K86K53m79M42k49J35J31m39L41j02j18k2J75ql5j10
$$ -52 11 -195 -177 -42 -139 53 -338 -52 201 -278 164 -85 50 181 -258 83 -19 -137 -159 16 8 -27 -137
4884a37Qj12M68n62M85r1M9o9j21M44l07q2q6q5K5J95r1K48k53L3L2r9K01J9j66
$$ -137 -129 -241 227 -335 150 59 108 39 -82 362 55 -27 -113 -198 -173 22 -69 179 -74 -41 -9 -108 93 112 -54
4909e4M03l11j74M36k38lL28m67L59m43J03R9L8r1J50j09J01j11j62J52n5Q9K52
$$ -54 349 38 -136 300 62 59 387 -80 279 -164 -61 38 76 -15 135 26 127 16 -146 6 -49 40 292
4932B92j05M9l04J44p1m9J38j00j34J57j42K13r1J72k55K48k29K53j81j35M07
$$ 292 187 236 -68 76 5 -44 94 -6 -140 17 -125 88 -3 169 -86 162 -67 186 5 -130 277
4953B77k56J64j49k51L44j36M3j09J07J99j84l2R1j02j2l28M53k67J17K15j46
$$ 277 21 185 36 -215 129 -7 36 -73 34 233 49 17 108 6 -6 -334 119 -148 -31 184 38
4974C8j8k58J3J85k06L10j83J29m9P3k26K03k78L31o0j17r0J57J14j8j05J47l38
$$ 38 20 -238 -225 -40 -246 64 -119 10 -39 34 -192 11 -267 64 4 -113 -203 -46 68 50 -55 92 -246
4997b46P1J83j25O4j28K46j85n8J38K5K31n63R0l0J69J31K58n24K63J44k47q1
$$ -246 -175 8 -117 -53 -181 65 -120 -178 -40 -15 216 -347 -257 -287 -118 13 271 -253 10 154 -93 -174
5019a74N7J96p8J06k27K63l92L87o0J73k89NK61Q2l86J26K60j5m30j3L00j86k46
$$ -174 -117 79 1 107 -120 143 -249 138 78 251 -38 -33 228 310 -76 50 310 295 -135 -148 152 -34 -280
5042b80J71J46l27K84j05n7J71r3R7j38K10j74J11p8M7K35k28P8l56M05k96K97
$$ -280 -109 37 -290 -6 -111 -168 3 -90 7 -131 79 -95 16 -62 -15 220 -8 70 -286 119 -177 120
5064A20j6j28P2k19R1K43l61L02J45k49jO0K56n34J39L61J39l30k28J64p0J06
$$ 120 104 -24 48 -171 -80 163 -198 104 249 0 -1 59 315 -219 -80 281 420 90 -138 26 -44 62
5086F2k18L66j14j90K83N4j02j41j4O8k1p3J6j30L82l43Q2j09J08%J15k40P0j0
$$ 62 -156 210 96 -94 189 243 141 0 -14 54 33 -40 -24 -154 228 -115 -33 -142 -34 -34 81 -159 -89 -99
5110i9o7J01O2q7o1J25j5L48k31j07R0k40j4K25n6k70K14j1R3l19L59q9j2n9%
$$ -99 -166 -65 -3 -90 -151 -26 -41 307 76 -31 59 -181 -195 30 -26 -296 -82 -93 0 -319 40 -49 -61 -120 -120
5135a20J75l18L32n1r4n5J65k33K89q3K2J36M4k74L74k71k78K50l1j7p2K51l70
$$ -120 55 -263 69 18 -76 -131 34 -199 90 7 29 165 209 -65 309 38 -240 10 -21 -38 -110 141 -229
5158b29K19Q2k77L12k76K13l64M59j67n7o7K19j27J35m5J0J5j77J24p3m4L13k91
$$ -229 -10 72 -205 107 -169 44 -320 139 -28 -85 -152 67 -60 75 30 40 55 -122 2 -71 -115 198 -93
5181i3K26K3l23R2L43n91R8L18J11k90l0N9J14Q7j43O6j6K53o28K29m0K01L19
$$ -93 133 156 -167 -75 268 -323 -225 93 204 -86 -116 -57 57 144 1 67 51 304 -324 -95 -135 66 385
5204C85j44l43K26nP0o9J23l94J11J6j91K89k45K21J37l01K25j59j65L2j41L80
$$ 385 241 -102 124 119 189 120 243 -151 -40 -24 -215 74 -171 50 187 -114 111 -48 -213 -181 -322 58
5226E8j31j35L78l30K70n0k14n5R3L04j02N6k28j21R2J00j1j10R1p1J8mK68r7
$$ 58 -73 -208 170 -160 110 60 -154 -209 -116 188 86 142 -86 -207 -115 -15 -26 -136 -45 -116 -98 -102 166 69
5250F9Ql0Kj49p6R1J69m39O00l43J66o29N95O8J43r4j99J67j82Q3l87L70qJ65
$$ 69 77 47 49 -100 -176 -85 84 -355 245 -98 68 -561 34 102 245 151 -48 119 -63 20 -367 3 -5 160
5274A60l12J35L5k14N15m00k13J57J7K96l03K35K7l36J68J51j82L7m6%q7J24K91
$$ 160 -152 -17 18 -196 319 -81 -294 -137 -120 176 -127 108 135 -201 -33 118 -64 -27 -73 -73 -160 -36 255
5297B55k40r3l7p9K22J49l68J33K48L1j04k47K06K45l98j00J52J66J0l56L53k19
$$ 255 15 -78 -115 -194 28 177 -191 -58 190 221 117 -130 76 321 -77 -177 -25 141 151 -205 148 -71
5319g1L40k02J47k90J35L9j56J25j16J71r8J61j74J07l1l32J14J72j06j05J72
$$ -71 269 67 214 -76 59 98 -58 67 -49 122 24 185 11 118 87 -245 -131 41 -65 -170 2
5340Bj0o4M15n13K66m8k63k4L17Q8q7J10j07J15m1l49M90j70L11n26J32P2j02
$$ 2 -8 -72 343 -170 96 48 -215 -239 78 166 79 189 82 197 156 -193 297 127 438 -88 44 116 14
5363A4o1K89Pm11K55l45N08J0l65J21J36j20N3Q1k02P1j21P7k94L49L05o59L25
$$ 14 -47 242 249 -162 93 -252 256 266 -99 22 158 38 91 172 -30 41 -80 -3 -297 52 357 -302 23
5386B3r3j52O74j89l19N0p4j97N4K53r4J29R5j46KJ5j4J89k82n2Jm2L49k56j64
$$ 23 -70 -222 452 263 -56 -6 -80 -277 -223 30 -64 65 160 14 16 31 17 206 -76 -128 -127 -169 180 -76 -240
5411b40K16L6J73k51J10j68K6m4L04j22k90M46o6Q1q4k5j28L02q2o3J97k45o0
$$ -240 -24 12 185 -66 44 -124 -98 -142 162 40 -250 196 130 211 127 102 -26 276 194 131 328 83 23
5434B3m54P04l29J28k6m9K7j48N3O0mk06N3L0J75j23j89L96j70j52O1J26O8K51
$$ 23 -431 273 -56 72 46 -3 24 -124 -71 -11 -15 -221 -168 -138 37 -86 -275 121 -49 -201 -140 -14 54 305
5458C05l56J55Q9r2M6l59K89j13K98k78J9k17J12J19k53L69l01M9j32L32j10M03
$$ 305 -51 104 193 101 147 -212 77 -36 262 -16 3 -214 -102 17 -236 133 -168 -119 -251 81 -29 374
5480C74n1k07j81K25j43J58l5l08K11n5Rm2O9J38nj05J83k90kP9J25k10K3K32
$$ 374 323 116 -65 160 17 175 140 -168 43 -12 -3 -45 24 162 157 52 235 -55 -57 22 147 -63 -40 192
5504A92k57o7q4J55M1J07j34J70l0j72p4L94l12J07J43O4o52L6L34J7R1J98m90
$$ 192 -65 -132 -216 -61 -20 87 -47 123 93 -79 -153 241 -71 36 179 243 -409 -373 -39 -22 69 267 -223
5527b23J32J60j75J47K36j46k52J49k11j6J44K08j41K9K3q3l0J91j58L14j55j17
$$ -223 -91 69 -106 41 277 131 -121 28 -183 -199 -55 153 12 41 64 -19 -49 142 -16 298 143 26
5549B6k26J99j07K72q8j96L19k75J5m5K99n7K23m71j9L22m7l38j09L10J8j28J49
$$ 26 -200 -1 -108 164 76 -120 199 -76 -61 -106 193 136 359 -112 -131 191 144 -194 -303 7 25 -103 46
5572D6p3k1l8j10K44m6j64P0J37j13m59O24r7J48k36K4q3M60j72j34j04J85J71
$$ 46 -27 -48 -86 -196 48 2 -162 -92 45 -68 -527 97 0 148 -88 -64 -147 313 141 7 -97 88 259
5595B59m78K23L52k62N1k91K87j94J31J50k21j22m0L02k32O7J29m28M48j17l5
$$ 259 -219 4 356 94 145 -146 141 -53 78 228 7 -115 -155 147 -85 -18 111 -317 131 14 -21
5616b1J64m41N16m02p6J38K02l22J88o9m7K71j23k1n7L07r6k54J75K41l46j44
$$ -21 143 -298 218 -184 -260 -122 80 -242 -54 -123 -170 101 -22 -43 -100 207 111 -143 32 273 -73 -217
5638b17R5N9O5k81M62q3M7k91K03k97J80O4LQ7j58O6J4K35k55O1P3l2j8k14J20
$$ -217 -122 -63 2 -279 183 100 147 -144 59 -238 -58 6 9 96 -62 4 18 253 -2 59 132 100 82 -132 -12
5663a2Q4n3j04N5k46nJ89J69m9k32o4J92o0K31k04o2K32L4k13O6J81k26K96j29
$$ -12 72 19 -85 -30 -276 -281 -92 77 28 -204 -268 -76 -136 95 -109 -171 61 95 -118 -52 129 -97 199 70
5687G0o5J22j92m7J09j09P6j94J94R6k10M52j71l22L64l7l08J54K24k03R2k45
$$ 70 5 127 -65 -112 -3 -112 -36 -230 -36 60 -150 302 131 -191 173 136 -172 -18 206 3 95 -150
5709a50J15q2K37p9M8j82K35l04K20j09o7J94P4j54L1j93JL79l67Q0P3MJ88j11
$$ -150 -35 -117 120 41 89 -93 142 -162 58 -51 -118 76 150 -4 27 -166 -165 214 -153 -73 0 4 192 81
5733H1l33J37j1K89r5J44l68LK91N4k63N5N8J45o9o9J02k68j61L29p3K13k21J85
$$ 81 -252 -115 -126 163 68 212 -156 -153 138 192 -71 -16 42 187 118 49 151 -117 -278 51 -22 191 -30 155
5757A55Kj15J59l43J3Q1p2L12o9r7Lk7K87k80m9M2j63J77K66l21M9J21j84J69
$$ 155 157 42 201 -142 -129 -48 -120 192 123 26 29 2 289 9 -40 2 -161 16 282 -39 10 131 -53 116
5781A16n4J06l10J56L8j08K5M6L28k05k60K57j21k39P7l5K10J38j63k72L35p4
$$ 116 62 168 -142 14 52 -56 -31 15 343 138 -122 135 14 -225 -148 -183 27 165 2 -270 65 -9
5803ij5qJ59k18K59l08J27j84K31J28k73j13K61q4o4J35j18%J49N2l30L00n7N6
$$ -9 -24 -32 127 -91 168 -140 -13 -197 34 162 -111 -224 37 -47 -111 24 -94 -94 55 107 -223 77 20 76
5827G6j36k7J32K44J3m12K30r3k3K47l67J68K4j4Rj84K50j95j20j46J04J04m0
$$ 76 -60 -87 45 289 302 -110 120 27 4 251 -116 52 76 62 71 -113 137 -58 -178 -324 -220 -116 -156
$$ [...]
8191b
##END NTUPLES=NMR FID
##END=
