##TITLE=1H_LR-688B-M-TFA
 CDCl3+TFA, 8 sc, 
 30.7.2019
##JCAMPDX= 6.0         $$ Bruker NMR JCAMP-DX V2.0
##DATA TYPE= NMR FID
##DATA CLASS= NTUPLES
##ORIGIN= UXNMR, Bruker Analytische Messtechnik GmbH
##OWNER= root
$$ XWIN-NMR		Version 3.5
$$ Tue Jul 30 16:27:43 2019 Russian Standard Time (UT+4h)  she@DPX200
##.OBSERVE FREQUENCY= 200.13155
##.OBSERVE NUCLEUS= ^1H
##.DELAY= (6, 6)
##.ACQUISITION MODE= SIMULTANEOUS
##.ACQUISITION SCHEME= undefined
##.AVERAGES= 8
##.DIGITISER RES= 18
##SPECTROMETER/DATA SYSTEM= spect
##.PULSE SEQUENCE= zg30
##.SOLVENT NAME= CDCl3
##.SHIFT REFERENCE= (INTERNAL, CDCl3, 0, 15.7039)
##AUDIT TRAIL= $$ (NUMBER, WHEN, WHO, WHERE, WHAT)
$$ ##TITLE= Audit trail, XWIN-NMR		Version 3.5
$$ ##JCAMPDX= 5.01
$$ ##ORIGIN= Bruker BioSpin GmbH
$$ ##OWNER= she
$$ F:/spectra/data/she/nmr/H-F/1/audita.txt
$$ ##AUDIT TRAIL=  $$ (NUMBER, WHEN, WHO, WHERE, WHAT)
(   1,<2019-07-30 16:26:49.07 +0400>,<she>,<DPX200>,
      <created by zg, POWCHK disabled, PULCHK disabled
       configuration hash MD5:
       00 E9 B6 7A A2 85 ED C7 34 08 36 98 17 FE 4E 26
       data hash MD5: 16K
       BD 15 56 C6 70 E3 10 80 CF 27 4F 23 55 D8 EE 67>)
$$ ##END=
$$ 
$$ hash MD5
$$ 01 9D C5 CC 42 7A 44 AF 70 42 89 81 9B 38 08 8E
##$RELAX= 
##$RELAX= 
##$RELAX= 
##$RELAX= 
##$RELAX= 
##$RELAX= 
$$ Bruker specific parameters
$$ --------------------------
##$DU= <F:/spectra>
##$EXPNO= 1
##$NAME= <H-F>
##$PROCNO= 1
##$TYPE= <nmr>
##$USER= <she>
##$AMP= (0..31)
100 100 100 100 100 100 100 100 100 100 100 100 100 100 100 100 100 100 
100 100 100 100 100 100 100 100 100 100 100 100 100 100 
##$AQSEQ= 0
##$AQ_mod= 1
##$AUNM= <au_zg>
##$AUTOPOS= <>
##$BF1= 200.13
##$BF2= 200.13
##$BF3= 200.13
##$BF4= 200.13
##$BF5= 200.13
##$BF6= 200.13
##$BF7= 200.13
##$BF8= 200.13
##$BYTORDA= 1
##$CFDGTYP= 0
##$CFRGTYP= 5
##$CHEMSTR= <none>
##$CNST= (0..31)
1 1 145 1 1 1 1 1 1 1 1 1 1 1 1 1 1 1 1 1 1 1 1 1 1 1 1 1 1 1 1 1 
##$CPDPRG= <>
##$CPDPRG1= <>
##$CPDPRG2= <>
##$CPDPRG3= <>
##$CPDPRG4= <mlev>
##$CPDPRG5= <mlev>
##$CPDPRG6= <mlev>
##$CPDPRG7= <mlev>
##$CPDPRG8= <mlev>
##$CPDPRGB= <>
##$CPDPRGT= <>
##$D= (0..31)
0 1.2 0 0 0 0 0 0 0 0 0 0.03 0 0 0 0 0 0 0 0 0 0 0 0 0 0 0 0 0 0 0 0 
##$DATE= 1564489608
##$DBL= (0..7)
120 120 120 120 120 120 120 120 
##$DBP= (0..7)
150 150 150 150 150 150 150 150 
##$DBP07= 0
##$DBPNAM0= <>
##$DBPNAM1= <>
##$DBPNAM2= <>
##$DBPNAM3= <>
##$DBPNAM4= <>
##$DBPNAM5= <>
##$DBPNAM6= <>
##$DBPNAM7= <>
##$DBPOAL= (0..7)
0.5 0.5 0.5 0.5 0.5 0.5 0.5 0.5 
##$DBPOFFS= (0..7)
0 0 0 0 0 0 0 0 
##$DE= 6
##$DECBNUC= <off>
##$DECIM= 24
##$DECNUC= <off>
##$DECSTAT= 4
##$DIGMOD= 1
##$DIGTYP= 9
##$DL= (0..7)
0 120 120 120 120 120 120 120 
##$DP= (0..7)
150 150 150 150 150 150 150 150 
##$DP07= 0
##$DPNAME0= <>
##$DPNAME1= <>
##$DPNAME2= <>
##$DPNAME3= <>
##$DPNAME4= <>
##$DPNAME5= <>
##$DPNAME6= <>
##$DPNAME7= <>
##$DPOAL= (0..7)
0.5 0.5 0.5 0.5 0.5 0.5 0.5 0.5 
##$DPOFFS= (0..7)
0 0 0 0 0 0 0 0 
##$DQDMODE= 0
##$DR= 18
##$DS= 0
##$DSLIST= <SSSSSSSSSSSSSSS>
$$ [...]
##$SUBNAM2= <"">
##$SUBNAM3= <"">
##$SUBNAM4= <"">
##$SUBNAM5= <"">
##$SUBNAM6= <"">
##$SUBNAM7= <"">
##$SUBNAM8= <"">
##$SUBNAM9= <"">
##$SW= 24.9336996594482
##$SWIBOX= (0..15)
0 0 2 0 0 0 0 0 0 0 0 0 0 0 0 0 
##$SW_h= 4990.01996007984
##$TD= 16384
##$TD0= 1
##$TE= 0
##$TE2= 300
##$TE3= 300
##$TEG= 300
##$TL= (0..7)
0 120 120 120 120 120 120 120 
##$TP= (0..7)
150 150 150 150 150 150 150 150 
##$TP07= 0
##$TPNAME0= <>
##$TPNAME1= <>
##$TPNAME2= <>
##$TPNAME3= <>
##$TPNAME4= <>
##$TPNAME5= <>
##$TPNAME6= <>
##$TPNAME7= <>
##$TPOAL= (0..7)
0.5 0.5 0.5 0.5 0.5 0.5 0.5 0.5 
##$TPOFFS= (0..7)
0 0 0 0 0 0 0 0 
##$TUNHIN= 0
##$TUNHOUT= 0
##$TUNXOUT= 0
##$USERA1= <user>
##$USERA2= <user>
##$USERA3= <user>
##$USERA4= <user>
##$USERA5= <user>
##$V9= 5
##$VALIST= <valist>
##$VCLIST= <CCCCCCCCCCCCCCC>
##$VD= 0
##$VDLIST= <DDDDDDDDDDDDDDD>
##$VPLIST= <PPPPPPPPPPPPPPP>
##$VTLIST= <TTTTTTTTTTTTTTT>
##$WBST= 1024
##$WBSW= 4
##$XGAIN= (0..3)
0 0 0 0 
##$XL= 0
##$YL= 0
##$YMAX_a= 182071
##$YMIN_a= -263213
##$ZGOPTNS= <>
##$ZL1= 120
##$ZL2= 120
##$ZL3= 120
##$ZL4= 120
##$ABSF1= 10
##$ABSF2= 0
##$ABSG= 5
##$ABSL= 3
##$ALPHA= 0
##$AQORDER= 0
##$ASSFAC= 0
##$ASSFACI= 0
##$ASSFACX= 0
##$ASSWID= 0
##$AUNMP= <proc_1d>
##$AZFE= 0.1
##$AZFW= 0.1
##$BCFW= 1
##$BC_mod= 2
##$BYTORDP= 1
##$COROFFS= 0
##$CY= 11.3945322036743
##$DATMOD= 1
##$DC= 2
##$DFILT= <>
##$DTYPP= 0
##$F1P= 20.1537800932815
##$F2P= 0.134698688090026
##$FCOR= 0.5
##$FTSIZE= 0
##$FT_mod= 4
##$GAMMA= 1
##$GB= 0.15
##$INTBC= 1
##$INTSCL= 1
##$ISEN= 128
##$LB= 0.24
##$LEV0= 0
##$LPBIN= 0
##$MAXI= 10000
##$MC2= 0
##$MEAN= 0
##$ME_mod= 0
##$MI= 1.114404
##$NCOEF= 0
##$NC_proc= 0
##$NLEV= 6
##$NOISF1= 3.799351
##$NOISF2= 2.8
##$NSP= 1
##$NTH_PI= 0
##$NZP= 0
##$OFFSET= 15.70392
##$PC= 1
##$PHC0= -9225.66
##$PHC1= 20.00097
##$PH_mod= 1
##$PKNL= yes
##$PPARMOD= 0
##$PSCAL= 0
##$PSIGN= 0
##$REVERSE= no
##$SF= 200.130013532006
##$SI= 16384
##$SIGF1= 3
##$SIGF2= 2
##$SINO= 400
##$SIOLD= 16384
##$SREGLST= <1H.CDCl3>
##$SSB= 0
##$STSI= 0
##$STSR= 0
##$SW_p= 3612.71676300578
##$SYMM= 0
##$S_DEV= 0
##$TDeff= 0
##$TDoff= 0
##$TI= <>
##$TILT= no
##$TM1= 0
##$TM2= 0
##$TOPLEV= 0
##$USERP1= <user>
##$USERP2= <user>
##$USERP3= <user>
##$USERP4= <user>
##$USERP5= <user>
##$WDW= 1
##$XDIM= 8192
##$YMAX_p= 0
##$YMIN_p= 0
$$ End of Bruker specific parameters
$$ ---------------------------------
##NTUPLES= NMR FID
##VAR_NAME=  TIME,          FID/REAL,        FID/IMAG
##SYMBOL=    X,             R,               I
##VAR_TYPE=  INDEPENDENT,   DEPENDENT,       DEPENDENT
##VAR_FORM=  AFFN,          ASDF,            ASDF
##VAR_DIM=   8192,          8192,            8192
##UNITS=     SECONDS,       ARBITRARY UNITS, ARBITRARY UNITS
##FACTOR=    0.0002004,     1,               1
##FIRST=     0,             0,               0
##LAST=      1.6414764,     0,               0
##MIN=       0,             -263213,         0
##MAX=       1.6414764,     182071,          0
$$ Real data points
##PAGE= N=1
##DATA TABLE= (X++(R..R)), XYDATA
0 0 0 0 0 0 8 -8 8 -8 8 -16 16 -24 31 -33 40 -49 64 -72 88 -104 120 -139 161 -185 215 -248 281 -320 361
29 361 -408 460 -518 580 -650 726 -809 899 -998 1109 -1228 1361 -1507 1668 -1848 2047
45 2047 -2268 2523 -2810 3137 -3519 3968 -4509 5168 -5999 7078 -8551 10688 -14083 20339
59 20339 -35762 155812 126291 -171376 -17235 74134 21799 1316 114363 53341 -70832
70 -70832 -38427 84594 39571 -35785 -20525 -32651 -120802 -50271 113635 68302 -145415 -150402
82 -150402 20440 37916 -104548 -134180 -70341 -67612 -58512 29322 23184 -120358 -176072 -68691
94 -68691 -1473 -33078 -45970 -55489 -116008 -85306 77158 110455 -84407 -197998 -58320 76418
106 76418 26114 -34980 6064 27943 6810 43580 79329 7170 -60756 -568 75838 65286
118 65286 58471 84034 37497 -29402 34382 137333 81453 -40493 -11698 98740 110062 67459
130 67459 71257 49593 -22080 -10251 84423 86462 -6523 -19961 48469 57690 24731 36557 22236
143 22236 -66610 -82730 32293 86709 -10354 -80689 -21219 30084 -4096 -33209 -30949 -62877
155 -62877 -87298 -31661 26640 -7255 -65770 -61393 -37727 -38487 -31655 -26345 -65229 -90172 -30231
168 -30231 35801 4121 -64448 -68936 -39345 -31672 -19515 481 -19224 -50090 -20672 32363
180 32363 24338 -17228 -22960 -14925 -18660 7699 54675 40170 -17615 -10011 53410 59966 8043
193 8043 -9039 13952 23500 34781 66330 63666 13377 -87 43584 60773 32331 21289 31065
206 31065 18531 17538 60877 74446 12200 -31890 8831 51113 28177 837 11048 15501 4694
219 4694 16658 29107 -4476 -41427 -23428 7416 892 -12468 -8190 -19068 -42068 -25789 5789
232 5789 -15583 -62584 -57779 -17163 -8674 -23437 -27242 -36246 -54379 -41938 -10986 -19344 -52660
245 -52660 -45996 -13502 -13004 -25537 -14945 -13223 -41344 -41448 4958 23201 -13303 -30492 464
258 464 19668 5433 3064 10849 -2285 -8783 23902 49152 27543 5638 20844 34728 23783
271 23783 25798 40040 27563 7638 29353 62895 47539 10997 12380 33189 30367 22525 30351
284 30351 27024 9163 12908 34100 27492 -32 -5561 5364 1775 -1287 11849 11323 -16693 -27144
298 -27144 -3721 5455 -19945 -38191 -27109 -14422 -14710 -15025 -19178 -32857 -38143 -26890 -21378 -31050
312 -31050 -32834 -24084 -23755 -26192 -14758 -7680 -25085 -41298 -26808 -4821 -5572 -14823 -11931 -5524
326 -5524 -4063 1100 4627 -5538 -14269 -1298 17115 17381 11990 16651 18475 10209 11018 22987 22850
341 22850 8453 8912 27509 36175 26939 18121 15788 13295 14081 20463 20854 13189 13325 22202 23456
356 23456 14282 9292 5727 -2563 -5552 6646 15437 5781 -6051 -1768 6962 1621 -10917 -17078
370 -17078 -16341 -11152 -4587 -2646 -7645 -11862 -12271 -14446 -19811 -19601 -15058 -16065 -18780 -11909 -121
385 -121 -1058 -14082 -21295 -16800 -10128 -8351 -8936 -9325 -5889 1549 4523 -2330 -11281 -11644 -6789 -3949
401 -3949 -1922 4797 10298 7622 3206 5177 8460 3532 -4749 -4326 5932 15343 15673 10476 7386
416 7386 7788 7440 4074 2418 3753 6725 9847 12228 14962 13003 6719 -385 -1111 3261 6596 5051
432 5051 3320 6725 12405 11526 2916 -5194 -5441 -2064 -350 616 3662 6212 4851 580 -2655 -3137
448 -3137 -5333 -9756 -12400 -6956 3055 6108 -1097 -8485 -6986 -3081 -7351 -14080 -12926 -5360 -81
463 -81 -1053 -3713 -5356 -7021 -9184 -12206 -12706 -8000 -2153 -2132 -4574 -1567 3689 276 -9695 -12520 -4782
480 -4782 1532 1875 1829 4854 5539 4099 2496 -323 -3095 -1643 2812 5498 7683 12589 13424 7809
496 7809 3741 6946 8279 2245 486 8156 14407 11295 8100 7981 5828 1267 1482 4493 3831 3311
512 3311 7174 7485 2932 1698 4266 -1906 -11985 -9070 2426 2046 -6268 -5565 1920 -313 -9855
527 -9855 -11720 -8180 -8042 -8658 -5201 -3106 -4286 -4401 -4332 -9077 -12122 -8238 -5756 -10266 -10207 -1233 4320
544 4320 -1639 -6251 -3405 -1727 -3291 -1975 1234 1260 2532 7027 6126 157 1105 6334 3100 -1996
560 -1996 4304 13507 9621 1524 5995 13027 6718 -1364 1769 6482 4436 4388 9651 7687 1722 3008
576 3008 6458 -8 -5561 697 6300 -488 -4435 3877 5967 -4665 -8824 -1357 -102 -7783 -7627
591 -7627 -909 -2507 -7270 -3892 -846 -7353 -10051 -3781 -1946 -7131 -4321 3375 298 -7908 -3809
606 -3809 2931 -2471 -9114 -2568 5564 1766 -2682 1304 3020 -726 747 4413 511 -2758 4208
621 4208 8995 1876 -620 7842 9245 -1457 -3537 6524 7881 -636 -166 6961 4579 -1904 818
636 818 4595 -732 -2883 4375 4603 -5065 -4164 5103 2306 -8077 -5175 3686 -450 -9580 -3928 5564
652 5564 822 -6355 -3274 90 -3962 -4216 177 -822 -5353 -1060 3223 -2291 -7162 -337 4552 -1868
668 -1868 -4788 1919 3981 -1852 -1654 4690 3549 -2056 103 4206 1372 134 4603 4617 -1367 424
684 424 5867 1182 -4754 2360 9713 1593 -5934 1727 8446 -43 -6158 744 4651 -1673 -2686
699 -2686 1841 -994 -4286 1715 5057 -5545 -9652 1991 7355 -4825 -9129 3499 6309 -6419
713 -6419 -9218 2231 3489 -5107 -3837 4186 1245 -5360 -956 3485 -1804 -3527 3282 3233 -4249
728 -4249 -2016 7072 4689 -4474 -1817 6125 2348 -5180 -1295 5759 4008 -626 232 988 -327 1788
744 1788 2310 -2145 -2115 4205 4350 -3924 -3825 4198 3415 -5029 -3627 3352 639 -5619 -707 5070 -464
761 -464 -5748 -1029 1640 -4218 -3354 3389 1073 -5159 362 6132 -2202 -8858 1466 9040 -1358
776 -1358 -8739 1722 8803 256 -4956 2696 5402 -1107 -1464 3071 589 -1583 5238 7181 -2921
791 -2921 -5517 4463 6546 -4315 -5389 5688 6445 -4487 -4782 4729 3313 -4503 -3092 2403 -428
806 -428 -4426 -1046 1639 -1716 -1740 843 -2577 -7024 -1742 3032 -2405 -6595 14 4013 -2767 -6498
822 -6498 -642 2548 -1690 -2425 -174 -1192 -984 3058 3039 -2962 -2003 5368 3584 -5337 -2175 9000
838 9000 6872 -3394 -1248 7807 4275 -3402 829 7089 2909 -2201 2751 5536 528 -276 4466
853 4466 2835 -3270 -394 4935 565 -4410 1353 6119 -1346 -6784 -837 3338 -2642 -6097 -1087
868 -1087 1309 -3030 -4306 -2086 -2626 -3669 -1737 -2116 -5772 -4496 1284 704 -4948 -4239 1846 1196
884 1196 -5303 -4179 1381 1265 -1795 -514 1487 811 504 1762 730 -808 2046 4197 1080 -428
900 -428 4466 6208 803 -920 3790 4673 -106 -357 5017 5042 961 1083 4194 1997 -1347 861 2391
917 2391 -252 -836 2719 2273 -2794 -2146 2002 -47 -5453 -4083 1253 494 -4373 -2725 1512 -266
933 -266 -4366 -4233 -2186 -2024 -2617 -2275 -2012 -1598 -297 -381 -3266 -3939 -368 654 -2033 -2608 956 2498
951 2498 459 -916 553 880 102 199 545 732 2426 3930 1880 -644 1516 3690 1225 -1490 556
968 556 4522 3333 308 1438 2788 1116 -526 -288 263 -206 1004 1657 470 -646 1427 866 -2429
985 -2429 -2811 321 951 -2464 -2072 1299 1098 -2617 -3385 -243 -634 -2784 -2004 343 192 -704 -841 -424
1003 -424 -1246 -1416 14 -843 -2189 -174 3045 1309 -1645 -450 1837 312 -2114 -889 2042 2055
1019 2055 546 192 991 1246 1104 -352 -1254 8 1723 1336 -769 -363 1903 1539 -1773 -1976 216
1036 216 1219 -87 -764 420 826 121 -928 -1131 -1341 -268 -114 -812 -1090 667 1885 -283 -1853
1053 -1853 -661 918 -371 -1587 -21 2049 1574 -102 -188 453 674 534 -223 331 1254 1550 951 161
1071 161 549 1771 682 -906 -797 1199 1834 441 -247 456 798 -595 -1801 -1123 166 612 -783
1088 -783 -1550 -407 305 -138 -2225 -2275 -323 146 -1723 -2284 -680 794 -492 -2427 -2276 -271 350
1105 350 -587 -1225 -478 926 726 -512 -1106 67 1325 399 -460 115 2122 2083 532 361 1227 1918
1123 1918 623 191 993 2903 2852 1255 296 1143 1945 1220 -126 497 1986 1661 -15 -126 710 1257
1141 1257 -415 -1581 -1090 552 246 -1039 -1451 -316 -569 -2000 -2841 -1702 -466 -585 -1687 -1976 -1018
1158 -1018 -774 -1583 -2605 -2001 -1189 -785 -1609 -1469 -418 632 -35 -1723 -1563 329 775 -607 -428 1361
1176 1361 2358 1206 -343 718 1987 1764 57 278 2040 3159 2144 732 776 1916 1901 522 235
1193 235 1643 3062 1686 239 354 1309 982 -175 -965 -123 876 1136 -669 -1033 184 168 -1225 -2884
1211 -2884 -1790 18 -328 -1710 -1936 -286 -180 -2164 -2839 -1717 -772 -745 -1729 -1223 -46 210 -211 -1741
1229 -1741 -1347 -322 139 -815 -774 843 1483 503 -743 -44 1040 480 -329 531 1656 1813 1062 919
1247 919 952 920 591 -366 18 1238 2175 1475 169 559 1387 478 -1052 -1115 350 986 374 -776 158
1266 158 1294 343 -1076 -2137 -397 235 -462 -928 -68 1080 123 -1180 -1771 -430 -317 -878 -735 -28
1284 -28 759 609 110 -562 -583 -4 224 -664 -666 1021 1782 276 -971 94 840 -137 -1220 -309 1262
1303 1262 1128 130 510 690 34 -525 -544 -406 2 613 582 -42 184 407 132 -1668 -1289 -17 116 -971
1323 -971 -667 935 682 -219 -1127 -725 -61 -245 -263 68 244 1103 616 -598 -776 521 364 -540 -738
1342 -738 976 1623 860 175 379 655 210 101 326 259 783 1528 857 121 -70 1411 85 -1611 -812
1361 -812 1392 843 -726 -211 830 575 -1052 -1549 -841 -113 -534 -553 -378 -497 -801 -212 -1040 -1777 -1023
1380 -1023 -389 -321 -1346 -693 258 -81 -1042 -1150 -381 -323 -588 -509 199 220 316 72 -63 228 51 -4 161
1401 161 899 1368 654 368 1259 1212 727 131 646 1062 922 915 784 957 692 859 309 -299 -47 1022 1173
1422 1173 -641 -575 956 903 -956 -1345 25 15 -738 -1082 64 -100 -847 -579 -345 -1234 -1046 -454 -350
1441 -350 -1060 -837 82 -252 -1495 -853 -25 -168 -1328 -813 711 362 -707 -465 375 661 209 14 360
1460 360 355 994 683 315 114 593 826 315 148 861 1126 354 106 601 473 425 477 177 122 472 554 6
1482 6 84 483 326 -492 -943 39 217 -520 -616 45 622 -668 -1473 -163 74 -903 -762 -144 -109 -386 -100
1503 -100 -224 -706 -639 116 305 -655 -407 908 406 -687 -760 475 592 -95 -429 770 598 376 58
1522 58 283 424 1 340 -52 276 471 948 246 -192 197 302 -315 -565 144 571 283 -361 25 76 -244
1543 -244 -487 -426 -626 47 550 89 -425 -334 -136 -440 -1102 -923 210 -105 -420 -385 475 150 -337 -634 -82
1564 -82 -201 -133 231 133 271 592 756 -101 -353 141 762 -136 -164 854 1101 353 10 182 536 148 -200
1585 -200 241 399 487 61 153 -141 238 -15 -28 -650 -48 -28 92 -549 -88 -63 -297 -354 -743 -473 -33 -178
1607 -178 -385 -280 -330 322 -304 -722 -752 221 -277 -234 55 498 407 -191 -261 -6 148 -250 33 411 285 473
1629 473 213 306 19 3 333 195 -118 589 705 333 173 437 396 -235 -458 35 483 -88 -342 353 133
1650 133 -128 -426 -544 -589 -256 -140 -207 -633 -129 271 -45 -477 -633 -46 -148 -192 -224 371 184 26 -424
1671 -424 -578 -177 -149 -105 86 548 400 498 -177 -428 41 342 98 -13 327 820 448 14 251 422 119
1692 119 -362 147 49 347 529 219 -217 -53 149 -320 -189 -149 317 214 44 -132 71 -368 -288 -429 -415
1713 -415 -219 150 71 -304 -172 -147 -279 -397 -255 24 130 -129 224 465 102 21 -72 -190 -38 175 -3
1734 -3 318 527 537 246 217 281 137 123 62 38 307 569 589 51 -299 656 53 -49 -298 202 435 310 143
1757 143 279 161 -171 -374 -500 -278 -214 -83 -370 -220 -177 -157 -449 -701 -366 -22 -138 -378 -66 -126 -433
1778 -433 -224 -224 -379 14 -226 -245 -273 494 378 15 -52 184 490 40 134 18 419 370 175 307 430 80
1800 80 109 259 132 326 235 -15 49 226 365 -55 43 -8 262 50 175 -14 102 134 -85 -277 -141 -73 -56
1823 -56 81 -228 -160 -98 -629 -655 -234 -331 143 -474 -223 85 148 6 -172 -310 -208 84 -177 -552 61 -73
1845 -73 113 -180 -419 240 475 -9 -63 16 437 563 267 63 24 72 110 51 111 645 425 -72 133 23 -3
1868 -3 -124 -387 154 111 -105 46 -108 -70 2 -96 -341 -57 27 36 -183 -118 -34 26 -228 -93 -313 12 -149 -337
1892 -337 -294 -17 -338 -411 -219 255 400 48 -129 -49 77 131 -224 51 -82 -189 -117 -93 -4 355 81 22 -315
1915 -315 -197 370 -28 -306 -112 3 1 -169 -298 -312 -39 -138 -152 -160 -49 216 -21 -104 -458 -225 -13 -278 -330
1938 -330 -146 254 256 -133 185 158 228 -199 228 155 462 160 -119 339 221 368 50 -219 168 128 173 196 244
1961 244 463 432 288 -222 125 260 382 158 -124 332 381 -131 -360 20 -102 -264 -228 149 -141 162 -240
1982 -240 -262 -329 -315 -583 -741 -393 -43 25 -619 -288 -138 -227 -588 -228 -347 -137 -21 -57 -224 224 74 -209
2004 -209 -16 -295 -130 244 322 97 374 491 354 79 193 194 589 21 310 557 599 310 194 330 361 438
2026 438 402 331 -56 237 420 264 -14 -1 -56 -30 -135 -211 61 -81 -683 -452 -165 -477 -303 -753 -441 -353
2048 -353 -103 -833 -249 40 -380 -260 -459 19 -9 -149 83 22 -73 -181 -150 -308 -47 159 125 -306 111 -42
2070 -42 381 180 62 259 503 496 79 97 328 721 34 -12 215 754 443 18 371 121 116 519 -68 -115 158
2093 158 4 9 -299 -100 484 142 -183 -504 77 60 -394 -293 -151 185 -440 -236 5 6 -122 -126 -406 -141
2115 -141 -113 -73 -89 -118 129 58 -334 -358 -126 81 -65 -304 -89 227 448 29 10 -110 225 -34 -150 -97 -68
2138 -68 217 -50 -141 310 363 -302 -243 -177 275 -156 -350 0 145 -349 102 -272 -229 -159 48 -272 -244 -126 220
2161 220 139 -382 -191 297 387 -217 -484 169 238 97 -151 141 247 88 367 60 202 29 318 167 -57
2182 -57 37 453 75 26 138 131 227 139 -40 227 310 -24 -372 -126 243 -203 -299 -203 -71 25 -177 -345 -205 32
2206 32 -167 -477 -135 -299 -117 -117 -139 -239 -46 -12 -55 -385 -222 -125 272 -467 -291 -108 148 57 -57 126 1
2229 1 -81 -319 273 282 45 56 550 487 153 220 231 315 363 366 378 162 300 894 646 -66 31 167 339 -44 -37 367
2255 367 220 44 -93 -131 205 180 -48 -247 -21 -244 106 -463 -416 -111 132 -427 -381 -27 -350 -386 -558 -484
2277 -484 -159 -176 -590 -351 -155 -196 -26 -47 -387 10 0 -311 -46 107 413 -103 120 -45 415 517 86
2298 86 191 309 226 -120 233 212 507 180 227 26 300 605 405 -296 142 282 399 -103 -112 152 177 1
2320 1 -291 -189 249 195 -5 -123 -421 70 -136 -223 -430 33 603 -51 -287 -84 -196 -126 -411 -435 -143 132
2342 132 -106 -200 -101 84 57 -102 -297 92 372 263 237 82 273 -42 -265 -139 117 257 31 -29 392 165
2364 165 -107 231 -70 156 188 -174 -212 105 174 63 -14 -169 -220 38 56 -507 75 128 121 -200 -247 26 -156
2387 -156 -193 -564 -303 15 -67 -49 -319 200 341 -103 -242 94 -57 237 71 -107 408 114 216 22 -112
2408 -112 -166 360 44 157 519 184 175 -142 -91 177 223 -93 -162 86 523 83 70 -7 75 196 -375 -125 -192
2431 -192 -89 -111 -145 -383 -164 -64 -321 -428 -33 219 -220 -327 -54 278 -163 -531 -443 -77 68 -155 -57
2452 -57 -282 383 267 -219 -229 13 555 180 -154 -70 329 432 383 62 246 239 426 -59 -69 151 163 226 -89
2475 -89 370 271 201 -298 -175 -15 -223 196 -334 -107 340 -98 -306 -336 -138 187 -170 -416 -292 -213 -95 -193
2497 -193 -239 -6 -240 -151 -447 -189 192 -136 26 -473 -20 258 77 -327 -2 121 264 -156 128 206 240
2518 240 288 -222 152 250 212 -41 48 369 367 292 108 42 285 55 -94 -289 204 218 114 -94 -8 416 50
2541 50 -439 118 -28 72 41 -91 2 218 -41 -554 -189 -219 163 -194 -51 -32 -152 -126 -532 -190 -145 213
2563 213 -124 -321 -9 375 549 -159 -28 181 33 81 36 247 314 384 90 52 145 293 174 59 -5 438
2585 438 164 131 -14 -84 9 -109 87 -144 -10 -250 -43 -66 -326 113 246 -229 -484 55 63 -229 -390 23
2607 23 -21 -167 -314 -366 -215 -118 -313 -396 -367 -30 118 -169 -400 -89 148 43 98 18 2 -75 -92 -152 -119 460
2631 460 210 104 161 449 75 77 209 81 503 150 -61 133 499 50 286 85 312 418 356 -68 -292
2652 -292 218 -166 -104 -210 84 -57 -301 -297 -487 201 -139 -95 -459 -108 85 -301 -363 -154 -209 54 -23 -310
2674 -310 -272 39 -280 -122 -28 12 12 -76 -46 93 69 84 -198 245 -220 113 20 -142 160 277 121 26 -43 116
2698 116 357 115 27 253 620 41 -22 152 87 190 -1 -217 139 221 -226 105 -110 394 -100 -337 -133
2719 -133 -83 -230 -4 -85 -52 188 69 -1 -373 -211 -111 46 -80 -26 86 117 -291 -69 83 24 151 136 -169
2742 -169 -142 252 174 -209 -302 147 79 29 -287 246 150 228 76 211 552 52 -204 -260 259 -1 -233 -200 79
2765 79 -138 15 -234 -162 -168 41 -237 -103 17 -52 -320 -336 -336 -124 -149 238 152 13 94 -72 -214 -100 111 92
2789 92 -271 12 -35 226 188 -161 93 132 329 -108 205 116 187 261 521 64 -193 170 66 225 154 -19 451
2812 451 218 -117 21 397 145 -205 -344 396 -103 -153 -225 65 -266 -500 -554 -203 -172 -263 -259 -100 -243 -361
2834 -361 -120 -555 -270 -403 -262 -14 -562 -306 38 -41 -150 -53 -17 -179 -59 -127 35 307 212 179 150 0
2856 0 35 222 141 682 326 292 156 73 426 434 260 127 237 278 289 154 91 29 223 312 -233 239 343 33
2880 33 -163 -150 210 117 41 -581 -121 -91 -267 -238 -165 -244 -215 -188 -427 -674 -246 -119 -560 -425 -69 86 -222
2903 -222 -349 -157 -44 -224 -102 81 191 172 93 -26 -75 -156 134 296 36 10 398 193 -62 63 335 -29
2925 -29 -47 -118 414 255 533 10 217 174 -217 25 221 -205 162 310 -209 -168 168 51 -593 -396 98 312
2947 312 -137 -365 -23 -81 -244 -405 -58 -31 152 -20 539 149 -159 -111 20 -16 -98 -78 218 17 43 344
2969 344 67 -94 -107 127 373 114 -359 13 306 357 223 -281 -188 -121 90 -167 -195 17 225 136 -50 -33
2991 -33 73 169 -268 -112 -234 -312 109 -128 -158 -82 47 -390 -466 -265 108 148 -91 -199 148 91 -57 -152 77
3014 77 44 -114 329 8 73 78 -173 137 40 361 135 -2 29 193 447 313 243 -38 248 235 -178 128 222
3037 222 287 44 -54 149 206 -115 -16 2 -61 77 -96 -40 78 -227 -115 -202 -262 -103 182 -192 -208 -430 -115
3060 -115 -146 -254 -187 -93 72 -168 -358 -154 212 35 -308 -256 74 187 -268 -91 87 -5 197 -64 132 252
3082 252 -141 -91 12 255 81 240 311 -110 137 109 333 84 164 266 349 279 -61 -176 130 168 91 -233 -67
3105 -67 -44 -6 -384 42 -192 -269 -306 -356 -103 -135 -269 -398 -307 141 -16 -307 -255 -612 14 -385 -321 -1 338
3128 338 188 -316 126 87 56 -30 -205 58 270 -123 -87 95 -22 -1 -134 269 246 486 154 167 51 54 101
3151 101 161 -375 -89 333 297 -43 -56 112 212 103 -191 126 142 379 -57 -235 -8 221 -93 -381 13
3172 13 -15 -140 -301 -97 40 190 146 -40 89 -138 -85 -91 -231 -72 -11 110 -197 -181 152 34 -100 -77 92
3195 92 236 -176 -182 -181 255 26 26 22 194 50 -245 -157 252 247 -2 -118 -95 163 85 -39 -21 -1 34 204 -428 -72
3221 -72 -201 -71 77 134 245 -36 52 -170 -335 -191 -79 -45 41 -175 -106 -83 -126 -353 35 -192 3 -132 46
3244 46 216 -44 39 -256 -105 64 177 80 73 -10 290 -36 233 106 422 242 187 -100 224 85 66 -3 151
3267 151 60 17 -254 -415 74 -29 -172 -367 195 55 -293 -448 -18 -4 131 -95 99 -224 12 -76 5 -46
3289 -46 -58 149 18 72 26 105 -303 -169 -5 220 127 -248 -256 186 201 263 173 -135 400 249 -280 -165 224 117
3313 117 342 -139 141 -69 426 175 -6 17 360 197 60 374 57 -38 -158 22 -55 -17 176 -36 -98 -96
3335 -96 133 21 -372 -265 -93 -78 -141 20 -352 158 -183 -170 -227 169 -46 -218 59 17 91 -236 -112 33
3357 33 -303 48 -1 -111 125 390 241 59 -153 -182 6 142 -184 171 358 163 158 -65 338 -78 112 -159
3379 -159 156 368 84 -75 -43 -96 179 -351 -137 -139 364 130 -353 -297 -298 -162 -81 -220 -77 212 -19 25 7
3402 7 -39 104 -157 -177 137 147 -245 90 -86 -35 71 -159 155 33 322 -195 -131 97 -8 -210 -67 -117 82
3425 82 78 494 -83 -227 82 122 -13 249 254 222 -122 -284 156 344 15 -75 -53 -181 -145 -56 -285 -283 329 190
3449 190 -32 -217 -162 -278 -72 -170 -136 3 -40 172 -19 -140 -255 193 -360 103 -135 -7 -148 -210 -168 6
3471 6 184 -212 120 -129 113 -54 -159 -168 -304 -158 -281 119 9 -121 -75 -185 250 244 -71 29 -101 111
3493 111 -117 227 51 -154 434 37 -169 160 -109 -161 -135 -144 -54 96 -37 -167 -207 -6 130 148 17 -217
3515 -217 152 -185 -188 -8 177 149 -31 -59 -212 -18 -219 -18 260 129 182 13 221 -244 -26 288 81 49
3537 49 175 33 65 85 232 225 79 135 -204 -7 82 -35 -8 -64 265 73 -32 -256 12 -14 21 -428 192 -182
3561 -182 75 -5 -91 27 80 -92 56 -199 -15 32 -85 -161 -146 -181 -97 12 -79 -131 -332 -102 150 98 181 -221
3585 -221 27 105 123 207 153 212 -167 105 -118 156 -194 -14 7 -213 149 -21 -61 140 128 299 271 -68 69
3608 69 -63 -183 104 59 -109 -153 -113 -203 -105 -217 -83 -90 -91 151 91 -116 37 218 35 -119 -165 339 187 -38
3632 -38 132 -96 -318 -114 10 185 138 -72 -82 -144 -40 243 347 60 118 -79 30 116 -80 -12 144 265
3654 265 132 23 116 -63 -190 49 74 -155 237 1 13 166 -117 79 -12 91 -52 -16 -223 -26 -6 -288
3676 -288 83 -133 115 -14 -31 -44 -64 -26 72 -101 -37 -314 -75 -111 -177 60 30 -211 -143 313 -31 193 -138
3699 -138 94 127 2 66 -11 234 62 135 143 83 232 49 192 -74 154 -149 -67 -74 274 -170 139 -282 -97
3722 -97 341 198 -482 -149 -15 -51 135 -342 -301 -164 -85 -128 -366 -258 229 -166 -51 -123 -178 6 140 -256
3744 -256 -183 -21 247 -10 -75 1 92 -125 227 -53 135 123 -125 83 -92 188 -58 -128 -117 46 -51 -148 83
3767 83 -30 115 231 161 -219 -39 119 -52 94 157 -173 66 -29 -291 38 -17 -23 -311 159 -24 -216 64
3789 64 319 88 -53 109 166 7 -117 -74 41 -311 -112 174 -68 209 38 126 -199 -46 -299 159 -35
3810 -35 -257 34 307 27 -165 146 6 114 367 116 173 -97 250 -67 -39 -12 139 119 -127 -7 -9 8 -306
3833 -306 47 -241 184 -6 -25 -233 125 130 -184 -172 -151 34 -50 -190 -196 -163 -305 60 329 23 33 -118 -52 309
3857 309 -115 -48 -213 120 -37 -100 158 131 116 -49 102 232 24 -65 105 -29 -124 -44 317 8 154 132 -73
3880 -73 -108 186 -58 -236 44 250 -8 -215 -215 154 130 203 6 -183 102 -274 -44 -39 -24 -60 -3 -134 -16 11
3904 11 217 -103 -137 121 34 17 -196 33 156 92 63 -204 70 -139 -67 -60 0 -79 119 107 14 -39 21 427 116
3929 116 20 236 -127 -136 257 144 283 202 180 51 -124 -345 105 -113 -64 -176 -24 105 51 -21 -180 56 -5
3952 -5 -151 174 182 -152 -189 -311 60 -53 -71 259 0 161 200 151 332 235 154 -51 38 -4 -169 -31 140 21
3976 21 -13 -83 -30 -191 78 179 -89 -42 80 -126 73 198 225 11 245 -149 -189 150 -119 1 -166 -209 -168
3999 -168 92 3 -8 296 -15 123 185 199 -77 85 182 -115 -24 -2 -56 -247 -176 227 -5 -147 0 65 -204
4022 -204 -48 -128 -81 -4 177 45 -94 -115 254 267 -334 -62 93 33 54 134 137 19 -164 -206 23 -130 -211 295
4046 295 -81 -230 -132 -266 141 -158 171 31 113 198 -232 7 -61 358 34 -120 -125 14 -39 109 -31 41 146
4069 146 56 35 -197 74 -243 236 -213 -212 -99 -39 222 8 -92 41 -59 78 50 3 75 -190 136 -207 63
4092 63 -150 89 -96 2 -38 139 45 199 -209 -139 92 -34 83 119 -180 -191 -235 -128 -129 -164 -5 -98 -151 -28
4116 -28 49 237 78 40 -114 29 276 -2 8 173 10 -61 -187 246 62 50 -140 254 -136 23 31 390 75
4139 75 67 -218 157 33 86 131 -29 279 -27 102 -210 170 266 -95 -47 24 -271 -146 -34 -200 7 -41 11
4162 11 -116 -34 152 242 141 -178 100 -232 -242 -18 -87 111 191 273 -2 -139 217 7 -43 -37 42 19 -268 -31
4186 -31 -97 142 170 246 155 -44 -52 -156 -44 18 154 -185 -14 -145 -51 154 38 100 57 65 33 -108 -101 200 278 -14
4212 -14 214 192 186 65 6 15 -115 64 -6 159 3 11 223 26 -198 -205 -66 54 199 -139 -118 -191 -194 -63 -101 110
4238 110 118 39 -125 20 308 167 -244 -60 23 -126 93 -161 96 64 165 0 146 313 6 23 -86 -40
4260 -40 56 222 -38 57 0 56 132 -30 22 27 -111 195 161 129 161 -104 -145 -106 101 -15 -119 -278 -103 220 188
4285 188 -92 24 341 -2 41 -212 -1 279 -136 -298 194 61 -160 -118 -149 70 -66 185 -62 -221 -38
4306 -38 1 53 -159 -25 283 147 -14 8 13 78 43 56 307 -179 80 224 15 100 -142 46 127 91 25 94 17
4331 17 74 -34 -171 -181 -58 -183 10 120 114 -224 99 -28 -59 -116 69 -189 87 53 18 -146 65 -105 79
4354 79 91 159 -63 -243 -278 -150 416 287 185 -63 18 293 117 -56 -28 -7 -93 -165 177 2 138 -43 -8
4377 -8 40 -164 -2 -117 -157 -87 -154 -106 50 202 179 129 -201 -75 85 -122 -49 -151 -88 84 -69 -107 -188 -93 -123
4402 -123 102 38 -68 -32 -166 -47 131 -61 -30 -288 184 271 -82 104 -127 27 238 -174 50 -80 126
4423 126 212 68 84 127 62 277 79 135 -17 109 -93 -41 -72 23 102 55 -24 103 121 -71 -82 26 -150 202
4447 202 -126 -172 -42 -154 63 -502 -186 -129 -103 -67 -155 240 101 -150 102 135 -133 23 -160 -91 -23 -82 -122
4470 -122 -586 -94 38 22 -134 25 -106 100 41 -163 23 -145 168 11 166 -337 38 36 -69 -45 -61 65
4492 65 -41 -199 -327 -87 137 108 94 -224 76 -103 -62 -147 180 237 -223 -70 -179 4 -115 -161 -399 82
4514 82 39 -233 11 -35 248 -195 117 117 -92 -45 92 -70 282 68 -39 -223 -159 78 -118 154 -39 -123 196
4537 196 -36 85 -49 -36 129 120 -241 44 -124 -11 67 196 67 9 -14 102 -94 110 -507 -53 -123 36
4559 36 6 -193 156 -277 -6 133 -276 -51 -120 -148 -482 -6 -195 -41 135 -288 13 -20 -89 -23 -200 -273 468
4582 468 176 -220 -43 170 2 -186 242 -9 102 86 20 29 165 27 -46 -30 284 157 189 104 322 -196 53
4605 53 169 -153 169 -79 181 292 -6 103 -189 -291 -23 92 -246 -92 -55 -147 68 -30 136 -231 -68
4626 -68 -134 20 117 -82 193 -45 -259 -95 74 126 -23 -19 148 -247 218 -72 -267 -44 -29 -255 -94 -5 -122
4649 -122 168 -90 -115 82 149 111 142 210 31 -98 -109 1 122 106 -34 89 -18 127 76 94 55 -53 117
4672 117 -93 -195 80 -214 -306 -195 -255 -69 -91 -169 -327 235 -49 130 166 -149 -348 -337 15 -54 -37 40 -151
4695 -151 -114 -60 88 85 -167 -74 211 55 62 301 88 167 82 70 54 196 -216 -186 88 -209 132 115 -301 -24
4719 -24 -11 -310 56 207 -58 -196 153 363 48 -263 -253 28 120 -56 7 67 285 108 -13 92 105 -286
4741 -286 200 139 -14 165 141 176 -415 97 70 34 -8 -98 68 -185 104 61 -71 -50 -13 -196 46 201 49
4764 49 -19 -263 135 10 -187 8 29 -173 147 -30 -50 467 5 -29 -32 100 145 314 28 -74 76 43 12
4787 12 -147 54 -268 -159 140 11 -7 199 -51 84 54 -119 -125 -47 -67 2 -69 -140 -165 -33 -139 104 -223 -63
4811 -63 -104 -99 -40 63 228 97 25 67 294 181 -31 174 -89 393 135 296 -74 -167 185 46 272 -21 43
4834 43 58 236 -17 132 138 -55 129 188 -188 -114 -400 185 -181 77 176 -112 -14 -257 136 -61 -67 290 188
4857 188 -130 53 66 69 -74 65 -286 -62 -27 -55 -116 37 -100 -37 245 -73 -55 -157 121 44 -132 -4 133
4880 133 65 171 32 -86 197 -111 -191 70 106 -21 3 5 72 317 156 -55 -56 54 -538 -56 -188 -53 236
4903 236 -40 40 -76 -81 168 -161 -219 138 -80 57 -75 108 -243 -97 -80 25 -114 148 -370 285 79 -43
4925 -43 -111 -129 -97 117 199 -125 217 -122 -24 -118 -35 -348 54 267 -182 152 -33 42 -36 315 -147 -101 132 246
4949 246 18 67 -81 120 -25 -195 163 -64 -104 -285 85 32 -182 -46 7 -80 39 -31 -77 88 -256 -55
4971 -55 108 -205 -99 -37 -67 48 44 -265 198 -106 -86 21 177 17 23 226 178 167 69 213 378 203 -72 -266
4995 -266 223 112 -115 128 283 -90 23 205 -239 -240 -131 -16 98 -202 -206 6 -160 -243 -136 -121 -21 18
5017 18 -85 -201 76 -244 -176 86 -40 -23 114 176 131 44 -160 182 35 57 99 -88 -67 -199 37 -50 211
5040 211 -196 13 250 14 -44 -396 195 33 76 19 364 53 9 -43 277 91 -60 -140 389 -194 -95 -65 -215
5063 -215 17 -107 -4 -163 104 299 -368 -238 28 -107 132 5 -67 -209 -29 -194 -36 -99 -99 20 86 -160
5085 -160 52 133 -98 43 -114 -155 13 -251 -160 -18 -29 92 134 390 56 -71 125 130 178 44 115 -251 34
5108 34 -171 167 69 -98 109 125 224 66 -53 -21 292 41 -7 -190 24 -233 41 -161 -19 37 134 -35 -239
5131 -239 52 170 -203 -60 -63 246 91 -277 6 -69 -72 2 39 -79 206 -82 76 17 81 277 53 30 -31 262
5155 262 217 -192 -218 -182 110 185 145 131 49 -196 139 54 25 -90 135 65 129 -2 162 -253 151 -122 117 -211
5179 -211 -200 19 -189 -153 230 69 274 137 -221 -22 -241 -29 -87 20 -178 -295 -112 6 107 148 -188
5200 -188 419 -265 -189 200 -14 106 -43 -182 131 171 51 -180 103 41 165 11 12 42 176 296 35 -40
5222 -40 113 95 46 44 109 161 -11 198 -225 144 24 -62 -243 -278 -64 95 -138 -54 -183 67 -31 -104 -65 -233
5246 -233 -19 -124 -128 -434 -98 -288 -269 159 248 122 55 50 -191 47 -35 -109 69 128 -16 -62 -166 64 11 167
5270 167 -156 -23 -65 102 25 -148 50 107 122 -60 235 61 -275 253 -222 52 -196 12 -127 -73 95 223
5292 223 -106 -55 235 -54 -114 -257 -186 6 -315 127 -173 -22 -81 -28 -9 -58 20 -123 -45 -166 104 -170 -43
5315 -43 -121 -122 -415 102 -77 239 -51 -108 121 -38 -211 231 40 -8 -17 -79 -22 196 376 15 156 -136 4
5338 4 43 -76 28 -31 60 470 42 121 53 -260 162 -221 40 -191 -311 63 -219 -68 -269 51 349 87
5360 87 -111 -255 -231 -150 -203 -136 -13 -11 -136 -27 -204 -33 -80 -142 -96 -83 70 106 -39 36 276 256 -269 127 -157
5385 -157 -173 -69 -129 -127 126 -318 -213 89 -51 389 -23 63 -114 126 252 93 -106 148 87 251 182 67
5407 67 -97 29 118 -223 -72 -102 -37 5 -217 -73 119 -265 -186 107 2 -215 -206 -134 -208 -45 -66 -109 -95 -214
5431 -214 -139 246 -23 234 242 150 36 250 133 -62 -32 108 152 165 -13 93 100 82 -56 442 -74 -136 120 -170
5455 -170 50 182 66 -18 93 -89 -126 96 119 82 -215 -50 7 -47 33 83 72 -72 -224 2 -131 -50 -93 -426
5479 -426 -204 -153 -98 422 -90 54 -43 16 -43 53 -17 39 -162 8 -133 53 86 -228 -30 -153 144 66 -77
5502 -77 33 -61 143 141 -140 -46 157 360 287 -102 176 79 -23 -35 92 -90 -99 -281 3 90 -119 -119 -221 112
5526 112 -84 -253 -325 -60 95 -214 46 140 -130 -55 -357 -86 -32 135 -207 -66 -113 -89 -184 -56 206 44
5548 44 -15 -30 152 55 -214 291 30 -140 -41 50 98 8 66 -21 -34 -81 354 50 34 -161 51 -13 72 -9 -145
5573 -145 133 -112 -249 -157 -184 48 -30 -158 24 76 116 168 -97 -320 78 62 79 190 -59 -28 -144 -55 98
5596 98 -5 106 -187 -127 196 -227 4 226 -173 -7 -24 93 68 -148 12 71 -12 -95 -33 64 -138 -161 -25
5619 -25 41 -36 115 -38 -14 114 -294 -181 2 -212 236 45 -102 -267 -283 54 -266 -345 40 -46 -10 -151 -170
5642 -170 111 -1 -132 -324 -2 50 111 -129 -202 -116 -210 -319 -68 -231 40 228 155 -37 122 -25 44 148
5664 148 189 258 108 -6 134 120 51 -80 5 -92 -181 231 -240 27 132 26 -363 308 -219 -82 51 -5 43
5687 43 -133 -30 -65 33 -48 71 -272 -220 -105 -102 -100 -410 -134 -209 48 -74 14 -115 -81 -35 -9 -165 -248 56 47 253
5713 253 -191 34 -240 -8 -292 81 -106 106 -328 40 295 -46 203 207 188 150 -1 86 73 -33 59 -4 -146
5736 -146 1 297 -68 -169 63 62 159 140 112 -357 15 280 110 100 -167 95 -18 36 183 55 -25 -13 -48
5759 -48 -6 -41 -11 -224 22 350 -78 -333 -65 -24 -57 -208 9 92 -144 32 56 -10 22 200 -204 -23 269
5782 269 16 -47 212 -257 66 157 -13 -201 -5 2 -14 24 -190 -20 216 -118 -248 -343 63 -135 53 -3 -165
5805 -165 244 -53 -265 -159 66 -128 -330 -283 -101 31 1 -151 -340 150 190 101 50 -194 -1 304 -2 171
5827 171 2 -42 79 -38 -48 308 42 -95 17 209 175 -80 -219 -147 46 -86 -223 144 59 -49 162 112
5849 112 241 219 347 -182 -25 41 -31 232 40 -115 82 -254 -111 66 -92 160 -144 163 0 -140 -23
5870 -23 -347 -214 39 -188 -218 50 48 -7 -147 60 -213 -112 146 -132 -74 -94 -22 137 -245 -50 -65 17 -26 154
5894 154 -15 281 -151 232 -179 -95 -32 -11 -83 -185 -98 344 -102 -277 -139 -87 19 19 125 -109 147 111 -353
5917 -353 -169 14 20 -61 -34 -229 -330 115 -218 182 248 -111 -191 -288 -211 -265 -45 -166 -407 -120 -38 222 -98
5940 -98 34 63 176 -331 -131 278 384 166 -4 -1 -147 -235 -71 -110 325 77 186 173 130 -120 90 -111 133
5963 133 -14 39 193 -87 147 -46 58 -186 121 -59 -137 338 -106 -215 -20 53 -111 -8 161 -20 -66
5984 -66 294 169 87 -71 -6 -136 41 182 40 -289 21 104 -125 57 -144 244 -234 -132 146 81 239 101
6006 101 -110 203 463 206 -59 126 38 -14 -82 -85 303 53 73 -101 12 30 -16 134 -123 129 204 58 171
6029 171 -298 -177 64 9 -169 -264 15 -136 89 -6 -5 127 121 -26 56 -161 176 13 -95 -11 348 -95 -28
6052 -28 -7 -142 -39 144 -350 -121 -76 -162 -67 318 -228 78 45 -23 12 271 294 -118 -68 188 23 -54 87 -61
6076 -61 -227 249 -252 -56 -121 209 34 40 -49 44 66 -498 -225 -75 93 -10 179 150 -110 -268 -240 167 -162
6099 -162 -226 -177 19 -88 -40 -51 -11 -27 79 9 -74 -290 -35 199 126 -173 7 155 -27 50 76 246 95 171
6123 171 -4 -75 145 152 19 80 24 32 -140 20 75 142 -33 141 160 -191 89 -55 85 -246 -19 -107 -200 -116
6147 -116 102 196 5 -45 -100 -132 177 -179 178 -129 142 247 -189 -281 184 -85 -183 379 -26 -46 -107 -7 -3
6170 -3 48 49 -87 110 -21 250 -97 166 115 -260 8 131 -55 91 209 -166 117 -132 -32 -125 -211 -73 -78
6193 -78 -43 70 181 20 77 98 -85 218 -53 -27 259 -65 129 230 7 79 114 64 -113 21 141 93 -258
6216 -258 -195 -71 70 -307 -192 -40 -119 121 235 -111 112 183 104 -97 54 -7 -263 -233 264 -137 259 46
6238 46 -154 187 54 -26 -166 402 281 -61 9 -438 172 -24 -302 -3 169 77 -393 -324 32 -171 -9 -112
6260 -112 133 70 219 -16 -154 23 37 93 245 149 -8 220 -36 0 104 82 -108 -43 57 179 -84 82
6282 82 -118 -219 100 19 -86 153 -72 230 -19 -94 -287 -162 -132 -153 -110 -63 150 -158 164 32 -85 -421
6304 -421 -32 147 -195 -145 -72 -10 31 -184 45 -122 338 79 -164 -113 -110 19 6 74 -15 -264 -186 -33 -117 -30
6328 -30 -553 66 -183 -64 60 -67 -14 181 -87 -47 -165 -136 159 95 269 -13 119 71 -287 273 86 -69
6350 -69 256 65 83 129 284 -318 169 -43 -48 51 -177 107 110 101 -173 7 30 -140 209 76 29 -18 -270 0
6374 0 -95 -200 75 177 52 260 -135 133 24 236 113 -64 -51 67 67 -245 -339 -50 12 22 160 11 182
6397 182 42 -23 93 -107 -139 -124 -20 19 147 156 -197 29 23 288 64 200 -39 -7 -42 -110 -128 -151 -108 -17 -127
6422 -127 -32 123 -225 -8 -275 -233 147 -271 50 32 -154 207 5 94 92 -106 -234 -80 -195 -187 -267 436 -291
6445 -291 -14 -139 77 115 -87 -87 -271 75 59 13 -86 156 77 236 169 -22 159 192 -116 73 -139 66 -51
6468 -51 -246 -112 -69 -170 -31 -7 -255 -126 139 -24 33 -138 -177 227 -422 -156 65 -135 -120 220 86 251
6490 251 16 -4 260 -81 -42 -156 24 40 187 -11 -43 -222 257 325 -165 38 -212 -35 -147 178 260 -173
6512 -173 123 -221 -58 -77 7 90 24 -129 -169 72 53 33 134 -26 -77 -173 -57 197 -158 165 275 51 -288
6535 -288 -86 -85 -230 -123 -106 -381 -173 136 -104 -80 -67 -76 -257 90 48 -195 -75 143 27 -394 -67 -180 156
6558 156 203 -179 -37 70 -113 -9 -142 178 208 -113 89 -24 -173 85 73 -99 -18 239 28 -13 -6 188
6580 188 180 -212 31 92 162 206 -47 87 -87 -96 91 24 -162 -82 -109 -114 -75 120 -6 81 0 -212 -143 -93 145 114
6606 114 -48 -180 -164 374 80 131 206 -17 -14 0 -218 320 8 171 29 -189 -77 -49 -96 -9 22 -136 -21
6629 -21 -188 -140 115 -182 65 96 -147 -233 -172 197 132 -111 -181 -27 243 1 182 -115 -22 -182 3 -53 -145
6652 -145 -172 -165 35 121 -207 -87 -40 -72 -111 -39 -35 -226 -5 117 -71 -87 5 -146 90 -34 110 126 182 -47 31
6677 31 8 31 -76 126 -46 -38 77 112 -310 -14 -79 127 41 -506 251 10 88 213 -182 -68 -168 60 124
6700 124 -18 -176 59 -84 -63 -112 -20 44 -322 -60 -12 2 -316 -78 -14 -9 -36 202 -25 -31 187 -417 -139 143
6724 143 67 -208 -98 265 -33 -53 -75 71 -142 -154 -80 113 215 337 -33 89 -183 -206 103 160 22 254
6746 254 -121 -202 -6 197 -115 -362 145 197 104 -170 115 208 29 -36 -3 -131 -1 -16 279 15 -63 -366 58
6769 58 -109 -79 95 -144 -235 -230 -80 -131 -251 0 -134 -244 -101 58 6 64 -267 114 -89 83 61 -22 -8 -264
6793 -264 -56 -158 57 -50 -100 360 8 102 -281 20 -209 38 -116 102 -147 -330 118 -103 47 237 -116
6814 -116 121 -121 -134 131 112 -92 -49 152 167 -49 -170 151 71 -67 -258 -102 -76 372 41 35 -323 -171 26
6837 26 -101 -141 154 -43 -45 29 -121 -177 183 50 86 252 -114 -6 -90 246 -84 -54 81 194 -134 -194 -294
6860 -294 72 -54 -53 101 94 -66 -26 -11 -77 208 249 -86 -245 -97 -302 -16 -95 -179 -96 -104 122 -109 89 -389
6884 -389 -111 29 -40 -4 -247 37 -30 14 -221 -79 -147 -80 13 -228 -86 -102 -91 -127 16 176 -180 -53 -166
6907 -166 -33 142 -181 105 -88 -149 -74 238 -24 -122 152 -143 5 -264 -94 165 -37 -90 199 -50 249
6928 249 -196 200 -158 -308 -137 133 -18 173 195 -62 -255 125 -4 -235 32 178 -68 -77 56 -105 -93
6949 -93 -139 180 17 -277 19 15 35 163 10 -146 55 45 258 -21 202 18 57 -43 53 32 -245 48 164
6972 164 -213 -66 -6 85 -105 -115 -137 8 -166 179 226 -16 -155 234 201 -131 236 169 -91 5 -54 476 -198
6995 -198 -68 2 -92 117 -237 -81 293 -130 -57 -108 13 -57 -280 177 -38 20 -253 -121 -42 47 163 -100 92
7018 92 155 -105 -124 -43 -8 345 16 178 -67 185 -49 -18 164 133 -233 57 254 -3 -140 -159 -64 -3 -60 -429
7042 -429 119 -220 -123 -97 99 -53 -285 -98 -192 -158 106 -58 -105 76 45 -106 -49 -13 117 -90 210 -219 80
7065 80 -230 -90 -269 -164 40 15 -1 60 -116 -14 -125 -35 -132 180 193 -65 -145 71 -17 123 -17 31 -49 -229
7089 -229 216 -102 118 -60 185 158 69 -105 343 -225 236 -24 -82 130 92 8 16 -82 83 -5 20 -126 6
7112 6 -79 -28 63 34 -91 49 -47 97 84 -47 -238 -98 -64 157 97 19 267 34 -95 182 19 -205 -5 -71
7136 -71 214 239 50 117 242 135 190 -395 127 55 -145 173 16 268 129 -287 -253 140 -45 -24 -70 -8 9
7159 9 -123 -145 -21 -16 218 -107 -326 -343 129 -76 -29 76 -4 38 -123 26 -118 17 -133 -34 98 197 45 -119
7183 -119 238 251 -158 -6 -237 48 -326 205 287 -360 132 65 38 360 220 230 149 283 -332 179 161 232 0
7206 0 104 223 -47 235 103 -352 45 -128 -29 -75 182 -99 -379 -2 221 -34 -100 113 105 -35 203 90
7228 90 35 -59 -224 -89 -161 -172 -311 208 -81 -69 -5 -267 -37 188 158 175 109 218 34 -103 71 -95 -443
7251 -443 112 71 3 341 -38 -235 -148 -114 -101 -74 -55 121 -232 80 200 45 -295 10 20 -66 44 -144 -30
7274 -30 -104 133 -11 -24 68 44 297 79 -386 160 71 106 -104 -279 325 -139 -136 -130 -40 -194 182 -104 -44 -83 35
7299 35 -247 -93 -157 149 101 -61 -68 115 77 71 -233 466 41 -154 -86 31 202 -161 7 71 -109 -140 137 -148
7323 -148 -73 23 150 137 23 156 154 -152 -239 31 -17 -107 -221 108 -146 36 -131 -156 -133 118 -136 -11 18 138
7347 138 133 217 -32 138 -17 70 -129 111 129 -80 -66 -42 44 -98 95 -85 197 16 43 88 -94 -70 19 166
7371 166 -32 -48 47 -65 55 -222 127 191 133 -148 -63 -76 -72 -93 -165 -4 -146 -153 -56 -30 101 -21 103 -245 119
7396 119 -134 -15 -227 -288 -15 -200 208 67 144 -141 293 -108 2 84 268 34 63 37 129 103 24 65 113
7419 113 161 93 -131 389 -120 -136 113 -111 -217 -5 164 100 -19 214 153 -5 22 -54 25 193 -296 -32 156
7442 156 -388 -196 165 -86 10 -4 -159 -36 -116 -36 8 -113 -7 -66 -11 -342 67 -157 22 129 -196 38
7464 38 -106 -97 13 207 -306 -148 334 68 43 -46 -71 -115 134 216 22 78 99 -110 -245 33 4 -23 -41 406
7488 406 -180 313 271 -64 -165 -88 -71 -117 65 280 -83 -150 -50 -255 68 -219 100 535 -137 119 -376 -37
7510 -37 -134 -144 -104 143 36 -211 233 -200 -51 25 197 156 33 -79 37 35 66 -138 -124 111 -105 -3 189
7533 189 -22 -202 -187 25 5 68 29 -37 86 199 223 190 -168 40 178 305 -314 -69 -204 -49 18 283 -67
7556 -67 404 313 -63 108 -157 132 -228 -229 -160 193 79 -119 -72 26 44 189 167 -129 212 95 160 -103 8
7579 8 48 177 227 247 117 -60 13 106 -86 206 118 134 33 -24 -124 95 116 23 206 181 -268 20 483 -82
7603 -82 107 -38 -112 212 120 -6 97 124 134 -153 -157 241 -137 263 -216 158 -133 31 49 -110 -127 206 73
7626 73 -87 -34 25 289 206 123 -186 -241 -141 41 11 -149 -199 -12 -14 -81 29 47 86 -160 -62 209 -232 -18 -44
7651 -44 300 163 286 -84 -462 -99 -311 48 -246 18 -76 8 119 153 128 -122 -177 -261 -229 147 -125 156 -121
7674 -121 74 6 124 -2 -6 87 -195 -70 -47 -177 -253 59 5 164 -29 114 -145 -181 -37 125 -162 -74 39
7697 39 -61 -79 148 188 298 206 -74 142 -95 -281 -278 101 27 104 122 25 105 -117 102 96 -191 -178 -116 66 -100
7722 -100 -194 34 -17 219 54 94 1 23 -101 -164 -161 165 54 -192 144 -247 -62 194 183 14 25 -200 221
7745 221 165 -65 -44 93 -152 -79 -275 147 -8 -23 16 188 214 -179 -15 315 -12 56 -42 -130 -48 -32 55 228
7769 228 120 178 160 -34 219 215 -114 -271 254 139 100 -324 -40 -288 9 -41 -35 150 -42 -47 102 163 -98 -92
7793 -92 -40 -187 14 -19 -65 -249 3 12 -258 27 110 -56 -41 -150 -138 -180 -100 193 -152 127 157 263 28 -47
7817 -47 133 -138 -105 -4 -30 7 -88 78 196 -134 -129 -142 195 314 200 -73 147 -154 -29 89 -136 213 -75
7840 -75 78 109 -131 169 153 86 205 304 25 -166 -68 -215 85 -69 136 67 99 -156 -274 101 -287 23 143
7863 143 -137 11 136 39 199 181 -102 116 -54 331 -352 -209 -127 -33 12 0 -77 -229 -157 -191 268 68 0
7886 0 -157 198 -1 -205 85 116 -57 49 -276 155 -32 -129 -41 338 15 39 15 -10 91 133 -269 -10 -20
7909 -20 312 179 172 -41 118 142 -86 -227 -99 105 101 287 189 -227 -99 -150 -107 90 -332 -86 -88 126 115 -64
7933 -64 12 343 81 6 -240 57 -77 135 -30 -223 -101 -58 -216 184 -32 -90 266 68 161 -66 72 107
7955 107 119 -80 -27 -192 -46 41 -310 29 -16 112 -56 286 -177 164 -28 8 42 -23 -16 36 250 123 -14
7978 -14 -77 60 -179 -51 -102 53 -95 14 -203 21 -59 303 -7 234 88 -296 -119 -72 -45 -8 -39 -30 -129 49
8002 49 145 147 -248 -44 65 -203 72 -6 185 -195 -114 50 -214 -257 -114 459 143 7 426 -113 -200 -433 440
8025 440 -53 237 208 208 -78 49 66 -236 101 29 195 -60 -97 -290 162 -256 -261 293 100 78 -115 24 -153
8048 -153 -271 78 89 -108 4 -9 28 -129 -232 153 -71 -209 -32 -124 -87 -43 -244 119 40 -123 -41 182 -67
8071 -67 96 -127 59 370 12 -240 97 -37 195 89 -83 -43 52 264 183 -42 -27 34 -105 -46 134 -255
8093 -255 311 -22 84 -86 -45 -104 -161 108 -151 -118 -136 -69 -8 84 86 38 77 27 -95 24 -176 76 -196 196
8117 196 -150 4 -255 124 172 -138 -236 -152 267 -31 -197 114 -162 -49 -32 -69 -148 -294 -156 -322 170 -50
8139 -50 -199 138 -28 -303 133 120 32 61 53 38 -148 -423 41 -15 25 45 -129 0 360 -287 -120 34 92 -114
8163 -114 78 2 -92 -51 60 -133 -99 -82 -73 -105 -75 221 -11 -46 65 64 -49 223 4 -171 220 209 -49 59
8187 59 292 125 32 80
8191H0
$$ Imaginary data points
##PAGE= N=2
##DATA TABLE= (X++(I..I)), XYDATA
0 0 0 0 0 0 0 0 0 8 -8 8 -8 16 -16 24 -24 32 -40 48 -52 64 -74 84 -98 114 -131 148 -171 192 -219 246
30 246 -278 310 -350 390 -434 486 -539 598 -665 735 -813 902 -999 1105 -1223 1360 -1512
47 -1512 1686 -1883 2116 -2394 2728 -3139 3664 -4355 5313 -6737 9071 -13568 25393 -120174
61 -120174 -263213 61236 123728 -130049 -256107 -35947 100291 11226 -96598 -123333 -164446
72 -164446 -104280 55485 58816 -151573 -209453 -18433 86900 -26603 -93673 -58602 -97308
83 -97308 -143292 -7882 132935 39741 -116353 -72841 47172 46108 -705 -2362 -27521 -40411
95 -40411 61802 151405 62617 -46800 14525 98931 42639 -1337 74275 93346 399 14423
107 14423 160995 182071 29028 -56225 3451 63679 81111 95986 55084 -29635 -6086 113743
119 113743 114570 -20316 -70035 4989 34432 9911 41823 60207 -28249 -84723 630 62476
131 62476 -24243 -106086 -65166 -11872 -12927 4586 14337 -65881 -132305 -59407 24557 -31406
143 -31406 -109121 -67096 -7316 -29841 -40142 2278 -21266 -109384 -102874 -2498 26725 -36199
155 -36199 -60762 -26202 -6557 1618 18232 -8076 -66409 -54957 24492 54492 17230 331
167 331 11747 1514 1533 40212 46338 -6929 -22285 40555 85830 61309 29112 19319 9998 21218
181 21218 63723 67769 11031 -9420 47933 84382 50558 20054 21817 7176 -8766 29446
193 29446 70155 36238 -14369 2061 40675 31151 4738 -2386 -17821 -31611 2885 40595
205 40595 7595 -47612 -34417 5062 -8650 -37152 -26430 -21097 -47601 -39899 8572 9794 -46281
218 -46281 -71004 -41526 -23098 -28410 -25834 -30703 -52267 -43981 -186 3955 -42960 -61411 -29167
231 -29167 -10325 -18003 -11304 -140 -18313 -28758 1745 22044 -3618 -24840 -7117 10810
243 10810 14247 29776 36901 6927 -13479 21730 55636 30155 796 20700 44033 33806
255 33806 31613 48709 36284 3046 12189 50899 50634 20494 18459 33783 29571 24696 35095
268 35095 24195 -8940 -6635 30582 35685 2539 -7657 6650 1057 -13738 -3292 4101 -20745
281 -20745 -36626 -11691 7955 -10901 -32201 -30171 -29856 -34274 -22688 -14028 -33762 -48725 -26853
294 -26853 -5498 -22162 -43587 -35969 -25999 -31511 -26988 -9151 -9713 -26912 -26420 -8679 -3429 -11382
308 -11382 -14720 -13441 -9808 7240 23206 13564 -6813 -2149 18073 18837 7340 10672 20317 20091
322 20091 21518 33279 34226 16827 9349 19165 26765 25449 27605 27965 19668 18680 30931 31253 9796
337 9796 -3307 9488 21629 15983 10427 12070 7776 -1720 -225 4754 -2769 -13651 -11438 -1949
351 -1949 1109 -872 -5585 -16529 -25142 -19057 -10225 -16308 -26125 -19568 -7067 -7196 -15199 -16625 -17557
366 -17557 -24656 -26363 -16829 -8345 -9455 -12987 -11849 -7811 -4930 -6255 -14232 -20524 -12737 4102 9178
381 9178 1287 -1572 4285 6876 1705 -1057 911 2961 4920 10814 16478 16317 11209 5315 1099
396 1099 2625 9588 13132 9334 7676 15805 23865 17870 4542 -461 2965 5873 5557 7127 10595
411 10595 11802 9302 6514 5317 2683 -3662 -7493 -2998 5946 9722 5325 -1363 -2106 -871 -2558
426 -2558 -7921 -10687 -7490 -2297 1222 1536 0 -3441 -8476 -13114 -12220 -6976 -4452 -6256 -6151 -765
442 -765 3113 -1611 -11729 -16784 -13444 -7280 -5736 -6765 -4851 1063 3551 -2305 -8008 -7281 -5701
457 -5701 -8250 -8379 -686 7882 6382 -1063 -3910 -794 1268 -791 -4812 -3494 4816 13210 12103
472 12103 4866 2731 5982 5046 309 916 7919 11354 9492 9856 12474 9314 2770 -465 1359 4073
488 4073 8096 9759 8260 7219 9802 10093 2465 -4418 -2693 700 -886 -66 5689 6082 -1600 -5853
504 -5853 -3147 -3043 -8288 -9478 -5440 -3182 -2447 -1148 -4063 -11122 -12001 -6990 -8362 -15267 -12010 -651
520 -651 -70 -7388 -6803 -817 -4756 -14028 -11035 -1579 1004 -2058 -839 1289 841 1045 194 -4235 -5817
537 -5817 692 7059 4659 3239 9060 11647 5381 1542 5347 6819 3919 4894 10297 10841 8400 7948
553 7948 5506 742 2896 8405 5602 -1137 3131 11757 7274 -2825 -1094 4065 -1696 -8106 -2046
568 -2046 3838 -484 -3570 247 -14 -6623 -6633 -3443 -7596 -11557 -3068 3138 -4728 -10730 -2618 634
584 634 -8441 -12243 -3706 -1218 -7420 -5878 2185 778 -5831 -3297 1404 -1837 -4475 1689 4363
599 4363 -544 1102 8702 5532 -4214 -1230 6661 3869 -1771 3899 10613 4713 -342 3830 6643
614 6643 1719 705 4437 3020 -329 5212 8333 484 -3538 4133 6084 -4568 -7789 2507 5473
629 5473 -3354 -4059 2600 -56 -7134 -3891 1644 -2686 -6449 -564 574 -6645 -6092 2646 160 -9995
645 -9995 -6620 4591 1331 -7872 -2846 6650 2000 -5752 -2516 2664 -850 -2130 3159 3236 -1434
660 -1434 744 4948 382 -3265 3318 7497 707 -3213 4295 6980 402 -899 4542 3892 -1978
675 -1978 367 4335 1116 -1429 2643 2938 -2832 -2167 2572 -211 -5352 692 7476 -1485 -9403 -1618
691 -1618 5921 -2043 -8946 -1666 3546 -2640 -4775 523 -396 -4559 -197 3660 -4452 -7911 2663
706 2663 7257 -4351 -8180 4638 7852 -5526 -8213 4206 7053 -2393 -2598 5656 3369 -3790
720 -3790 247 5899 680 -2662 3552 4833 -2243 -1074 6771 3951 -5098 -2679 5811 2611 -5356
735 -5356 -1556 6045 3153 -3041 -2430 -513 -1322 -128 1091 -2393 -3125 2604 2615 -4940 -5081 3164 2910
752 2910 -5793 -4607 3797 2026 -5340 -1287 5500 326 -5858 -536 3409 -1485 -1772 3997 3161 -3276
768 -3276 -33 5649 -718 -6634 2754 10246 -587 -8237 2618 10404 174 -6703 1183 5193
782 5193 -1525 -2826 2177 1189 -2199 2417 4361 -4662 -7596 2668 5058 -5573 -7097 4092 4697
797 4697 -6244 -7050 3102 3039 -5887 -4767 2035 349 -4468 -1105 2185 -1202 -2582 691 -1165
812 -1165 -4076 313 4884 181 -4146 2024 6040 -733 -4301 2364 6194 1212 -565 2480 2841
827 2841 2169 3940 4221 -1285 -820 5954 4554 -3513 -999 8990 6252 -4961 -2898 6058 2842 -5681
843 -5681 -1652 5504 684 -5071 -805 2866 -2236 -4441 664 -153 -5971 -3482 1724 -1623 -7043
858 -7043 -1355 2710 -3784 -9112 -2046 3377 -2974 -6868 -931 2525 -2209 -4075 -1014 158 -1536
873 -1536 125 844 -1600 -294 4733 3999 -1712 -1212 4968 3520 -2216 -453 5532 5024 1199 1825
889 1825 3990 2806 1678 2992 1815 602 2422 4766 1419 -534 2863 4394 -948 -2998 1644
904 1644 2852 -2070 -2702 2280 1877 -3040 -3084 214 -1699 -4742 -2620 141 -2465 -4193 -433 -588
920 -588 -5251 -4501 -455 -1015 -6063 -3647 2179 940 -4042 -2511 2180 328 -3966 -3235 656 953
936 953 -87 709 915 991 1984 1784 -393 -480 3165 3832 915 258 3928 4790 1220 -217 1292 2382
954 2382 1367 1295 1582 1758 2277 2660 540 -1997 63 2400 307 -2498 -138 3240 1002 -2399 -1586
971 -1586 138 -1303 -2991 -2144 -918 -1080 -582 63 -1445 -2217 -589 -722 -3199 -3089 258 1249 -1839
988 -1839 -2028 1095 699 -2749 -2400 509 835 -974 -516 1909 1767 -115 102 213 -667 -166 1291 1028
1006 1028 99 1868 3430 1492 -1596 -261 1956 769 -1514 -10 2742 2666 -74 -680 479 571
1022 571 -283 -1385 -1083 7 1306 429 -1139 -825 1027 224 -2378 -2284 438 1638 -11 -1022 -31
1039 -31 389 -576 -1348 -1088 -620 608 702 15 -724 1235 1889 -147 -1554 -327 1680 856 -683 863
1057 863 2612 1527 -552 -663 457 937 -487 -512 225 872 1275 -69 -783 -202 489 -589 -1873 -961
1075 -961 962 948 -924 -1560 -519 -342 -1674 -2237 -939 289 499 -965 -1830 -393 515 -103 -1763
1092 -1763 -1687 885 1383 -354 -865 812 2158 242 -1474 -521 1414 2175 734 298 1416 2153 1503
1109 1503 95 88 1636 2594 1102 -119 1010 2098 2019 436 -405 929 1183 425 -147 433 1190 993
1127 993 -1294 -1672 -659 -47 -861 -1812 -1239 339 -238 -2231 -2185 -1259 -646 -2041 -3052 -1557 -178 -772
1145 -772 -2193 -1919 -608 -924 -2148 -2299 -763 576 91 -794 -679 254 926 -33 -589 169 1391 1753
1163 1753 964 835 1764 2103 1216 -149 325 2450 2680 1200 799 2551 2858 1275 -468 670 2238
1180 2238 1703 -6 -80 1477 1893 450 -930 -719 571 -248 -1478 -1174 233 823 -772 -1890 -1744
1197 -1744 -980 -1385 -2184 -2389 -830 9 -696 -1782 -2267 -1060 -552 -1889 -2612 -1279 709 399 -1326
1214 -1326 -1196 335 435 -1387 -1955 4 1365 763 261 531 1677 1377 451 -196 298 1705 1489 742
1232 742 884 2238 2072 721 -522 400 1240 915 92 792 1641 1725 335 -386 -147 169 -465 -592 -404
1251 -404 751 1241 -210 -1117 -836 -177 -946 -1783 -1447 208 919 -485 -1057 -445 116 -686 -1816 -2063
1269 -2063 -199 970 220 -717 81 745 -104 -1632 -1334 385 1015 -214 -179 710 844 401 -546 -657
1287 -657 -186 388 814 -28 151 1301 1862 33 -1503 -184 646 -155 -1041 44 1583 952 -506 -324
1305 -324 30 -395 -879 -570 -80 58 730 520 -309 -425 169 -313 -962 -847 896 982 -253 -108 1034
1324 1034 1112 -602 -1469 -194 588 464 488 515 730 1155 224 -510 -618 341 765 -214 -19 1307 1344 427
1344 427 -604 -352 584 -54 -444 68 209 198 587 -263 -1086 -1061 21 -824 -1750 -734 1030 397 -1145
1363 -1145 -1307 226 -204 -1729 -1791 -172 205 -132 -441 -229 -263 -413 -215 -386 -1026 104 927 519 -221
1382 -221 381 1012 350 -347 81 684 773 596 900 1241 1284 807 470 494 518 723 480 973 942 1369 342
1403 342 -288 475 539 -135 -678 211 659 445 -315 -254 -419 -457 -444 -682 -1349 -727 405 -216 -1566 -1383 68
1424 68 -492 -1905 -1689 -450 129 -1177 -1014 -59 -66 -935 -808 -34 -559 -423 -83 328 -416 -21 707 420
1444 420 -789 -188 1169 804 -55 -56 1443 1245 47 115 982 682 -18 406 763 671 913 635 275 177
1464 177 486 234 95 -379 794 718 -119 -356 -223 -261 -125 -365 -19 -456 -191 -249 -281 -875 -504 -296 -792
1485 -792 -1032 -118 165 -720 -1034 -39 363 -748 -1018 5 598 -164 -554 -117 698 101 -6 79 -50 -31
1505 -31 714 550 -191 -34 961 1046 -558 -614 755 751 88 21 651 720 393 -383 387 -111 5 -98 39 119
1527 119 261 478 -36 -536 -203 -64 -367 -875 188 545 -94 -441 -282 -128 -644 -420 -546 -507 81 420
1547 420 -221 -400 9 282 -176 -809 -192 825 320 7 7 693 471 -430 3 226 -29 168 402 376 235
1568 235 347 390 -112 -396 160 507 -44 -355 541 410 -16 -812 -106 183 -489 -574 -209 436 303 -27 -583
1589 -583 -663 -268 -486 -645 -315 120 228 -239 -637 -327 142 -191 -620 -629 237 409 202 23 -33 283 249 -36
1611 -36 -241 -136 693 639 -11 174 1039 405 -278 -80 343 76 221 77 254 525 515 262 -36 -357 -6
1632 -6 295 -296 -109 63 489 -239 -704 -315 435 -283 -578 -147 214 -18 -263 -129 -166 -453 -345 -410 -134
1653 -134 91 286 98 -140 163 190 -124 -357 -236 404 522 25 12 158 421 110 -351 -330 343 360 437 357
1675 357 493 281 119 -315 -411 465 191 150 228 614 597 376 -404 -452 65 33 -447 -384 109 324 221 -315
1697 -315 -266 -437 -216 -145 -332 -230 332 211 -320 -493 18 -238 -478 -217 44 -42 242 149 -152 96 3 -246
1719 -246 -351 -42 181 303 403 447 477 413 -34 -173 245 64 383 32 554 354 354 -8 -160 -314 132 -254
1741 -254 -95 -243 129 638 -172 -446 -315 -97 -246 -287 -313 -189 -168 -107 -474 -239 -221 -243 -406 -415 40 163 -329
1764 -329 -426 -388 -26 199 -460 -500 -117 206 43 117 184 160 187 -30 107 -46 350 266 226 126 432 657 204
1787 204 327 75 719 207 139 487 568 355 -223 56 138 339 -197 17 106 286 -88 -73 -141 -79 -351 -293 -478
1810 -478 -261 -155 -306 -340 -247 90 -92 -348 -465 -424 -39 -39 -179 -419 -270 133 -179 -510 18 -88 165 -389
1832 -389 -10 -102 336 97 -204 15 467 540 15 -40 261 631 290 38 -38 441 363 89 -50 198 264 61
1854 61 -93 -25 -110 15 -49 -264 -202 2 293 158 -176 0 -66 109 -259 121 171 192 -297 -458 148 52 -124
1877 -124 -248 134 251 -35 -257 -149 227 -115 43 -232 32 255 216 -44 -103 362 39 -79 -12 197 -17
1898 -17 18 42 -93 453 101 -176 -40 142 159 288 -14 -191 -77 77 -381 -126 -250 -230 -69 24 -229 15
1920 15 347 137 -262 -213 129 -193 -266 35 129 71 -99 22 -55 -147 76 -228 -104 505 431 85 53 -26 209
1943 209 450 159 94 -78 699 -65 131 -13 445 94 -106 -152 214 137 301 142 -65 15 81 -284 -382 -152
1965 -152 133 53 32 -150 -163 30 -315 -334 -246 100 -444 -382 -230 330 -140 -336 -147 -193 255 -113 -317 85
1987 85 72 113 -138 -351 260 221 44 -135 185 613 649 419 237 225 412 180 27 -86 286 557 232 126
2009 126 104 360 551 -250 -43 216 670 20 -35 344 185 83 -257 -191 65 200 -149 -273 -136 -233 -405
2030 -405 -398 -475 -366 -358 -308 -382 2 -32 10 -587 -563 -247 -119 -317 -197 -9 165 26 -261 -30 289 -112 -450
2053 -450 -195 271 113 111 188 287 491 478 349 290 120 420 462 341 88 454 596 47 -99 221 488 335
2075 335 -103 -17 485 387 83 -99 267 104 -96 -347 6 9 -34 -92 -28 -220 -202 -123 -209 -570 -93 -25 -77 -388
2099 -388 -275 -191 -15 -550 -377 -97 292 -15 -404 394 219 -1 -119 -112 -168 28 243 -102 218 68 68 -85
2121 -85 -65 288 290 246 -360 34 289 307 212 410 -275 144 -11 -144 -490 411 156 -98 -204 330 193 -170
2143 -170 -101 252 335 -84 -324 109 -16 -88 135 -96 -184 -275 397 -25 -77 -218 160 -266 -539 -137 493 204
2165 204 75 -84 243 288 -199 26 -152 407 261 87 -8 96 169 -308 -276 -116 137 -24 -271 -30 -1 54
2187 54 -299 71 -561 -84 -73 -19 -384 -48 325 -243 -269 -497 -81 -224 -65 -372 -130 -38 -163 -371 -260 -120
2209 -120 87 -80 98 37 274 62 39 -251 84 227 169 -24 39 316 494 -82 13 755 452 286 245 397
2231 397 786 329 191 171 342 225 -187 -53 -172 357 134 -131 -111 -212 369 -335 -529 -344 -276 20 -136
2252 -136 -409 -198 -76 -252 -596 -510 -289 -93 -286 -682 -280 -56 -211 -688 -296 -121 96 -223 -433 -43
2272 -43 -112 -46 -181 13 -75 -67 242 337 383 342 482 14 47 364 173 249 125 358 737 339 -37 192 651 211
2296 211 -64 -140 189 277 -13 -257 162 48 162 -96 -631 -265 49 -124 -299 -241 -162 226 -435 -400 -148 133
2318 133 -267 -597 -410 159 164 -116 -469 -103 123 128 -137 102 597 367 -360 -55 -63 -95 7 -71 34 392 499
2341 499 234 206 140 514 93 128 -231 90 416 -69 20 -9 644 225 -158 -49 -150 200 -55 -277 -93 94
2363 94 -355 -176 -493 -228 -29 -134 -131 -295 127 -103 -358 -60 -196 274 268 -26 13 276 300 -47 -340 49
2385 49 345 -22 -19 21 234 191 -112 -283 213 141 -3 -154 -43 436 6 154 -93 336 221 240 -131 75
2407 75 290 146 101 -152 116 183 -113 -113 -278 97 -107 -177 296 -137 124 -3 -552 1 -98 -96 -242 -559 -72
2430 -72 -180 -271 -294 -20 317 34 -152 -392 -230 194 169 39 -78 289 233 -358 -78 184 481 383 -26 55
2452 55 382 310 96 15 348 233 193 -155 38 7 309 12 -1 289 71 166 76 -80 50 132 -132 -187 -26
2475 -26 20 -89 -237 -401 -46 -265 -256 -444 -303 215 -148 -483 -166 37 19 -324 -158 7 140 -11 -230 -136
2497 -136 -4 18 -71 -209 198 -40 626 -193 94 140 267 205 180 276 411 183 29 115 122 421 136 32 -8
2520 -8 -11 280 -64 194 281 94 -140 -349 -92 -11 -83 -35 -216 213 -84 -367 -338 -250 -271 83 -411 -260 113 -295
2544 -295 -150 -268 92 -110 -24 -514 15 122 115 -247 -408 86 568 86 -349 -23 388 317 178 -127 -210 274
2566 274 322 -245 -140 124 181 180 -148 249 358 197 153 -175 -93 31 -16 140 255 209 -113 -214 -48 -287 -257
2589 -257 -28 -74 -178 173 92 -228 -519 -71 -355 -308 -265 -334 -98 -199 28 -51 181 99 -272 -11 -345 141
2611 141 100 -226 92 415 316 265 -98 162 250 104 306 207 379 593 363 447 347 347 608 137 -52 104 231
2634 231 296 -35 -240 15 -114 -460 -405 -58 266 -444 -226 -126 -16 -8 -258 -56 -65 -178 -10 -474 -299 -2
2656 -2 -297 -228 -624 -68 161 -292 -243 -321 -194 -28 36 -439 -347 425 154 -116 -206 275 137 94 -184 118 342
2679 342 162 273 103 183 94 -21 -140 -14 295 136 -19 93 349 359 100 140 97 176 198 -187 -394 225
2701 225 164 -127 -195 -80 -38 5 -184 -117 -155 -35 -112 -86 -118 -94 -68 -350 -478 -7 203 -210 -454 -177 267 196
2725 196 -45 -77 35 283 145 170 -159 375 163 -32 -64 20 339 -159 -122 -296 -24 103 -25 -133 10 -157
2747 -157 -8 11 -293 18 305 -410 -619 -80 80 -100 -362 -52 -58 -207 -144 -3 -84 -35 191 -262 -223 50
2769 50 21 111 145 -40 53 50 -16 127 526 233 73 -243 24 167 220 -102 -13 126 54 -12 159 239 428 486 126
2794 126 248 377 398 129 236 -17 617 135 -133 150 -57 -52 -113 -46 -118 12 124 -675 -347 -46 -53 -119 -403
2817 -403 -383 89 46 -552 -414 -210 -229 -431 -247 -172 -301 -89 -118 -130 -35 146 33 107 184 303 77 355 24
2840 24 66 197 366 144 416 339 418 375 278 445 664 392 161 99 272 369 44 271 454 201 -83 -167 -10
2863 -10 -69 330 -60 -98 -156 53 -96 -288 -413 -488 -205 -413 -416 -454 -14 21 -558 -397 -126 -253 -409 -296 -336
2886 -336 319 -94 -172 -374 -110 133 -298 -109 -223 -49 431 -72 -216 143 108 148 -25 -260 374 178 -111
2907 -111 43 348 423 240 -34 404 158 400 99 -134 244 542 257 45 -133 362 130 -77 267 -72
2927 -72 114 -48 -39 -13 -320 -31 194 124 -436 -139 -127 -325 -331 -391 16 -172 -385 -211 -28 92 -106 -20 104
2950 104 -76 -406 -280 456 147 -88 68 -35 237 -151 -164 -118 -314 141 50 -98 -248 262 197 -56 213
2971 213 229 173 -65 -171 -334 418 71 -32 -322 214 233 -123 -159 -92 237 -225 -166 4 -59 -296 -217 -49 -32
2994 -32 -161 -32 -121 -143 -27 60 44 -73 237 20 246 63 -64 -66 148 -148 -430 151 197 10 305 64 -18
3017 -18 173 84 -107 57 -75 143 112 70 106 248 62 -302 -364 301 -281 -90 -158 -208 -38 18 -108 -259 -152
3040 -152 -174 -269 -539 -295 -54 -28 -420 -128 -120 210 -269 -217 13 126 -109 -64 -153 179 167 46 -229 -96 314
3063 314 409 35 265 346 278 139 112 86 141 22 32 408 211 198 359 0 191 419 40 -64 113 42 250
3086 250 -88 10 -176 176 -241 84 -437 82 281 238 -131 -285 -21 -60 -150 -160 -50 -238 -193 -158 -110 -233 -136
3109 -136 -196 -196 -191 3 12 -8 -198 -293 179 -93 -215 -69 76 158 14 122 165 164 142 26 -31 444 12 122 189
3134 189 166 70 -31 176 -30 275 163 314 123 392 234 -216 259 -157 220 133 28 -270 -45 -19 93
3155 93 -117 -107 0 10 -242 -215 -93 250 -15 101 -341 -407 -186 40 -200 52 151 -112 -9 -97 -38 -165 -309
3178 -309 2 -121 13 -113 61 125 144 213 -194 84 -12 -20 -126 230 112 387 152 -44 18 112 188 77 -29
3201 -29 39 83 68 -164 86 -178 -53 -82 -111 41 -110 -186 -45 -322 -13 -2 56 214 -135 132 -269 -8 224
3224 224 -19 13 -159 69 -150 -139 -129 91 391 -122 67 363 -2 92 177 34 239 120 261 146 98 -11
3246 -11 8 -48 -45 -22 126 284 127 211 110 161 79 145 127 -133 -104 9 -225 -86 110 -62 -361 -243 -72 -148
3270 -148 153 64 -62 -310 -68 -94 -91 33 56 137 116 -84 -128 41 180 -116 -153 -123 -156 126 62 -65 272 136
3294 136 2 168 -89 39 226 221 -2 1 363 30 -138 158 139 144 126 129 231 178 236 -213 53 226 108 -28
3318 -28 -121 50 166 153 -93 150 240 80 -233 -82 -169 43 -203 -60 -281 -167 98 -200 132 -199 -9 76
3340 76 -90 239 -134 207 -375 -40 -43 -14 2 137 83 214 207 56 -113 21 292 190 139 44 458 94 215
3363 215 -260 -19 248 113 42 -9 61 141 198 81 -228 117 91 -22 1 28 122 31 -45 -446 -107 -101 32 -41 -3
3388 -3 343 378 -101 -252 -45 94 -48 -98 -137 -16 145 -147 -177 37 38 68 10 19 -84 -101 111 120 -111 345 214
3413 214 170 127 296 -58 53 -9 473 314 93 86 -144 218 -200 8 112 -100 15 183 -104 -18 169 -153
3435 -153 -188 149 71 92 -11 2 -8 -80 -111 99 -33 241 11 79 2 165 272 -39 -347 -61 -154 -12 -37 -39
3459 -39 215 163 322 -181 -296 -184 24 -29 184 -321 270 478 -165 -7 240 200 -48 -208 45 282 -117
3480 -117 -145 -140 100 7 1 55 2 57 -22 -233 -328 -68 86 20 -82 -25 112 2 -32 -134 246 198 -32 -54 202
3505 202 416 25 196 -424 1 -187 87 69 -95 298 246 92 23 67 378 112 3 -171 -42 317 263 -47
3527 -47 322 207 194 29 161 143 188 100 184 121 157 -40 -145 -9 177 113 -200 75 -380 -231 42 -147 -262
3550 -262 -146 121 -174 -197 -96 319 151 97 -25 -310 16 -37 -197 14 174 -211 -187 -139 55 173 178 -169
3572 -169 25 -88 -122 -53 173 -158 305 176 -69 101 290 183 -11 26 95 -2 44 253 32 406 75 26
3594 26 -142 -132 156 -10 -158 91 50 70 -103 109 53 -105 -33 4 -261 -26 -158 -99 -166 -77 86 -70 -174
3617 -174 -254 -163 -129 -99 18 -12 83 -34 -135 -259 81 53 -89 402 13 -18 -102 4 59 17 -68 118 -3 233
3641 233 -122 -146 72 37 -143 -32 154 -81 -108 359 -28 -275 184 -43 61 -168 -132 -21 -115 -240 -522 145
3663 145 294 32 -87 -11 -133 300 -40 32 -174 -5 286 -362 -37 60 222 -277 -251 -113 104 119 107 -118
3685 -118 -9 -101 379 36 -15 110 33 -52 50 -154 162 141 -25 -71 -40 92 -386 219 0 -20 -81 -96 -294
3708 -294 -198 -275 -23 -171 121 8 -13 -5 129 17 204 -215 -117 -427 116 -291 -357 -97 -40 -208 -134 -352 -131
3731 -131 259 -55 -149 1 64 -9 -81 221 100 212 -66 -303 76 -161 168 -48 66 -165 307 236 -37 -157
3753 -157 -109 171 125 169 10 191 211 27 217 39 -67 -282 148 43 -209 -261 26 8 74 58 -211 161 -244
3776 -244 8 -93 -351 -219 -55 15 68 -72 -151 84 -144 -96 -29 63 222 -63 -53 -197 42 -150 23 191
3798 191 167 -58 -122 -5 92 129 -171 -131 131 -81 384 102 -129 104 192 271 -46 90 53 262 -316 30 19
3821 19 -110 173 122 -25 -120 -128 -80 -266 -71 -38 117 -71 11 -388 -25 -39 76 -398 238 -45 76 -247 -107
3844 -107 -20 188 -29 203 -42 305 -74 -308 -321 -150 -26 -59 54 103 -159 52 181 447 -134 -176 -127 -173
3866 -173 252 132 -142 -35 -124 94 195 -68 202 -68 35 -83 -61 -202 -95 333 134 -92 -113 -197 21
3887 21 9 -229 -140 -49 -257 33 -273 -119 -96 37 24 335 -98 -128 124 -64 78 -113 64 35 172 -48 -377
3910 -377 114 250 105 85 124 175 96 224 -108 104 82 365 -288 -1 -219 254 70 -217 209 -1 199 -143
3932 -143 -79 -56 -244 96 -74 -78 -155 -148 -278 233 -44 -172 -133 -16 -72 -39 -234 -71 -169 193 216 77 -8 -154
3956 -154 215 225 39 -164 27 -103 206 145 -135 192 52 -67 -217 179 -51 343 -44 139 -103 58 62
3977 62 165 118 95 -14 -16 19 -169 181 6 -223 -38 128 -5 262 -322 99 70 79 36 -257 -73 219 -9
4000 -9 85 -40 -382 115 20 -355 -10 -201 -276 127 61 -9 126 -194 191 -162 206 129 -12 6 165 123 93 206
4024 206 50 295 -35 111 16 377 -69 36 -32 219 -59 -211 66 69 -2 371 87 -201 -91 -411 37 -281
4046 -281 126 -172 108 51 174 -320 40 -127 -128 -73 -49 -36 -22 49 -521 -77 -78 39 -27 207 -131 -32 -202 163
4070 163 155 112 334 107 237 135 51 -15 9 -181 -43 31 254 -40 -83 308 -31 -121 -140 -80 78 66 -209 9
4094 9 328 -191 173 -79 102 190 -153 -173 30 199 -22 -289 60 363 -95 1 105 -289 47 28 -262 236
4116 236 -132 -175 73 5 18 -214 26 -134 3 -61 225 -2 10 299 -13 55 54 184 -134 191 27 -270 -279
4139 -279 34 -116 -176 -29 -4 -180 38 147 266 -158 -4 -86 94 -66 -80 -205 -60 -185 88 64 -27 -45
4161 -45 176 -19 -158 -176 -289 -183 -116 -70 -38 533 43 245 -109 -491 -236 -58 -81 237 118 -90 84 -40
4183 -40 -206 -118 -46 54 -219 -85 104 400 58 -63 -71 -309 -140 -202 -126 -12 -37 296 135 38 335 114 -97
4206 -97 -123 -59 -20 257 -113 -143 186 -27 -80 -7 22 218 19 66 25 190 -203 -212 65 -29 51 107 -80 48 -127
4231 -127 -90 -68 51 12 231 88 12 97 111 -1 202 -99 -188 -201 -77 184 120 362 93 20 93 130 17 66
4255 66 -131 143 158 -114 118 -18 87 132 450 282 43 37 164 -22 -126 0 -71 -35 -185 -232 17 143 -33
4278 -33 231 -46 -94 -151 -110 -291 -44 -114 -28 -159 -55 146 -431 111 -96 -17 -185 236 -257 20 207 88
4300 88 -30 -238 -103 -113 -37 41 -315 278 -108 86 -3 176 56 -64 133 136 11 61 -46 302 -238 -9 20
4323 20 -16 -110 -154 222 132 8 -60 -110 -57 -132 33 30 -20 34 -17 -57 65 103 -194 -117 327 60 -16 -167 167 -100
4349 -100 133 -126 68 284 181 -51 88 39 -62 237 -217 106 -181 286 152 -238 78 141 274 182 -61
4370 -61 -133 -62 168 -23 -91 167 -90 93 195 50 -137 -148 -38 -80 194 -55 5 111 -96 -88 -18 161 -147
4393 -147 -64 -161 80 -27 114 137 38 -44 13 403 205 219 86 -206 105 60 -17 154 30 365 -125 240 236 -204
4417 -204 -32 -42 -8 211 225 219 -6 -202 94 61 28 48 176 -54 176 -230 -86 -257 143 -49 -127 61 145
4440 145 -258 113 90 12 177 62 -386 137 -148 -289 -90 223 233 7 11 -220 -141 -125 91 -32 251 94
4462 94 128 235 -60 279 -5 96 -35 39 207 148 -21 -14 432 -26 370 295 -199 -158 31 -36 -96 -36 216 50
4486 50 169 -19 -285 119 156 -230 40 300 103 -224 -211 -228 79 -148 -22 88 209 -93 182 67 -13 -166
4508 -166 21 50 -107 2 -27 -56 -260 93 -12 192 -325 208 -213 -131 -72 -14 40 286 67 210 111 173 111
4531 111 74 280 6 -9 -65 83 -253 156 -23 29 118 146 96 -7 -24 -171 13 -20 57 -31 21 -276 125 174
4555 174 234 121 -209 -31 -24 -97 26 152 -34 -4 73 352 270 -61 -120 38 -32 29 -416 -300 -116 248 -235
4578 -235 49 -21 159 150 -124 -117 36 -75 -52 -69 260 120 20 -38 236 -15 86 -245 -250 -44 -174 -53 -45 155
4602 155 -17 95 -216 53 73 52 -173 -42 144 -1 -16 -184 -309 -108 -150 -300 -48 -181 79 -156 -51
4623 -51 105 145 25 -309 95 -35 -41 30 -322 123 71 -27 -21 3 156 43 389 81 203 -115 101 37 -31 92
4647 92 17 -30 53 -99 335 -104 51 66 -56 149 6 2 -173 179 -130 66 -73 -24 166 16 -113 41 -42
4670 -42 233 49 29 -161 -125 -76 -67 -92 -344 28 327 -106 -5 24 -198 13 154 -115 -62 154 -30 109 -2
4693 -2 78 -32 -3 -42 39 173 -112 143 -28 -15 111 -51 54 191 182 232 -206 -189 162 44 -51 -195 -11 -47
4717 -47 -188 -77 -75 -78 -200 -244 -165 -15 -96 -184 96 11 37 -33 -85 189 118 -97 -72 -91 -1 -67 320 29 -7 143
4743 143 17 126 166 287 73 104 70 164 -160 -134 30 -138 57 306 52 323 161 -59 247 64 -275 251
4765 251 -109 -122 -74 49 -70 -158 -171 -214 228 -157 -85 -183 155 30 69 44 -490 181 -17 -393 344 -37 -309
4788 -309 -149 -94 -229 148 -143 -251 -28 13 70 -12 246 -141 -269 -256 -112 360 131 173 386 -91 -289 143
4810 143 -114 12 -197 -1 -36 -33 -80 256 -124 -2 93 -99 -172 13 295 -395 -86 64 -139 181 33 56
4832 56 173 267 134 -161 -31 34 120 -275 -146 3 93 -88 -289 63 121 -50 -24 -4 5 -126 -112 52 -33 335
4856 335 -74 55 96 90 23 116 -139 240 -138 -136 208 -111 71 149 33 39 -148 14 254 -72 -81 -29 -65 9 13 -125
4882 -125 -86 -43 -121 -134 246 28 -116 47 134 270 -389 163 -100 57 -118 -305 -247 -92 -122 -199 -72 -100 -376
4905 -376 137 101 -14 -119 237 178 -89 6 44 299 193 54 -38 -38 5 43 -7 -68 -272 93 -115 -113 114 -107
4929 -107 59 90 164 129 -38 -132 -156 31 148 50 -148 -189 -139 84 -195 101 -147 90 -75 162 -27 -15 -73
4952 -73 149 98 -18 167 148 84 -80 58 128 -257 342 -17 4 -30 15 -92 215 -2 -38 489 -60 51 128
4975 128 9 -37 -139 210 -86 54 -91 231 -267 -189 160 88 -2 -209 -45 9 249 216 71 18 -193 113
4997 113 -43 -214 -81 217 -127 -81 -156 100 -248 81 -190 -38 -7 27 -158 67 -15 36 101 30 62 -51 -121
5020 -121 152 354 84 102 -136 -170 17 150 -36 209 1 262 49 193 119 -89 112 343 183 -216 74
5041 74 -271 -40 181 -15 -86 4 -196 135 172 -235 -270 -64 -38 26 88 -129 -257 353 39 47 -1 -374 -13 62
5065 62 77 -95 -4 162 85 -200 317 33 105 -141 57 75 -97 161 -91 -84 -147 42 -156 -148 -10 67 121 -150
5089 -150 131 194 116 -90 133 240 -87 -117 266 85 152 186 28 -40 15 288 -208 85 113 120 169 -150 -29 -140
5113 -140 -45 18 -58 -170 -71 -63 126 -65 -80 138 238 31 -104 -220 -142 -3 -431 -113 124 -27 -257 50 382
5136 382 61 265 152 186 59 -13 312 68 -56 185 59 -249 -18 108 -12 -150 -66 81 -186 -58 46
5157 46 46 -142 -68 -308 -156 132 -228 -74 -122 -151 -92 -322 16 26 108 -116 -194 37 -123 71 129 31 170 -143
5181 -143 -77 48 149 -91 -42 -98 -81 355 39 194 45 -50 -46 -129 140 142 114 219 208 -467 -122 -26 108 90 160
5206 160 -116 -219 -30 -270 15 63 -102 -281 -30 103 -247 145 -193 -163 -146 190 -182 -227 -210 -61 89 -184
5228 -184 -183 -142 23 -70 -31 -30 -231 -161 3 -67 317 9 -116 441 -265 -15 188 -140 276 -242 -211 -64 125
5251 125 170 157 -12 -277 171 -18 -100 -4 -98 -119 235 64 130 -62 238 162 -82 92 -36 -221 -114 41 -7
5274 -7 -290 5 124 -141 -337 41 49 -24 -197 254 -11 70 9 -307 -179 -103 -111 -171 -77 188 40 -277 -144 186
5298 186 -116 -66 339 61 183 -21 -329 -217 122 171 189 148 73 197 304 -173 -55 179 -4 -89 124 46
5320 46 402 30 -191 -17 115 270 -105 -189 134 280 -255 203 51 -178 -9 35 34 247 192 -59 -147 -101 36
5343 36 -242 -20 -190 5 -17 -72 -189 -80 -208 11 -57 122 -124 2 161 33 117 -210 15 50 -23 144
5365 144 253 162 135 89 93 149 -30 143 -52 101 243 177 -199 -28 29 -115 65 -106 3 57 -38 -181 -270 261
5389 261 144 -69 -120 -278 97 11 -178 -109 9 38 -288 67 -569 175 -110 131 -169 20 108 -88 112 267
5411 267 275 -135 264 -216 -2 0 -176 132 169 312 130 -59 -23 71 198 15 274 218 70 -9 17 390 238
5434 238 -35 -216 303 224 -33 546 -19 8 -63 33 150 -137 -48 233 131 13 1 -81 176 -82 -24 -200 23
5457 23 -130 -25 3 73 244 -186 -237 -55 109 -89 -99 14 175 36 -54 -229 -122 -64 65 56 42 47 110 244
5481 244 -38 -229 164 -15 -31 -12 297 146 -48 46 -42 -24 120 -65 28 46 -176 58 -240 -138 -19 -40 -280
5504 -280 60 308 53 258 -402 -6 -26 73 -75 -4 -135 -37 -152 -213 -137 -183 -205 -110 -137 -60 12 158 137 -74
5528 -74 -69 11 10 219 -53 263 205 -67 -87 28 313 170 -142 -28 51 485 85 3 146 135 125 50 25 41 -117
5553 -117 -269 16 30 64 133 209 -20 188 159 1 -155 -9 -161 -67 -140 -239 275 49 -166 -59 -196 -34 189
5576 189 -59 -289 56 -150 67 123 -52 -240 -212 149 43 58 265 -10 171 -35 220 36 -34 73 305
5597 305 124 173 -373 -76 -58 120 -100 -3 127 296 183 -111 69 328 -16 213 -41 22 -84 -196 -311
5618 -311 -25 -4 -59 -348 -330 -72 -227 -198 119 -167 14 -159 -41 -227 -123 134 366 -177 -152 179 -3 143
5640 143 178 223 -354 120 216 -93 112 144 -381 28 -18 234 1 -158 91 428 -140 180 53 270 152 -175
5662 -175 160 93 315 189 12 466 249 39 50 -97 -111 -84 129 -170 104 -13 -248 -197 -129 -286 -404 40
5684 40 53 -184 -88 -130 -26 0 -253 -66 -79 -179 -279 57 -48 0 -8 -146 374 247 149 -292 78 228 76
5707 76 -144 272 -84 126 10 153 141 -191 103 63 356 105 86 -201 85 191 338 -16 -41 10 -46 -128 258
5730 258 210 -214 40 13 292 -57 132 -17 -207 -76 273 17 1 -135 -59 -44 -377 -172 -29 -201 12 -254
5752 -254 -100 76 79 -98 101 16 83 136 -200 298 -27 181 97 -197 25 86 111 115 -1 98 -141 305 66 -30
5776 -30 245 -297 -9 192 -19 -77 250 -366 151 -233 -104 -144 -109 -29 214 -156 -326 22 -113 -106 7 272
5798 272 -238 -159 -112 -152 -4 -237 -231 53 -216 225 194 233 -350 -256 -11 -122 -68 -142 44 261 372 -13 -83 155
5822 155 307 59 -54 401 168 80 -10 -153 29 298 368 26 6 281 539 -3 -43 -263 108 94 -232 6
5844 6 -301 -58 257 30 -273 2 -4 85 -338 -257 96 -102 -155 -243 -103 35 -287 -339 -102 165 -89 -226 4
5867 4 82 24 42 50 162 62 157 -62 63 160 -36 78 69 -91 165 166 -99 -19 138 42 19 87 94 -26 -15 123 71
5894 71 75 220 -64 150 41 -69 91 -237 41 87 -65 80 -374 -27 -38 -24 -227 62 221 -364 -185 -285
5916 -285 13 -264 99 -25 -244 -357 -89 4 -227 -28 99 -65 -281 -128 -189 288 -99 -314 92 200 34
5937 34 -144 -69 52 30 59 181 64 170 -133 287 -32 132 58 203 -113 381 -11 143 49 -18 76 8 65
5960 65 65 -73 -2 91 -214 -102 -361 20 -115 -133 -28 326 -62 -196 122 39 -6 69 16 -108 30 243 38
5983 38 -324 -117 -125 2 23 -10 -72 290 -270 -67 230 116 9 149 -160 127 236 14 -51 1 288 -8 -46
6006 -46 -91 94 116 213 30 175 -169 -32 37 150 -87 86 -169 -77 -446 -134 -312 -178 -179 -55 40 61 -252
6029 -252 -269 155 2 -49 -131 346 94 45 -208 178 -178 26 -45 17 -115 -71 -31 -237 133 159 192 193 281 58
6053 58 -28 342 -65 342 184 28 -68 -24 -35 86 -207 -16 -158 -115 -125 -171 120 75 13 -6 -50 294 -42 40
6077 40 0 170 -82 -162 -116 -2 6 160 216 -16 -141 -42 220 -44 -100 -118 125 -174 179 80 54 190 -139 -145 211
6102 211 155 96 -139 65 72 283 154 -94 38 -22 -262 -49 186 -150 11 -45 74 171 -61 -303 -28 7 -27
6125 -27 -75 -189 44 80 -32 40 -155 41 129 51 4 91 -41 15 -55 -118 -290 -239 -8 98 98 -303 24 55 -54
6150 -54 24 62 107 -107 196 53 -120 257 45 -141 -32 99 36 8 164 189 193 111 -6 -89 -39 12 235 -53
6174 -53 -6 235 -279 12 173 112 -43 -325 -60 -189 15 -151 -84 76 11 77 -1 132 25 -12 -190 23 274
6197 274 -72 -97 -2 12 -68 212 298 -13 218 85 317 -28 -25 -35 -174 80 193 -157 161 233 -111 -48 -105 117
6221 117 183 -118 99 -127 -70 -87 131 -26 -219 234 -251 -32 40 146 -331 -22 -198 -15 103 -171 203
6242 203 139 -79 -62 112 -243 213 -169 -295 168 -5 -77 -130 199 46 -82 -119 197 -77 162 142 -178 -518
6264 -518 -20 -93 143 78 134 290 -57 90 23 -23 220 5 -174 64 323 -67 -102 86 -56 4 -145 86
6286 86 -18 246 426 -21 3 59 50 133 -59 18 -33 243 -62 -105 -18 69 -72 5 -185 74 -26 21 -220 1
6310 1 225 -214 148 178 145 55 -257 -151 263 -155 370 79 -33 127 14 -226 197 138 -26 -5 -167 71
6332 71 -246 -56 154 60 -80 84 -54 41 -282 -32 -89 104 -307 -8 179 123 -165 232 156 209 -67 62
6354 62 125 59 250 -69 -149 -18 -232 -240 -215 37 -208 167 -16 10 149 -219 -259 -50 116 99 -198 -10 9 50
6378 50 -43 78 318 213 47 4 -57 55 1 -17 12 35 -196 75 -33 23 -80 -190 -70 149 25 -1 -64 270
6402 270 -74 -112 -89 181 -214 -197 -304 -301 -42 -103 -72 -193 -107 70 148 -392 -226 122 -192 -167 -308 41 -23 -120
6426 -120 -374 -70 154 286 -173 -131 -151 79 254 -257 214 234 29 -212 317 91 11 -172 1 -152 422
6447 422 486 -64 -190 -216 -227 12 218 76 -43 -14 18 31 -76 -96 139 -266 -159 60 61 -41 -157 156 -282
6470 -282 -102 -97 31 -154 -348 -110 100 318 269 18 232 202 133 -66 121 -57 132 -140 -50 -399 -2 107
6492 107 -93 -407 77 451 -28 -157 -106 42 116 127 -105 -67 103 -28 -140 97 -87 78 109 -5 -352 -62
6514 -62 96 -120 124 26 32 81 168 -7 142 -10 266 98 -252 -46 -219 62 300 -54 41 -73 174 83 288
6537 288 76 -326 17 -154 90 -192 -228 26 22 -116 194 172 91 212 -153 272 161 312 -20 145 -157 -119
6559 -119 -5 -78 -205 50 32 3 -61 79 141 -217 -516 -99 124 0 2 -247 -70 156 129 126 100 -36 -16 -2
6583 -2 22 -19 203 -4 110 -316 -81 -189 252 -2 126 -39 -54 -38 -136 235 120 329 -218 215 -162 175
6605 175 37 169 -61 244 101 102 -64 6 -147 -12 8 -25 -128 -216 -81 -28 145 -43 -62 -61 -26 -169 68 202
6629 202 -161 -197 269 59 -108 -110 -36 26 3 -210 -30 -199 -187 -52 244 -81 17 196 25 35 -244 -121 55
6652 55 -41 267 297 79 113 -18 56 61 -110 -357 163 -141 137 195 -184 23 -76 50 -46 76 105 56 -162 43
6676 43 2 -39 -100 62 106 350 -116 95 -99 149 165 23 -293 -289 62 -47 143 9 244 -76 -399 -240 -104
6699 -104 -138 -8 41 -252 -112 57 -14 193 -196 242 68 89 -177 -24 17 248 -84 54 -90 101 -155 27
6721 27 -87 307 263 -161 101 291 -132 268 234 278 -44 43 111 71 -43 166 -20 86 -45 92 -3 -121 -12
6744 -12 27 129 202 90 225 153 -187 -204 -9 -45 -236 -316 -115 156 93 -77 -162 -81 -105 -139 -96 80 95 -155 218
6769 218 -59 -171 48 310 -77 -170 -26 109 166 -93 200 -37 101 -167 170 -102 -100 89 169 -4 -146 -82
6791 -82 -212 -221 100 -111 -136 -138 -179 -102 -105 -129 67 -241 -65 131 -256 67 61 168 35 254 -167 -282 48 32 153
6816 153 179 74 -28 -19 -141 -253 -65 308 -170 -53 -94 122 152 -27 -100 -45 58 261 -55 -29 185 -112 -116
6839 -116 -98 -8 23 -85 0 94 -275 186 21 56 131 294 184 5 66 -88 6 131 -145 -403 228 127 326
6862 326 263 -112 -257 -239 196 -206 -98 -7 29 9 52 76 -66 -273 121 -33 -123 -100 -106 52 -319 -88 -440 -296
6886 -296 -250 -187 -302 -53 0 244 263 -45 120 -275 -233 116 52 241 5 -39 -62 273 -315 -175 152 269 -89
6909 -89 -12 -90 79 124 -116 18 345 37 -216 18 -30 -65 27 41 -90 -96 175 -297 231 -91 112 53 111 29
6933 29 -119 80 68 94 -84 -326 -79 62 54 154 -17 -114 20 -175 -105 36 144 207 198 -148 240 -19 -56 62
6957 62 -148 302 -138 332 1 -194 41 -11 -112 -4 -118 127 -4 7 -142 81 -128 -101 61 -82 -187
6978 -187 -185 -102 -41 -337 -122 -115 -59 -100 -327 23 -76 -144 -48 15 62 -63 186 -136 -211 -55 142 93 -48 95 197
7003 197 181 -136 -136 65 30 -89 9 99 292 -203 -263 -106 -145 151 -61 -66 -86 98 -187 -168 1 13 -30 62 377
7028 377 37 -370 -19 -74 -85 -80 183 245 -102 -365 -178 -99 -15 -139 -87 -31 -59 312 140 -10 -238 -86 117
7051 117 -120 -26 144 55 -129 93 -19 141 -338 4 225 176 212 227 240 28 -9 -48 146 168 -26 31 132
7074 132 72 -139 -67 -29 -17 -240 -156 -133 -97 257 -254 -135 8 149 -120 -36 -85 224 176 -14 -53 33 -302 -39
7098 -39 -61 -206 107 57 68 -116 -330 -88 -105 -112 -204 65 -218 -115 -80 -169 -130 183 345 313 -30 88 -1 -98 -69
7123 -69 137 -107 -47 359 313 -1 41 -118 33 -16 -232 31 -58 -65 -170 24 -177 -119 -96 119 277 269 -185 54
7147 54 33 -47 -217 156 -116 -62 -15 -167 -157 105 -168 -6 87 174 211 -23 178 55 18 166 184 -55 -123 -33
7171 -33 122 234 99 14 -69 344 129 11 302 64 33 73 -126 145 103 115 127 -173 50 87 -134 -161 -53
7194 -53 113 -76 216 -193 -11 -9 -21 168 -62 -51 18 115 79 -321 -116 34 101 270 279 -274 -224 91 133 -54
7218 -54 -86 157 59 238 -59 364 298 227 -63 -142 -32 129 -20 -41 347 4 297 19 144 -86 97 -55
7240 -55 215 0 111 -41 113 -3 19 62 16 -44 234 -84 127 149 177 28 -114 32 133 40 -1 173 77
7263 77 202 -80 -303 17 36 -44 189 125 -60 -45 -21 -134 -4 -116 69 93 63 -135 -102 -85 5 325 -146 127
7287 127 66 138 68 98 -188 91 344 -190 -16 -65 -107 -82 -236 151 -236 -65 67 192 -40 -52 -23 -92 -278
7310 -278 61 -204 228 -85 57 -89 326 76 108 164 -65 295 37 -74 -411 -271 151 120 266 -168 -75
7331 -75 -325 -247 70 -155 101 134 107 110 94 86 46 172 -91 -83 -43 131 -59 -79 123 174 -159 -115 -101 52 -136 62
7357 62 -101 165 -110 -309 -21 161 -129 56 203 -221 -235 289 30 -223 -258 319 124 99 -69 -221 63
7378 63 2 -93 -134 -38 -77 -128 18 231 -232 -30 -88 -67 143 82 -292 33 23 213 170 -12 -303 -3 52 -344
7402 -344 122 127 -165 -58 -47 -36 330 -43 65 107 55 100 -114 178 -61 373 44 -122 42 342 248 8 -112
7425 -112 -6 11 47 -33 -375 93 145 175 -5 -105 110 -37 -174 -104 -106 220 60 193 144 -251 -178 11 295
7448 295 -175 -22 74 109 -157 246 133 124 12 147 131 -140 196 -101 -58 42 -386 -173 290 -28 -175 70
7470 70 -17 113 31 -12 6 97 138 -107 233 57 95 -156 236 327 -131 -94 30 -54 111 -86 -248 119 127 38 -54
7495 -54 14 -37 -167 125 -83 -250 31 106 72 38 93 -174 159 15 99 129 222 -72 -189 -26 -146 -230 -348 -321
7519 -321 63 -46 47 42 205 94 92 -29 -223 10 -160 -216 -129 -46 -189 -152 17 59 -92 -88 -22 136 -88 -28 -70
7544 -70 -3 30 44 13 14 23 -161 -10 304 -120 -24 50 88 -69 -159 -176 157 -68 82 47 4 -160 -187 256 -26 52
7570 52 321 149 14 358 79 -204 82 191 -206 -252 -22 -128 -31 -88 -209 276 138 -3 -73 -30 252 -103
7592 -103 82 19 36 31 -15 17 -72 -104 -235 99 -100 -137 -212 32 10 140 -1 181 -24 -185 35 35 177 -96
7616 -96 259 -153 -196 67 -115 -182 86 486 -33 -45 90 -195 -54 -10 -228 -48 103 -159 -29 30 70 -51
7638 -51 -99 351 173 167 -69 -209 264 50 -5 -7 -187 33 -101 146 -140 236 -200 54 5 -151 -121 -23 -108 51
7662 51 -235 -181 -4 26 80 -106 236 -215 -164 171 -84 -80 246 -175 117 64 -2 -56 -90 -2 -124 -180 53 -204
7686 -204 -305 55 -31 59 431 -184 24 -111 148 14 351 127 195 -19 47 60 -153 67 -129 56 122 73
7708 73 -44 327 -90 16 63 269 219 109 73 -78 233 -133 -2 113 -49 158 5 78 110 136 -276 -108
7730 -108 120 -222 5 -100 63 -114 -71 -31 14 140 56 8 -171 -191 148 75 71 -120 -40 130 111 44 331 -175
7754 -175 -283 311 -131 -9 -60 231 -103 -172 17 40 -73 -244 339 112 -185 -16 202 80 200 -279 10
7775 10 52 131 41 -249 214 -46 -150 -195 147 125 -45 -132 115 97 -9 -213 -161 -146 75 146 10 192 -175 -131
7799 -131 -69 89 -58 23 -162 15 264 27 166 67 -43 -54 -44 183 195 -125 -136 31 413 -186 206 -35
7821 -35 399 175 135 -63 5 -39 219 -11 -169 -233 168 -49 -132 -131 40 103 -63 -36 122 -230 54 -104 63
7844 63 -22 -40 216 -105 -22 -205 -3 -82 70 -136 -98 168 99 -50 -142 -26 -309 -15 -187 49 221 -118 -199
7867 -199 86 -33 -78 -55 -98 131 -147 191 78 164 129 67 -27 -68 35 -59 162 -7 198 -140 203 151 -245
7890 -245 341 -165 -231 133 147 35 41 -126 -180 -140 89 -12 61 -28 129 -29 -192 -49 -40 3 -228 -18 -298 90
7914 90 -97 -76 -110 -57 217 12 82 -59 -322 374 168 -48 236 98 -91 -67 188 114 32 62 174 -30 23
7937 23 58 -65 -118 410 223 166 -153 -70 101 46 88 277 -182 36 -24 -202 90 -112 -7 -56 173 -34 29
7960 29 97 130 113 19 162 66 -134 -15 -44 -148 173 -26 131 98 191 -140 -171 -331 -113 192 -62 110 93 -128
7984 -128 83 -201 -18 21 165 -19 121 171 -32 229 34 215 144 37 -36 228 7 159 151 209 218 -430 81
8007 81 -124 -209 122 41 222 85 139 227 28 -42 -184 -33 29 75 95 -53 119 311 10 -159 3 90 188 37
8031 37 165 -74 -47 -288 -63 144 41 65 57 -149 -73 -96 -9 70 -37 153 -75 45 -70 220 -6 -18 -51 139
8055 139 -42 101 -178 206 93 169 -123 0 -32 -78 -37 -25 -68 -78 206 43 180 104 -131 -37 -150 17 90
8078 90 250 -104 -122 -206 206 77 -163 -209 -29 -17 -197 226 19 -244 38 74 53 269 -177 132 12 -88
8100 -88 0 17 171 -88 -189 -43 250 55 25 -215 221 205 -125 119 -191 -156 -29 -95 -104 116 -212 39 -254
8123 -254 -95 -33 -13 -4 75 21 87 179 86 -155 57 -8 178 -76 68 42 -20 -110 100 -306 54 120 23 80 160 15
8149 15 38 90 312 8 -44 289 -90 -149 -17 5 -76 -43 74 -189 71 65 -41 -30 40 8 174 -95 -21 60 -126
8174 -126 -22 -174 -186 -278 313 -27 68 -66 207 -115 49 -75 -356 228 -9 -148 172
8191A72
##END NTUPLES=NMR FID
##END=
