##TITLE=1H_LR-688B-M-OST
 CDCl3, 8 sc, 
 2.8.2019
##JCAMPDX= 6.0         $$ Bruker NMR JCAMP-DX V2.0
##DATA TYPE= NMR FID
##DATA CLASS= NTUPLES
##ORIGIN= UXNMR, Bruker Analytische Messtechnik GmbH
##OWNER= root
$$ XWIN-NMR		Version 3.5
$$ Fri Aug  2 14:10:44 2019 Russian Standard Time (UT+4h)  she@DPX200
##.OBSERVE FREQUENCY= 200.13155
##.OBSERVE NUCLEUS= ^1H
##.DELAY= (6, 6)
##.ACQUISITION MODE= SIMULTANEOUS
##.ACQUISITION SCHEME= undefined
##.AVERAGES= 8
##.DIGITISER RES= 18
##SPECTROMETER/DATA SYSTEM= spect
##.PULSE SEQUENCE= zg30
##.SOLVENT NAME= DMSO
##.SHIFT REFERENCE= (INTERNAL, DMSO, 0, 15.7039)
##AUDIT TRAIL= $$ (NUMBER, WHEN, WHO, WHERE, WHAT)
$$ ##TITLE= Audit trail, XWIN-NMR		Version 3.5
$$ ##JCAMPDX= 5.01
$$ ##ORIGIN= Bruker BioSpin GmbH
$$ ##OWNER= she
$$ F:/spectra/data/she/nmr/H-F/1/audita.txt
$$ ##AUDIT TRAIL=  $$ (NUMBER, WHEN, WHO, WHERE, WHAT)
(   1,<2019-08-02 14:09:01.64 +0400>,<she>,<DPX200>,
      <created by zg, POWCHK disabled, PULCHK disabled
       configuration hash MD5:
       00 E9 B6 7A A2 85 ED C7 34 08 36 98 17 FE 4E 26
       data hash MD5: 16K
       10 8D 3E EC C8 2A 5A 96 FF 47 4B 4C D7 F8 F9 31>)
$$ ##END=
$$ 
$$ hash MD5
$$ CB AD FE C3 56 37 E5 42 97 F8 F6 89 07 75 1D 63
##$RELAX= 
##$RELAX= 
##$RELAX= 
##$RELAX= 
##$RELAX= 
##$RELAX= 
$$ Bruker specific parameters
$$ --------------------------
##$DU= <F:/spectra>
##$EXPNO= 1
##$NAME= <H-F>
##$PROCNO= 1
##$TYPE= <nmr>
##$USER= <she>
##$AMP= (0..31)
100 100 100 100 100 100 100 100 100 100 100 100 100 100 100 100 100 100 
100 100 100 100 100 100 100 100 100 100 100 100 100 100 
##$AQSEQ= 0
##$AQ_mod= 1
##$AUNM= <au_zg>
##$AUTOPOS= <>
##$BF1= 200.13
##$BF2= 200.13
##$BF3= 200.13
##$BF4= 200.13
##$BF5= 200.13
##$BF6= 200.13
##$BF7= 200.13
##$BF8= 200.13
##$BYTORDA= 1
##$CFDGTYP= 0
##$CFRGTYP= 5
##$CHEMSTR= <none>
##$CNST= (0..31)
1 1 145 1 1 1 1 1 1 1 1 1 1 1 1 1 1 1 1 1 1 1 1 1 1 1 1 1 1 1 1 1 
##$CPDPRG= <>
##$CPDPRG1= <>
##$CPDPRG2= <>
##$CPDPRG3= <>
##$CPDPRG4= <mlev>
##$CPDPRG5= <mlev>
##$CPDPRG6= <mlev>
##$CPDPRG7= <mlev>
##$CPDPRG8= <mlev>
##$CPDPRGB= <>
##$CPDPRGT= <>
##$D= (0..31)
0 1.2 0 0 0 0 0 0 0 0 0 0.03 0 0 0 0 0 0 0 0 0 0 0 0 0 0 0 0 0 0 0 0 
##$DATE= 1564740540
##$DBL= (0..7)
120 120 120 120 120 120 120 120 
##$DBP= (0..7)
150 150 150 150 150 150 150 150 
##$DBP07= 0
##$DBPNAM0= <>
##$DBPNAM1= <>
##$DBPNAM2= <>
##$DBPNAM3= <>
##$DBPNAM4= <>
##$DBPNAM5= <>
##$DBPNAM6= <>
##$DBPNAM7= <>
##$DBPOAL= (0..7)
0.5 0.5 0.5 0.5 0.5 0.5 0.5 0.5 
##$DBPOFFS= (0..7)
0 0 0 0 0 0 0 0 
##$DE= 6
##$DECBNUC= <off>
##$DECIM= 24
##$DECNUC= <off>
##$DECSTAT= 4
##$DIGMOD= 1
##$DIGTYP= 9
##$DL= (0..7)
0 120 120 120 120 120 120 120 
##$DP= (0..7)
150 150 150 150 150 150 150 150 
##$DP07= 0
##$DPNAME0= <>
##$DPNAME1= <>
##$DPNAME2= <>
##$DPNAME3= <>
##$DPNAME4= <>
##$DPNAME5= <>
##$DPNAME6= <>
##$DPNAME7= <>
##$DPOAL= (0..7)
0.5 0.5 0.5 0.5 0.5 0.5 0.5 0.5 
##$DPOFFS= (0..7)
0 0 0 0 0 0 0 0 
##$DQDMODE= 0
##$DR= 18
##$DS= 0
##$DSLIST= <SSSSSSSSSSSSSSS>
##$DSPFIRM= 0
$$ [...]
##$SUBNAM2= <"">
##$SUBNAM3= <"">
##$SUBNAM4= <"">
##$SUBNAM5= <"">
##$SUBNAM6= <"">
##$SUBNAM7= <"">
##$SUBNAM8= <"">
##$SUBNAM9= <"">
##$SW= 24.9336996594482
##$SWIBOX= (0..15)
0 0 2 0 0 0 0 0 0 0 0 0 0 0 0 0 
##$SW_h= 4990.01996007984
##$TD= 16384
##$TD0= 1
##$TE= 0
##$TE2= 300
##$TE3= 300
##$TEG= 300
##$TL= (0..7)
0 120 120 120 120 120 120 120 
##$TP= (0..7)
150 150 150 150 150 150 150 150 
##$TP07= 0
##$TPNAME0= <>
##$TPNAME1= <>
##$TPNAME2= <>
##$TPNAME3= <>
##$TPNAME4= <>
##$TPNAME5= <>
##$TPNAME6= <>
##$TPNAME7= <>
##$TPOAL= (0..7)
0.5 0.5 0.5 0.5 0.5 0.5 0.5 0.5 
##$TPOFFS= (0..7)
0 0 0 0 0 0 0 0 
##$TUNHIN= 0
##$TUNHOUT= 0
##$TUNXOUT= 0
##$USERA1= <user>
##$USERA2= <user>
##$USERA3= <user>
##$USERA4= <user>
##$USERA5= <user>
##$V9= 5
##$VALIST= <valist>
##$VCLIST= <CCCCCCCCCCCCCCC>
##$VD= 0
##$VDLIST= <DDDDDDDDDDDDDDD>
##$VPLIST= <PPPPPPPPPPPPPPP>
##$VTLIST= <TTTTTTTTTTTTTTT>
##$WBST= 1024
##$WBSW= 4
##$XGAIN= (0..3)
0 0 0 0 
##$XL= 0
##$YL= 0
##$YMAX_a= 264441
##$YMIN_a= -445458
##$ZGOPTNS= <>
##$ZL1= 120
##$ZL2= 120
##$ZL3= 120
##$ZL4= 120
##$ABSF1= 10
##$ABSF2= 0
##$ABSG= 5
##$ABSL= 3
##$ALPHA= 0
##$AQORDER= 0
##$ASSFAC= 0
##$ASSFACI= 0
##$ASSFACX= 0
##$ASSWID= 0
##$AUNMP= <proc_1d>
##$AZFE= 0.1
##$AZFW= 0.1
##$BCFW= 1
##$BC_mod= 2
##$BYTORDP= 1
##$COROFFS= 0
##$CY= 11.3945322036743
##$DATMOD= 1
##$DC= 2
##$DFILT= <>
##$DTYPP= 0
##$F1P= 20.1537800932815
##$F2P= 0.134698688090026
##$FCOR= 0.5
##$FTSIZE= 0
##$FT_mod= 4
##$GAMMA= 1
##$GB= 0.15
##$INTBC= 1
##$INTSCL= 1
##$ISEN= 128
##$LB= 0.24
##$LEV0= 0
##$LPBIN= 0
##$MAXI= 10000
##$MC2= 0
##$MEAN= 0
##$ME_mod= 0
##$MI= 1.114404
##$NCOEF= 0
##$NC_proc= 0
##$NLEV= 6
##$NOISF1= 3.799351
##$NOISF2= 2.8
##$NSP= 1
##$NTH_PI= 0
##$NZP= 0
##$OFFSET= 15.70392
##$PC= 1
##$PHC0= -9221.446
##$PHC1= 13.40097
##$PH_mod= 1
##$PKNL= yes
##$PPARMOD= 0
##$PSCAL= 0
##$PSIGN= 0
##$REVERSE= no
##$SF= 200.130013532006
##$SI= 16384
##$SIGF1= 3
##$SIGF2= 2
##$SINO= 400
##$SIOLD= 16384
##$SREGLST= <1H.CDCl3>
##$SSB= 0
##$STSI= 0
##$STSR= 0
##$SW_p= 3612.71676300578
##$SYMM= 0
##$S_DEV= 0
##$TDeff= 0
##$TDoff= 0
##$TI= <>
##$TILT= no
##$TM1= 0
##$TM2= 0
##$TOPLEV= 0
##$USERP1= <user>
##$USERP2= <user>
##$USERP3= <user>
##$USERP4= <user>
##$USERP5= <user>
##$WDW= 1
##$XDIM= 8192
##$YMAX_p= 0
##$YMIN_p= 0
$$ End of Bruker specific parameters
$$ ---------------------------------
##NTUPLES= NMR FID
##VAR_NAME=  TIME,          FID/REAL,        FID/IMAG
##SYMBOL=    X,             R,               I
##VAR_TYPE=  INDEPENDENT,   DEPENDENT,       DEPENDENT
##VAR_FORM=  AFFN,          ASDF,            ASDF
##VAR_DIM=   8192,          8192,            8192
##UNITS=     SECONDS,       ARBITRARY UNITS, ARBITRARY UNITS
##FACTOR=    0.0002004,     1,               1
##FIRST=     0,             0,               0
##LAST=      1.6414764,     0,               0
##MIN=       0,             -445458,         0
##MAX=       1.6414764,     264441,          0
$$ Real data points
##PAGE= N=1
##DATA TABLE= (X++(R..R)), XYDATA
$$ [...]
$$ plain form
2062 -1285 -1010 -28 106 -745 -52 693 640 15 -1159 -871 -478 -425 -210 -342 -512 577 275 -812 -1176
2081 -1176 -429 -394 -373 -627 249 422 305 -188 45 -497 -643 -73 139 186 49 439 444 -179 -486 -380 -212
2102 -212 154 441 81 445 848 891 204 -553 -123 898 397 283 602 817 981 107 -568 42 792 775
2122 775 191 -173 577 1171 346 -575 -757 529 653 -510 -476 423 795 71 -834 -616 -100 -46 -131 -593
2142 -593 -364 -56 553 -630 -1122 -891 -266 -341 -979 -649 134 -10 -409 -582 -695 -503 -238 -476 -295 -102
2162 -102 25 -168 -520 -518 -321 -73 24 43 585 138 106 513 67 -191 -140 963 1098 370 497 1078 1357 189
2184 189 -291 343 691 996 492 312 751 719 663 -353 -760 248 1110 -24 -516 341 1040 330 -1122
2203 -1122 -861 -281 131 -229 -430 -414 351 84 -591 -1478 -1196 -521 -383 -964 -421 246 531 -220 -684 -678 -625
$$ packed form
2062a285K75R82J34q51O93P45n3o25j174K88L93N3K15j32j70J089l02j087l64
2081a176P47L5K1k54Q76J73j17m93K33n42j46N70K12M7j37L90No23l07J06J68
2102b12L66K87l60L64M03M3o87p57M30J021n01j14L19K15J64q74o75O10P50j7
2122G75n84l64P50N94q25r21j82J286J24j163L4Q99L72p24r05K18N16N4q5m62
2142e93K29L08O09j183m92K31O25p5o38L30P83j44l99j73j13J92K65k38J81J93
2162a02J27j93l52KJ97K48R7J9N42m47l2M07m46k58N1J103J35p28J27N81K79j168
2184A89m80O34L48L05n04j80M39l2n6j016m07J008Q62j134m92Q57O99p10j452
2203a122K61N80M12l60k01J6P65k67o75q87K82O75J38n81N43O67K85p51m64ON3
$$ plain form
2224 -625 -1048 -470 -83 68 375 185 -369 -433 -575 -80 -238 -429 557 927 844 665 219 -242 -382 -144 287
2245 287 944 477 1034 1025 729 -107 -328 285 187 39 136 794 924 507 176 -367 -522 71 -5 -610 -361 1088
2267 1088 1109 -131 -1015 -259 -27 -266 -951 -186 471 777 390 -601 -953 -398 -299 -1202 -1398 222 1326
2286 1326 1 -764 -537 -43 -360 -985 -790 280 501 822 239 -377 -276 -57 -314 -938 -750 562 925
2305 925 114 279 352 -135 -554 -491 58 -243 360 1163 690 268 82 96 -15 -828 -244 416 722 779 648
2326 648 -179 -276 -345 -284 -423 -592 446 1201 608 -351 -241 467 -256 -976 -417 200 643 500 132 -141 -111
2347 -111 327 -631 -1073 -399 791 378 -330 -159 236 282 -996 -1148 -480 352 299 -40 -259 82 166 -209
2367 -209 -661 -1051 -161 544 -208 -93 261 237 -290 -848 -122 81 -300 85 393 430 -56 132 3 -422 -333
$$ packed form
2224f25m23N78L87J51L07j90n54o4j42M95j58j91R86L70q3j79m46m61j40K38M31
2245B87O57m67N57rk96q36k21O13r8j48R7O58J30m17l31n43j55N93p6o05K49J449
2267A088K1j240q84P56K32k39o85P65O57L06l87r91l52N55R9r03j96J620J104
2286A326j325p65K27M94l17o25J95J070K21L21n83o16J01K19k57o24J88J312L63
2305I25q11J65P3m87m19O3N49l01O03Q03m73m22j86J4j11q13N84O60L06N7j31
2326F48q27r7o9O1j39j69J038P55n93r59J10P08p23p20N59O17M43j43l68k73L0
2347a11M38r58m42O74J190m13p08J71L95M6j278j52O68Q32n3l39k19L41Q4l75
2367b09m52l90Q90P05p52J15L54k4n27n58P26K03l81L85L08L7m86J88j29m25Q9
$$ plain form
2388 -333 282 362 -10 631 631 438 -3 43 210 -186 201 947 648 -208 336 847 572 -381 -694 242 661
2409 661 318 108 98 264 403 -131 -748 -732 497 442 -583 -715 317 321 -336 -1520 -463 154 -75 -427
2429 -427 -495 64 140 -212 -1011 -1162 -466 298 -337 -535 -27 331 120 -800 -634 261 413 115 173 73 572
2450 572 77 28 -128 -239 324 611 39 321 474 1075 304 -69 138 329 266 630 751 381 430 73 443
2471 443 -213 -401 -136 388 381 137 115 199 107 -276 -526 -950 -192 557 -104 -578 -411 511 -262 -1488 -1271
2492 -1271 -176 185 -374 -455 -279 355 -261 -1020 -1066 -574 324 97 -535 -223 555 222 -484 -1045 -300 452
2512 452 131 126 258 1024 535 49 -267 -506 515 882 117 406 964 903 356 -39 -188 420 270 171 654
2533 654 600 524 441 139 30 -283 -166 -105 106 100 169 -62 -3 -399 -876 -1003 -568 -127 -73 -541 -157 286 -189
$$ packed form
2388c33O15Q0l72O41%j93m41M6J67l96L87P46k99q56N44N11k75r53l13R36M19
2409F61l43k10j0J66J39n34o17J6J229n5j025j32J032Mo57j184J057O17k29l52
2429d27o8N59P6l52p99j51O96P64o35j98N08L58k11r20J66Q95J52k98N8j00M99
2450E72m95m9j56j11N63K87n72K82J53O01p71l73K07J91o3L64J21l70M9l57L70
2471D43o56j88K65N24pk44k2Q4r2l83k50m24P58P49o61m74J67R22p73j226K17
2492a271J095L61n59q1J76O34o16p59m6M92Q98k27o32L12P78l33p06n61P45P52
2512D52l21nJ32P66m89m86l16k39J021L67p65K89N58o1n47l95j49O08j50r9M83
2533F54n4p6q3l02j09l13J17O1K11oO9k31N9l96m77j27M35M41N4m68L84M43m75
$$ plain form
2556 -189 -890 -1295 -293 -175 -239 -591 102 621 360 -566 -950 -740 -63 -261 -299 -178 725 1010 276 -673
2576 -673 -438 315 206 -278 -29 998 1253 488 -224 -255 46 264 -399 112 723 1184 849 252 -23 -8
2596 -8 219 -481 -186 561 707 757 724 265 -297 -181 -672 -585 226 361 376 337 217 -388 -495 -421 -492 -400 -684
2619 -684 -13 163 516 -23 -820 -381 -543 -374 -819 -340 296 697 45 -796 -636 -237 -85 -737 -822 248
2639 248 907 167 -449 -270 -301 34 -856 -808 178 1063 618 -35 155 257 151 -669 -710 298 672 845 440
2660 440 270 316 425 -191 -689 -277 391 508 366 452 622 686 -40 -354 -250 119 256 680 746 550 134
2681 134 -105 221 31 -294 -146 262 310 205 185 -17 -265 -315 -725 -632 -381 180 45 -199 -701 114 13
2702 13 -926 -1091 -602 91 4 -482 -573 111 223 -780 -790 -646 210 456 -257 -246 -46 408 -100 -944 -117
$$ packed form
2556a89p01m05J002J18o4l52O93N19k61r26l84K10O77j98l8J21R03K85p34r49
2576f73K35P53j09m84K49J027K55p65p12l1L01K18o63N11O11M61l35n97k75J5
2596hK27p00K95P47J46N0l3m59n62J16m91Q7Q11J35J5l9j20o05j07P4p1R2k84
2619f84O71J76L53n39p97M39j62J69m45M79O36M01o52q41J60L99J52o52q5J070
2639B48O59p40o16J79l1L35q90M8R86Q85m45o53J90J02j06q20m1J008L74J73m05
2660D40j70M6J09o16m98M12O68J17j42Q6J70O4p26l14J04L69J37M24O6j96m16
2681A34k39L26j90l25J48M08M8j05k0k02k48n0m10R3K51N61j35k44n02Q15j01
2702A3r39j65M89O93q7m86r1O84J12j003j0J44Q56K46p13J1K00M54n08q44Q27
$$ plain form
2723 -117 610 528 212 219 508 663 613 -253 -189 637 916 617 169 571 1088 694 2 -350 672 174 338
2744 338 228 503 755 480 90 -83 34 215 208 127 56 102 -126 -399 -323 -374 -466 -480 -229 80 -409 -493 -270
2767 -270 -456 -723 -1147 -603 -457 -333 -279 -526 -512 -155 -430 -752 -1027 -205 68 -235 -463 -275 535 -27 -538
2788 -538 -579 414 374 38 66 312 372 343 -181 -305 387 1128 820 228 478 961 973 297 -215 514 998 514
2810 514 315 279 503 409 -151 -92 -371 173 212 181 -69 16 270 -129 -595 -578 -171 -396 -100 203 -129 -463
2832 -463 -486 -322 -506 -907 -771 -385 -45 -484 -456 -223 -171 -365 -357 -735 -367 -97 4 -417 -216 -37 161 -770
2854 -770 -759 -226 223 238 -84 355 566 523 -112 -389 -50 581 812 660 39 848 728 368 -855 -174 584
2875 584 283 239 370 734 936 205 -158 -250 222 92 34 -78 534 722 517 -301 -468 -204 -131 -234 145
$$ packed form
2723a17P27q2l16PK89J55n0q66O4Q26K79k99m48M02N17l94o92l52J022m98J64
2744C38j10K75K52k75l90j73J17J81pq1p1M6k28k73P6n1r2j4K51L09m89q4K23
2767b70j86k67m24N44J46J24N4k47J4L57k75l22k75Q22K73l03k28J88Q10n62n11
2788e38m1R93m0l36K8K46O0k9n24j24O92P41l08n92K50M83J2o76n12P29M84m84
2810E14j99l6K24r4n60N9k79N44L9l1k50Q5K54l99m66J7M07k25K96L03l32l34
2832d63k3J64j84m01J36L86L40m39K8K33N2j94Ql78L68K70J01m21K01J79J98r31
2854g70J1N33M49J5l22M39K11m3o35k77L39O31K31j52o21Q09j20l60j223O81P58
2875E84l01m4J31L64K02p31l63r2M72j30n8j12O12J88k05q18j67K64P3j03L79
$$ plain form
2896 145 204 156 2 -419 -258 -633 -737 -309 -70 -346 -227 -3 224 -596 -639 -465 -367 -313 -44 -220 -168 33
2918 33 145 -134 -696 -570 203 17 -279 -298 682 561 9 -386 -401 59 -32 104 -367 249 739 497 -326
2939 -326 -347 322 355 -432 -62 514 718 526 101 -69 88 39 -14 -252 -199 760 595 371 -103 175 66 -364
2961 -364 -346 -41 136 255 393 149 52 -172 -289 -134 -231 -167 343 37 -189 -400 -395 -481 -753 -304 -106 69
2983 69 97 -37 -84 -580 -808 -444 -378 -796 -465 149 295 242 -551 -366 -254 -164 -634 -566 -127 268 646 74
3005 74 -409 -111 254 363 -408 103 785 920 340 81 704 669 -48 -117 55 542 905 614 138 273 787
3026 787 443 -95 154 504 460 414 137 469 267 -10 -300 -209 4 -234 71 -51 -243 -208 -164 -340 -433 -215
3048 -215 -373 -267 -172 -266 -327 -464 -387 -376 -483 -419 -487 -58 92 -531 -363 -177 -216 -331 -630 -97 -115 108 -115
$$ packed form
2896A45N9m8j54m21J61l75j04M28K39k76J19K24K27q20m3J74R8N4K69j76N2K01
2918C3J12k79n62J26P73j86k96j9R80j21n52l95j5M60r1J36m71O16M90k42q23
2939c26k1O69L3p87L70N76K04j92m25j70J57m9n3k38N3R59j65k24m74K78j09m30
2961c64J8L05J77J19J38k44r7k24j17J55r7O4N10l06k26k11Nq6k72M49J98J75
2983F9K8j34m7m96k28L64O6m18L31O14J46n3p93J85J12R0m70O8M39L95L78n72
3005G4m83K98L65J09p71N11O82J35n80k59O23l5p17o9J72M87L63k91m76J35N14
3026G87l44n38K49L50m4m6k77L32k02k77k90R1K13k38L05j22j92L5M4j76r3K18
3048b15j58J06R5r4o1j37P7J1j07O4o8M29J50o23J68J86l9j15k99N33j8K23k23
$$ plain form
3071 -115 -198 87 234 -142 66 -146 489 695 128 -358 435 302 196 -37 -115 318 685 525 3 315 624
3092 624 612 102 -148 132 699 266 -61 187 403 245 -228 -343 -165 222 46 -85 -32 168 143 -264 -638
3113 -638 -226 94 -177 -83 -111 31 -239 -194 -366 -349 -332 -265 -231 171 -38 -453 -174 -461 -347 -284 -269 30 249
3136 249 154 85 108 -115 -172 -343 -196 125 284 484 78 195 556 68 -97 -170 313 570 488 52 -113 -80
3158 -80 370 16 -587 -169 583 354 -35 167 297 314 -135 -443 -266 215 329 -30 33 373 332 355 -235 -290
3180 -290 97 -169 51 -58 310 279 206 -157 -243 -45 -180 -3 243 -13 9 -110 -201 -120 -363 -579 -189 -308
3202 -308 -167 -172 100 0 -364 -190 -376 -151 -347 112 33 -104 254 -49 -226 -374 -559 -162 213 32 -140
3223 -140 277 276 1 -397 -178 -207 69 71 -79 195 354 207 31 -60 271 412 -197 -59 209 449 412 114
$$ packed form
3071a15q3K85J47l76K08k12O35K06n67m86P93j33j06k33p8M33L67j60n22L12L09
3092F24j2n10k50K80N67m33l27K48K16j58m73j15J78L87j76j31N3K00k5m07l74
3113f38M12L20k71R4k8J42k70M5j72J7J7O7L4M02k09m15K79k87J14O3J5K99K19
3136B49r5o9K3k23n7j71J47L21J59K00m06J17L61m88j65p3M83K57q2m36j65L3
3158h0M50l54o03M18P52k29l89K02J30J7m49l08J77M81J14l59O3L40m1K3n90n5
3180b90L87k66K20j09L68l1p3l63q6J98j35J77K46k56K2j19r1Q1k43k16L90j19
3202c08J41nK72j00l64J74j86K25j96M59p9j37L58l03j77j48j85L97L75j81j72
3223a40M17jk75l98K19k9K76Kj50K74J59j47j76r1L31J41o09J38K68K40l7k98
$$ plain form
3245 114 -81 -207 211 -139 -124 320 435 399 453 12 80 7 -228 -289 95 229 -11 -108 95 -354 -306 -252 -515
3268 -515 -120 -30 -110 -98 -340 -244 -450 -356 -295 -188 22 -143 95 -182 -44 -260 -267 -235 -335 -256 -137 226 349
3291 349 55 104 -138 -192 15 -290 -46 157 381 598 121 3 305 213 140 264 -111 439 540 406 126
3312 126 38 235 -389 -154 56 212 271 437 -98 277 165 2 -164 -237 124 45 -219 -40 -132 -115 -113 -509 -140
3335 -140 -376 78 -177 -190 -92 -14 -162 -240 -493 -333 -325 -333 -199 -68 -105 -155 2 347 -209 -96 -190 107 110 -132
3359 -132 43 -110 185 187 102 -14 197 253 241 -81 206 251 104 -172 -22 307 186 165 -174 270 123 117 8
3382 8 -109 33 182 -50 -42 -196 -92 -151 -97 -204 107 158 113 13 31 -95 188 -18 -414 124 188 239 -359 79
3406 79 78 -188 -214 -206 -418 339 -42 273 166 90 -156 -144 -163 75 135 -356 33 66 -137 -101 -45 22 -55 -130 41
$$ packed form
3245A14j95j26M18l50J5M44J15l6N4m41O8p3k35o1L84J34k40r7K03m49M8N4k63
3268e15L95R0q0J2k42R6k06R4O1J07K10j65K38k77J38k16pL2j00P9J19L63J23
3291C49k94M9k42n4K07l05K44K03K24K17m77j18L02r2p3J24l75N50J01j34k80
3312A26q8J97o24K35K10J56N9J66n35L75j12j63j66p3L61p9k64J79r2J7Kl96L69
3335a40k36M54k55j3R8P8j48p8k53J60QqJ34J31l7n0J57L45n56J13r4K97Lk42
3359a32J75j53K95Kq5j16K11N6j2l22K87M5j47k76J50L29j21k1l39M44j47oj09
3382Hj17J42J49k32Qj54J04n9N4j07L11N1m5j00J8j26K83k06l96N38O4N1n98M38
3406G9jk66k6Qk12P57l81L15j07p6k46J2j9K38O0m91L89L3k03L6N6O7p7p5J71
$$ plain form
3431 41 151 446 -73 10 -110 -273 171 -316 85 -160 438 281 -50 -12 68 61 7 110 -57 301 45 -182
3453 -182 65 114 -171 204 -121 33 53 109 83 53 346 160 85 107 52 281 323 -26 -32 156 -90 -316 -209 -182
3477 -182 -212 -251 282 -98 -235 111 98 50 -106 -194 94 88 154 -177 346 -212 -248 -26 -76 -134 -154 -8 34 21 -483
3502 -483 -58 -198 -237 -54 -248 -10 48 67 -121 -82 -71 -116 114 -50 155 247 39 -75 94 295 -185 -18
3524 -18 139 106 301 76 85 111 -25 166 -76 -201 125 276 -97 -208 36 187 271 -183 78 -71 70 96
3546 96 -344 88 442 147 -43 112 15 66 -229 -290 -143 143 125 -516 -197 -68 -86 -107 1 -152 -60 138 232
3569 232 165 112 -213 -84 92 -57 298 -254 -339 -45 128 -133 -271 -79 -99 78 -38 31 248 207 175 95 77
3592 77 47 -65 -99 -53 248 -70 121 -42 -132 195 -127 -232 -106 -230 90 -103 46 429 160 -14 -77 -283
$$ packed form
3431D1J10K95n19Q3j20j63M44m87M01k45N98j57l31L8Q0pn4J03j67L58k56k27
3453a82K47M9k85L75l25J54K0N6k6l0K93j86p5K2n5K29M2l49oJ88k46k26J07K7
3477a82l0l9N33l80j37L46j3m8j56q8K88oO6l31N23n58l6K22n0n8k0J46M2j3n04
3502d83M25j40l9J83j94K38N8J9j88L9J1m5K30j64K05R2k08j14J69K01m80J67
3524a8J57l3J95k25RK6j36J91k42j25L26J51l73j11K44J51Q4m54K61j49J41K6
3546I6m40M32L54k95j90J55r7N1k95o1J47K86j8o41L19J29j8k1J08j53R2J98R4
3569B32o7n3l25J29J76j49L55n52q5K94J73k61j38J92k0J77j16O9K17m1l2q0j8
3592G7l0j12l4M6L01l18J91j63r0L27l22j05J26j24L20j93J49L83k69j74o3k06
$$ plain form
3614 -283 -51 51 74 -131 -210 88 -71 -153 -14 246 -16 103 5 -30 -366 28 130 -217 -220 315 102 7 -90
3637 -90 -28 -300 -258 -121 -176 150 69 16 -51 -27 147 -143 19 210 -88 278 -204 337 -242 -58 -22 -194 80
3660 80 -52 -20 -67 115 221 -211 -8 -162 281 -229 33 101 31 131 -256 -126 235 186 -307 69 124 108 110
3683 110 -30 -80 -130 10 -82 -63 2 36 -14 209 339 -193 -92 -253 -125 41 -60 -339 105 349 26 8 -11
3706 -11 -153 -92 -104 -1 66 222 391 -113 -167 -103 -139 -197 158 197 6 73 -146 -87 73 -38 -134 -102 -30 -207 264
3731 264 -261 101 31 143 -188 -163 -136 206 175 29 230 -97 213 -97 -1 73 39 8 -150 -193 -228 63 255
3754 255 -199 -345 350 124 -15 -48 -64 290 145 22 -88 83 167 -124 96 -65 -27 -230 -163 -232 -35 6
3776 6 190 48 55 16 -107 52 -47 -57 -20 65 -69 223 -41 -270 -56 68 -22 -8 -73 244 66 94 53 150 7
$$ packed form
3614b83K32J02K3k05p9K98j59q2J39K60k62J19r8l5l36L94J02l47lN35k13r5r7
3637i0O2k72M2J37n5L26q1n3o7K4J74k90J62J91k98L66m82N41n79J84L6j72K74
3660H0j32L2m7J82J06m32K03j54M43n10K62O8p0J00l87J30L61m9m93L76N5j6K
3683A10j40n0n0J40r2J9O5L4n0K23J30n32J01j61J28J66j01k79M44K44l23j8j9
3706a1j42O1j2J03O7J56J69n04n4O4l6n8L55L9j91O7k19N9J60j11r6L2P2j77M71
3731B64n25L62p0J12l31K5K7L42l1j46K01l27L10l10R6P4l4l1j58m3l5K91J92
3754B55m54j46O95k26j39l3j6L54j45j23j10J71Q4k91K20j61L8k03O7o9J97M1
3776FJ84j42Pl9j23J59r9j0L7Q5j34K92k64k29K14J24r0J4o5L17j78K8m1R7j43
$$ plain form
3801 7 233 17 -8 276 54 -36 45 -182 39 185 -1 100 -259 -34 230 -95 88 30 -173 -263 -395 -60
3823 -60 202 181 -89 125 -132 -407 -243 -55 227 79 -34 60 66 -222 -18 53 -97 107 363 164 177 75
3845 75 -118 174 -112 -17 -198 56 110 375 -178 -123 128 15 3 161 -57 -92 213 12 107 124 135 -149 152
3868 152 -96 -144 -12 169 149 37 199 61 -41 -268 238 78 145 133 -71 -231 -59 -225 -216 27 -101 221
3890 221 -84 -315 90 110 30 -50 -125 155 59 -107 -68 49 154 79 -135 -172 -114 -62 -1 -82 76 -143 159 -21
3914 -21 -76 26 32 203 -24 -40 -27 125 -28 -78 -122 68 -42 216 192 -86 20 -26 -30 -34 -131 -55 32 156 57 215
3940 215 -138 257 -155 -188 -7 -9 268 -197 2 -208 25 -81 -24 220 -68 75 -58 18 -394 -83 97 -168
3962 -168 -94 -150 -31 75 263 281 144 -143 92 259 202 48 97 88 25 117 199 115 191 99 -165 17 -109 -52 114
$$ packed form
3801GK26k16k5K84k22r0Q1k27K21J46j86J01l59K25K64l25J83n8k03r0j32L35
3823f0K62k1k70K14k57k75J64J88K82j48j13R4Ok88K04P1j50K04K56j99J3j02
3845G5j93K92k86R5j81K54N4K65n53N5K51j13j2J58k18l5L05k01R5J7J1k84L01
3868A52k48m8J32J81k0j12J62j38j02k27N06j60O7j2k04j60J72j66RK43j28L22
3890B21l05k31M05K0q0q0p5K80r6j66L9J17J05p5k14l7N8N2O1q1J58k19L02j80
3914b1n5J02OJ71k27j6J3J52j53n0m4J90j10K58k4k78J06m6mmr7P6Q7J24r9J58
3940B15l53L95m12l3J81kK77m65J99k10K33j06N7K44k88J43j33P6m12L11J80k65
3962a68P4n6J19J06J88J8j37k87K35J67n7j54M9ro3R2Q2q4P6r2k64J82j26N7J66
$$ plain form
3987 114 -136 107 52 38 274 9 70 221 149 -301 253 -90 -159 231 -75 30 94 130 -117 -114 315 -87 236
4010 236 94 -34 49 118 -91 -38 -24 46 -204 -225 134 316 148 -32 27 -151 -173 -105 -32 -91 -3 92 53 -158 -4
4035 -4 -236 -103 -154 -36 130 34 11 -44 77 -124 -72 -155 -54 -136 77 -5 -45 221 86 -296 113 238 -228 133
4059 133 23 -392 -75 -14 199 -145 -260 79 -157 41 29 -104 271 -218 46 153 108 109 242 51 116 68
4081 68 -226 72 -140 57 163 -231 89 -44 19 90 179 -39 -135 -58 -106 -61 10 -77 -211 52 -71 50 -142
4104 -142 -168 35 33 -135 198 -211 33 -28 141 156 158 -157 228 -90 34 215 179 75 -156 -167 -102 271 -202
4127 -202 195 425 361 56 -11 77 -202 -52 -48 107 22 219 271 -31 82 99 101 -221 -53 205 102 166 174 -97
4151 -97 -192 -71 -141 46 -10 66 -28 107 -17 -140 -85 136 292 291 146 -115 36 256 -226 -176 -133 256 -51 33
$$ packed form
3987A14k50K43n5j4K36k65O1J51p2m50N54l43o9L90l06J05O4L6k47LM29m02L23
4010B36j42j28Q3O9k09N3J4P0k50k1L59J82j68j80N9j78k2O8P3n9Q8R5l9k11J54
4035dk32J33n1J18J66r6k3n5J21k01N2q3J01q2K13q2m0K66j35l82M09J25m66L61
4059A33j10m15L17O1K13l44j15L39k36J98j2j33L75m89K64J07m5JJ33j91O5m8
4081F8k94K98k12J97J06l94L20j33O3P1Q9k18r6P7m8M5P1q7j34K63j23J21j92
4104a42k6K03kj68L33m09K44o1J69J5Kl15L85l18J24J81l6j04k31j1O5L73m73
4127b02L97K30o4l05o7Q8k79J50MJ55q5J97N2l02J13J7Kl22J68K58j03O4Qk71
4151i7r5J21p0J87n6P6r4J35j24j23N5K21J56jj45k61J51K20m82N0M3L89l07Q4
$$ plain form
4175 33 -14 -14 -111 125 215 -73 -59 -202 131 -110 -1 240 253 134 380 126 -24 149 93 63 128 -119 -35 11
4199 11 210 7 -30 394 264 186 -95 88 101 61 87 -235 -5 -25 -185 200 72 -8 -253 -107 -264 -201 303
4222 303 -34 -172 -237 164 162 18 -100 -68 184 -4 -7 -144 -27 -6 95 -221 -43 -59 5 -156 -79 149 20
4245 20 -400 -6 92 -81 -179 182 104 25 -29 -187 -218 -278 78 -29 -237 155 -292 57 -112 82 268 122 19
4268 19 118 196 -76 43 258 213 203 -28 -74 -176 -22 -373 -63 -108 51 53 77 -107 -253 56 -165 -179 -320 29
4292 29 -118 167 25 1 -52 6 112 3 56 -66 4 139 -36 34 -65 81 -94 146 39 84 84 -59 -189 -148
4316 -148 129 277 -73 -10 -72 15 185 356 195 -252 -201 104 155 -251 196 -149 131 -101 20 -204 -206 -168 -66
4339 -66 180 -7 142 244 64 150 239 34 185 -116 -7 -160 -5 -61 -31 80 -10 189 -102 102 122 -142
$$ packed form
4175C3m7%r7K36R0k88J4j43L33k41J09K41J3j19K46k54j50J73n6l0O5k47Q4M6
4199A1J99k03l7M24j30p8k81J83J3m0K6l22K30k0j60L85j28q0k45J46j57O3N04
4222C03l37j38o5M01kj44j18L2K52j88lj37J17K1J01l16J78j6O4j61P7K28j29
4245B0m20L94R8j73r8L61p8p9n4j58l1o0L56j07k08L92m47L49j69J94J86j46j03
4268A9R9P8k72J19K15m5j0k31m6j02J54l51L10m5J59KK4j84j46L09k21j4j41L49
4292B9j47K85j42k4n3N8J06j09N3j22P0J35j75P0r9J46j75K40j07M5%j43j30M1
4316a48K77J48l50O3o2Q7J70J71j61m47N1L05N1m06M47l45K80k32J21k24kL8J02
4339f6K46j87J49J02j80Q6Q9k05J51l01J09j53J55n6L0J11r0J99k91K04K0k64
$$ plain form
4361 -142 -22 -91 -31 205 -24 6 -135 43 225 -58 3 87 107 -338 -144 46 -46 -152 135 -34 -294 -286 254
4384 254 -27 -135 8 -117 -7 259 110 52 -225 85 -235 -83 -156 -108 -82 -37 -57 -80 101 -450 -83 136
4406 136 -32 76 109 -72 149 228 -16 193 -64 50 -9 -11 81 -97 -182 262 56 -58 39 198 -205 288 111
4429 111 -88 -67 -34 30 -43 -249 -168 -229 4 -132 5 51 -198 11 13 -95 275 -330 -14 -215 75 -215 17
4452 17 196 169 20 -97 28 -319 264 -158 217 -60 -192 52 -120 8 -37 -53 108 288 -43 58 234
4473 234 -133 -33 9 -140 -259 -223 -124 -9 -136 131 208 86 3 10 -14 235 26 14 -23 171 181 64 -55 -138
4497 -138 -107 -64 -5 -140 -200 123 -317 -243 210 -163 192 17 -69 -4 -33 153 51 -305 57 28 -158 -269 -59
4520 -59 11 -21 181 276 -44 282 -100 -56 249 -189 52 -48 -72 -71 -147 -210 -128 103 -205 -20 137 27 -217 80
$$ packed form
4361a42J20o9O0K36k29L0j41J78J82k83O1Q4K0m45J94J90r2j06K87j69k60QN40
4384B54k81j08J43j25J10K66j49n8k77L10l20J52p3M8K6M5k0k3J81n51L67K19
4406A36j68J08L3j81K21P9k44K09k57J14n9kR2j78q5M44k06j14R7J59m03M93j77
4429A11j99K1L3O4p3k06Q1o1K33j36J37M6k49K09Kj08L70o05L16k01K90k90K32
4452A7J79k7j49j17J25l47N83m22L75k77j32K44j72J28m5j6J61J80l31J01J76
4473B34l67J00M2j49j19L6R9J15j27K67P7j22q3Pk4K49k09j2l7J94J0j17j19q3
4497a38L1M3N9j35o0L23m40P4M53l73L55j75q6O5k9J86j02l56L62k9j86j11K10
4520e9P0l2K02R5l20L26l82M4L05m38K41j00k4Jp6o3Q2K31l08J85J57j10k44K97
$$ plain form
4544 80 3 -73 -7 148 131 101 283 101 -149 -206 45 176 280 -90 -69 -308 20 -183 -17 27 -43 78 -137
4567 -137 196 0 -71 68 -53 122 -190 -35 50 102 -24 -43 146 185 177 -231 10 -266 241 2 47 242 -183
4590 -183 25 80 179 38 403 169 -215 -35 201 -143 137 -42 -212 42 -9 -275 -112 100 -121 -66 86
4611 86 -11 -93 -386 -110 -251 -88 -104 -61 46 93 -201 -245 143 157 -273 -21 295 318 178 -509 -288 -36 357
4634 357 30 -153 -166 -223 102 142 4 46 69 226 -96 -80 12 32 -145 -366 -8 239 -258 -155 -255 137 89
4657 89 81 15 -116 -1 -11 32 126 -58 130 11 210 -10 -92 72 -36 -161 -249 21 -127 70 -38 -98 -344
4680 -344 -83 -138 32 105 -142 55 171 -31 -6 -11 -30 -98 -129 -190 -75 239 389 269 225 -27 -214 -56 -51 117
4704 117 9 -270 94 134 20 180 167 -316 82 176 202 -148 -121 11 -46 -31 51 2 -14 75 75 55 37 19 -44 -258
$$ packed form
4544H0p7p6O6J55j7l0J82j82k50n7K51J31J04l70K1k39L28k03J66M4p0J21k15
4567a37L33j96p1J39j21J75l12J55Q5N2j26j9J89L9qm08K41k76N07k39M5J95m25
4590a83K08N5R9j41L65k34l84J80K36l44K80j79j70K54n1k66J63K12k21N5J52
4611H6r7q2k93K76j41J63j6M3J07M7k94m4L88J4m30K52L16K3j40o87K21K52L93
4634C57l27j83j3n7L25M0j38M2K3J57l22J6R2K0j77k21L58K47m97J03j00L92m8
4657H9qo6j31J15j0M3R4j84J88j19J99k20q2J64j08j25q8K70j48J97j08o0k46
4680c44K61n5J70P3k47J97J16k02K5nj9o8l1o1J15L14J50j20m4k52j87J58NJ68
4704A17j08k79L64M0j14J60j3m83L98R4K6l50K7J32n7J5Q2m9j6Q9%k0j8j8o3k14
$$ plain form
4730 -258 -19 145 -243 -215 -45 126 -85 166 -117 -95 -28 -140 321 -348 -53 -263 5 -141 -285 -91 -224
4751 -224 -3 131 -144 78 -155 27 231 22 318 -287 252 169 -34 -198 174 62 -212 -71 -32 198 144
4772 144 134 -210 153 64 40 306 -146 -263 -40 0 -100 15 -112 77 15 -253 174 103 152 -171 189 70
4794 70 -157 -149 -180 108 -200 -79 36 108 101 103 268 28 -189 -101 64 139 -28 -40 163 -290 -97 107 139 66 107
4819 107 124 66 32 181 -28 178 71 -165 295 64 -32 -81 -45 -114 195 -208 35 -16 -260 69 11 -75 300
4842 300 -203 261 -14 -261 -35 -25 -75 121 -120 259 156 -4 91 -57 -45 -51 -129 -15 -70 -212 -9 -145 -158
4865 -158 65 -133 281 14 177 -6 -118 -204 188 41 243 -24 232 472 -83 -179 -353 193 -58 233 128
4886 128 14 -100 95 -317 -13 184 -82 -102 -17 41 -12 -53 -184 -176 -214 -47 124 -162 -233 -283 -131 -134 -46 224
$$ packed form
4730b58K39J64l88K8J70J71k11K51k83K2O7j12M61o69K95k10K68j46j44J94j33
4751b24K21J34k75K22k33J82K04k09K96o05N39q3k03j64L72j12k74J41L9K30n4
4772A44j0l44L63q9k4K66m52j17K23M0j00J15j27J89o2k68M27p1M9l23L60j19
4794G0k27Ql1K88l08J21J15P2pKJ65k40k17Q8J65P5j67j2K03m53J93K04L2p3M1
4819A07J7n8l4J49k09K06j07k36M60k31r6m9L6o9L09m03K43n1k44L29n8q6L75
4842C00n03M64k75k47K26J0n0J96k41L79j03j60R5j48J2op8J14n5j42K03j36j3
4865a58K23j98M14k67J63j83j12q6L92j47K02k67K56K40n55r6j74N46k51K91j05
4886A28j14j14J95m12L04J97k66k0Q5N8n3m1j31Ql8J67J71k86p1n0J52lQ8K70
$$ plain form
4910 224 55 -39 -158 7 157 104 -49 107 -7 -98 -205 -30 82 -88 90 87 38 116 -416 -72 108 81 126
4933 126 -253 -114 138 21 -125 83 107 60 -106 12 -5 -121 -50 -296 3 153 14 -91 73 -93 -48 -16
4955 -16 212 17 -196 -32 202 -142 -161 178 -126 -172 -120 -33 179 -51 369 65 282 -162 -142 -93 -50 -4 47
4978 47 78 78 -300 -109 -32 218 188 -60 43 57 200 -87 -15 86 139 14 -77 -129 95 -64 83 90 101 -17 94
5003 94 195 58 121 309 -165 56 161 -243 -90 -164 15 -36 43 7 148 -163 -152 -177 -216 -53 105 217 272
5026 272 3 20 4 -41 -16 -74 -275 -53 -7 -28 -153 118 152 -60 -113 -5 -247 50 175 129 184 287 -210 1
5050 1 -68 -14 -193 -292 2 143 109 343 -91 134 -98 80 262 -84 -35 -134 44 -191 73 -10 -128 124 -177
5073 -177 89 -255 144 65 59 -257 50 83 -107 -80 -364 -349 -76 3 118 -209 318 108 73 105 -134 35 199
$$ packed form
4910B24j69r4j19J65J50n3j53J56j14r1j07J75J12j70J78lm9P8n32L44J80k7M5
4933A26l79J39K52j17j46K08K4m7j66J18j7j16P1k46K99J50j39j05J64j66M5L2
4955a6K28j95k13J64K34l44j9L39l04m6N2Q7K12k30M20l04K17m44K0M9M3M6N1
4978D7L1%l78J91P7K50l0k48J03J4J43k87P2J01N3j25r1n2K24j59J47PJ1j18J11
5003I4J01j37O3J88m74K21J05m04J53p4J79n1P9l6J41l11J1k5l9J63J58J12N5
5026B72k69J7j6m5K5n8k01K22M6k1j25K71L4k12n3J08k42K97J25m6N5J03m97K11
5050Ao9N4j79r9K94J41l4K34m34K25k32J78J82l46M9r9J78k35K64q3j18K52l01
5073a77K66l44L99p9ol16L07L3j90K7k84J5K73P9J15l27N27k10l5L2k39J69J64
$$ plain form
5096 199 239 220 201 209 102 -62 -47 29 24 44 67 77 -299 -88 76 183 324 131 6 -92 -99 -161 -148 -18 -208 274
5122 274 -96 1 -26 126 175 -210 -75 199 -77 -260 -59 -56 -56 -35 33 -222 -73 1 -71 18 2 -73 95 153 -116
5147 -116 -28 109 -18 -122 -189 18 -133 -119 -351 -272 250 -40 -97 -15 198 -364 19 -53 -79 -101 -23 278 100
5170 100 -55 77 223 -170 65 30 -358 131 -106 114 31 -118 106 9 94 51 -53 -45 104 -147 -174 80 -90
5193 -90 29 95 113 -124 -136 145 94 12 -266 -189 188 -110 37 222 -197 -55 -241 -141 105 -35 -133 46 -133
5216 -133 171 -178 47 -59 79 -4 197 6 214 142 91 237 -94 36 19 6 -12 -139 86 80 -27 -18 -69 -175
5240 -175 -23 36 138 -83 -27 -42 -75 -53 164 -55 -176 -3 -125 18 -13 219 48 357 -301 52 -199 -40
5262 -40 -67 -52 -36 -108 38 -5 -38 3 108 249 63 -92 60 -115 -96 192 262 126 1 162 273 35 16 -38
$$ packed form
5096A99M0j9j9Qj07j64J5P6nK0K3J0l76K11J64J07J41j93j25r8po2J3J30j90M82
5122B74l70R7k7J52M9l85J35K74k76j83K01L%K1O8k55J49P4p2Q9j6p5J68N8k69
5147a16Q8J37j27j04o7K07j51J4k32P9N22k90n7Q2K13n62L83p2k6k2P8L01j78
5170A00j55J32J46l93K35l5l88M89k37K20q3j49K24r7Q5m3j04QJ49k51k7K54j70
5193i0J19O6J8k37j2K81n1q2k78P7L77k98J47J85m19J42j86J00K46j40r8J79j79
5216a33L04l49K25j06J38q3K01j91K08p2n1J46l31J30j7j3j8j27K25oj07Rn1j06
5240a75J52N9J02k21N6j5l3K2K17k19j21J73j22J43l1K32j71L09o58L53k51J59
5262d0k7J5J6p2J46m3l3M1J05J41j86j55J52j75J9K88P0j36j25J61J11k38j9n4
$$ plain form
5286 -38 36 -112 -349 96 151 84 180 -13 191 13 -71 51 16 -158 -132 -138 59 -29 -118 -363 -231 77 6 -74 -66
5311 -66 -15 -15 162 226 55 -48 267 -116 113 126 -42 -73 15 51 -67 -45 226 -61 -389 54 -296 -19 61 163
5335 163 115 65 168 53 -111 277 79 -217 -39 -68 -32 35 72 100 -99 102 -35 -29 372 153 99 126 78 -83
5359 -83 -117 -255 -196 182 -254 5 117 -27 341 349 -143 248 -148 37 21 -99 8 -13 117 26 345 149 76
5382 76 141 -47 39 130 79 53 158 116 -210 -28 -52 -188 -106 200 78 -26 11 34 -108 112 83 -256 -42 -71
5406 -71 166 253 -121 79 11 163 51 144 -171 -172 -78 -260 2 -118 154 -282 -183 91 97 1 73 -131 58 4
5430 4 -65 141 14 -2 135 -55 -22 127 -31 22 183 -301 50 20 -73 -6 25 192 -135 -93 -85 68 71 93 -6 -58
5456 -58 -195 -269 16 160 45 77 255 -72 305 -249 -39 140 -339 -140 130 -178 -426 -28 -83 -170 -34 71
$$ packed form
5286c8P4j48k37M45N5o7R6j93K04j78q4J22l5j74K6oJ97q8q9k45J32L08p1q0Q
5311f6N1%J77O4j71j03L15l83K29J3j68l1Q8L6j18K2K71k87l28M43l50K77Q0J02
5335A63m8n0J03j15j64L88j98k96J78k9L6O7L7K8j99K01j37OM01k19n4K7m8j61
5359h3l4j38N9L78m36K59J12j44L68Qm92L91l96J85j6j20J07k1J30r1L19j96p3
5382G6O5j88Q6R1n1k6J05m2l26J82k4j36Q2L06j22j04L7K3j42K20k9l39K14k9
5406g1K37Q7l74K00o8J52j12R3l15jR4j82K62j20K72m36R9K74Or6P2k04J89n4
5430Do9K06j27j6J37j90L3J49j58N3J61m84L51l0r3O7L1J67l27M2QJ53LK2r9n2
5456e8j37p4K85J44j15L2J78l27L77n54K10J79m79J99K70l08k48L98n5q7J36J05
$$ plain form
5478 71 3 247 -114 282 -39 -321 -307 67 -47 -253 -144 117 -103 112 71 -44 16 -10 -370 87 70 28 92
5501 92 -128 286 94 191 27 217 181 -28 -87 -245 -2 88 -35 -460 -85 -54 -99 63 -63 -43 -10 412 -233
5524 -233 147 19 23 -70 205 -134 8 52 -201 13 202 169 -43 -129 -125 18 96 -307 -55 -12 -32 4 -108 -288
5548 -288 245 120 55 -6 -201 370 185 27 -100 -17 -254 -4 -54 292 -9 137 -36 -16 27 -10 52 63 23
5571 23 12 -106 152 296 -22 181 33 -89 210 -253 -136 -142 -32 -24 -76 -125 432 218 27 -97 104 -151 266
5594 266 38 -100 146 8 7 16 262 11 -76 -26 -242 -104 162 -472 -268 -9 24 43 -33 3 -133 78 -64
5617 -64 -159 -155 64 -83 182 -37 32 -59 -25 -91 14 10 -90 152 -141 4 30 -54 113 -2 -91 -97 8 258 -39
5642 -39 -32 -88 182 83 -277 95 -9 -98 -63 133 -215 146 0 -253 -117 -15 -207 130 6 119 177 -137 4
$$ packed form
5478G1o8K44l61L96l21k82J4L74j14k06J09K61k20K15m1j15O0k6l60M57j7m2O4
5501I2k20M14j92R7j64J90l6k09n9j58K43R0j23m25L75L1m5J62j26K0L3M22o45
5524b33L80j28Mr3K75l39J42M4k53K14J89l3k12q6MJ43P8m03K52M3k0L6j12j80
5548b88N33j25o5o1j95N71j85j58j27Q3k37K50n0L46l01J46j73K0M3l7O2J1m0
5571B3j1j18K58J44l18K03j48j22K99m63J17oJ10Qn2m9N57k14j91j24K01k55M17
5594B66k28j38K46j38jRK46k51q7N0k16J38K66o34K04K59L3J9p6L6j36K11j42
5617f4r5MK19j47K65k19O9r1L4o6J05mj00K42k93J45K6q4J67j15q9oJ05K50k97
5642c9Pn6K70r9l60L72j04q9L5J96l48L61j46k53J36J02j92L37j24J13N8l14J41
$$ plain form
5665 4 16 -184 42 -182 -91 74 35 356 217 -195 -40 -254 145 -68 -185 -163 -184 -154 -163 9 -252 170 -40
5688 -40 0 -257 23 260 39 -223 33 326 -64 -27 -345 -125 -3 -195 81 -96 -289 68 -52 129 121 -104
5710 -104 90 121 76 -69 68 50 200 181 -129 -94 13 174 -18 -36 5 84 -43 44 155 -63 142 32 -99
5733 -99 -259 -75 -41 -189 -137 -222 -99 49 28 -63 202 -155 -11 -9 79 -134 114 160 -275 89 102 71 101 96 -175
5758 -175 -11 80 123 -100 79 119 41 169 -179 6 -93 -98 -76 -156 -284 58 -79 -58 78 141 -254 121 -74 128
5782 128 303 -217 -21 -28 199 266 -46 27 148 90 -1 105 -137 -48 93 255 205 190 148 -145 159 9 20 -92
5806 -92 -273 -127 128 -318 103 20 163 -81 -191 -126 153 92 70 -310 130 306 -176 -82 -53 37 -265 -74 -211
5829 -211 -5 -174 -34 139 25 -124 -32 -118 -73 -119 -114 -33 -142 -108 -5 -42 157 23 -317 -128 -49 73 191
$$ packed form
5665DJ2k00K26k24R1J65l9L21j39m12J55k14L99k13j17K2k1L0rJ72k61M22k10
5688d0M0k57K80K37k21k62K56K93l90L7l18K20J22j92K76j77j93L57j20J81qk25
5710a04J94L1m5j45J37j8J50j9l10L5J07J61j92j8M1P9j27Q7J11k18K05j10j31
5733i9j60J84L4j48N2q5J23J48k1r1K65l57J44KQ8k13K48M6m35L64J3l1L0nk71
5758a75J64R1M3k23J79M0p8J28l48J85r9nK2q0j28L42j37K1J36O3l95L75j95K02
5782A28J75n20J96pK27O7l12P3J21n8r1J06k42Q9J41J62n0j5m2k93L04j50J1j12
5806i2j81J46K55m46M21q3J43k44j10O5K79o1k2l80M40J76m82R4K9R0l02J91j37
5829b11K06j69J40J73j14j49R2q6M5m6NQ1j09L4J03l7J99j34l40J89P9J22J18
$$ plain form
5852 191 -96 254 200 -127 11 -69 255 -169 -177 106 60 -61 106 268 -107 -203 132 30 87 -135 7 -76 43
5875 43 -7 -10 140 174 50 -19 102 92 -323 -85 5 276 -108 168 -147 -88 306 216 -45 221 87 86 -235 -114
5899 -114 196 189 59 77 -251 188 32 -75 -120 24 34 10 108 59 137 -106 -172 158 94 -20 -70 -7 95 107 -17
5924 -17 -102 190 105 58 150 -86 143 -57 -79 77 7 92 -133 -134 15 22 95 31 48 84 67 -42 -122 -101 97 174 234
5951 234 192 185 -116 176 -183 24 -39 -4 74 260 83 -80 20 258 1 129 -3 -304 35 356 68 10
5973 10 -94 208 -1 -71 -257 -205 57 163 6 114 -52 -154 36 -132 -166 41 141 60 139 -58 -253 -42
5995 -42 122 -81 -20 226 205 -21 90 158 -112 -173 10 102 218 6 -63 150 -210 -271 115 -40 -48 98 -154
6018 -154 63 -127 96 -95 -141 -163 -72 -158 -86 156 -38 -234 -252 -154 -210 -168 -63 90 78 -152 32 134 146 -17
$$ packed form
5852A91k87L50n4l27J38q0L24m24qK83m6j21J67J62l75r6L35j02N7k22J42q3J19
5875D3n0lJ50L4j24o9J21j0m15K38R0K71l84K76l15N9L94r0k61K66j34jl21J21
5899a14L10pj30J8l28M39j56j07m5J44J0k4R8m9P8k43o6L30o4j14n0O3J02J2j24
5924a7q5K92q5m7R2k36K29k00k2J56p0Q5k25jJ49PP3o4J7L6j7j09q0K1J98P7O0
5951B34m2pl01K92l59K07o3L5P8J86j77j63J00K38k57J28j32l01L39L21k88n8
5973A0j04L02k09p0j86N2K62J06j57J08j66j02J90j68l4K07J00q1P9j97j95K11
5995d2J64k03O1K46k1k26J11O8k70o1J83R2J16k12o9K13l60o1L86j55qJ46k52
6018a54K17j90K23j91m6k2R1q6P2K42j94j96j8R8n6M2J05J53j2k30J84J02J2j63
$$ plain form
6042 -17 -41 -58 72 -31 -17 -132 208 139 129 13 123 -295 89 -67 16 -105 -7 -147 92 -101 -150 -226 128
6065 128 -186 51 74 -284 -69 -105 -217 77 163 -65 158 57 221 -140 -142 94 130 -29 118 57 -80 190
6087 190 -122 -10 148 -148 -120 -184 312 -46 -126 -81 -43 101 252 -114 -231 191 -73 -87 46 2 59 5 -197
6110 -197 -201 8 13 -208 -32 266 -185 258 -1 -97 30 178 74 -128 66 -28 -174 144 43 -250 62 125
6132 125 -106 -205 -62 81 236 178 -115 39 -265 11 59 191 226 295 -253 60 4 -154 -36 -133 98 -118
6154 -118 -158 -40 228 137 176 170 -175 -10 69 292 208 -134 -153 63 -208 -273 -162 213 215 -85 160 -65 82 116
6178 116 185 -217 171 117 281 85 -199 299 -318 53 203 -186 106 -24 154 10 -42 146 -134 -67 73
6199 73 -33 -51 -152 -59 116 -73 301 -64 -214 -237 -30 -194 -105 -89 -245 237 67 -137 -204 -56 -141 49 102
$$ packed form
6042a7k4j7J30j03J4j15L40o9j0j16J10m18L84j56Q3j21R8j40K39j93m9p6L54
6065A28l14K37K3l58K15l6j12K94Q6k28K23j01J64l61kK36L6j59J47o1j37K70
6087A90l12J12J58k96K8o4M96l58q0M5L8J44J51l66j17M22k64j4J33m4N7n4k02
6110a97mK09Nk21J76K98m51M43k59r6J27J48j04k02J94r4j46L18j01k93L12O3
6132A25k31r9J43J43J55n8k93J54l04K76M8J32L5O9n48L13n6j58J18r7K31k16
6154a18m0J18K68r1L9ol45J65P9K23q4l42j9K16k71o5J11L75Kl00K45k25J47L4
6178A16O9m02L88n4J64j96k84M98o17L71J50l89K92j30J78j44n2J88k80O7J40
6199G3j06j8j01R3J75j89L74l65j50k3K07j64Q9J6j56M82j70k04o7J48q5J90N3
$$ plain form
6222 102 23 -23 53 -21 79 27 59 -61 137 -40 78 -109 -219 293 10 -31 100 179 -172 -263 -30 257 24
6245 24 64 143 -118 62 55 -115 45 159 6 -101 9 80 -142 226 -136 130 137 85 -17 -66 -261 69 -218
6268 -218 112 -113 -153 -3 -82 26 -74 -74 267 -65 -53 -24 -45 -240 -50 172 -173 131 -13 9 92 81 102 113
6292 113 5 -182 -99 -99 -193 -109 -316 -226 -260 80 304 -119 97 227 -146 55 205 53 -156 -51 145 322
6314 322 35 -20 38 -56 8 -177 51 -53 135 -232 -162 85 -4 -52 53 175 187 -40 -172 301 -148 -15 193
6337 193 -347 306 -127 146 100 -345 128 102 77 150 133 -103 228 -93 -73 119 105 -85 -237 128 87 -7 -195
6360 -195 283 96 -190 -36 -197 255 83 -89 165 -118 -17 -16 -208 140 -123 80 -175 -143 -273 -156 -13
6381 -13 -66 41 -267 -286 189 142 42 -64 -138 72 43 191 -26 26 -10 -120 -88 -347 -305 -176 -306 340 -16
$$ packed form
6222A02p9m6P6p4J00n2L2j20J98j77J18j87j10N12k83m1J31P9l51r1K33K87k33
6245B4M0P9k61J80pj70J60J14j53j07J10P1k22L68l62K66Pn2j02m9j95L30k87
6268b18L30k25m0J50p9J08j00%L41l32J2K9k1j95J90K22l45L04j44K2Q3j1K1J1
6292A13j08j87Q3%r4Q4k07R0l4L40K24m23K16J30l73K01J50j52k09J05J96J77
6314C22k87n5N8r4O4j85K28j04J88l67P0K47q9m8J05J22J2k27j32M73m49J33K08
6337A93n40O53m33K73m6m45M73k6k5P3j7k36L31l21K0J92j4j90j52L65m1r4j88
6360a95M78j87k86J54j61M52j72j72K54k83J01Jj92L48k63K03k55L2j30J17J43
6381a3n3J07l08j9M75m7j00j06p4K10k9J48k17N2l6j10L2k59M2J29j30O46l56
$$ plain form
6404 -16 -52 332 -46 86 -9 292 90 173 296 499 152 181 44 -130 -169 260 -15 -125 -38 -28 96 -220 -119
6427 -119 337 399 -11 -106 -103 -78 -319 184 47 1 -10 131 -107 -231 61 -159 47 -157 17 -92 11 -10 127
6450 127 5 368 85 392 -90 257 48 10 166 102 -186 -276 72 105 -105 0 228 86 23 43 -28 -14 329
6473 329 -7 1 90 307 -55 140 58 40 -60 -206 -90 202 -5 68 -131 -2 302 -223 -230 107 -327 173 -143
6496 -143 -54 204 -60 -69 -7 -110 -286 44 -301 -107 -40 -157 -61 -30 -135 74 77 -71 -6 -310 95 246 35
6519 35 6 211 12 -115 38 28 -100 191 -13 -172 -129 73 -33 -52 308 145 106 -192 51 27 43 247 -46
6542 -46 53 277 9 5 -10 -96 59 -61 285 -21 103 -144 -64 262 -119 84 -127 -25 -18 144 -110 -234 164
6565 164 -78 -115 -193 285 54 -5 -34 -237 29 -347 -154 -10 -78 -137 67 -216 165 52 187 -45 75 -134
$$ packed form
6404a6l6L84l78J32r5L01k02Q3J23K03l47K9j37j74l9M29k75j10Q7J0J24l16J01
6427a19M56O2m10r5LK5k41N03j37m6j1J41k38j24K92k20K06k04J74j09J03k1J37
6450A27j22L63k83L07m82L47k09l8J56o4k88r0L48L3k10J05K28j42o3K0p1J4L43
6473C29l36QQ9K17l62J95q2j8j00j46J16K92k07P3j99J29L04n25pL37m34N00l16
6496a43Q9K58k64rO2j03j76L30l45J94O7j17R6L1j05K09Lj48O5l04M05J51k11
6519C5k9K05j99j27J53j0j28K91k04j59M3K02j06j9L60j63l9k98K43k4J6K04k93
6542d6R9K24k68mj5q6J55j20L46l06J24k47Q0L26l81K03k11J02PJ62k54j24L98
6565A64k42l7p8M78k31n9k9k03K66l76J93J44o8n9K04k83L81j13J35k32J20k09
$$ plain form
6587 -134 -102 158 -116 20 -169 149 135 283 -38 -42 23 188 -120 -383 116 -103 86 189 -266 58 162 234
6609 234 -203 -143 -105 15 -121 -110 27 -29 109 -97 -127 209 -10 75 185 142 329 -6 -105 167 20 -289 -37
6632 -37 -93 -156 -302 166 -112 53 75 163 46 -125 156 42 -33 -170 83 -72 428 -79 307 -83 5 -57 -23
6655 -23 -98 204 -142 127 -16 80 111 -161 112 -154 -266 -51 300 -238 37 113 265 -96 259 136 7 -246
6677 -246 -1 -223 -60 108 -44 87 61 179 -42 173 -271 -62 243 -3 -44 -153 -33 209 -208 -202 97
6698 97 103 216 -53 140 -145 -452 71 -158 138 47 -193 92 -56 -96 58 -317 -61 -23 -87 102 -138 -96 -22
6721 -22 16 -4 -42 215 -35 224 166 164 122 -47 240 -144 28 -47 258 -258 -94 199 84 209 172 67 411
6744 411 45 239 -44 -257 52 -235 174 136 -50 -192 222 -138 14 -18 298 -434 -159 -207 -326 -146 209
$$ packed form
6587a34L2K60k74J36j89L18j4J48l21mO5J65l08k63M99k19J89J03m55L24J04P2
6609B34m37O0L8J20j36J1J37n6J38k06l0L36k19Q5J10m3J87l35r9K72j47l09K52
6632c7n6o3j46M68k78J65K2Q8j17j71K81j14p5j37K53j55N00n07L86l90Q8o2L4
6655b3p5L02l46K69j43R6L1k72K73k66j12K15L51n38K75P6J52l61L55j23j29k53
6677b46K45k22J63J68j52J31k6J18k21K15m44K09L05k46m1j09J20K42m17OK99
6698I7OJ13k69J93k85l07N23k29K96r1k40K85j48m0J54l75K56L8o4J89k40M2P4
6721b2L8k0l8K57k50K59n8km2j69K87l84J72p5L05n16J64K93j15J25l7j05L44
6744D11l66J94k83k13L09k87M09l8j86j42M14l60J52l2L16p32K75m8j19J80L55
$$ plain form
6765 209 -82 -35 220 -110 13 -159 -22 -334 200 -49 -351 -125 38 -158 -150 125 99 101 -173 23 -170 -182
6787 -182 -104 40 10 -11 79 -179 -13 200 66 -72 41 -122 -79 120 29 -75 105 43 50 150 -99 6 -108
6810 -108 -146 -45 329 -168 187 -54 471 45 -70 -323 -85 81 258 325 73 -44 -147 76 93 -187 166
6831 166 129 39 79 111 42 -50 -133 -285 -302 -99 17 -180 196 131 92 149 -197 227 -214 -121 142 13 -107 -132
6855 -132 -202 -87 160 107 -70 -220 -273 76 64 149 -175 123 -24 -108 -2 149 -80 1 -91 131 98 -20 81
6878 81 55 86 6 130 65 -115 53 125 262 -97 -66 -50 100 57 24 -64 184 55 -119 25 -405 16 -212 149
6902 149 56 -59 470 237 -29 -120 -33 59 -9 -109 -267 -347 -23 95 5 -176 -27 260 171 -175 19 -30 209
6925 209 204 119 122 37 147 78 -262 143 -34 75 220 -50 -120 438 -16 -360 -259 -53 10 117 296 59 166
$$ packed form
6765B09k91M7K55l30J23j72J37l12N34k49l02K26J63j96QK75k6Kk74J96j93j2
6787a82P8J44l0k1R0k58J66K13j34j38J13j63M3J99r1j04J80o2PJ00k49J05j14
6810a08l8J01L74m97L55k41N25m26j15k53K38J66J77O7k52j17j03K23J7k80L53
6831A66l7r0M0L2o9r2q3j52j7K03J16j97L76o5l9N7l46M24m41R3K63j29j20k5
6855a32p0J15K47n3j77j50n3L49j2Q5l24K98j47q4J06J51k29Q1r2K22l3j18J01
6878H1k6L1q0J24o5j80J68P2J37l59L1J6J50m3l3q8K48j29j74J44m30M21k28L61
6902A49r3j15N29k33k66r1Q7R2o8j00j58q0L24J18r0j81J49K87q9l46J94m9K39
6925B09nq5Lq5J10o9l40M05j77J09J45k70p0N58m54l44J01K06O3J07J79k37J07
$$ plain form
6948 166 -255 60 -104 270 -221 63 60 362 139 161 50 100 -177 238 54 206 323 -71 8 27 148 284
6970 284 356 -240 144 102 185 -71 -56 122 -65 -222 19 241 210 -239 96 231 -13 -168 18 37 33 -58 119
6993 119 -15 178 -89 98 16 -269 -31 -21 11 -24 -405 -40 161 -38 -77 18 -40 148 -91 461 -153 -102 53
7016 53 52 55 -17 26 -54 -2 -150 -100 46 -143 121 256 -4 86 -98 32 -237 -195 -107 153 161 -11 239 -108 -89
7041 -89 -52 257 159 70 10 11 11 -111 405 122 22 -136 149 217 -47 -176 -405 -257 432 -9 -169 91 207
7064 207 426 71 112 -170 -298 5 -102 -95 117 -159 -44 -180 166 -105 -25 -56 -354 -91 75 -87 455 63
7086 63 6 221 -1 141 368 32 -92 -125 -89 119 -168 167 -123 247 -117 -31 42 107 -50 -112 23 -192 306
7109 306 -128 65 115 60 -250 266 -18 -246 159 -97 66 -151 -211 9 17 109 -307 -85 61 157 97 -180 136
$$ packed form
6948A66m21L15j64L74m91K84lL02k23K2j11N0k77M15j84J52J17l94P9J9J21J36
6970B84P2n96L84m2Q3k56J5J78j87j57K41K22l1m49L35J35k44j55J86J9mr1J77
6993A19j34J93k67J87q2k85K38J0L2l5l81L65K01j99l9R5n8J88k39N52o14N1J55
7016E3jLp2M3q0N2j48N0J46j89K64J35k60R0j84J30k69M2Q8K60Qj72K50l47J9
7041h9L7L09r8q9o0J%j22N16k83j00j58K85O8k64j29k29J48O89m41j60K60J16
7064B07K19l55M1k82j28L03j07PK12k76J15j36L46k71Q0l1k98K63J66j62N42l92
7086F3n7K15k22J42K27l36j24l3L6K08k87L35k90L70l64Q6P3O5j57o2J35k15M98
7109C06m34J93N0n5l10N16k84k28M05k56J63k17o0K20QR2m16K22J46R6o0k77L16
$$ plain form
7132 136 81 157 128 42 171 -108 -88 -293 -2 -66 -60 41 -16 90 138 127 -58 42 -29 -49 67 -101 8 -21 4
7157 4 57 -212 60 -204 15 55 -208 -165 215 263 -95 -198 -358 -128 30 -106 98 -239 -45 134 216 147 -174
7180 -174 -6 107 42 159 -236 -87 -41 -77 -137 45 13 -87 166 19 113 -55 -213 3 118 -199 185 -148
7202 -148 -25 -263 293 -44 74 228 18 -25 77 -44 211 -135 -257 87 -59 160 -187 55 13 239 453
7223 453 10 334 -244 -112 126 -160 195 259 -48 -72 36 1 -51 47 -117 222 85 193 -128 -54 54 54 221
7246 221 -157 -171 115 -57 69 -203 44 -6 220 75 125 234 -43 -73 -113 -183 -89 -36 35 6 -98 266 -180
7269 -180 -41 127 28 276 -284 68 -193 -34 166 -43 -97 -207 -83 -59 -134 -31 -25 -141 112 224 40 20
7291 20 244 213 151 111 169 -229 7 -24 130 -95 -4 97 -195 136 -91 -32 -93 112 314 77 -5 160 -176
$$ packed form
7132A36n5P6k9q6J29k79K0k05K91o4OJ01n7J06M8j1j85J00p1k0J16j68J09k9K5
7157DN3k69K72k64K19M0k63M3L80M8l58j03j60K30J58j36K04l37J94J79Q2o9l21
7180a74J68J13o5J17l95J49M6l6o0J82l2j00K53j47R4j68j58K16J15l17L84l33
7202a48J23k38N56l37J18J54k10m3J02j21K55l46j22L44j46K19l47K42m2K26K14
7223D53m43L24n78J32K38k86L55O4l07k4J08l5n2R8j64L39j37J08l21P4J08%J67
7246B21l78j4K86j72J26k72K47n0K26j45N0J09k77l0m0p0R4N3P1k9j04L64m46
7269a80J39J68r9K48n60L52k61J59K00k09n4j10J24K4p5J03Oj16K53J12j84k0
7291B0K24l1o2m0N8l98K36l1J54k25R1J01k92L31k27N9o1K05K02k37q2J65l36
$$ plain form
7314 -176 -244 -45 64 -62 -137 -1 -49 118 -130 -160 -30 164 -268 -73 55 -45 87 -291 298 -85 36
7335 36 -38 62 -39 -236 107 -31 71 -107 61 -153 272 -43 249 -69 112 -13 248 45 115 -143 80
7356 80 15 -21 -19 -149 145 203 -34 185 74 223 -89 -67 69 114 82 161 -134 236 94 -38 31 -12 -44 224
7380 224 48 71 -40 178 204 -257 -159 -2 -252 134 118 -197 -8 32 -25 25 19 -123 -259 55 -44 16 -108 -184
7404 -184 -25 67 180 -181 -184 135 -114 71 82 270 -60 -107 22 -157 -72 136 308 -109 -7 120 -53 -207
7426 -207 96 36 4 168 -46 -115 169 -38 204 -50 236 143 38 126 -263 -94 -118 106 -277 94 296 165
7448 165 156 -44 -45 36 52 -23 116 67 -50 -49 299 -62 88 -95 -24 144 -225 -148 -146 126 -324 -53 124 173 274
7473 274 108 -34 31 -40 -87 79 -211 -214 142 42 -317 225 -37 72 -101 -82 139 268 -306 379 -51 34
$$ packed form
7314a76o8J99J09j26p5J36m8J67k48l0J30J94m32J95J28j00J32l78N89l83J21
7335C6p4J00j01j97L43j38J02j78J68k14M25l15K92l18J81j25K61k03P0k58K23
7356H0o5l6Kj30K94N8k37K19j11J49l12K2J36M5l2P9k95L70j42j32O9m3l2K68
7380B24j76K3j11K18K6m61R8J57k50L86j6l15J89M0n7N0oj42j36L14r9O0j24p6
7404a84J59R2J13l61lL19k49J85J1J88l30m7J29j79Q5K08J72m17J02J27j73j54
7426b07L03o0l2J64k14o9K84k07K42k54K86r3j05Q8l89J69k4K24l83L71K02j31
7448A65rk00jQ1J6p5J39m9j17JL48l61J50j83P1J68l69P7KK72m50K71J77M9J01
7473B74j66j42O5p1m7J66k90lL56j00l59N42k62J09j73J9K21J29n74O85m30Q5
$$ plain form
7495 34 347 133 -323 -28 74 -146 -85 -122 -82 154 43 235 79 80 198 -92 -23 31 150 -347 75 165 -293
7518 -293 -349 80 59 258 82 -185 -69 -32 1 28 -147 -187 -222 -143 -178 314 -65 141 39 -113 -48 -310 59
7541 59 -25 44 -162 192 8 -155 166 105 38 102 216 6 43 -98 -77 -28 123 258 -72 69 -86 214 -96
7564 -96 19 223 -41 95 67 53 -31 63 270 211 -128 164 -161 -109 -103 -42 155 32 -41 115 -41 183 70 32
7588 32 84 180 -96 180 8 -21 -140 -199 88 -136 39 7 114 80 -156 227 29 66 120 -252 55 57 83 -183
7612 -183 -293 -143 202 -205 199 197 189 -128 -241 8 -41 19 -263 -135 173 -52 103 -120 154 -72 29 41
7634 41 -47 23 29 188 -191 73 -49 -187 143 -6 60 -53 -63 -90 -38 -41 146 50 61 -80 -56 -60 73 -49 315
7659 315 -153 186 77 125 -7 192 -176 -251 -74 -27 -249 -73 136 183 -84 253 233 -75 -47 109 27 182
$$ packed form
7495C4L13k14m56K95J02k20O1l7M0K36j11J92j56JJ18k90O9N4J19m97M22R0m58
7518b93n6M29k1J99j76k67J16L7L3K7j75m0l5P9l5M92l79K06j02j52O5k62L69
7541E9q4O9k06L54j84j63L21o1o7O4J14k10L7j41K1M9J51J35l30J41j55L00l10
7564i6J15K04k64J36k8j4q4R4K07n9l39K92l25N2OO1J97j23p3J56j56K24j13l8
7588C2N2R6k76K76j72k9j19n9K87k24J75l2J07l4k36L83j98L7N4l72L07KK6k66
7612a83j10J50L45m07M04kql17j13K49m9O0k82J28L08k25J55k23K74k26J01J2
7634D1q8P0OJ59l79K64j22j38L30j49O6j13j0k7N2lJ87r6J1j41K4mJ33j22L64
7659C15m68L39j09M8j32J99l68p5J77M7k22J76K09M7k67L37k0l08K8J56q2J55
$$ plain form
7681 182 -28 13 -67 126 238 -190 332 -10 -93 -199 -19 -47 -164 23 272 -291 -440 -12 50 231 -279 147
7703 147 -277 -141 165 82 49 -82 21 -124 -101 -20 60 -55 -194 173 106 -46 -137 262 84 152 -74 34 493
7726 493 153 -162 25 -143 17 184 61 -106 -168 -27 -157 -26 -297 -40 106 -122 -12 134 -58 -251
7746 -251 86 -82 -129 -190 292 -4 -183 27 -120 18 162 49 35 154 -123 88 -56 377 455 444 -9 141
7768 141 -42 156 18 72 68 138 -54 70 204 46 -5 81 75 83 46 223 263 -46 147 -3 -180 94 -89 -338
7792 -338 32 -37 27 -259 -297 -11 28 104 42 80 -203 126 -111 -122 110 124 -33 128 -131 91 -118 -221 298
7815 298 34 186 -56 25 -93 -107 112 -140 -140 213 -19 157 -366 0 241 -64 -155 49 -76 -45 -111 180
7837 180 -26 -26 120 129 -190 291 -101 70 3 -172 205 -302 20 43 97 -23 -41 -247 146 -214 -146 -207 -108 -9
$$ packed form
7681A82k10M1q0J93J12m28N22l42q3j06J80k8j17J87K49n63j49M28O2J81n10M26
7703A47m24J36L06q3l3j31J03j45K3Q1Q0j15j39L67o7j52r1L99j78O8k26J08M59
7726D93l40l15J87j68J60J67j23j67o2J41j30J31k71K57J46k28J10J46j92j93
7746b51L37j68m7o1M82k96j79K10j47J38J44j13j4J19k77K11j44M33P8j1m53J50
7768A41j83J98j38N4mP0j92J24J34j58n1Q6oQl7J77M0l09J93j50j77K74j83k49
7792c38L70o9O4k86l8K86L9P6o2L8k83L29k37j1K32J4j57J61k59K22k09j03N19
7815B98k64J52k42Q1j18j4K19k52%L53k32J76n23L66K41l05r1K04j25L1o6K91
7837A80k06%J46Rl19M81l92J71o7j75L77n07L22K3N4j20j8k06L93l60O8o1R9R9
$$ plain form
7861 -9 52 29 -318 -147 -384 357 16 -177 75 120 -83 -154 75 -66 -156 138 22 -186 -196 105 52 312 63
7884 63 147 83 -173 -63 -80 123 -243 121 -218 -27 -34 65 7 116 286 -52 141 82 -97 54 -127 -246 78
7907 78 -90 86 93 79 -59 63 -8 143 -183 -70 194 181 53 -150 196 72 146 -49 109 82 48 -110 144
7930 144 72 184 -176 -99 97 -306 -254 -255 23 99 -45 108 41 16 211 324 -271 -64 -64 -64 52 13 -34 69 160
7955 160 160 -90 -207 -166 155 -357 -146 -177 -48 -34 -109 -8 120 35 310 -110 -3 175 279 8 -278 -98
7977 -98 63 -160 147 361 74 -114 19 185 -270 77 -108 95 -226 -202 3 -194 -22 197 87 -9 85
7998 85 264 73 33 -47 358 134 44 225 128 265 212 60 356 228 -127 -35 -48 -102 152 -80 292 188 -73
8021 -73 229 -116 148 174 31 117 -21 4 -226 209 -74 -239 -394 10 -24 -41 18 -47 -195 187 70 -217 276
$$ packed form
7861iO1k3l47J71k37P41l41j93K52M5k03p1K29j41r0K94j16k08j0L01n3K60k49
7884F3Q4o4k56J10j7K03l66L64l39J91pR9n8J09J70l38J93n9j79J51j81j19L24
7907G8j68J76Pj4j38J22p1J51l26J13K64j3j28k03L46j24P4j95J58k7l4j58K54
7930A44p2J12l60P7J96m03N2jK78P6j44J53o7k5J95J13n95K07%%J16l9m7J03R1
7955A60%k50j17M1L21n12K11l1J29J4p5J01J28q5K75m20J07J78J04k71k86J80
7977i8J61k23L07K14k87j88J33J66m55L47j85K03l21K4K05j97J72K19j10r6R4
7998H5J79j91m0q0M05k24r0J81r7J37n3j52K96j28l55R2j3n4K54k32L72j04k61
8021g3L02l45K64K6j43Q6j38K5k30M35k83j65j55M04l4j7N9o5j48L82j17k87M93
$$ plain form
8044 276 304 -94 96 -217 -199 -108 -94 187 -75 371 -214 -20 -118 -354 158 -160 73 -31 -81 -56 59 92 68
8067 68 -106 406 -140 22 198 -270 -11 -142 95 -57 338 0 -214 -102 95 -56 -306 -66 -394 262
8087 262 121 340 124 -213 -91 -92 -21 156 101 -237 -100 12 150 190 97 -113 -80 17 69 -244 34 -108 198
8110 198 163 -135 126 63 106 -93 21 1 76 83 -32 -256 170 43 90 9 130 158 -5 256 -28 -113 -65 52
8134 52 -192 -111 133 38 55 228 170 -215 19 -29 -106 -60 -63 86 -35 199 -152 174 -104 192 326 173 33
8157 33 31 -12 -75 117 -70 -131 -204 232 -30 -57 -340 -207 150 -151 -39 -69 -70 -5 -9 59 -276 -321 214 311 522 72
8183 72 -22 31 1 39 -13 104 -19 19
$$ packed form
8044B76K8l98J90l13J8R1J4K81k62M46n85J94r8k36N12l18K33j04n0K5J15L3k4
8067F8j74N12n46J62J76m68K59j31K37j52L95l38k14J12J97j51k50K40l28O56
8087B62j41K19k16l37J22jP1J77n5l38J37J12J38M0r3k10L3R7N2l13K78j42L06
8110A98l5k98K61o3M3j99J14k0P5Pj15k24M26j27M7q1J21K8j63K61k84q5M8J17
8134E2k44Q1K44r5J7J73n8l85K34m8p7M6lJ49j21K34l51L26k78K96J34j53j40
8157C3km3o3J92j87o1p3M36k62k7k83J33L57l01J12l0jO5mO8l35m5N35R7K11m50
8183G2r4N3l0L8n2J17j23L8
8191A9
$$ Imaginary data points
##PAGE= N=2
##DATA TABLE= (X++(I..I)), XYDATA
$$ plain form
0 0 0 0 0 0 0 0 -8 8 -8 8 -16 16 -24 24 -32 38 -46 53 -64 73 -86 99 -115 132 -152 174 -200 224 -256 287
30 287 -324 364 -407 453 -507 565 -628 695 -771 856 -946 1049 -1163 1286 -1425 1581 -1760
47 -1760 1962 -2194 2468 -2790 3183 -3667 4285 -5102 6245 -7947 10766 -16275 31093 -153867
61 -153867 -445458 -161098 -49354 -204411 -236207 -2753 31655 -157901 -247831 -182931 -217073
72 -217073 -273185 -200292 -96613 -105167 -103112 -58883 -101583 -216595 -220709 -147624 -130638 -117584
84 -117584 -19814 43318 8363 -8542 13242 -35271 -80903 -386 89734 65719 68073 168604
96 168604 186992 75751 42272 115947 115538 60494 120711 230526 221624 166915 198265 218490
108 218490 128893 58393 101730 143709 117900 116992 159510 157313 116521 90646 48290 -3817
$$ packed form
0@%%%%%%qJ6j6J6k4L2m0M8n6P0q4R9j17J37j59J85k14K47k84L26l74M24m80N43
30B87o11O88p71Q60r60J072j193J323j466J627j802J995k212K449k711L006l341
47a760L722m156M662n258N973o850P952r387J1347j4192J8713k7041M7368j84960
61a53867k91591K84360J11744j55057l1796K33454L4408j89556q9930O4900l4142
72b17073n6112P2893J03679q554K055M4229m2700j15012m114P3085J6986J3054
84a17584R7770O3132l4955j6905K1784m8513m5632Q0517R0120k4015K354J00531
96A68604J8388j11241l3479P3675m09n5044O0217J09815q902n4709L1350K0225
108B18490q9597p0500M3337M1979k5809r08M2518k197m0792k5875m2356n2107
$$ plain form
120 -3817 16758 62587 21060 -21812 52640 101963 -13906 -122956 -74772 -38414 -130994 -176428
132 -176428 -85006 -31823 -89397 -117944 -93295 -127420 -186924 -163892 -126307 -157452 -155183 -66736
144 -66736 -42718 -134136 -169646 -106386 -106724 -177413 -156201 -54842 -24429 -47636 -25356 -3887
156 -3887 -42555 -65272 -33857 -23525 -30293 24569 95900 87164 47065 61819 78333 39722 20132
169 20132 69558 113776 115046 132489 165459 143955 94356 92272 107098 83211 72780 117866
181 117866 148389 125802 104841 97428 64728 36529 50469 57404 35891 52069 100696 80225
193 80225 -486 -22393 11388 -9789 -72446 -67127 -7162 2625 -39666 -62814 -64550 -79980 -94572
206 -94572 -100460 -111069 -101625 -54750 -39457 -90163 -118795 -82941 -75137 -128785 -139351 -79191 -51308
$$ packed form
120c817K0575M5829m1527m2872P4452M9323j15869j09050M8184L6358r2580m5434
132a76428R1422N3183n7574k8547K4649l4125n9504K3032L7585l1145K269Q8447
144f6736K4018r1418l5510O3260l38p0689K1212J01359L0413k3207K2280K1469
156c887l8668k2717L1415J0332o768N4862P1331q736m0099J4754J6514l8611j9590
169B0132M9426M4218J270J7443L2970k1504m9599k084J4826k3887j0431M5086
181A17866L0523k2587k0961p413l2700k8199J3940O935k1513J6178M8627k0471
193H0225q0711k1907L3781k1177o2657N319N9965R787m2291k3148j736j5430j4592
206i4572n888j0609R444M6875J5293n0706k8632L5854P804n3648j0566O0160K7883
$$ plain form
219 -51308 -76609 -72785 -46136 -61004 -83553 -57773 -36523 -59096 -51204 13050 32582 -19445
231 -19445 -31407 24377 35707 -15032 -15114 51971 79633 49352 45824 77927 80554 53619 49820
244 49820 70628 82058 81163 85828 96285 98423 80825 56329 55583 75487 70571 42644 54588
257 54588 100134 94100 32184 14608 57563 56563 -7070 -22199 35102 53646 831 -29267
269 -29267 -5226 -3595 -43495 -60806 -43940 -36804 -40494 -32957 -33925 -56283 -69774 -64152 -66735 -84685
283 -84685 -86869 -64125 -41854 -43658 -64791 -78365 -64610 -49415 -69640 -94363 -61633 -2046
295 -2046 -4358 -52441 -46301 4832 -3039 -60951 -56168 10581 30296 -887 7147 49048 44069
308 44069 5413 6764 35335 34897 26012 53627 84944 73414 47928 48841 57127 41917 24802
$$ packed form
219e1308k5301L824K6649j4868k2549K5780K1250k2573P892O4254J9532n2027
231a9445j1962N5784J1330n0739q2O7085K7662l0281l528L2103K627k6935l799
244D9820K0808J1430q95M665J0457K138j7598k4496p46J9904m916k7927J1944
257E4588M5546o034o1916j7576M2955j000o3633j5129N7301J8544n2815l0098
269b9267K4041J631l9900j7311J6866P136l690P537r68k2358j3491N622k583j7950
283h4685k184K2744K2271j804k1133j3574J3755J5195k0225k4723L2730N9587
295b046k312m8083O140N1133p871n7912M783O6749J9715l1183Q034M1901m979
308D4069l8656J351K8571m38q885K7615L1317j1530k5486R13Q286j5210j7115
$$ plain form
321 24802 36168 62760 77150 70892 56403 50222 49330 37220 14461 9219 31269 49267 42458
334 42458 29277 24478 16369 -2571 -18678 -25837 -25878 -12691 5913 5474 -16431 -28178 -22490 -31631
348 -31631 -61837 -72474 -44850 -16913 -21552 -39488 -39642 -29975 -37990 -64525 -79330 -58826 -24791
361 -24791 -16277 -31779 -30071 -8993 -9777 -42077 -59787 -37781 -11095 -7926 -9088 5081 17561
374 17561 12153 -1740 -11024 -11207 201 18386 29336 30757 36669 45008 36486 14864 5786 15383
388 15383 24014 28330 38820 49759 47019 38102 32741 23401 7626 5102 23496 38831 33525 26196
402 26196 32544 34454 12930 -13042 -14186 2484 9626 4837 4437 12998 14375 -640 -20191 -30214
416 -30214 -25419 -15562 -10186 -10643 -11201 -5821 -3220 -17865 -41477 -46670 -26769 -12456 -20537 -26914
$$ packed form
321B4802J1366K6592J4390o258j4489o181q92j2110k2759n242K2050J7998o809
334D2458j3181m799q109j8940j6107p159m1J3187J8604m39k1905j1747N688r141
348c1631l0206j0637K7624K7937m639j7936j54R667q015k6535j4805K0504L4035
361b4791Q514j5502J708K1078p84l2300j7710K2006K6686L169j162J4169J2480
374A7561n408j3893r284j83J1408J8185J0950J421N912Q339q522k1622r078R597
388A5383Q631M316J0490J0939k740q917n361r340j5775k524J8394J5335n306p329
402B6196O348J910k1524k5972j144J6670P142m789m00Q561J377j5015j9551j0023
416c0214M795R857N376m57n58N380K601j4645k3612n193J9901J4313q081o377
$$ plain form
430 -26914 -9798 7819 -6712 -38300 -43330 -19846 -8119 -21964 -27253 -3311 17556 2304
442 2304 -25828 -25567 -5891 -3506 -16227 -10088 14524 24332 10339 818 5050 2301 -7234 -3114
456 -3114 12910 17036 11815 19287 29302 17667 -4526 -2867 17243 20332 6704 10484 32913
469 32913 36274 12986 -1611 8793 15980 5222 429 14992 25154 15939 7665 11198 6909
482 6909 -8081 -7843 10987 14237 -3523 -3558 19007 17024 -17820 -30898 -2916 11626 -12885 -26889
496 -26889 -955 20241 -1357 -28841 -22818 -4472 -7499 -20981 -19238 -4683 2320 -5108 -17018
509 -17018 -22779 -18934 -13315 -13711 -16148 -10462 758 2992 -4623 -13500 -15948 -10983 -4259 -4144 -7492
524 -7492 -960 13540 12804 -6007 -15063 -1289 8693 -872 -4259 12460 26253 17156 4185 4984
$$ packed form
430b6914J7116J7617j4531l1588n030K3484J1727j3845n289K3942K0867j5252
442B304k8132K61J9676K385j2721O139K4612R808j3993r521M232k749r535M120
456c114J6024M126n221P472J0015j1635k2193J659K0110L089j3628L780K2429
469C2913L361k3288j4597J0404P187j0758m793J4563J0162r215q274L533m289
482F909j4990K38J8830L250j7760l5K2565j983l4844j3078K7982J4542k4511j4004
496b6889K5934K1196k1598k7484O023J8346l027j3482J743J4555P003p428j1910
509a7018n761L845N619l96k437N686J1220K234p615q877k448M965O724J15l348
524g492O532J4500p36j8811r056J3774R982r565l387J6719J3793r097j2971P99
$$ plain form
538 4984 7863 3177 1715 10387 17790 17833 18051 19941 14246 2238 -2808 4440 12302 11998 9475 15549
554 15549 24153 17403 -2423 -11963 -1934 6452 -779 -5475 6844 19161 10482 -7802 -15249 -11428
568 -11428 -7404 -8567 -9959 -5814 5691 11696 -1904 -22505 -23951 -10404 -10033 -22521 -18621 5300
582 5300 13827 -2560 -17010 -14636 -11732 -16807 -18758 -11711 -544 9636 11566 305 -12711 -12169
596 -12169 -6244 -10559 -16076 -2877 17666 20069 8347 1342 1732 -2036 -8498 -7268 720 11806
610 11806 20514 21536 13286 4379 782 -2793 -6697 -4213 7401 17261 20524 19822 14276 3152 -6200
625 -6200 -5107 -1595 -2247 991 15195 25198 15468 -2988 -8190 -2996 -4722 -15265 -12990 8619
639 8619 25111 14944 -4604 -6349 1148 -7485 -25118 -20772 3284 15201 7151 776 2648 -2495
$$ packed form
538D984K879m686j462Q672P403M3K18J890n695j2008n046P248P862l04k523O074
554A5549Q604o750j9826r540J0029Q386p231m696J2319J2317q679j8284p447L821
568a1428M024j163j392M145J1505O005j3600k0601j446J3547L71j2488L900K3921
582E300Q527j6387j4450K374K904n075j951P047J1167J0180J930j1261j3016N42
596a2169N925m315n517J3199K0543K403j1722p005L90l768o462J230P988J1086
610A1806Q708J022q250q907l597l575l904K484J1614R860L263p02n546j1124r352
625f200J093L512o52L238J4204J0003r730j8456n202N194j726j0543K275K1609
639H619J6492j0167j9548j745P497q633j7633M346K4056J1917q050o375J872n143
$$ plain form
653 -2495 -14322 -19947 -17549 -12903 -2046 12875 13956 -1126 -8869 -2708 -7217 -25872 -27869 -1853
667 -1853 17098 9024 -2999 3133 9490 -5675 -25333 -22687 -2872 8222 4812 5394 13667 12935
681 12935 -2835 -16261 -13330 -5761 -4099 1771 15778 21809 11042 1041 2099 -688 -12251
694 -12251 -12722 6023 21975 17935 9270 12405 14472 1730 -14064 -12959 2138 12851 12536 12236
708 12236 15983 15215 4386 -8741 -12786 -7787 -79 8049 13092 10724 6513 6313 1316 -14631 -24522
723 -24522 -10884 8449 6053 -5909 1483 15486 3156 -24734 -28892 -10057 -2504 -9607 -8487
736 -8487 5124 11185 122 -14394 -19978 -17157 -10802 -7607 -5628 966 9879 9099 -3246 -12762
750 -12762 -12686 -9740 -8299 -3513 4554 10162 11716 9949 3324 -5457 -7803 -1339 3733 5735 10834
$$ packed form
653b495j1827n625K398M646J0857J4921J081j5082p743O161m509j8655j997K6016
667a853J8951q074j2023O132O357j5165j9658K646J9815J1094l410N82Q273p32
681A2935j5770j3426K931P569J662N870J4007O031j0767j0001J058k787j1563
694a2251m71J8745J5952m040q665L135K067j2742j5794J105J5097J0713l15l00
708A2236L747p68j0829j3127m045M999P708Q128N043k368m211k00m997j5947r891
723b4522J3638J9333k396j1962P392J4003j2330k7890m158J8835P553p103J120
736h487J3611O061j1063j4516n584K821O355L195J979O594Q913p80j2345r516
750a2762P6K946J441M786Q067N608J554j767o625q781k346O464N072K002N099
$$ plain form
765 10834 17101 17733 11711 3825 -1827 -2896 2755 8418 8338 9979 17092 19047 8183 -3948 -4125
780 -4125 1102 1842 869 4643 10447 12865 8944 -992 -10841 -9525 -1000 -1948 -8663 -3546 10455 9161
796 9161 -7762 -16687 -10188 -5838 -11378 -14244 -7443 1858 4478 -2353 -12363 -14701 -7268 -4896 -13002
811 -13002 -14071 1273 11780 1262 -11072 -6026 899 -5236 -12076 -5184 4604 6225 4537 3960
825 3960 2145 -543 -224 1081 308 2157 8486 11929 9865 6746 4054 2459 3196 4646 3279 2954
841 2954 9343 14546 7721 -1087 342 5494 1831 -3377 776 6874 5981 3257 2668 -864 -5591 -2346
857 -2346 1637 -2796 -6959 1103 8908 666 -11280 -9345 243 -811 -9751 -10178 -321 6372 -116
872 -116 -11264 -11623 -723 2625 -8895 -13534 904 12195 1275 -10963 -3902 5314 -1581 -9889
$$ packed form
765A0834O267O32o022p886n652j069N651N663q0J641P113J955j0864j2131j77
780d125N227P40r73L774N804K418l921r936r849J316Q525r48o715N117J4001j294
796I161j6923q925O499M350n540k866O801R301K620o831j0010k338P433K372q106
811a3002j069J5344J0507j0518j2334N046O925o135o840O892R788J621j688n77
825C960j815k688L19J305p73J849O329L443k064l119k692j595P37J450j367l25
841B954O389N203o825q808J429N152l663n208M153O098q93k724n89l532m727L245
857b346L983m433m163Q062P805q242j1946J935R588j054q940m27R857O693o488
872a16j1148l59J0900L348j1520m639J4438J1291j0920j2238P061R216o895q308
$$ plain form
886 -9889 -2942 5444 3129 818 3428 991 -5349 -2178 3899 30 -4885 3701 13231 6604 -4115
901 -4115 -1423 5288 1815 -4280 -425 7008 8330 5145 2534 1250 -72 -1177 -2863 -1653 2309
916 2309 4783 3480 3259 3636 -1840 -7985 -3675 3572 -124 -5560 2524 12360 5086 -9327 -7344
931 -7344 2738 891 -8601 -6098 5441 9265 2547 -4119 -5394 -3157 -1504 -4760 -7884 -1647 9486
946 9486 8636 -2579 -5693 604 1022 -6359 -7670 -338 6019 7020 3888 -1250 -4062 -1014 -574 -7054
962 -7054 -8526 2690 11809 5335 -3392 -31 4834 -2302 -9700 -4666 3636 4610 4277 5724 4116
977 4116 28 -1788 -2425 -5123 -4372 2581 6559 4733 2910 2724 -389 -4776 -4562 -2538 -2473 247 7261
994 7261 9058 1193 -3378 -347 -22 -6150 -7915 -839 6534 6905 1955 -1491 -1245 -143 -4402 -10829
$$ packed form
886i889O947Q386k315k311K610k437o340L171O077l869m915Q586R530o627j0719
901d115K692O711l473o095L855P433J322l185k611j284j322j105j686J210L962
916B309K474j303k21L77n476o145M310P247l696n436Q084R836p274j4413J983
931g344J0082j847r492K503J1539L824o718o666j275K237J653l256l124O237J1133
946I486q50j1215l114O297M18p381j311P332O357J001l132n138k812L048M40o480
962g054j472J1216R119o474q727L361M865p136p398N034Q302R74l33J447j608
977D116m088j816o37k698P51O953L978j826j823j86l113m387K14K024O5K720P014
994G261J797p865m571L031L25o128j765P076P373L71m950l446K46J102m259o427
$$ plain form
1010 -10829 -7611 3645 8786 1074 -3926 1571 4227 -4113 -11362 -6544 2690 4886 3001 1880
1024 1880 2222 2485 747 -5544 -9287 -3219 6061 5757 523 1837 7286 4222 -5319 -7289 -1864 2526
1040 2526 3237 3859 5020 5664 5616 2068 -4365 -6135 34 4475 1560 826 6351 7025 -583 -5895 -3534
1057 -3534 -2397 -4760 -2002 4244 4135 -782 -1295 1178 -2831 -9896 -8048 178 3075 -890 -2191
1072 -2191 1541 2944 -3087 -9851 -9494 -2071 1340 -1764 -3078 1946 4928 -155 -7304 -6292 -936
1087 -936 914 431 1410 3713 4839 5252 1433 -3804 -3585 3068 6390 1996 305 6998 11206 4030
1103 4030 -4453 -1902 5359 5255 131 824 7700 10144 3975 -2233 -1072 2849 2035 -1596 -594 4273
1119 4273 5327 559 -2190 -1535 -2336 -4866 -3571 -1167 -793 -2981 -1582 -133 -3822 -8660 -6948 -2713
$$ packed form
1010a0829L218J1256N141p712n000N497K656q340p249M818R234K196j885j121
1024A880L42K63j738o291l743O068R280l04n234J314N449l064r541j970N425M390
1040B526P11O22J161O44m8l548o433j770O169M441k915p34N525O74p608n312K361
1057c534J137k363K758O246j09m917n13K473m009p065J848Q226K897l965j301
1072b191L732J403o031o764L57P423L411l104j314N024K982n083p149J012N356
1087i36J850m83R79K303J126M13l819n237K19O653L322m394j691O693M208p176
1103D030q483K551P261j04n124O93O876K444o169o208J161L921q14l631J002M867
1119D273J054m768k749O55q01k530J295K404L74k188J399J449l689m838J712M235
$$ plain form
1135 -2713 -2964 -5427 -3692 -251 -7 -4151 -6211 -5641 -4131 -3168 -2286 -2389 -1791 248 799 -1460 -5189
1152 -5189 -3501 1778 2974 -679 -329 4732 7616 2515 -2717 462 6213 6384 2121 1956 7197 9763
1168 9763 5237 -247 356 4860 6213 2793 1567 5074 8409 5478 -674 -1485 2286 3772 649
1183 649 -700 2103 4923 2678 -2029 -4094 -2745 -1541 -2518 -3563 -2207 -199 -553 -3456 -5815 -6376
1199 -6376 -5869 -5686 -4747 -3471 -2299 -1816 -2124 -3396 -5903 -7078 -5068 -2992 -2647 -2344 -281 978 421
1216 421 -2621 -5013 -4292 -1006 1158 487 743 4013 5872 2749 -2438 -1700 2268 3822 2511 3163
1232 3163 6781 8616 6658 1980 -1039 892 4294 3965 1196 3198 9787 9209 1121 -3218 788
1247 788 3543 -400 -2099 2600 7143 5786 1035 -1556 -1704 -1970 -2402 -3621 -2424 1269 3872 1048
$$ packed form
1135b713k51k463J735L441K44m144k060N70J510R63Q82j03N98K039N51k259l729
1152e189J688N279J196l653L50N061K884n101n232L179N751J71m263j65N241K566
1168I763m526n484O03M504J353l420j226L507L335k931o152q11L771J486l123
1183F49j349K803K820k245m707k065J349J204r77j045J356K008l54k903k359n61
1199f376N07J83R39J276J172M83l08j272k507j175K010K076L45L03K063J259n57
1216D21l042k392P21L286K164o71K56L270J859l123n187P38L968J554j311O52
1232C163L618J835j958m678l019J931L402l29k769K002O589n78q088m339M006
1247G88K755l943j699M699M543j357m751k591j48k66m32j219J197L693K603k824
$$ plain form
1263 1048 -3325 -4269 -3635 -5663 -7173 -4523 -1426 -344 166 -288 -3358 -6247 -6110 -4350 -5709 -5393
1279 -5393 -409 3206 1342 -2210 -2824 -2970 -5220 -5291 -2711 -167 1024 3496 4330 893 -2858 -2202
1295 -2202 -438 -1277 -1451 2103 6925 7452 4329 803 151 2095 1501 -1884 -486 7444 11044 5378
1311 5378 57 3078 5023 25 -4392 -312 6463 6578 4233 4114 3620 1133 -537 -1757 -3017 -1129
1327 -1129 3720 6056 1419 -1038 1033 259 -5448 -8044 -3542 44 68 -616 -137 -878 -2978 -4845
1343 -4845 -7112 -7643 -4431 -874 -565 -1894 -643 -251 -4253 -7213 -5981 -3989 -3799 -1742 2263 1761
1359 1761 -1503 -2243 -698 -3252 -5821 -2747 2672 3559 2418 2825 3679 2616 169 -859 -1390 1274
1375 1274 5815 6639 3924 3761 6681 5136 -870 -2193 2803 5731 4639 4179 5684 6108 4010 1458
$$ packed form
1263A048m373r44O34k028j510K650L097J082N10m54l070k889J37J760j359L16
1279e393M984L615j864l552o14j46k250p1K580K544J191K472Q34l437l751O56
1295b202J764q39j74L554M822N27l123l526o52J944n94l385J398P930L600n666
1311E378n321L021J945m998m417M080O775J15k345j19m94k487j670j220j260J888
1327a129M849K336m637k457K071p74n707k596M502L586K4o84M79p41k100j867
1343d845k267n31L212L557L09j329J251L92m002k960J232J992J90K057M005n02
1359A761l264p40J545k554k569L074N419Q87j141M07Q54j063k447j028n31K664
1375A274M541Q24k715j63K920j545o006j323M996K928j092m60J505M24k098k552
$$ plain form
1391 1458 -1300 -1600 2256 4641 2255 657 3773 5290 -533 -5703 -3334 -48 -1770 -3008 -703
1406 -703 1216 -328 -2227 -3341 -6215 -6838 -3623 -2498 -4284 -3387 -22 -379 -5536 -7140 -4232 -4066
1422 -4066 -5647 -3769 -482 -632 -1744 -1251 -1676 -4303 -4222 -1518 -82 -687 928 3425 2875 1271 623
1439 623 -566 -96 2029 3992 3421 2471 5411 6933 2916 -467 1900 4992 3466 1535 3828 6434
1455 6434 5571 3238 1677 911 1659 2931 2320 579 2150 5248 3213 -1928 -2494 913 645 -2699
1471 -2699 -2556 291 579 -834 -2027 -3318 -4393 -2773 -2048 -4770 -5086 -958 625 -4012 -6676 -2950
1487 -2950 -1107 -4513 -5653 -2576 -361 -2366 -2961 -1433 -1695 -3492 -2508 -475 -1215 -1969 42 1488
1503 1488 225 -471 343 798 451 1423 2205 1379 2191 4012 2823 -32 668 3932 3599 876 2309
$$ packed form
1391A458k758l00L856K385k386j598L116J517n823n170K369L286j722j238K305
1406g03J919j544j899j114k874o23L215J125j786Q97L365l57n157j604K908J66
1422d066j581J878L287j50j112M93m25k627Q1K704J436o05J615K497n50j604o48
1439F23j189M70K125J963n71r50K940J522m017l383K367L092j526j931K293K606
1455F434q63k333j561p66P48J272o11j741J571L098k035n141n66L407k68l344
1471b699J43K847K88j413j193j291j075J620P25k722l16M128J583m637k664L726
1487b950J843l406j140L077K215k005n95J528k62j797R84K033p40p54K011J446
1503A488j263o96Q14M55l47R72P82q26Q12J821j189k855P00L264l33k723J433
$$ plain form
1520 2309 4744 4187 1736 1762 2112 1675 2649 3277 1697 889 3214 4529 445 -2364 582 3081 303
1537 303 -2060 769 2838 993 -1973 -2281 -1442 -746 -957 -2019 -2380 -433 994 -1738 -5091 -3216
1553 -3216 -837 -2438 -4320 -2331 53 -917 -2861 -1986 -2674 -3522 -2686 -1464 -1720 -1851 -57 1221 -1093
1570 -1093 -3000 -1219 -542 -1797 -1148 1119 1801 746 1110 1814 -113 -1321 546 2226 1186 790
1586 790 3507 4074 2285 475 972 1156 1432 2261 2408 2281 3394 4745 2402 -937 126 2734 1722
1603 1722 -811 989 4379 3259 772 -728 -182 -350 -508 -751 -1266 499 2637 1519 -2362 -3041
1619 -3041 -737 -941 -3974 -3988 -18 1146 -1378 -2410 -1947 -1983 -3334 -3561 -3474 -2440 -1069 5 -762
1636 -762 -2649 -2121 -1458 -2827 -3426 -2089 -4 22 55 744 133 -1332 -1139 -431 -731 -473 1396 3616
$$ packed form
1520B309K435n57k451K6L50m37R74O28j580q08K325J315m084k809K946K499k778
1537C03k363K829K069j845k966l08Q39O96k11j062l61J947J427k732l353J875
1553c216K379j601j882J989K384r70j944Q75o88q48Q36J222k56j31J794J278k314
1570a093j907J781O77j255O49K267O82j055L64P04j927j208J867J680j040l96
1586G90K717N67j789j810M97J84K76Q29J47j27J113J351k343l339J063K608j012
1603A722k533J800L390j120k487j500N46j68j58k43n15J765K138j118l881o79
1619c041K304k04l033j4L970J164k524j032M63l6j351k27Q7J034J371J074p67
1636g62j887N28O63j369n99J337K085K6L3O89o11j465J93P08l00K58J869K220
$$ plain form
1654 3616 2531 1459 1425 1370 491 680 1161 1737 3003 4255 3930 1851 1121 2232 2115 40 157 3114
1672 3114 4391 2854 1181 1321 1753 768 -911 -1009 187 1933 2054 -293 -1069 527 478 -2645 -3924
1689 -3924 -1607 531 -294 -2094 -1557 -516 -1633 -3327 -4052 -3196 -2050 -1146 -1509 -1795 -1279 -1062 -1954
1706 -1954 -3461 -2976 -1525 -622 -801 -34 208 -234 64 -909 -1335 -1109 73 1198 1148 1196 2148 1723 730
1725 730 58 761 1112 1194 2478 3336 2495 1690 2175 2338 1157 -356 1272 3289 2509 956 1393 2366
1743 2366 1820 -224 -798 143 1401 1049 275 -18 940 1084 -685 -2590 -1796 40 207 -1684 -1627 -117
1761 -117 -129 -1461 -3019 -2600 -1158 -788 -1541 -2036 -1194 185 -424 -2382 -2630 -1094 -443 -1023 -1477 -430
1779 -430 463 -193 -1048 -1180 -484 -168 17 159 356 878 1019 149 152 85 759 676 931 1328 1384 1078 1230 1131
$$ packed form
1654C616j085j072l4n5q79J89M81N76J266J252l25k079p30J111j17k075J17K957
1672C114J277j537j673J40M32r85j679r8J196J746J21k347p76J596m9l123j279
1689c924K317K138q25j800N37J041j117j694p25Q56J146R04l63k86N16K17q92
1706a954j507M85J451R03j79P67K42m42K98r73m26K26J182J125n0M8R52m25r93
1725G30o72P03L51Q2J284Q58q41q05M85J63j181j513J628K017p80j553M37R73
1743B366n46k044n74R41J258l52p74k93R58J44j769j905P94J836J67j891N7J510
1761a17j2j332j558M19J442L70p53m95Q42J379o09j958k48J536O51n80m54J047
1779d30Q93o56q55j32O96L16J85J42J97N22J41q70Lo7O74q3K55L97N6l06J52r9
$$ plain form
1801 1131 688 60 694 1742 1543 1006 870 1261 1343 334 133 105 873 1656 828 216 523 1281 344 -1352
1821 -1352 -1085 798 1310 117 -1172 365 736 -103 -2021 -1640 -517 353 -468 -1166 -899 76 -192 -1966
1839 -1966 -2068 -933 -4 -472 -1311 -683 344 -76 -1456 -1944 -1077 -245 -34 -829 -415 625 206 -592
1857 -592 -1272 -967 -194 -102 -262 92 722 847 16 -137 -176 -97 127 869 1266 1471 1160 1074 1086 53 -226
1878 -226 -16 906 1845 1368 998 1426 1532 773 -750 -821 600 1350 787 830 1190 1579 573 -705 -1444
1897 -1444 -303 446 175 -211 213 1362 385 -1208 -2105 -1446 -143 -713 -1125 -783 458 702 -597 -2167
1915 -2167 -1943 -635 -894 -1554 -966 769 878 -446 -1330 -1487 -855 -1071 -1377 -420 963 1027 774 119 -633
1934 -633 -468 -585 -412 36 1172 1800 2112 1229 993 7 -73 287 436 1068 1395 1786 1949 1524 133 -375
$$ packed form
1801A131m43o28O34J048j99n37j36L91Q2j009k01k8P68P83q28o12L07P58r37j696
1821a352K67J883N12j193j289J537L71q39j918L81J123Q70q21o98K67R75k68j774
1839a966j02J135R29m68q39O28J027m20j380m88Q67Q32K11p95M14J040m19p98
1857e92o80L05P73R2j60L54O30J25q31j53l9P9K24P42L97K05l11q6J2j033k79
1878b26K10R22R39m77l70M28J06p59j523p1J421P50n63M3L60L89j006j278p39
1897a444J141P49k71l86M24J149r77j593q97O59J303n70m12L42J241K44j299j570
1915b167K24J308k59o60N88J735J09j324q84j57O32k16l06R57J383O4k53o55p52
1934f33J65j17J73M48J136O28L12q83k36r86q0L60J49O32L27L91J63m25j391n08
$$ plain form
1954 -375 -46 312 386 363 1250 2050 1706 428 -443 -699 -172 -511 -209 -187 1197 1218 -28 -1192 -1532 -377
1974 -377 -1217 -1657 -1333 572 1225 -68 -1424 -1046 -834 -1371 -2132 -1565 169 776 501 -344 -856 -330 -923
1993 -923 -1632 -1581 -442 824 875 225 -98 83 -100 -726 -966 149 791 1378 1117 876 1106 248 49 -237
2013 -237 -163 779 1066 1465 1453 1000 462 43 273 -276 -186 109 1403 1098 502 179 89 -328 -686 -756 -450
2034 -450 515 1061 700 -169 -454 215 -371 -1230 -1405 -23 720 126 -135 -475 178 -417 -1578 -1776 -698
2053 -698 305 596 -289 -509 258 458 -775 -1719 -715 713 342 -457 37 650 515 -746 -1109 -566
2071 -566 204 243 185 99 534 654 470 -460 -857 191 330 330 495 904 960 284 214 -218 -364 -208 201 551
2093 551 344 268 458 583 -101 -285 -107 410 656 421 523 154 628 613 -297 -619 94 747 511 -124 -225
$$ packed form
1954c75L29L58P4k3Q87Q00l44j278q71k56N27l39L02K2J384K1j246j164l40J155
1974c77q40m40L24J905O53j293j356L78K12n37p61N67J734O07k75q45n12N26n93
1993i23p09N1J139J266N1o50l23J81j83o26k40J115O42N87k61k41K30q58j99k86
2013b37P4R42K87L99j2m53n38m19K30n49R0K95J294l05n96l23r0m17l58p0L06
2034d50R65N46l61q69k85O69n86q59j75J382P43n94k61l40O53n95j161j98J078
2053f98J003K91q85k20P67K00j233r44J004J428l71p99M94O13j35j261l63N43
2071e66P70L9n8q6M35J20j84r30l97J048J39%J65M09N6o76p0m32j46J56M09L50
2093E51k07p6J90J25o84j84J78N17K46k35J02l69M74j5r10l22P13O53k36o35j01
$$ plain form
2114 -225 621 452 -505 -841 -159 420 267 -68 -700 266 764 -492 -1468 -922 179 124 -592 -944 213
2133 213 71 -753 -1253 -909 -275 91 2 -704 -361 373 -168 -761 -796 -4 508 42 -91 229 731 402 -404
2154 -404 -224 71 572 624 664 531 591 576 405 388 -21 510 542 1093 857 677 520 259 649 247 18 291
2176 291 843 1041 253 113 671 459 -341 -707 9 301 250 83 -116 -163 97 -629 -1290 -1072 -311 458 -68
2197 -68 -1032 -385 193 -477 -1442 -1256 -56 57 -280 -264 -95 110 -181 -958 -1129 -553 287 211 -398 397 993
2218 993 632 -646 -988 214 359 299 519 691 1353 825 567 -351 -519 149 548 377 978 1028 1118 500
2238 500 -116 -186 -34 -91 49 855 412 142 461 444 -360 -829 -379 -46 -251 -42 53 354 59 -540 -1013
2259 -1013 -1248 -643 -212 -76 -541 -260 436 397 -1415 -1389 -396 -276 -642 -276 144 494 488 -186 -868 -753 -43
$$ packed form
2114b25Q46j69r57l36O82N79j53l35o32R66M98j256r76N46J101n5p16l52J157
2133B13j42q24n00L44O34L66q9p06L43P34n41n93l5P92N12m66j33L20N02l29q06
2154d04J80K95N01N2M0j33O0j5j71j7m09N31L2N51k36j80j57k61L90m02k29K73
2176B91N52J98p88j40N58k12q00l66P16K92n1j67j99m7K60p26o61K18P61P69n26
2197f8r64O47N78o70r65J86J200J13l37J6J69K05k91p77j71N76Q40p6o09P95N96
2218I93l61j278l42J202J45o0K20J72O62n28k58r18j68O68L99j71O01N0R0o18
2238E00o16p0J52n7J40Q06m43k70L19j7q04m69M50L33k05K09R5L01k95n99m73
2259a013k35O05M31J36m65K81O96l9j812K6R93J20l66L66M20L50oo74o82J15P10
$$ plain form
2280 -43 10 -374 105 1127 1294 400 -865 -459 -45 -173 -461 260 1136 1274 729 315 -276 -175 8 37
2300 37 -405 410 1333 1010 -91 -45 188 -179 -637 48 499 619 607 448 494 -464 -664 -451 -216 -207 185 861
2322 861 700 -175 -239 -697 -569 -409 -516 -333 114 480 1014 57 -771 -458 80 -463 -854 -175 418 708
2342 708 285 -493 -422 -383 -361 -769 -1025 -61 1066 558 -654 -567 113 -25 -1021 -791 486 849 642 -78
2362 -78 -184 -180 -123 -193 -613 -142 732 624 500 -114 431 409 -328 -614 234 500 523 698 419 361 -132 332 18
2385 18 -502 146 560 447 175 361 315 -122 -250 -411 -110 -59 214 577 318 -98 -202 34 -64 -581 -422
2406 -422 91 302 128 -177 -664 -351 -282 -485 -966 -864 105 462 -534 -624 77 241 -725 -990 -210 542 287
2427 287 -481 -396 -70 341 -122 -670 -470 408 872 22 88 361 691 302 -475 -65 887 1032 393 385 392 615
$$ packed form
2280d3N3l84M79J022J67q94j265M06M14j28k88P21Q76J38n45m14n91J01J83K9
2300C7m42Q15R23l23j101M6K33l67m58O85M51J20j2j59M6r58k00K13K35RL92O76
2322H61j61q75o4m58J28J60j07J83M47L66N34r57q28L13N38n43l91O79N93K90
2342G08m23p78P1L9K2m08k56R64J127n08j212Q7O80j38r96K30J277L63k07p20
2362g8j06MN7p0m20M71Q74j08j24o14N45k2p37k86Q48K66K3J75k79n8m93M64l14
2385A8n20O48M14j13k72J86m6m37j28j61L01N1K73L63k59m16j04K36r8n17J59
2406d22N13K11j74l05m87L13O9k03m81J02R69L57r96r0P01J64r66k65P80P52k55
2427B87p68Q5L26M11m63n48K00Q78M64q50O6K73L30l89p77M10R52J45o39qPK23
$$ plain form
2449 615 425 -58 -4 -150 751 629 433 129 96 483 -143 -533 -97 -188 -145 362 -117 -18 -347 -289 -111 -734
2471 -734 -856 -333 200 -164 -514 -490 -357 -559 -727 -719 -649 205 305 -276 -702 -509 158 -269 -1042 -568 263
2492 263 377 -67 -135 6 429 -282 -37 -436 368 1047 780 76 227 669 591 -106 -502 474 838 681 129
2513 129 634 786 298 -493 -439 -33 359 607 395 304 322 341 -100 -674 -681 -47 -10 -197 175 391 182 -600
2535 -600 -769 -778 -666 -461 -19 113 -174 -16 -386 -894 -596 -814 -664 -219 453 148 -70 -289 231 -242 -834
2556 -834 -879 -83 629 229 3 394 712 60 -584 -331 332 548 886 563 306 1152 728 5 -552 -175
2576 -175 651 430 -184 809 1105 488 112 -572 -62 394 114 -60 -7 635 671 300 -548 -771 -529 -300 -399
2597 -399 -166 278 227 184 -298 -530 -632 -715 -660 287 121 40 161 -199 -547 -546 -672 -626 -268 182 93 89 295 218
$$ packed form
2449F15j90m83N4j46R01j22j96l04l3L87o26l90M36r1M3N07m79R9l29N8J78o23
2471g34j22N23N33l64l50K4J33k02j68QP0Q54J00n81m26J93O67m27p73M74Q31
2492B63J14m44o8J41M23p11K45l99Q04O79k67p04J51M42p8o97l96R76L64j57n52
2513A29N05J52m88p91N4M06L92K48k12r1J8J9m41n74pO34L7j87L72K16k09p82
2535f00j69rJ12K05M42J32k87J58l70n08K98k18J50M45O72l05k18k19N20m73n92
2556h34m5P96P12m00k26L91L18o52o44K53O63K16L38l23k57Q46m24p23n57L77
2576a75Q26k21o14R93K96o17l76o84N10M56k80j74N3O42L6l71q48k23K42K29r9
2597c99K33M44n1m3m82k32j02q3N5R47j66q1J21l60l48Jj26M6L58M50q9mK06p7
$$ plain form
2621 218 -472 -839 -407 -130 -59 103 98 903 739 -18 -286 -620 41 263 -81 -125 902 1101 435 -668 -129
2642 -129 224 -66 -347 -162 852 1359 607 -334 -368 376 -55 -100 -21 862 1156 984 106 -114 53 -51 -392
2663 -392 -706 5 480 1098 79 -93 -133 -403 -706 -407 -357 318 257 -24 40 -166 -554 -657 -550 -694 -260
2684 -260 -169 212 55 -91 -815 -771 -701 -548 -297 -267 75 518 106 -334 -524 -74 -140 -428 -659 303 672 631
2706 631 -309 -122 122 332 -557 -554 219 871 813 500 173 706 583 -156 -522 97 1115 1052 534 351 598
2727 598 488 386 -59 -169 621 595 41 37 193 427 126 -799 -375 237 -47 -304 -107 -62 -378 -438 -528 -710
2749 -710 -866 -255 -280 -258 -747 -293 -488 -643 -1063 -597 -374 -464 -78 -200 -581 -452 -36 72 -437 -583 85
2770 85 684 612 23 65 211 260 213 -94 37 252 1159 278 233 559 800 602 -51 -61 1187 1028 453 321
$$ packed form
2621B18o90l67M32K77P1J62nQ05j64p57k68l34O61K22l44m4J027J99o66j103N39
2642a29L53k90k81J85J014N07p52r41l4P44m31m5P9Q83K94j72q78k20J67j04l41
2663c92l14P11M75O18j019j72m0k70l03K99N0O75o1k81O4k06l88j03J07j44M34
2684b60R1L81j57j46p24M4P0J53K51L0L42M43m12m40j90M50o6k88k31R62L69m1
2706F31r40J87K44K10q89LP73O52n8l13l27N33j23p39l66O19J018o3n18j83K47
2727E98j10j02m45j10P90k6n54mJ56K34l01r25M24O12k84k57J97M5l16o0r0j82
2749g10j56O11k5K2m89M54j95j55m20M66K23r0L86j22l81J29M16J08n09j46O68
2770H5N99p2n89M2J46M9m7l07J31K15R07q81m5L26K41j98o53j0J248j59n75j32
$$ plain form
2792 321 840 799 274 -43 76 420 751 413 -39 148 452 157 -365 -721 33 630 -263 -547 -129 215
2812 215 -545 -702 -972 -485 -166 -24 -231 -484 -238 -379 -537 -1009 -795 -371 -113 -273 -207 21 -180 -339
2832 -339 -487 -161 -266 -256 493 364 30 -67 47 -53 -191 -203 149 602 1228 646 261 450 455 480 -177 -463
2854 -463 399 945 620 208 299 717 482 -163 -438 218 909 706 225 -97 176 582 -178 -665 -79 582
2874 582 411 -335 -238 621 346 -817 -722 -438 -387 -153 -130 -499 39 -82 -299 -761 -727 -637 -222 -199 82 22
2896 22 96 -461 -614 -501 -491 -328 42 222 354 334 -3 -215 -299 -694 -2 -25 146 339 496 144 600 152
2918 152 -97 -348 -42 686 472 49 239 559 304 -208 -397 7 592 780 4 480 726 646 354 -86
2938 -86 -317 190 661 -311 302 759 831 398 -567 -259 88 171 61 -294 324 439 205 -326 -734 -267 -48
$$ packed form
2792C21N19m1n25l17J19L44L31l38m52J87L04k95n22l56P54N97q93k84M18L44
2812B15p60j57k70M87L19J42k07k53K46j41j58m72K14M24K58j60O6K28k01j59
2832c39j48L26j05J0P49j29l34r7J14j00j38j2L52M53O26n82l85J89NK5o57k86
2854d63Q62N46l25m12R1M18k35o45k75O56O91k03m81l22K73M06p60m87N86O61
2874E82j71p46R7Q59k75j163R5K84N1K34K3l69N38j21k17m62L4R0M15K3K81o0
2896B2P4n57j53J13J0J63L70J80J32k0l37k12q4l95O92k3J71J93J57l52M56m48
2918A52k49k51L06P28k14m23J90L20k55n12j89M04N85J88p76M76K46q0k92m40
2938h6k31N07M71r72O13M57P2m33r65L08L47Q3j10l55O18J15k34n31m08M67K19
$$ plain form
2959 -48 -348 -713 49 385 400 -573 -457 -518 -330 -555 -560 -261 -99 126 29 -281 -152 -738 -286 -498 -220 -82
2981 -82 47 144 138 -3 -406 -553 -298 347 159 -24 595 795 -91 -192 85 367 271 149 384 621 635 927
3003 927 122 -116 376 424 208 -140 453 929 742 169 -45 434 346 -413 -154 148 380 230 91 -79 -430
3024 -430 98 -317 -656 -604 -74 149 -192 -735 -361 -17 -539 -668 -657 -180 -317 -481 -350 -224 -746 -301 -209
3045 -209 -379 -320 -44 72 36 10 84 -104 -144 17 19 17 238 250 623 -54 -283 80 61 290 309 300 515 680 304
3070 304 146 437 412 514 1 173 663 467 232 -201 217 483 15 -174 264 474 544 392 -382 -91 353
3091 353 372 -156 -448 85 126 130 -362 -411 -149 -211 -544 -482 -103 -128 -211 -264 -222 -61 -311 -687 -430 -580 303 -125
3115 -125 -193 -95 -174 -65 -256 -12 -220 283 62 -143 334 -98 144 7 -104 115 96 371 13 412 259
$$ packed form
2959d8l00l65P62L36J5r73J16o1J88k25nK99J62K25r7l10J29n86M52k12K78J38
2981h2J29R7oj41m03j47K55O45j88j83O19K00q86j01K77K82r6j22K35K37J4K92
3003I27q05k38M92M8k16l48N93M76j87n73k14M79q8p59K59L02K32j50j39j70l51
3024d30N28m15l39N2N30K23l41n43L74L44n22j29J1M77j37j64J31J26n22M45R2
3045b09j70N9K76J16l6k6P4j88m0J61KkK21J2L73o77k29L63j9K29J9rK15J65l76
3070C04j58K91k5J02n13J72M90j96k35m33M18K66m68j89M38K10P0j52p74K91M44
3091C53J9n28k92N33M1Mm92m9K62o2l33O2L79k5q3n3M2J61k50l76K57j50Q83m28
3115a25o8R8p9J09j91K44k08N03k21k05M77m32K42j37j11K19j9K75l58L99j53
$$ plain form
3136 259 99 92 252 276 359 20 326 499 382 -44 -58 202 133 -261 -374 43 470 450 -86 -137 174 -87 -267
3159 -267 -413 103 522 221 -230 -187 13 19 -352 -821 50 279 -58 -192 -145 116 -104 -254 -460 -306 -59
3180 -59 243 40 -236 -25 -310 -200 -569 -330 -325 -39 385 82 -66 -56 -113 -272 -425 -134 51 -56 203 140
3202 140 163 58 -222 228 -93 -88 68 362 298 103 153 102 82 -86 -52 144 279 398 140 12 361 158 -161
3225 -161 -392 -96 259 642 -21 221 182 383 53 -318 -262 0 384 -59 -123 18 290 -275 -63 -229 37
3246 37 77 111 -97 79 118 -26 -407 -285 -181 -162 -7 -142 -66 367 -32 -166 -551 -149 -194 -390 -52 -178
3268 -178 343 -4 76 -23 -126 -280 -242 87 177 51 -42 507 164 142 150 -129 263 155 158 366 98 338 436 -37
3292 -37 -3 255 371 76 62 309 392 601 330 37 -16 230 76 -121 195 334 106 -377 -20 -193 242 -11
$$ packed form
3136B59j60pJ60K4Q3l39L06J73j17m26j4K60o9l94j13M17M27k0n36n1L11k61j80
3159b67j46N16M19l01m51M3K00Ol71m69Q71K29l37j34M7K61k20j50k06J54K47
3180e9L02k03k76K11k85J10l69K39NK86M24l03j48J0n7j59j53K91J85j07K59o3
3202A40K3j05k80M50l21NJ56K94o4j95N0n1k0j68L4J96J35J19k58j28L49k03l19
3225a61k31K96L55L83o63K42l9K01l30l71N6K62L84m43o4J41K72n65K12j66K66
3246C7M0L4k08J76L9j44l81J22J04J9J55j35P6M33l99j34l85M02m5j96L38j26
3268a78N21l47Q0r9j03j54L8L29R0j26r3N49l43k2Qk79L92j08LK08k68K40R8m73
3292c7L4K58J16k95j4K47Q3K09k71k93n3K46j54j97L16J39k28m83L57j73M35k53
$$ plain form
3314 -11 -239 133 204 73 127 89 -239 26 -224 -278 -258 -94 -122 2 -298 -160 -46 2 -301 -313 -23 210 -56
3337 -56 -206 -23 -68 -134 -225 -107 65 91 19 -14 -125 -141 -165 112 -126 -27 199 362 346 243 283 -104 168 147
3361 147 281 -47 71 294 17 397 -24 165 55 341 -226 -262 205 47 -186 -35 211 53 -64 -388
3381 -388 -90 333 325 -38 -335 -219 114 -39 -9 -375 83 81 74 -221 -169 43 82 -22 -216 -96 299 -136 -47
3404 -47 -54 36 -136 -185 -59 -52 -17 -228 64 368 -76 106 15 -201 -13 -66 234 12 45 -58 -205 -30 57 219
3428 219 40 -7 70 248 264 83 -115 131 -26 112 -153 -72 152 98 -176 -29 66 -18 -26 -59 75 72 -71 -103
3452 -103 -48 -5 -80 -244 -89 104 -107 124 41 -178 -121 -194 -158 -299 -16 296 106 -172 -98 144 -37 105 -421
3475 -421 -295 -46 -34 -18 -155 -226 -19 3 89 -122 -57 -224 -147 -77 -68 34 -81 -86 -160 207 -157 61 256 -102
$$ packed form
3314a1k28L72P1j31N4l8l28K65k50n4K0J64k8J24l00J38J14M8l03j2K90K33k66
3337e6j50J83m5o6r1J18J72K6p2l3j11j6k4K77k38R9K26J63j6j03M0l87K72k1
3361A47J34l28J18K23k77L80m21J89j10K86n67l6M67j58k33J51K46j58j17l24
3381c88K98M23ql63k97J16L33j53L0l66M58kpk95N2K12L9j04j94J20L95m35Q9
3404d7pR0j72m9J26PL5k11K92L04m44J82r1k16J88n3L00k22L3j03j47J75Q7J62
3428B19j79m7P7J78J6j81j98K46j57J38k65Q1K24n4k74J47R5q4ql3J34lj43l2
3452a03N5M3p5j64J55J93k11K31q3k19N7p3L6j41K83L12j90k78P4K42j81J42n26
3475d21J26K49J2J6j37p1K07K2Q6k11O5j67P7P0RJ02j15np4L67l64K18J95l58
$$ plain form
3499 -102 12 -204 121 172 -281 -62 162 17 -8 92 2 176 0 84 56 103 211 75 59 65 222 -72 154
3522 154 -285 -170 176 279 0 -110 27 240 298 -229 -53 152 97 -183 -158 -40 207 -104 -179 -506 45
3543 45 -17 122 125 -69 131 176 311 -327 -10 -34 -229 19 -316 269 -54 -265 79 -130 4 -80 -3 -77 -64
3566 -64 -3 289 84 -149 114 -187 -90 35 30 31 19 161 -50 -25 118 -145 225 -52 78 62 75 -214 -9 56
3590 56 -24 82 -155 -68 177 325 107 -376 -333 -257 114 24 -125 -97 11 135 -242 -431 -335 164 -163 -55 -6
3613 -6 126 60 73 -20 -37 159 87 -130 -78 32 372 -89 -394 162 29 -313 -113 95 84 189 -141 280 36
3636 36 24 -181 216 237 29 318 -62 -28 146 362 -99 197 71 291 40 -214 -71 -83 -106 -309 -126 141
3658 141 -45 -3 -38 21 333 276 -144 -229 2 -47 -136 -146 -49 283 87 -123 -316 349 186 -140 -258 -133 -80
$$ packed form
3499a02J14k16L25N1m53K19K24j45k5J00r0J74j76Q4k8M7J08j36j6OJ57k94K26
3522A54m39J15L46J03k79j10J37K13N8n27J76K05n5k80K5J18K47l11p5l27N51
3543D5o2J39Lj94K00M5J35o38L17k4j95K48l35N85l23k11L44k09J34q4P7p4J3
3566f4O1K92k05k33K63l01R7J25nJj2J42k11K5J43k63L70k77J30j6J3k89K05O5
3590E6q0J06k37Q7K45J48k18m83M3P6L71r0j49K8J08J24l77j89R6M99l27J08M9
3613fJ32o6J3r3j7J96p2k17N2J10L40m61l05N56j33l42K00K08j1J05l30M21k44
3636C6j2k05L97K1k08K89l80L4J74K16m61K96j26K20k51k54J43j2k3k03J83K67
3658A41j86M2l5N9L12n7m20q5K31m9q9j0R7L32j96k10j93O65j63l26j18J25N3
$$ plain form
3681 -80 -105 14 38 -178 -7 -12 -94 -54 338 -53 -112 54 -44 47 -119 -68 129 54 -98 213 28 216 54 172
3705 172 224 130 34 -165 138 -16 -88 114 -114 248 115 -170 104 -129 180 -229 -25 200 206 -423 -6 137
3727 137 -194 -65 38 11 127 -69 73 -119 -50 -34 184 -209 -206 140 -55 64 20 118 -2 253 -91 72
3749 72 -54 107 -14 -477 62 71 93 355 -92 83 -120 -179 -43 301 227 -29 -198 -53 28 -192 378 -151
3771 -151 -83 398 -45 -2 321 50 20 -68 57 -168 21 152 161 -79 152 192 53 119 106 82 5 73 -9 -30 306
3796 306 200 -156 -162 146 268 -83 126 -33 -1 102 89 23 150 132 -184 -90 -125 54 -178 113 -162 -66 197
3819 197 -288 -59 206 20 -273 3 58 -39 -398 -131 -6 108 372 -46 -111 34 84 -57 168 88 -18 152
3841 152 477 98 19 -245 -150 -326 -257 237 166 178 39 186 27 -18 30 43 330 -4 -95 126 217 244 83 -182
$$ packed form
3681h0k5J19K4k16J71nq2M0L92l91n9J66r8R1j66N1J97p5j52L11j85J88j62J18
3705A72N2r4r6j99L03j54p2K02k28L62j33k85K74k33L09m09K04K25Oo29M17J43
3727A37l31J29J03k7J16j96J42j92O9J6K18l93LL46j95J19m4R8j20K55l44J63
3749G2j26J61j21m63N39RK2K62m47J75k03n9J36L44p4k56j69J45Q1k20N70n29
3771a51O8M81m43M3L23k71l0q8J25k25J89J31Rk40K31M0j39O6j3k4p7O8q2k1L36
3796C06j06l56oL08J22l51K09j59L2J03j3o6J27j8l16R4l5J79k32K91k75R6K63
3819A97m85K29K65j86k93K76N5r7l59K67J25J14K64m18o5J45N0j41K25q0j06J70
3841A52L25l79p9k64R5j76O9M94p1J2j39J47j59m5M8J3K87l34r1K21R1K7j61k65
$$ plain form
3865 -182 -60 102 65 -113 -106 -81 30 26 224 -126 27 -244 -9 193 403 -231 -365 -39 -163 47 -18 -217
3887 -217 -458 19 333 74 -52 -26 -16 -315 -129 290 56 304 71 97 248 -32 3 108 -10 163 51
3908 51 -240 -167 50 92 227 123 30 64 -146 -85 147 -59 -30 -128 93 52 -129 -63 -207 -157 75 -243 11 -423
3932 -423 -49 -187 -240 -54 -307 -226 -177 84 293 -131 -343 -171 3 -77 71 85 23 104 64 86 -23 321 61
3955 61 57 173 192 -252 -18 -36 214 109 32 13 -71 248 183 49 -113 -44 -61 159 -166 -174 354 164 1 -99
3979 -99 34 111 1 -60 86 185 -96 189 -58 200 86 -304 174 -291 -180 -75 -90 -93 -129 166 -135 -39 129
4002 129 -86 -94 85 52 142 -52 -208 237 -110 -168 38 115 -357 240 110 128 -169 39 -8 -81 -87 221 27 -87
4026 -87 -176 67 -189 -6 268 45 -45 1 101 252 146 -191 187 -117 -122 -135 139 -145 -79 6 -220 95 -248
$$ packed form
3865a82J22J62l7j78PK5J11mJ98l50J53k71K35K02K10o34j34L26j24K10o5j99
3887b17k41M77L14k59j26K6J0k99J86M19k34K48k33K6J51k80L5J05j18J73j12
3908E1k91P3K17M2J35j04r3L4k10O1K32k06K9r8K21m1j81O6j44N0K32l18K54m34
3932d23L74j38n3J86k53Q1M9K61K09m24k12J72J74q0J48J4o2Q1m0K2j09L44k60
3955F1mJ16J9m44K34j8K50j05p7j9q4L19o5j34j62O9j7K20l25qN28j90j63j00
3979i9J33P7j10o1J46R9k81K85k47K58j14l90M78m65J11J05j5ll6K95l01R6J68
4002A29k15qJ79l3R0j94j56M45l47n8K06P7m72N97j30J8k97K08m7p3oL08j94j14
4026h7q9K43k56J83K74k23r0M6J00J51j06l37L78l04nj3K74k84O6Q5k26L15l43
$$ plain form
4049 -248 68 -270 -37 -166 -8 -207 -95 223 -208 -182 -10 -148 -253 12 -30 142 144 242 -196 64 308 156
4071 156 6 106 97 -10 -44 -181 275 103 -145 153 -105 -240 -87 -222 16 -185 -38 28 288 264 -2 251
4093 251 21 -179 194 27 139 88 91 313 -264 -2 195 303 180 -2 176 260 -20 83 -7 50 71 160 -57
4116 -57 -30 61 -8 -15 -122 236 37 128 391 83 -223 -170 -98 77 -19 -20 -48 -52 -76 -15 -240 103 56 -164 29 -45
4142 -45 154 -201 74 174 18 -393 -337 -132 -65 -76 236 -186 -161 -102 51 -161 -144 -11 135 -177 6 -13 -103
4165 -103 -103 -235 272 -97 114 -184 -34 -84 128 32 56 -68 -354 57 103 147 124 176 169 177 45 330 145 71 -6
4190 -6 343 -118 2 102 -92 136 -66 231 -178 -89 92 158 -108 -137 -83 176 4 16 -75 186 -218 -158 91
4213 91 175 262 56 -77 -269 -386 75 100 203 330 -207 154 -137 -71 -236 -183 163 229 116 391 125 253
$$ packed form
4049b48L16l38K33j29J58j99J12L18m31K6J72j38j05K65m2J72KR8m38K60K44j52
4071A56j50J00rj07l4j37M56j72k48K98k58j35J53j35K38k01J47O6K60k4k66K53
4093B51k30k00L73j67J12n1LK22n77K62J97J08j23j82J78Q4k80J03r0N7K1Q9k17
4116e7K7R1o9pj07L58j99R1K63l08l06N3P2J75r6jk8mk4O1k25L43m7k20J93p4
4142d5J99l55K75J00j56m11N6K05O7j1L12m22K5N9J53k12J7J33J46l12J83j9r0
4165a03%j32N07l69K11k98J50n0K12r6K4j24k86M11M6M4k3N2pQj32K85j85p4p7
4190fL49m61J20J00j94K28k02K97m09Q9J81O6k66k9N4K59j72J2r1K61m04O0K49
4213I1Q4Q7k06j33j92j17M61K5J03J27n37L61k91O6j65N3L46O6j13K75k66J28
$$ plain form
4235 253 -30 9 -315 166 -192 63 -4 -136 352 -4 293 -65 -87 -131 81 172 -27 95 -29 -107 391 59
4257 59 1 114 -49 -108 101 -144 154 -267 -60 -154 -447 -90 115 199 -340 -420 -221 36 -54 -21 -57 198 -18
4280 -18 -127 -194 320 148 -298 119 269 157 -98 39 124 95 -109 -226 -219 414 34 -68 294 288 -247 -124 4
4303 4 -207 -48 140 54 -36 67 144 90 -57 271 42 -122 185 50 174 -9 259 166 123 -103 -74 149 -86
4326 -86 -98 78 -118 147 222 43 85 95 43 120 102 -1 127 173 -24 329 -123 -88 -89 -203 -34 -143 196 -171
4350 -171 10 -2 17 -70 106 31 93 15 51 -17 29 -260 -24 -86 50 54 -22 132 165 40 61 -27 -273 -190 -56 239
4376 239 -77 -369 -1 -59 -27 -254 -200 -161 -30 -148 -44 -230 108 38 -138 128 70 349 59 254 -78 113
4398 113 24 194 55 148 55 242 -7 -101 17 285 135 -107 252 -125 -28 -56 -65 46 -123 -254 108 148 53
$$ packed form
4235B53k83L9l24M81l58K55o7j32M88l56K97l58k2m4K12R1j99J22j24p8M98l32
4257E9n8J13j63n9K09k45K98m21K07r4k93L57K05Q4n39q0J99K57r0L3l6K55k16
4280a8j09o7N14j72m46M17J50j12k55J37Q5k9k04j17PO33l80j02L62on35J23J28
4303Dk11J59J88q6r0J03P7n4j47L28k29j64L07j35J24j83K68r3m3k26K9K23k35
4326h6j2J76j96K65P5j79M2J0n2P7j8j03J28M6j97L53m52L5jj14J69j09L39l67
4350a71J81j2J9q7J76p5O2p8L6o8M6k89K36o2J36Mp6J54L3j25K1q8k46Q3J34K95
4376B39l16k92L68n8L2k27N4L9J31j18J04j86L38p0j76K66n8K79k90J95l32J91
4398A13q9J70j39R3r3J87k49r4J18K68j50k42L59l77R7k8rJ11j69j31L62M0r5
$$ plain form
4421 53 -29 -247 81 -152 113 -68 -136 162 35 68 -249 466 236 136 -403 -42 -3 -87 -140 -296 -68 113
4443 113 -249 -56 -102 -39 185 -137 -131 -135 69 151 247 19 83 21 221 22 164 78 -60 97 -22 115 140 -39
4467 -39 -90 -148 -56 -116 196 -17 28 -112 117 267 118 -35 269 -105 74 42 58 -63 -187 33 22 80 -302
4490 -302 70 -81 168 -101 287 -80 -33 -48 95 -56 -102 107 119 -12 -62 141 -138 -300 101 234 -115 -3
4512 -3 -65 -40 4 -185 -281 164 257 -215 98 219 -108 255 33 41 71 -21 -18 187 -242 -214 -26 134 13 -108 221
4537 221 129 27 -212 57 78 157 -154 -208 -62 -87 158 5 27 -133 -52 -6 -101 68 -223 40 77 74 -329 161
4561 161 35 -1 -83 -50 -231 -114 86 -266 -62 -16 28 -260 9 -36 0 185 107 -169 -34 182 74 -207 -30
4584 -30 -215 29 5 -160 -132 -69 -58 -272 -112 -203 -61 -105 -202 127 -84 -178 -128 143 -149 -91 -70 89 -44 130
$$ packed form
4421E3q2k18L28k33K65j81o8K98j27L3l17P15k30j00n39L61L9q4n3j56K28J81
4443A13l62J93m6O3K24l22OmK04Q2R6k28O4o2K00j99J42q6j38J57j19J37K5j79
4467c9n1n8R2o0L12k13M5j40K29J50j49j53L04l74J79l2J6j21j24K20j1N8l82
4490c02L72j51K49k69L88l67M7j5J43j51m6K09J2j31n0K03k79j62M01J33l49J12
4512co2K5M4j89r6M45R3m72L13J21l27L63k22QL0r2LK05m29K8J88J60j21j21L29
4537B21r2j02k39K69K1P9l11n4J46k5K45j53K2j60Q1M6r5J69k91K63L7lm03M90
4561A61j26l6q2L3j81J17K00l52K04M6M4k88K69m5L6J85p8k76J35K16j08k81J77
4584c0j85K44k4j65K8O3J1k14J60r1J42m4r7L29k11r4N0K71k92N8K1J59j33J74
$$ plain form
4608 130 2 -76 281 -61 168 4 115 -64 54 -188 58 117 -19 152 16 327 25 -192 -169 17 202
4629 202 147 -282 -17 -99 -174 -49 54 99 -31 -169 135 -14 -254 116 52 31 -3 128 -28 4 200 142 125
4652 125 -87 -200 18 0 205 71 13 -120 -15 202 202 26 -324 -117 -262 257 64 2 154 -71 -312 -41
4674 -41 -19 186 -65 -176 184 -335 -20 135 58 41 5 73 -95 173 429 -11 95 49 -40 120 -35 168 -95
4697 -95 172 -93 54 221 -182 64 87 -69 0 -102 181 258 -141 149 -168 253 -152 50 78 -37 -165 -208
4719 -208 9 103 -83 -78 -162 -136 -181 21 -265 -308 -36 -172 -69 -260 152 -193 -284 -88 -146 82 36 -339 -19
4742 -19 266 79 -162 191 348 -58 -93 19 42 26 2 -186 -411 -2 20 -67 -144 128 -15 -24 -121 -179 27 25 -111
4767 -111 14 -144 -220 -109 -168 -31 -48 201 71 111 -146 -284 117 -138 -116 7 304 258 -4 -159 -89 -120 24
$$ packed form
4608A30j28p8L57l42K29j64J11j79J18k42K46N9j36J71j36L11l02k17K3J86J85
4629B02n5m29K65q2p5J25J03M5j30j38L04j49k40L70o4k1l4J31j56L2J96n8j7
4652A25k12j13K18j8K05j34n8j33J05K17%j76l50K07j45N19j93o2J52k25k41K71
4674d1K2K05k51j11L60n19L15J55p7j7l6O8j68K68K56m40J06m6q9J60j55K03k63
4697i5K67k65J47J67m03K46K3j56O9j02K83P7l99K90l17M21m05K02K8j15j28m3
4719b08K17R4j86Nq4K6m5K02k86m3K72j36J03j91M12l45r1J96n8K28m6l75L20
4742a9K85j87k41L53J57m06l5J12K3j6k4j88k25M09K2q7p7K72j43rr7n8K06kj36
4767a11J25j58p6J11n9J37j7K49j30M0k57j38M01k55K2J23K97m6k62j55P0l1J44
$$ plain form
4790 24 118 -143 146 261 -50 -60 292 115 -154 -57 -102 -225 70 167 -85 124 -247 -41 -354 113 -37 -199
4812 -199 188 -166 -149 -203 -64 135 -98 -350 -66 191 -201 167 84 -92 -341 4 -26 88 -20 -201 178
4833 178 205 -52 -55 192 16 -258 109 114 -79 -70 -97 -149 -115 -15 138 -407 -88 -190 -4 -112 155 75 -185 -6
4857 -6 36 96 -117 -4 125 -129 151 224 121 -86 199 33 -144 54 274 -87 278 -176 -200 -107 3 18 306
4880 306 -289 -116 -74 -97 -46 -247 -29 -15 19 -263 -4 -133 -384 -236 -208 -249 -68 -136 66 -240 73 36 -89
4903 -89 146 -196 111 172 46 -242 12 333 -83 62 43 245 -141 -67 120 198 175 326 187 148 256 189 -135
4926 -135 -134 -1 17 -102 28 -63 -256 25 30 196 -35 -61 -66 -62 218 -133 -85 20 137 -217 -357 205 -16 -207
4950 -207 207 -41 251 72 -239 -185 -263 -157 97 -102 -40 119 -276 90 -134 118 145 -336 189 -136 -116 138
$$ packed form
4790B4R4k61K89J15l11j0L52j77k69R7m5j23K95R7k52K09l71K06l13M67j50j62
4812a99L87l54J7n4J39J99k33k52K84K57l92L68q3j76k49L45l0J14j08j81L79
4833A78K7k57lK47j76k74L67Nj93Rk7n2L4J00J53n45L19j02J86j08K67q0k60J79
4857fM2O0k13J13J29k54K80P3j03k07K85j66j77J98K20l61L65m54k4R3J10J5K88
4880C06n95J73M2k3N1k01K18J4L4k82K59j29k51J48K8m1J81o8K02l06L13l7j25
4903h9K35l42L07O1j26k88K54L21m16J45j9K02l86P4J87P8k3J51j39l9J08o7l24
4926a35JJ33J8j19J30r1j93K81NJ66k31k6nMK80l51M8J05J17l54j40N62k21j91
4950b07M14k48K92j79l11N4p8J06K54j99O2J59l95L66k24K52K7m81N25l25K0K54
$$ plain form
4972 138 329 163 12 5 27 43 -76 90 37 -150 162 -55 154 84 49 59 -56 -49 116 -37 132 -3 -77 88
4996 88 133 -10 -116 -85 53 -218 -67 -73 -179 146 119 -213 100 34 -330 -4 47 -8 168 311 -19 112 19
5019 19 59 -222 -13 -306 82 210 -133 161 -38 -132 16 -345 213 -55 -14 209 24 315 59 97 21 -38
5041 -38 -18 -250 64 -27 50 89 49 344 -34 96 183 -40 -27 73 346 -37 98 185 -41 -89 -86 -239 -95 316
5065 316 -28 115 -106 -87 -132 211 224 52 82 -36 -76 -13 253 329 -61 -2 -173 93 -24 -146 73 223 20
5088 20 312 -44 189 159 61 -40 -188 54 -76 155 259 -48 -98 13 -136 -322 203 -16 63 120 -80 61
5110 61 117 -102 -36 38 -94 -173 148 -121 52 -109 24 70 -357 -179 -45 -137 -154 -302 -205 174 -98 -74 218
5133 218 183 95 -136 16 181 -161 -99 -91 92 31 301 -57 -38 -20 -206 269 55 -60 -55 140 -28 -5 134 395
$$ packed form
4972A38J91j66j51pK2J6j19J66n3j87L12k17K09p0l5J0j15PJ65j53J69j35p4J65
4996H8M5j43j06L1J38k71J51oj06L25k7l32L13o6l64L26N1n5J76J43l30J31r3
5019A9M0k81K09k93L88J28l43K94j99r4J48l61N58k68M1K23j85K91k56L8p6n9
5041c8K0k32L14r1P7L9m0K95l78J30Q7k23J3J00K73l83J35Q7k26m8Lj53J44M11
5065C16l44J43k21J9m5L43J3j72L0j18m0O3K66P6l90N9j71K66j17j22K19J50k03
5088B0K92l56K33l0r8j01j48K42j30K31J04l07n0J11j49j86N25k19P9N7k00J41
5110F1N6k19O6P4j32p9L21k69J73j61J33M6m27J78J34r2j7j48R7L79k72K4K92
5133B18l5q8k31J52J65l42O2QJ83o1K70l58J9J8j86M75k14j15NJ95j68K3J39K61
$$ plain form
5157 395 6 -194 -155 -133 168 248 -38 -96 -9 -73 107 -184 17 -336 -36 111 6 134 -69 -1 -90 150 -2
5180 -2 12 -288 -36 206 85 -35 67 -25 66 93 68 6 -130 -23 133 -14 -1 -142 139 126 -8 -143 -53 268
5204 268 41 66 154 200 -102 -76 338 -35 -73 18 261 -81 54 -201 23 120 -5 79 65 237 35 -132 -352
5227 -352 93 99 -126 -22 98 121 124 -124 -128 -135 63 -288 -58 -115 -96 291 -20 4 -178 -45 -97 209 -276 36
5251 36 34 -54 -91 -45 419 26 170 89 99 43 241 -230 61 -205 -46 100 -156 -222 246 -149 -151 86 -2 233
5275 233 -104 -132 11 386 -65 156 87 -147 199 209 -131 182 48 48 -132 -107 -235 -120 -193 31 -21 245 66
5298 66 387 69 163 -192 241 -32 -79 -67 40 -94 -5 101 -86 57 -15 142 -63 -291 438 153 -66 103
5320 103 -71 158 180 10 -96 -24 125 -211 21 -30 -27 100 126 166 240 176 8 -63 132 269 12 -175 -88 -176
$$ packed form
5157C95l89k00L9K2L01Q0k86n8Q7o4J80k91K01l53L00J47j05J28k03O8q9K40j52
5180bJ4l00K52K42j21j20J02r2R1K7k5o2j36J07J56j47J3j41K81j3j34j35R0L21
5204B68k27K5Q8M6l02K6M14l73l8R1K43l42J35k55K24R7j25Q4j4J72k02j67k20
5227c52M45Ok25J04J20K3Lk48mpJ98l51K30n7J9L87l11K4j82J33n2L06m85L12
5251C6kq8l7M6M64l93J44q1J0n6J98m71K91k66J59J46k56o6M68l95kK37q8K35
5275B33l37k8J43L75m51K21o9k34L46J0l40L13j34%j80K5j28J15p3K24n2K66j79
5298F6L21l18R4l55M33k73m7J2J07j34Q9J06j87J43p2J57k05k28P29k85k19J69
5320A03j74K29K2j70j06P2J49l36K32n1LJ27K6M0P4o4j68p1J95J37k57j87Q7q8
$$ plain form
5344 -176 -415 207 -95 6 -28 -109 -35 -355 -151 8 231 -119 341 -110 -16 56 317 -113 196 19 -45 25
5366 25 -82 -99 163 131 -61 -168 10 132 250 173 206 118 -54 112 -222 -149 -191 211 -79 339 -10 87 98
5389 98 145 47 191 170 70 103 -27 -12 55 -34 12 89 -134 -128 -322 -38 -35 51 18 172 255 -254 27 -207 272 179
5415 179 -214 -5 -55 82 246 165 -105 43 -64 -271 -202 112 -99 -128 31 -35 273 91 -179 136 -238 212
5437 212 72 138 235 -198 85 361 208 188 187 18 -39 190 113 211 -117 235 93 -67 154 -86 -140 147 138 155
5461 155 -77 369 113 25 -231 62 -14 -343 287 -161 -43 78 -102 -152 48 146 81 -289 -122 -62 -98 -18 124
5484 124 -355 138 -76 53 114 -69 -185 -170 163 22 -45 141 30 63 291 341 93 51 52 -104 124 -22 13
5507 13 -63 124 31 -324 -20 77 5 -176 216 35 130 34 -18 -94 -304 162 -66 78 218 -108 6 33 202
$$ packed form
5344a76k39O22l02J01l4q1P4l20K04J59K23l50M60m51R4P2K61m30L09j77o4P0
5366B5j07j7K62l2j92j07J78J22J18p7L3q8j72J66l34P3m2M02k90M18l49R7J1
5389I8M7r8J44k1j00L3j30J5O7q9M6P7k23Oj94K84LQ6l3J54Q3n09K81k34M79r3
5415A79l93K09n0J37J64q1k70J48j07k07O9L14k11k9J59o6L08j82k70L15l74M50
5437B12j40O6R7m33K83K76j53k0jj69n7K29p7R8l28L52j42j60K21k40n4K87rJ7
5461A55k32M46k56q8k56K93p6l29O30m48J18J21j80n0K00R8o5l70J67O0l6Q0J42
5484A24m79M93k14J29O1j83j16J5L33j41o7J86j11L3K28N0k48m2Jj56K28j46L5
5507A3p6J87r3l55L04R7p2j81L92j81R5r6n2p6k10M66k28J44J40l26J14K7J69
$$ plain form
5530 202 -236 -186 121 71 90 7 -40 155 142 -138 -53 148 46 50 171 112 -145 306 115 -7 21 141 -48 -34
5554 -34 -150 125 86 -98 158 -110 -105 -328 -44 0 127 -118 -139 -292 -11 150 -18 150 -76 31 -29 -77 -49
$$ packed form
5530B02m38N0L07n0J9q3m7J95j3k80Q5K01j02MJ21n9k57M51j91j22K8J20j89J4
5554c4j16K75l9j84K56k68Nk23K84M4J27k45k1j53K81J61j68J68k26J07o0m8K8
$$ [...]
8191A79
##END NTUPLES=NMR FID
##END=
