##TITLE=1H_LR-688B-KF1-TFA
 CDCl3, 8 sc, 
 30.7.2019
##JCAMPDX= 6.0         $$ Bruker NMR JCAMP-DX V2.0
##DATA TYPE= NMR FID
##DATA CLASS= NTUPLES
##ORIGIN= UXNMR, Bruker Analytische Messtechnik GmbH
##OWNER= root
$$ XWIN-NMR		Version 3.5
$$ Tue Jul 30 15:28:55 2019 Russian Standard Time (UT+4h)  she@DPX200
##.OBSERVE FREQUENCY= 200.13155
##.OBSERVE NUCLEUS= ^1H
##.DELAY= (6, 6)
##.ACQUISITION MODE= SIMULTANEOUS
##.ACQUISITION SCHEME= undefined
##.AVERAGES= 8
##.DIGITISER RES= 18
##SPECTROMETER/DATA SYSTEM= spect
##.PULSE SEQUENCE= zg30
##.SOLVENT NAME= CDCl3
##.SHIFT REFERENCE= (INTERNAL, CDCl3, 0, 15.7039)
##AUDIT TRAIL= $$ (NUMBER, WHEN, WHO, WHERE, WHAT)
$$ ##TITLE= Audit trail, XWIN-NMR		Version 3.5
$$ ##JCAMPDX= 5.01
$$ ##ORIGIN= Bruker BioSpin GmbH
$$ ##OWNER= she
$$ F:/spectra/data/she/nmr/H-F/1/audita.txt
$$ ##AUDIT TRAIL=  $$ (NUMBER, WHEN, WHO, WHERE, WHAT)
(   1,<2019-07-30 15:27:30.60 +0400>,<she>,<DPX200>,
      <created by zg, POWCHK disabled, PULCHK disabled
       configuration hash MD5:
       00 E9 B6 7A A2 85 ED C7 34 08 36 98 17 FE 4E 26
       data hash MD5: 16K
       DB 7C C2 BB 4E 9F D0 9A 0D 7E 4F 2D 46 97 B6 44>)
$$ ##END=
$$ 
$$ hash MD5
$$ 10 23 FD 60 B1 D5 A1 1A 9C CA 67 2A 1E 22 D1 96
##$RELAX= 
##$RELAX= 
##$RELAX= 
##$RELAX= 
##$RELAX= 
##$RELAX= 
$$ Bruker specific parameters
$$ --------------------------
##$DU= <F:/spectra>
##$EXPNO= 1
##$NAME= <H-F>
##$PROCNO= 1
##$TYPE= <nmr>
##$USER= <she>
##$AMP= (0..31)
100 100 100 100 100 100 100 100 100 100 100 100 100 100 100 100 100 100 
100 100 100 100 100 100 100 100 100 100 100 100 100 100 
##$AQSEQ= 0
##$AQ_mod= 1
##$AUNM= <au_zg>
##$AUTOPOS= <>
##$BF1= 200.13
##$BF2= 200.13
##$BF3= 200.13
##$BF4= 200.13
##$BF5= 200.13
##$BF6= 200.13
##$BF7= 200.13
##$BF8= 200.13
##$BYTORDA= 1
##$CFDGTYP= 0
##$CFRGTYP= 5
##$CHEMSTR= <none>
##$CNST= (0..31)
1 1 145 1 1 1 1 1 1 1 1 1 1 1 1 1 1 1 1 1 1 1 1 1 1 1 1 1 1 1 1 1 
##$CPDPRG= <>
##$CPDPRG1= <>
##$CPDPRG2= <>
##$CPDPRG3= <>
##$CPDPRG4= <mlev>
##$CPDPRG5= <mlev>
##$CPDPRG6= <mlev>
##$CPDPRG7= <mlev>
##$CPDPRG8= <mlev>
##$CPDPRGB= <>
##$CPDPRGT= <>
##$D= (0..31)
0 1.2 0 0 0 0 0 0 0 0 0 0.03 0 0 0 0 0 0 0 0 0 0 0 0 0 0 0 0 0 0 0 0 
##$DATE= 1564486050
##$DBL= (0..7)
120 120 120 120 120 120 120 120 
##$DBP= (0..7)
150 150 150 150 150 150 150 150 
##$DBP07= 0
##$DBPNAM0= <>
##$DBPNAM1= <>
##$DBPNAM2= <>
##$DBPNAM3= <>
##$DBPNAM4= <>
##$DBPNAM5= <>
##$DBPNAM6= <>
##$DBPNAM7= <>
##$DBPOAL= (0..7)
0.5 0.5 0.5 0.5 0.5 0.5 0.5 0.5 
##$DBPOFFS= (0..7)
0 0 0 0 0 0 0 0 
##$DE= 6
##$DECBNUC= <off>
##$DECIM= 24
##$DECNUC= <off>
##$DECSTAT= 4
##$DIGMOD= 1
##$DIGTYP= 9
##$DL= (0..7)
0 120 120 120 120 120 120 120 
##$DP= (0..7)
150 150 150 150 150 150 150 150 
##$DP07= 0
##$DPNAME0= <>
##$DPNAME1= <>
##$DPNAME2= <>
##$DPNAME3= <>
##$DPNAME4= <>
##$DPNAME5= <>
##$DPNAME6= <>
##$DPNAME7= <>
##$DPOAL= (0..7)
0.5 0.5 0.5 0.5 0.5 0.5 0.5 0.5 
##$DPOFFS= (0..7)
0 0 0 0 0 0 0 0 
##$DQDMODE= 0
##$DR= 18
##$DS= 0
##$DSLIST= <SSSSSSSSSSSSSSS>
$$ [...]
##$SUBNAM2= <"">
##$SUBNAM3= <"">
##$SUBNAM4= <"">
##$SUBNAM5= <"">
##$SUBNAM6= <"">
##$SUBNAM7= <"">
##$SUBNAM8= <"">
##$SUBNAM9= <"">
##$SW= 24.9336996594482
##$SWIBOX= (0..15)
0 0 2 0 0 0 0 0 0 0 0 0 0 0 0 0 
##$SW_h= 4990.01996007984
##$TD= 16384
##$TD0= 1
##$TE= 0
##$TE2= 300
##$TE3= 300
##$TEG= 300
##$TL= (0..7)
0 120 120 120 120 120 120 120 
##$TP= (0..7)
150 150 150 150 150 150 150 150 
##$TP07= 0
##$TPNAME0= <>
##$TPNAME1= <>
##$TPNAME2= <>
##$TPNAME3= <>
##$TPNAME4= <>
##$TPNAME5= <>
##$TPNAME6= <>
##$TPNAME7= <>
##$TPOAL= (0..7)
0.5 0.5 0.5 0.5 0.5 0.5 0.5 0.5 
##$TPOFFS= (0..7)
0 0 0 0 0 0 0 0 
##$TUNHIN= 0
##$TUNHOUT= 0
##$TUNXOUT= 0
##$USERA1= <user>
##$USERA2= <user>
##$USERA3= <user>
##$USERA4= <user>
##$USERA5= <user>
##$V9= 5
##$VALIST= <valist>
##$VCLIST= <CCCCCCCCCCCCCCC>
##$VD= 0
##$VDLIST= <DDDDDDDDDDDDDDD>
##$VPLIST= <PPPPPPPPPPPPPPP>
##$VTLIST= <TTTTTTTTTTTTTTT>
##$WBST= 1024
##$WBSW= 4
##$XGAIN= (0..3)
0 0 0 0 
##$XL= 0
##$YL= 0
##$YMAX_a= 238770
##$YMIN_a= -236178
##$ZGOPTNS= <>
##$ZL1= 120
##$ZL2= 120
##$ZL3= 120
##$ZL4= 120
##$ABSF1= 10
##$ABSF2= 0
##$ABSG= 5
##$ABSL= 3
##$ALPHA= 0
##$AQORDER= 0
##$ASSFAC= 0
##$ASSFACI= 0
##$ASSFACX= 0
##$ASSWID= 0
##$AUNMP= <proc_1d>
##$AZFE= 0.1
##$AZFW= 0.1
##$BCFW= 1
##$BC_mod= 2
##$BYTORDP= 1
##$COROFFS= 0
##$CY= 11.3945322036743
##$DATMOD= 1
##$DC= 2
##$DFILT= <>
##$DTYPP= 0
##$F1P= 20.1537800932815
##$F2P= 0.134698688090026
##$FCOR= 0.5
##$FTSIZE= 0
##$FT_mod= 4
##$GAMMA= 1
##$GB= 0.15
##$INTBC= 1
##$INTSCL= 1
##$ISEN= 128
##$LB= 0.24
##$LEV0= 0
##$LPBIN= 0
##$MAXI= 10000
##$MC2= 0
##$MEAN= 0
##$ME_mod= 0
##$MI= 1.114404
##$NCOEF= 0
##$NC_proc= 0
##$NLEV= 6
##$NOISF1= 3.799351
##$NOISF2= 2.8
##$NSP= 1
##$NTH_PI= 0
##$NZP= 0
##$OFFSET= 15.70392
##$PC= 1
##$PHC0= -9217.289
##$PHC1= 9.200967
##$PH_mod= 1
##$PKNL= yes
##$PPARMOD= 0
##$PSCAL= 0
##$PSIGN= 0
##$REVERSE= no
##$SF= 200.130013532006
##$SI= 16384
##$SIGF1= 3
##$SIGF2= 2
##$SINO= 400
##$SIOLD= 16384
##$SREGLST= <1H.CDCl3>
##$SSB= 0
##$STSI= 0
##$STSR= 0
##$SW_p= 3612.71676300578
##$SYMM= 0
##$S_DEV= 0
##$TDeff= 0
##$TDoff= 0
##$TI= <>
##$TILT= no
##$TM1= 0
##$TM2= 0
##$TOPLEV= 0
##$USERP1= <user>
##$USERP2= <user>
##$USERP3= <user>
##$USERP4= <user>
##$USERP5= <user>
##$WDW= 1
##$XDIM= 8192
##$YMAX_p= 0
##$YMIN_p= 0
$$ End of Bruker specific parameters
$$ ---------------------------------
##NTUPLES= NMR FID
##VAR_NAME=  TIME,          FID/REAL,        FID/IMAG
##SYMBOL=    X,             R,               I
##VAR_TYPE=  INDEPENDENT,   DEPENDENT,       DEPENDENT
##VAR_FORM=  AFFN,          ASDF,            ASDF
##VAR_DIM=   8192,          8192,            8192
##UNITS=     SECONDS,       ARBITRARY UNITS, ARBITRARY UNITS
##FACTOR=    0.0002004,     1,               1
##FIRST=     0,             0,               0
##LAST=      1.6414764,     0,               0
##MIN=       0,             -236178,         0
##MAX=       1.6414764,     238770,          0
$$ Real data points
##PAGE= N=1
##DATA TABLE= (X++(R..R)), XYDATA
$$ [...]
1940a05J84L79l65l09j41M07j76k09K48M44l74M4R8j61j93m6J26r4m0K82K35j89
1962D5j93m0j16m6l19M31O02m37m8o4M63n92Nrj83J32J87K93Oj86j29p3K9J20
1986a22R9J06J30j96L8M40n89l55M55j05K14l0K35K26m29K17m77M78k49m5K1R5
2008A57j11L1M90m14l39K42J12j68k43M84L46l59k93P1j52Q4k45N43j9l30K21
2029A08J22j99L9J35j53m42j94M08J38k75K05Q0J76m48l77N49p5Kk95M82K07m04
2051b11m2N23n96j53O03l24J23L7J28m1n24L40j11J28k17L13M12k96O9k31p8K
2073a46p3J72K70j85J1L18o1k16O9P5j00j44P4N29k20l1mM8j85k04q2L62j75k14
2097a12M00k67L00l83J20J8j6l35N14j57k74K16J37j21j08k45J9J01J69j96J38
$$ y = [-105, 79, 458, 93, -216, -357, 50, -126, -335, -87, 357, -17, 27, 125, -36, -229, -275, -149, -243, -283, -1, 234, 45, -148, -188, -304, -350, -669, -238, 364, -73, -121, -185, 278, -314, -309, -318, -501, -369, -182, 111, 117, -69, -198, -271, -242, -122, -23, 83, 213, 17, 55, 495, -94, -449, 6, -99, 115, 85, 320, 546, 117, 334, -143, 335, 86, 41, 62, 157, 46, 77, 567, 153, -186, 56, 168, 0, -243, 241, 587, 228, -65, 6, -146, -62, -307, 236, 217, -113, 108, 230, 31, 70, 205, 52, -390, -584, -176, -38, -313, -108, -28, 148, -300, -677, -128, -203, -201, -496, -14, 193, -211, -253, 270, -326, -479, 124, -200, -77, -40, 88, 47, -477, -137, -248, -120, -337, -24, 388, 92, 161, -70, -148, -146, -219, -47, 223, 38, 49, 367, 306, 90, 159, 234, 134, -10, 64, 593, 373, 342, 338, 386, 201, -3, -85, 277, 102, -112, 288, 21, 321, -62, 58, 76, 60, -275, 239, 82, -192, 24, 161, 40, -68, -313, -294, -193, -24, -220, -82]
2118h2L93m14J7k86J53l06L06Q0r5J25K9k09J22l38K28N7r9J67N56j79m89L42
2140G8J31m41j49K00L98k21L4Q5J92K2l36N3Q0r0K93J25j55j1J70l45J07n12O6
2163b26N95j45l44N27J07m2n65j33M05l03J19K07j37j33n2N63m25Q8m40O11n44
2184b67K4K82K85j09o39K38J17n4j69L48jj11k49N65n84l8Q7M1j9L17P0p7k23
2207a66R5p4J03o7m79O52q1j29k35N09Pm05K22K33k79k12M41K94j41l61L73L9
2229C39m68l20N85nm96O64J23k67q0k95O30Q0n94L3M04j40m8J76J30k34k96K45
2251A66Q4l05J9K96J6j70J9L9j32r3k00M24r5n0K67k51j30k70K37J15k16j40L94
2274B4J9J59k28KJ16l64Lo5L20j8l9K93K7o03m4J60k34L05L52Q7j17k91K6L95
$$ y = [-82, 311, -103, -86, -372, -219, -525, -219, -139, -234, -109, -80, -289, -167, -505, -277, -220, -319, -152, 404, 225, -264, 78, 209, -232, -381, -181, 217, -4, 30, 115, 307, 329, -7, 46, 126, 36, 329, 454, 299, 288, 458, 113, 220, -292, -226, 369, 224, -120, 407, 514, 472, -93, -226, 179, -124, -5, 202, 65, -68, -120, 443, 18, 106, -334, 277, -267, -243, 39, 324, 215, -424, -186, -69, -123, -292, 56, 55, -56, -305, 260, -324, -362, -275, -234, -253, 64, 134, 57, -166, -71, -145, -42, -109, -588, 64, -17, -146, -381, 128, 135, -270, -48, 185, -94, -306, 135, 429, 288, -73, 300, 339, -129, -449, 136, 131, -365, 299, 422, 155, 75, -220, 410, 490, -104, -71, 333, 193, 145, 321, 451, 217, -79, 166, 250, -55, -36, 260, 276, 106, 125, 164, 32, -61, -261, 163, 68, 18, 285, 34, -96, -366, -129, -14, -230, -370, 24, 43, 202, -26, -24, 92, -272, -269, -334, -14, -32, -71, 222, 249, -354, -398, -238, -472, -167, 185, 272, 155, -136, -110, 285]
2298B85j95k19j05M69k42k45R50m53l98j96L45j94m02L96N52R9j65p0K43j35l38
2319a8J19r2R6j31J74M60l47j60J30k12l37K17N01o5k80J63O9L6j37n4j12kj95
2342a77K59R3l68K6K02j87k85J22J22J22N1K2M68m57m11M03K7Om66R1M49l44K26
2365fJ9%j55n13K92J81K49l66K50K72j46j69L2j40P6J93M6l1o7P4n2K3l64K65
2389c7R7n7J19L37k62k6j84l4k07K92O0k04J34J67j16J34k65k62M08oj20PP2L92
2413D39k45n65K95k04L05k82J08O4Q7l6M72n63N3p5K30l12K21N9l8j2j94L35n25
2436c83K26j78J47j19L30l45N28j20l45J37l1j04K10m2K5n0K3L46k34j50J50j61
2458a40J79Rk61N09l34Q6J57j47J22k35K64k50L25k19K57k63j21O7j76L82m0%
$$ y = [285, 90, -129, -234, 235, -7, -252, 698, 245, -153, -349, -4, -198, -600, -204, 348, 447, 282, 212, 455, 320, -18, 101, 9, 105, -26, 148, 608, 261, 101, 231, 19, -318, -101, 400, 335, 55, 218, 287, 323, 186, 132, 20, 18, -177, 82, 175, -193, -167, 35, -152, -437, -315, -193, -71, -20, 2, 470, 13, -398, 5, 32, 38, -428, -337, 112, -232, -6, 13, 13, -142, -655, -363, -182, 67, -299, -49, 223, 77, -92, -60, -200, -124, 69, 115, 84, 17, 91, 39, 62, -302, -37, 60, 3, 122, 459, 197, 171, -13, -47, -254, 38, 98, -106, 28, 195, 79, 213, -52, -314, 94, 88, -32, -25, 47, 439, 194, -371, -76, -280, 25, -257, -149, -85, 2, -34, 438, -125, -72, -147, 83, -229, -8, 51, 13, 1, -193, 142, -383, -157, -335, -188, -307, 23, -322, 206, 86, -259, -122, -153, -257, -47, -89, -64, -114, -91, 255, 21, -129, 21, -140, 39, 48, -213, 296, -38, 48, 205, 58, 180, -55, 209, -41, 284, 65, 322, 59, -62, 5, -171, 211, 171, 171]
2480A71R4j5k53K13O2m11j45K99q0J90J17R7n36M74m06lp0j09M19l6J5J8j42m24
2504d61L12l75K28L10n0k77L78j02jl3l6p6J49R5m51L78J2k0p0J72j43k16K79
2527Bk75K32J13Q7K36m00j83J28J92k0j06Q1K42k97P5l7R3j92K46k32J0J46M4
2550A85r6L00Kl70R3l15J53K05J55p3p8j0K95n37L06m27J91q8K15l58L3K48k58
2573b29J64L49m62mJ67L30l53p9Q1K3j71j05J68j38J98j74L80l77K31k08M2J41
2595b6j01M5r2K57j36J21j30K07o18L27j52M5L82j70J92o5j1r4P8k94q8N94j95
2618G6K29k96K63j28o6k85J99J52j89Ok37P40j34k39j71m6J23J36m2j65J52m8
2640C0L28l53J24j75J58r8K61l47K65J06m51L46j97k4L70m53K14J89R9l46l11
$$ y = [171, 265, 250, -3, 210, 272, -139, -284, 15, -65, 125, 242, 339, -197, 277, -129, -132, -202, -311, 108, 72, 87, 105, -37, -461, -149, -524, -296, 14, -36, -313, 65, -37, -38, -71, -107, -183, -34, 61, -390, -12, 0, -20, -90, 82, -61, -277, 2, -273, -41, 72, 159, 395, -5, -188, -60, 132, 112, 6, 87, 329, 32, 107, 70, 163, -29, 217, -15, -5, 141, 185, 89, 389, 391, 21, 114, -201, -48, 157, 312, 239, 161, 151, 446, -91, 215, -212, -21, -109, 106, -252, -219, 29, -229, -65, 284, -178, -182, -15, 315, -38, -117, -36, -13, -184, -289, -121, -259, -61, -235, 145, -232, -1, -209, -167, -26, -127, -82, -174, 83, -53, 68, -62, 145, -473, -146, -298, -253, 129, -41, 151, 86, 75, -19, 59, -235, -323, 271, 76, 305, 9, 272, 144, 78, -207, -8, 144, -45, -39, -276, 464, 330, 91, -80, -126, -3, 133, 91, -74, 78, 30, 358, 5, 129, -46, 112, 14, 275, -72, 193, 299, -152, 194, -3, -27, 343, -110, 104, 293, 392, 46, -265]
2661b65J55k63K14j48r9M19J32n31N94O4k87k10k6L7l4L35l5j85L30j69j29P4
2683b7l21M50K0q7k36J23N83o76k2K75k22Q1N0Q6M6j73o5J22J48j93o7k04L21
2706A2j73M06J89k36j59k18M08n31k1N91K10k75k65J23P2M1j86k7P6k22N03k03
2728A15N7j2m89L30J82l22k7K31k10j23J20J49j09k09K87K8m53L96m9K88k44k32
2750b96J78j83k28N28q7q7o5K70oj80j3J4L39m45QO1M77l83K6N18n34K27J7k20
2774f4J71p5r9L66n2j48k87J47K56r8n3N3J72j34j63K69j85K6j30j77J54PJ99
2797A55q6M0j01O5l1j23M4K90k11K5K10j39j39r7n7r4L85j98J81J32l04%K81k69
2821d1k50K6K38r2j8J67QJ63l56J07j38K09k29K05P5l75K81m3J31m92L30L12k70
$$ y = [-265, -110, -373, -159, -307, -406, 13, 145, -386, 208, 272, -15, -225, -251, -214, -248, 87, 52, -133, 197, 28, -101, -27, -348, 102, 122, 35, -201, -78, 505, -171, -193, 82, -140, -59, -9, 77, 123, -50, -115, 7, 155, -38, -105, -309, 12, -161, 245, 434, 198, 39, -179, 229, -302, -323, 268, 478, 203, -62, 61, 133, 174, -12, -39, 37, -185, 318, 115, 172, 160, -329, 1, 183, -139, -166, 65, -145, -268, -148, 1, -108, -317, -30, -2, -455, -59, -108, 180, -64, -296, -118, -301, -529, -1, -88, -175, -240, 30, 24, -156, -169, -155, 184, -261, -253, -192, 285, -98, -72, 446, -88, 139, 156, -64, 107, 32, -67, 299, 247, 99, -188, -41, 215, 117, 64, 117, 289, 155, -8, 261, 76, 102, -28, -205, -51, -44, 155, 69, 109, 8, 73, 42, -81, -37, 253, 42, 67, 277, 138, -1, -98, -155, -249, 136, -62, 119, 251, -53, -53, 228, -41, -291, -265, -27, -119, -137, 30, 38, 201, -155, -48, -186, 23, -206, -1, 74, -301, -20, -63, 68, -424, -94, 218, -52]
2844e2l3j91M15m18J76L04l14rOj8N33l40j08Q6P9k03K2J68q2R4r7J61j12J00
2868A67r4N6l23L48j47K11m07L60l2J13l50R2l2L4n2N8j00Q1n3j75K94k51m0K57
2892A5q7o5M42p6P4m62K49j95J54k66J86K7Nk86J43J23K30n32L27J18j79PK2o
2916c2k0j81K94p2j15J76k08M4J59J40m39O00r5l33p1K16p9K85j57k61o8J55J68
2939A06O6k85L36j01j14K34l41L25N2n42M18n57L95K3K19j72ON9l16k7K02k9P9
2962C6j75K10j06Q5j82J94Pj66l5J03J22K99o78L98j10j00J05K5k90Q2O2RK72
2985A67k11j94J00m2n5P2J01J85k15L16l45K88m25K92j78J58l5J91P6l12K3M5
3007Bj6Ol2L7K63n42M09K33j03j52J92m71J68M40m07P1r8k04J73J71k17J14J08
$$ y = [-52, -85, -276, 139, -279, -103, 201, -113, -122, -116, -134, 399, 59, -49, 37, 116, -87, -65, 103, 21, 115, 18, 179, 67, 167, 73, 129, -194, 154, 7, 218, -189, 171, 139, 252, -98, -6, -38, -4, -56, 2, -98, -17, -70, -245, 49, -202, -242, 15, -72, -137, 305, 229, 303, -159, 90, -105, 49, -217, -31, -4, 1, -285, -142, -19, 211, -321, 6, 124, -55, -48, -26, -32, -52, -233, 61, -11, -126, 50, -158, -114, 45, 185, -254, 346, 251, -82, -153, 63, -16, 269, 112, -149, -217, -62, 106, 172, -113, 223, 122, 8, 242, -99, 226, 278, -264, 154, -403, -8, 15, 234, 62, 68, 127, -189, -216, -14, -43, 36, -139, 71, -35, 50, -132, 62, 69, -97, -132, -29, 93, 392, -286, 112, 2, -98, 7, 32, -258, -176, -114, -105, 167, -44, -238, -138, -180, -235, -163, -62, 123, -92, 224, -121, 167, -258, 34, -144, 14, -21, 170, 246, -66, -43, 2, -14, -8, -40, -3, 260, -282, 127, 360, 257, 105, 297, -174, -6, 434, 27, 98, 0, -204, -31, 140, -77, 37, 145]
3030A45km1l08Q4K32N0m00M19j74k36J51K03j78k70K92Q8q5k97K82R4j67J76k61
3053b03K86l09L07k68L03j21k46L24k20P4L43n03L12j15l24J97L85n8l03J31R5
3074H7m43M12L6k78O0L44j35k6q5j56K46L4j64j09L29l99J71J09L3n80P16o8j42
3097hP4l3M0j47J36m3L9o0k17K22J64k90j75M27k08j15J36j71M09n4j60P3j2J6
3121D3n8J89j10mj86j51K33J65l7o9j48P3LK47k72J61j64K14k39K5L22k06j7N
3145A9l97L63o2j8K59j41k95L62j05J66k65j25L24j44n4J09j27P1K67k35m0J60
3167I2k87j78M37L8o9Q2j85N5K11j08o7K1M1j60J95k67J82R9M6K15k06q0J13k80
3191f0k17K30J96j64l1M2j7J1J0J5j8kj16J60L14p28O63k56Q4j52j49L67j83J89
$$ y = [145, 143, 102, -206, -122, 110, 160, -240, 179, 5, -231, -80, 123, -55, -325, -33, 55, -30, -327, -45, 49, -118, 58, -203, 83, -226, 81, -187, 116, -5, -251, 73, -147, -73, 270, -233, 79, -36, -360, -163, 222, 164, -139, -8, 87, -356, 56, 92, -186, -126, 218, 83, 57, -28, -184, 62, 96, -68, -177, 152, -247, -76, 33, 66, -514, 202, 134, -8, 66, 33, 73, -74, 62, 19, 58, -2, -219, 3, 167, -123, -298, 129, -79, -194, -58, -229, 180, 126, -34, 39, 27, 43, -15, 174, 64, 60, -126, -277, -44, 121, 84, 15, -133, -60, -57, 190, -82, 79, -85, 129, -110, -85, 237, 31, 14, 19, -378, -15, -77, -95, 164, 23, -272, 90, -15, 151, -114, -239, 85, -59, -113, -4, -131, -60, 207, -28, -68, 92, -195, -373, 64, 102, 33, 115, -70, -15, 196, 88, 21, 42, 83, -77, 118, -149, 33, 132, 178, 393, 187, 107, 220, -60, -277, -47, 149, -15, -46, -4, -21, -10, 0, 15, -3, -5, -121, 39, 353, -375, 288, 32, 116, -36, -185, 182, -1, 188]
3215A88l25J79j54K10l3j76K22p7Oj54K94k91l2J50n0m0M5k31L35l04K59L3k99
3238b45J77n2j16L79j17J50l59nJ32p6J32j00L79l36Q9L5j6l64jN11k25K20o5
3261A27J55j71J49o7m33L90Km28L27l3J30k1j96Q4r5j85N77r9k18o5Q5j75jM90
3285C29k57j42K06l46J64j4K30N0k97K52k5j22j48R6J74m04K52r0P4O7jn9M6k5
3309A0n2j56j42L77NO9J3k70R0L96m36l45N87k57j03l6L48Q9n01N07j40r0J48
3332A11l4l39L97j15k68J21J26NK5p6M4J43o3rj61J90j90J19J2J11r6o0K45n12
3356b74K24j5N2N9o6K9k07J96K00K6k18Q1Om5J0L40n11L64j09j99J13K05k92L4
3380CJ14j99j92K76N3N1Ok51L75L3l30o3MM6Q4J58l08L41k93Q0J29j76K4Q4j55
$$ y = [188, -137, 42, -112, 98, 65, -111, 111, 34, 40, -114, 180, -111, -143, 7, -43, -83, -38, -269, 66, -238, 21, 54, -245, -68, -120, -236, 143, 26, 176, -183, -188, -56, -132, 0, -100, 279, -57, 32, 67, 51, -313, -314, 197, -28, 192, 127, 282, 111, 260, 193, -240, 150, 152, -276, 51, 18, 148, 127, -69, 15, -80, -265, 312, 213, -5, -70, 15, -160, -161, 329, 72, -70, 136, -210, -46, -60, 170, 220, -77, 175, 150, 28, -120, -24, 150, -254, -2, -92, -18, 49, 48, -11, 35, 10, -42, -198, -340, 37, 42, 111, 124, -146, -56, 340, -96, -441, 146, -111, -214, -250, 98, 187, -314, 193, 53, -37, 111, 77, -262, 135, 20, -248, -127, -1, 4, 29, -47, -3, 140, 77, 68, -93, 97, -93, 26, 38, 149, 53, -7, 238, -274, -50, -65, -13, 46, -20, 9, -198, -2, 198, 224, 6, 87, 93, 48, 58, 398, -113, 251, 142, -57, 56, 261, -31, 3, 117, -82, -274, 2, 55, 106, 112, -139, 236, 269, -61, -124, -120, -74, 10, 168, -140, 201, -92, -12, 117, -59, -35, 49, -106]
3405a06J32O5N2JMl13K46j05M3j36L50j79k23N00l34q2JM5J62ml35L47q7J70j4
3430B00q6K0j56Q8qp1J42m20NK28L7J06k23P1j65L75k56J73OK2k9q3J21k07L04
3455A94l81k4K79l07K0L89j12rk98K31o8k34L72j82M68l85l0J6K78m89N7J26J
3478h8k4j31J92L41l43J92j07K5k1K45p1m24K20Q4J0L0l68M64k31Mj61L29K56
3501D23l91pL7k27L11l20M16q4o12K37R2J55q3J40m4r5O8R8k40J43p1n3J92L6
3525A21o11N45L6n60K15J44j2K03k03r1K7J46j10J10j22J24J05l5j05j7n2J45
3547CJ46l67L69m86L25j68q4M85k99K10l92Q3L81m16K87q8L4Q3j96q3J65J83n7
3570A18J10k29N3p3j54M16j93k33P2L97k68J53K9j93J1K40k95j6J2N8k52M7L12
$$ y = [-106, 26, 91, 143, 144, 148, -165, 81, -24, 19, -117, 233, 54, -169, 331, -3, -85, -84, -39, 123, 119, -216, 131, 44, 214, 200, 114, 134, -22, 66, 58, -13, 129, -291, -286, -58, -21, 85, -138, -67, -232, 143, -113, 60, 66, 88, 59, -24, 97, -110, 194, -187, -211, 68, -239, -219, 170, 58, 49, -249, -18, -86, -320, 52, -130, 338, -47, -77, -61, 217, -272, -215, -89, -88, -112, -243, -51, 290, -53, 139, 32, 57, 36, 281, 210, -214, 6, 90, 100, 130, -238, 226, -5, -1, -162, 167, 423, 32, 25, 62, -165, 146, -174, 242, 158, -454, -217, -125, 30, -53, 87, 43, -52, 16, 114, -126, 17, -54, -107, 85, 121, -490, 55, 91, -469, -254, -110, -122, 81, -122, -213, -186, -40, -150, -40, -162, -38, 67, 32, -73, -90, -142, 3, 149, -218, 151, -335, -10, -178, -262, 223, -76, 134, -258, -175, 206, -210, 77, -11, 23, 106, -90, -173, -8, 175, 118, 228, -1, 52, -21, -175, 241, 48, -185, -113, 284, 16, 169, 198, 5, 16, 256, -39, -55, -43, 15, -237, -190, 122]
3593A22j35J34j09L09j57k05j43L1J67J62j13k06K26Rn9k02Q0L36n5or0J2k33
3616a25K33R0r6l27J21J58O4n85P05m23j13L91l21L36j46j7q4L08k40n1J91p8
3638iK0L2J08k35O6J84J26k01r8Q9n23L90j52K61Qm9p2K06k11K31k68K59L5L6
3662B33P6j50k9k31R4Q6K4n5k14J24j3L2L53l34m0K21j59J60j88j99K49J87j15
3685A12m6lm3j11J74j72j63L14l8J51j92J1m76M59K91k24j15M56m14j01L58k52
3707b4K35k43K58p4j10K2j83K1j26J81K94j62k09J14P2k79M1q6K04K1j29L06j60
3730a6K54m35L23k1j96J68j65K03Nj02j76J59l06L07r8K13L9j46j5j32j36L23
3752E0J8l8l7j76m7J20k7J73j57J18O1R9J06k36n0j30M28l54J55J72k16j93L73
$$ y = [122, -13, 121, 12, 321, 164, -41, -184, -153, 14, 176, 63, -143, 83, 92, 33, -169, -89, 247, 192, 186, 96, 108, -125, 108, 198, 102, -225, -104, 54, 118, -467, 238, -185, -298, 93, -228, 108, -38, -55, -139, 169, -71, -122, 69, -9, 11, 43, 151, -84, -18, 166, 292, 91, -7, 82, -441, -51, -203, 58, 66, 17, -55, 151, -60, 171, -97, 162, 197, 233, 309, 159, 130, -101, -7, 79, 103, 48, -166, -42, -55, -23, 330, -4, -44, 177, 18, 178, -10, -209, 40, 227, 112, 66, 63, 20, -91, 83, -89, -252, 62, 24, 175, -17, -6, -482, -23, 268, 44, -71, 385, -29, -130, 228, -24, 211, -32, 226, 152, 42, 64, -119, -98, -224, -43, 251, 89, -120, -6, 66, -213, -172, -258, -54, -33, -162, 144, -16, 238, -197, 126, 105, -91, 77, -88, 115, 120, 18, -158, 1, -305, 2, -96, 117, 156, 10, -5, -137, -273, 50, 68, 30, -7, -183, -230, -110, -137, 36, -121, -3, 58, 157, 263, 27, -23, -153, 275, -79, 76, 248, 32, -161, 212]
3775B12l34P8J94j24J5j69K72l31J29K6k36K71M9j11L6m95O82j7rj31P7l28M13
3798A69P9l48j03J05O0l21L24L4k04l6J56O3Q0K23l92O5K88j99L11m30j54O4j94
3821c60N76j83j39L21r1j79L4j26J39J60ok1J46k67q0k0M40m78K45j41J26n7k91
3844b52M05j20k32Q4N5l3l43L68k1j09K39j04j15J32j5P0j9K14k41k79M11m0j80
3867a25J10O06n16j02n5K55k57N4K10j91m6J74l21M78j83R8l36J6J37J66j09n25
3889d62M55n2p6L0j5j0K52n03K50K23j21P7l39P9r0J51J59j73O06m49q7K19q4
3912D0J01L4p9j37j6Qj20P9l39M40j43p3L61J87j73o3j7j51K36k01o1r3J63J56
3936A39l64J39R1p5J06J14l6K3j50n2K07m60J62K10K68k14r8l9k39L36n0j43L53
$$ y = [212, -122, -44, 150, 26, 41, -128, 144, -187, -58, -32, -268, 3, 52, -59, -23, -518, 164, 147, 138, 7, 84, -244, 169, 248, -100, -203, -98, -38, -359, -35, -1, -205, -241, -85, -22, 58, 281, -111, -46, 242, 43, 354, -76, -230, -166, -360, 216, 33, -106, 215, 124, -55, -21, -147, -8, 152, 146, 125, 271, 4, -76, -96, 344, -134, 111, -30, 96, 39, -252, 153, 33, -199, -115, -60, -93, -436, -68, -89, -198, 41, -63, -178, -46, -61, 9, -10, 204, -37, -316, 95, 55, -125, -15, 591, 75, -27, -82, 173, -84, -30, 180, -11, -57, 117, -204, 274, 91, 189, -147, -131, 6, 172, 63, -462, -7, -59, -135, -105, -120, -130, 122, -381, -131, 92, -29, 48, -291, -212, -302, -151, 8, -165, 441, -8, -95, 124, 40, 141, 175, 96, -41, -57, -49, -169, -90, -429, 11, -132, -205, 156, 343, 170, 107, 90, -61, 175, -26, -87, -180, -17, 139, -225, -86, 5, -70, 36, 150, 114, 137, -13, -65, 142, -318, -156, 54, 322, 108, 10, -29, -268, 68, 18, -125, 228]
3959B28k22nJ86l97J30J73l4k54K08M5nj24j22M46j21k6k74q9M16n7k46j1K63
3982A08j76M16l79j08N34o03K57j60M1J30N7j71O0K21k06kk7k69P7j50L73q7K
4005f2jp0J99r5j66K42J25l50J42Rm2P1k5J14k3j69j32K20j65M1K1L59j51J42
4029B34p3k83k38M69R2k24m4L0J49k02k1o8J94l19N5J35N8q9K41J77k03l29K24
4052c5K1k1l2K71L2m41OL12l06L33m3OL9j48K18rk45L5j58R2O0j76J45N1N4M39
4078E00m18j18J18k72O35l73N3j80P3j04n1Q5L2j50K07K59m10N7J91m3j42j1J34
4101G2j52K23k23j7Q9J24j62j48J51j11K19j57K23R7k94j22N36j02m17J24n4J44
4123D3j77N08k47j72L4J28j42k76L69Q6l04L2L57k01l0k98J21K42l1j41M1m4L21
$$ y = [228, 6, 1, 187, -210, -80, 93, 59, -195, 13, 58, 53, -71, -193, 253, 132, 106, -168, -257, 159, 102, -144, -155, 108, -68, 348, -31, -139, 395, -208, 49, -111, -70, 60, 117, -54, 6, 227, 21, 19, -8, -277, -200, -350, 23, -64, -62, -63, -133, 66, -29, -195, 47, 172, -178, -36, -27, -69, 2, -23, 91, 68, -101, -233, -13, -178, -137, -116, 243, 92, 234, 161, -122, -360, 109, 201, -23, -67, -37, 112, -90, -111, -179, 15, -304, -249, -114, -56, -145, 96, 273, 70, -259, -35, -14, -35, -67, 204, 236, -205, -199, 113, -193, 140, 97, 103, 142, -6, 212, 203, -42, -7, -165, -73, -13, -189, -44, 7, 61, 500, 82, -36, 82, -190, 445, 72, 125, -55, 18, -86, -137, -52, -20, -170, 37, 296, -114, -57, 134, 91, -51, -62, 72, -80, 143, -80, -97, -8, 116, -46, -194, -43, -154, 65, -92, 131, 228, -66, -188, 348, 246, -171, -47, -101, 43, -134, 374, 127, -45, -11, 117, -25, -301, 68, 154, -150, -118, 239, 38, 8, -290, -169, 73, 42, -99, -58, -102, 219]
4146B19p9j16r8J79n5L7K3j11j85K82J71k88O1N3j33OJ22q1j35j49K94j38m1K79
4170A17nJ1k2j36k79M9J55J85J40j91J6O8m12L02r6N2j59K16j40o0L91q5k4j06
4194a3o1l8L93p9k67OJ77k4j35k4k5R5L5j96K37j04j7J14J2j98K04p0J05j29R2
4219I0m1k90M53k95J33J99j34j55P3k5K2J8O8J62J46l25NQ8j53J02l06J43K53
4242B31j10k41L12k22j66L81m50L18l11M09l10O8J86k74K14J34k67J36R4k02j40
4263b10K50j82L30k35L20n1J00k33j18j93M64J7j65j7K90o60L62M8J70l02j10
4284a25J21J74k5m25L30J1j30M5mj06J31k25K08M8o8l7K08m66J19K5J58L2J29
4307A28k44K36J54m92K39K71r0k39M3j72j4K99p9j16k68M14J51Lj83j57M27p5
$$ y = [219, 140, 24, -74, 105, 50, 87, 110, -1, -186, 96, 267, -21, 40, 93, -40, -34, 88, 7, -128, -277, 17, -121, -162, 117, 112, 123, 101, -35, -314, -265, -110, 75, 215, 24, 40, 108, -304, -2, -98, -46, -205, 11, -129, -189, 202, 117, 93, -13, -74, -112, 281, 202, -65, -59, 118, 94, -41, -65, -90, 5, 40, -156, 81, -23, -40, 74, 86, -112, 92, 22, 127, -2, 90, 49, -241, 212, -83, 50, 249, 115, -40, 33, 8, 30, 48, 116, 278, 424, 99, 104, 192, 39, 141, -165, -22, 231, 121, -120, 192, -30, -196, 185, -265, 53, -258, 151, -159, -91, 95, -179, 35, 169, -98, 38, 132, -70, -210, 40, -142, 188, -47, 273, 222, 322, 89, -29, -222, 242, 259, 94, 77, 367, -293, 69, 117, 287, -15, -125, -4, 170, 145, -280, 50, 61, -69, -24, -28, -134, -3, -228, -20, 28, -40, -77, 131, -335, -216, -191, -33, -1, 128, -116, 120, 274, -218, 21, 292, 202, -37, 6, -166, -180, 119, 40, -76, -344, 70, 221, 224, 41, -116, 311, 236]
4329B36l64J34j5K5j90K7J83J80p9p6k3n0J0p0J40j94n6K28j42K0K45K59m40j77
4353a89L39l4l05L37j72M5M1j2J21L1j82k4j65N02k75k08L5k5K13m03J90K66q8
4376C8J32K6j97k20P2M00m14Q4lN8L0j26J2K87k0k40M31k21J62k79J59k58J78
4399I1j64r0J98J6J01J32j35l27p8J33k5Q6o3K21J50l73K30k95M32l86J65K32
4421B51k93P8k82M18l52M6K78j35j1lp2o7j57M12K1j96M8j8K09l81j65K12m4j77
4445c80K38L03j91J15j45j5PJ03K02l0m01J36j58pOJ72K63o4l09q4J85J83m9l6
4469D4M6j69j35J08L09k73P8j20K45k6l41N25K2j03m59K00j73J19L65o24M14k75
4491b23J30K18k17L76l01k4R7l08L54j77Q7K52m57J55K28l07K00oP4J2m08L66
$$ y = [236, -128, 6, -9, 16, -174, -147, 36, 216, 137, 61, 38, -12, -2, -72, 68, -126, -182, 46, -96, -76, 169, 428, -12, -189, 150, 116, -189, 148, -24, 21, 62, 50, 171, 202, 20, -4, -169, 333, 58, -150, -115, -140, 73, -330, -140, 126, 38, 170, 196, -1, -221, -149, 251, -163, -79, -82, -24, 6, -120, -108, 179, 159, -81, 350, 129, 291, 12, 171, -87, 91, -73, -163, 35, 51, 152, 284, 149, -178, -256, -123, -148, -62, -125, 96, 246, -127, 103, -192, 240, -146, 19, 251, -42, 36, -246, 172, -180, -134, 144, 9, -2, -5, -77, -144, -301, 111, 132, -64, -16, -34, 175, -206, -371, -159, -203, -380, -142, 161, -30, 85, -60, -75, -68, 35, 237, 207, -194, -58, -216, -223, -217, -45, 218, 154, -155, -239, -54, 129, 80, 44, 90, -79, -214, -106, 203, -70, 8, -112, 133, 107, -234, 291, 313, 210, -249, -49, -222, -103, 262, -362, 52, -223, -93, 125, -92, 284, -17, -41, 56, -252, 102, -75, 12, 264, -193, -38, 190, -117, 83, 77, 151, 163, -245, 121]
4513A21j23JK15k13j9N6J10l03J42q3n7L08n7P2l11RL12Q2j93m14R9L07j7j64
4537a20k45O47k11l84L23%L9J17R1m36M15k64L1J65j02p5r0j91J84K10j30L0j62
4560a58J30J42k6j38L37m55L60j89M2K76k85r5j13O0J25j89N01k81K75j68l77
4581b26R4L33j08j16J97k55J27L6k15j8J34k24R5J04P9k5R5j25K43l82K90j51
4603a8K75j83j53j09J86l20M97j05j96J37j21o2K13P5j66j59M08l26N2K31k43
4624h7O2L9o8J07N8o7N0l52Q0K88RNk75L05m22K28qk2q7Q1O7J34k00K84j50j8
4650D1k01J18K63j95m19M71o9j60l2K21l68K13K56l97N1J55r0Q9M0n2P2J65m39
4673b67J20L21j06k41J17J67l26M02l54m5K70n9j5J13l89L60l3j33n3K48j14m8
$$ y = [121, -2, -1, 214, 1, -18, 38, 148, -155, -13, -96, -153, 155, 98, 170, -141, -132, 180, 262, 69, -345, -246, 61, 44, -120, -365, 282, 71, -313, 10, 10, 49, 166, 257, -179, 236, -28, 3, 168, 66, -9, -99, -290, -106, 104, -26, 4, -158, -28, 114, 88, -50, 287, -168, 192, 3, 45, 321, 36, -59, -172, -112, 13, -176, 325, 44, 319, 151, -226, -132, 201, 93, -23, 174, -81, 46, 82, -133, -151, -17, -241, -146, -42, 37, 12, 107, -18, 225, -157, 133, -18, 257, 74, -79, -188, -2, -322, 175, 70, -126, 11, -110, -172, 41, 116, -50, -209, 199, -127, -75, 156, -87, -25, 14, -54, 53, 111, 44, 94, -258, -178, 110, 119, 124, -151, 154, -268, -40, -48, -70, -157, -76, -9, 125, -75, 209, 59, 41, -160, -42, 221, 26, -393, 78, 9, -151, -183, 38, -330, -117, 139, -258, -207, -52, -142, -53, -13, -65, 7, 172, -267, -147, 174, 68, -173, -56, 111, -215, 187, -167, -212, 58, -1, -16, 97, -292, 68, 35, -98, -151, 97, -17, -65]
4695f5ol9J49j15K31j17k51L62k33J5K05j76k90L88k54M73m02K96l05O8J03J10
4717A47M8k49L1K7j9J12J04k54N6r9J4j32J35KN7M9M1j47J15j6j62k5K80j22L16
4742C09j77j94M48m09k88N20R4m02j20L52l80O0L91j09j16j76l3M15k78L48J8
4763B73o17J11K85M2n2Rl52J28L18m9j09J33k42o9J07J72k14Q2k9k8q6K62j1l8
4787B6J40k70J67j44j00L20j00j37J47q9L10l82j09J28K43k39Q7o3J56j12M4q
4809A5m0Q4j17N6K3n8P8J55k94RJ57p2o21R17k70O2k15J20K6l08J67R1K98l78
4833a15j35P3L32k02q8L30Q5m14J60j99J08j17J92L40o38M63j32J63j90j6j91
4854a91J2J54L59n40L08m12O00l65K06P5k47j63R9j12K18R7k11J75N1Rp1K7K27
$$ y = [-65, -71, -110, 39, -76, 155, 38, -213, 149, -84, -69, 136, -40, -330, 58, -196, 277, -125, 171, -134, -66, 37, 147, 195, -54, -23, 4, -15, 97, 201, -53, 3, -96, -82, -214, -79, -77, -20, 29, 70, -77, 38, 22, -140, -165, 115, -7, 309, 132, -62, 386, -23, -311, 209, 303, -99, -219, 133, -247, -187, 204, 95, -21, -197, -230, 185, -93, 255, 273, -344, -233, 52, 94, 42, 51, -301, -173, 145, 96, -13, 120, -122, -191, -84, 88, -126, -44, -73, -101, -187, 75, 64, 26, 166, -104, 63, -81, -181, 139, 39, -98, 49, -40, 270, -112, -221, -93, 150, -89, -2, -65, 91, -21, 23, 15, -25, 59, -58, -2, 21, -37, 41, 196, -98, -89, 68, -4, -625, 292, 22, 84, -131, -11, 15, -293, -126, -35, 263, -115, -250, -177, 155, -47, -135, 195, 280, -134, 26, -173, -65, -182, 10, 350, -288, 175, 43, 206, 16, 0, -191, -179, -25, 334, -206, 102, -310, 290, -75, 131, 206, -41, -204, -105, -217, 1, 98, -113, 62, 113, 122, 51, 78, 305]
4877C05k93LP5p7n6j33K43j79kk4K09j82K6k22J50k9j0J64M7K16J13k50j38P2
4901B8o9K21J31o9k38K5J28o41P38l82k5J97o5J5M2K1k45N65k93jp8m1K61R3l79
4926f1j47J40J23k13K59j27o9K91l06j79K88Pm0j00L72k01J12m28L70M5l30O9
4948a25K59k95L24j27j50L00j85j22R1l14J34kL14J7j93K21l79M15k91J59p7J87
4970A61l02O4r7K47j30Q0O7O6J13l26K2l2J54j49Q6j02J97l34L63q4r6L5K95o6
4994B32j18j85J32p5n0mJ40k59j2L22k95J65m7J75k1QO5O9r6l15K77j19J2J69
5018A70J02k11m98L86M0R2J04j85j61L69j0j84J50M2o3N0j01j29j39K03N5oj64
5041h8L12j82R7k41J56k34L70Q1k20O4N9l6j80J54j26j65J45K43L9n22M19j10
$$ y = [305, 12, 15, 90, 13, -43, -176, 67, -112, -114, -138, 71, -111, -85, -307, -157, -186, -196, -32, 15, 231, 344, 94, -44, 28, -41, 180, 311, 242, 4, 29, 157, -484, 254, -128, -153, 44, -21, -6, 36, 57, -188, 377, 84, 83, 5, -36, 225, 318, -61, -208, -68, 55, -158, 101, -26, -95, 196, -110, -289, -1, 6, -34, -134, 238, 37, 149, -279, 91, 136, -194, -125, 134, -161, 163, 36, -114, 186, 1, -121, -30, -344, -210, -212, 102, 119, -74, 147, -232, 183, -108, 51, -26, 161, -141, -77, -174, 73, -57, 23, 90, 156, 269, -57, -35, -67, 87, -62, 24, -78, 119, -215, 148, 64, -32, 3, 298, 232, 114, -71, 61, -14, -64, -68, 72, -187, -199, 123, -172, -7, -54, 121, 100, 108, 173, 242, 146, -169, 108, -11, 1, 170, 272, 61, -437, -51, -11, 81, 185, 0, -161, 208, 198, 14, 164, 206, 143, 193, 92, -37, -176, 27, 82, 76, -88, 224, 42, 139, -102, 54, -180, 190, 271, 51, 115, 174, 138, -42, 112, -14, -179, -34, 209, 248, -274, 145, 35]
5063C5n5P2N4n8j79J49q2j12J70J7M7Mj49l1P7j63K51l1p7L15l97L7J23j66J53
5088DL3k80R8K79j82K61k46J88q0l1K04m30K07j00K14j62j15J33q7J73l59K50
5110b8k21L41n2J29j9n8q1l2jm3L35q7m1l50O6J06k01K98P5j22O9j73l1j3j80
5135c14J02O5L32l55J31p4M64l08j59o9K75J30l31N0j44N0K08K58l57L17m95K20
5157dP5r6q9K59k13M9O7j95O8J41Q9k36J72k13L38m29K77J68l32P1p2N0J33j63
5181h5j44J91J78r5J17j70l4q9J79J8l28O4L16j73J09j2k99K91pn2K41q8n00L46
5205b6L80k55o0j73o5M56l58O3J91Q5k77k5P6JK53j50j22j06M39n14J4L80m27
5228b20K95R3l14J89l0m5o9J70j99K0M82k83l83J98m0K73k58L75p2P5l86L07J26
$$ y = [35, -20, 52, 106, 48, -131, 18, -64, -176, -6, 11, 58, 62, -87, -118, -41, -204, 47, 16, -61, 254, -143, -106, 17, -149, 4, 37, -243, -145, 134, -48, 213, -33, 155, 75, 44, 248, -182, 25, -75, 139, -23, -138, -5, -92, 81, -278, -28, -249, 92, 40, 169, 150, 92, 11, -21, -22, -65, 270, 183, 142, -208, -142, -36, -237, 61, 136, 14, 83, -90, -121, -134, -314, -212, -147, 185, -170, -39, -113, 351, 43, -116, -185, 90, 220, -111, -61, -205, -155, 53, 311, -46, 271, -224, -4, 71, -25, -114, 145, -68, -19, 48, -147, -79, 62, 151, -85, 87, -126, 212, -217, 60, 228, -104, -33, -105, -55, 78, -85, -229, -38, 140, 45, 162, -8, -42, -131, 48, 66, -262, -198, 118, -55, 54, 42, -257, 34, 27, -25, 216, 128, -372, -26, 354, 99, 39, -134, -199, 257, -101, -38, 153, 238, -39, -64, 12, 13, 266, 116, -6, -112, 327, -187, -173, 207, -220, 75, 168, -146, 43, 13, -32, -101, 69, -130, -110, 372, 89, -294, -96, -136, 137, -121, 254, 182, 257, -129, 178, 304]
5251C04l34J16J3N2k71N7P3k86N7J11O6j33J35k09M44K6j34J04k85j35K62r2Q
5274e1j04L12q2j7R0k6j68J45K9k75M34j94j87R6Q5j9j03j12L74j61k27K29n9
5297IK33n5o6M8j04j84J92q6K20l15K76k99J87m17M46l7m8j10j73L22j84L4J26
5320A5k08J44P4Q7j12j56k8m5K79nn2K74K06m46j88J50O0j71q8NL17R1k69J06
5344D0j50K34j75j1MK23l44Q6M9j77K06r2Q7o3j04J70J38N7N3q3k72J57r6M8J12
5369I7k85M80l45r0J70Q1j42N2J53j49mq2N6o7lj18M55j39k31J58j55L5l3r7P8
5394a25J40P8j20r5K22j94j8J87J7j51j91J83J16r5o7M2k0K28l31J74rj43M5L06
5418A79j02j70K38n9j39J2k8P0k37L29Ll32J45j98K06O7k2J10j08J11J35m35M94
$$ y = [304, -30, 86, 99, 151, -120, -63, 10, -276, -219, -108, -42, -175, -40, -249, 195, 221, 87, 191, -94, -229, 33, -59, -51, -155, 157, 75, 58, 148, 122, -46, 99, 128, -147, 287, 93, -94, 2, 87, 68, -35, -147, 227, 66, -161, 68, 9, 242, 187, 121, 169, 65, -119, 73, -13, 207, -108, 168, -131, 56, -361, 85, 48, 0, -110, -283, 39, -145, -111, 15, -193, -49, 25, 112, 0, -156, -184, -229, 50, 45, -7, 267, 473, 27, -161, -11, 49, -122, -210, -205, 112, 203, -66, 40, -110, 124, -51, -62, -58, 165, -179, -93, -44, -221, -15, -107, -20, -83, -187, -17, 121, 178, 231, 148, -124, 33, -63, -15, 97, -188, 292, -53, -143, 27, 108, -34, 18, 171, 22, 18, -64, -8, -75, -78, -196, 259, 120, -111, 47, -108, -73, -106, -203, -125, 15, 93, -27, -122, 100, -94, -112, 75, 92, -59, -250, -67, 49, -46, -113, -71, -91, 137, -194, -20, -29, -172, -127, 179, 77, -93, 145, 86, -53, -41, -69, 1, -236, 93, 96, -236, -91, -289, -83, -16, -38, 72, -36, 75, 210, -225, 269]
5441B69k93R3K73m42K37k36Q4j50R1K09j02L16j69J67q7k63o4K32k0r9onp4L38
5465B99N6l36j12J39K7r6L57l53J79j59rK05k19P6J37j11M2k76J59m7J8K50l00
5488g4j97K20Jk6k00M56J59o12O02m26M0j54Q7m6k58M86l00M89l70P4K04J5M9
5511B19q8q4k7j14j0o3N2mL02l67J67j37J38L53n12L4K37Mp2L73o15J40P5n1J7
5536c3K77o3k20j14m1K43k69K76j79j10K31K58m10Q2K10J51k58j79K40J70r0L6
5558B08l56R8M00k54Nk30J3k4jK45j82J27M6j26j12j16L11j42J88j18K2n0K09
5581A61q0J10k85j4N92n23J86k65J6K65l93L03J33k72m1J12M5k17K02Lmo6p9L99
5605B88m04L59k21J89j69m6j44L27j01j66m1O6J39j13m2K94j73J12j79k69J85
$$ y = [269, -24, 69, 342, -100, 137, -99, -15, -165, -74, 135, 33, 349, 180, 347, 260, -3, -67, 165, 145, 46, 40, 35, -39, 299, 355, 19, -93, 46, 73, -23, 334, -19, 160, 1, -8, 197, -22, 54, 191, 80, 122, -154, 5, -42, -24, 226, -74, -271, -51, -50, -76, -276, 180, 339, -273, 329, -97, -57, -211, -124, -170, -428, 58, -242, 247, -123, -49, 155, 170, 219, 131, 47, 20, -94, -104, -167, -115, -119, 183, -184, -17, -154, -16, 337, -175, -141, 96, 100, 28, 401, -214, -74, 1, -50, -33, 244, 181, -39, -153, -194, 49, -220, 56, -123, -233, -2, 256, -154, -72, 138, 289, 31, -148, 92, 262, 172, 208, -148, -50, 350, 96, 101, -129, -116, -140, -141, 104, -78, 49, 95, -31, -143, -259, 52, -90, 98, -20, 2, -48, 161, 81, 191, -94, -108, 484, -39, 147, -118, -102, 163, -230, 73, 206, -66, -107, 5, 50, -167, 35, 38, 34, -32, -111, 288, -116, 243, 22, 211, 42, -4, -148, 179, 78, -88, -129, -63, 76, -37, -79, 215, 42, 154, -25, -294, -109]
5626a09R1K9N6k19K0M6J38q2J06k6P1q5j82L98m30P9R9m1J52k48K56j75R1K4p1
5651a2oN4L8j33j30l8K8J28j90L56j7j77Q4J19K1r9l65K21J34l3l6m0M7J60r2
5676B2K53j71J7j01j24J88k46l7l4K30N5q6J58m54M53K03l68j09K93m2j11j5j25
5699a51J90l4J87k13K0P9q4J00m4j19j53L33j30j1Jr5k20K08N37m86kno9K85q6
5724C8L0p5m19J93l0M13o7j83j17M49j07Q0r0j54O0j34M66l69J17j72R2P5k34
5747a38Q0J39n3Qq2J38l31M07J6q7r0QO4l92L20j60L84l53qJ74J88k70J34j48
5771e2J08k62K12k62J74L26l52P3K34p1K7K38o57K37j3J35N0M6j37j25K7R8N8
5794A12l15L13m1oK7J03n49K74K9M74m28M8j86N8R8j04K06o8j09L52j51j4k55
$$ y = [-109, -18, 11, 67, -152, -132, -86, 52, -30, 76, 50, 121, 36, -146, 252, -178, -99, 0, -41, 111, -137, 119, -56, 35, 59, -12, -18, 36, 74, -59, -189, -227, -199, -71, -261, 95, 78, -99, -15, 104, 125, 26, -339, -118, 16, -17, -53, -93, -46, 114, 22, 275, 104, 121, 20, -104, 84, -162, -199, -233, -3, 52, -34, 124, -330, 123, 326, -42, -151, 142, 100, -11, -26, -151, 39, 5, 192, -21, -1, 78, -6, 94, 50, -69, -222, 111, -19, -30, -29, -124, -344, -136, 401, -85, -87, -92, -161, 124, 38, 68, -7, -426, -233, -263, 150, 83, -100, -217, 232, 125, 205, 115, -39, 21, -113, 353, -16, 101, -71, 21, 96, -138, -58, 81, 28, 36, -46, 92, -239, 168, 184, 97, 7, 15, 79, -313, 7, -153, 231, -122, -130, 44, 232, -38, 96, -52, 56, -206, 6, -256, -82, 244, -108, -35, 199, 128, 155, 393, -264, -27, -40, 95, 145, 191, 54, -71, -44, 54, 112, -203, 110, 69, 63, 90, 193, -356, -82, -53, 421, -7, 41, -145, -87, 11, -93, 113, 45, -64, 288, 137, 123, -132]
5817a32J61K44j34o3q4M4J36k22j3L48l02j02k2M27l40M44k82k1l1q5QJ39k67
5840a49R3J28K24k05O9m64O5L35j98K33k42O5k4K87l64K61m0p8J60j47j96K51
5862F4J91k32r6r6K72m09N84k79J5m9k12L33J33p7l16K37k65oL26r9QqJ77k06
5886a0J3J25j65j04J08j14Q9K40l50K65N6l99K08l6L27l07M6J54m48L84j40NJ40
5909H7m08N18r6j41J65o8j08k5j5J98m8k23K53j52Q4k3J06Q7p5l47J58j61L02
5932F8n3j45R7K2Ok7K32l05K8m0K28j55j78J93J38k53K68O1j77j4k24M2K93k89
5956a84J47K51l12K19k98J58K25n4J15k87P4m3J85q3o9J21j15l2K49k58k20K83
5978G2j55k3K05j14j51m5J74L12l41J48L69l98J52K1k47J54r7j21J71K5k86L47
$$ y = [-132, 29, 273, 139, 76, -8, 36, 172, -50, -63, 285, -17, -119, -141, 286, -54, 390, 108, 87, 56, -29, -21, 118, -149, -56, 72, 296, 91, 160, -304, -239, 96, -102, 131, -111, -46, -70, 217, -147, 114, 74, -4, 156, 9, -187, 64, 255, 23, -73, -169, 103, -306, 278, -1, 14, -35, -247, 86, 219, 142, -174, 63, -202, -208, 118, 19, 27, 19, 196, -10, 3, 128, -37, -141, -33, -147, -58, 182, -168, 97, 153, -246, -38, -74, 253, -54, -8, 146, -302, 82, -58, -53, 87, -321, 197, 101, -40, 125, 57, -51, -76, -91, 107, 59, -164, 89, -63, 21, -2, 104, 191, 116, -231, -73, -234, 68, 15, -130, -33, -11, -5, -32, 200, -105, -77, -117, 111, -44, -222, -29, 109, -144, 124, 185, 8, -6, -230, -188, 105, -184, -37, 214, -98, 121, -177, -19, 206, 152, 267, -20, 54, 11, 196, 113, 44, 165, 50, 18, 267, 9, -211, 72, -83, -106, 99, -15, -166, -211, -37, 275, -66, 82, 451, 53, 205, 226, -21, 133, 36, -85, 86, 111, -175, 172]
6000A72j11r8J87m01L88N1n08L88r8L95m48R4l17N96m86K22P0k09L0k8J40Q5l5
6023G9q9j69J18QL73j04j86j06J46r5L54k38O6l23J02J10k9M4Nk01k34q0O30r0
6047I1r3J73j78j1j93J45K83k73M1J2J45L2j41j21P2J53m95N72r4k7N9K3l3l02
6071a60J28L2q9K26k22k5lo7J70K50l11N5m7Q4k6J22j1k07K73k0l38J44k32L24
6095E0O4j28J63L3k14K95l43L34k71J86m03M7L13n3J10l39L7l9K69j81Q0j16K73
6118A67j69%M8r5q2L19k03o5L9k10L94J54m41j64M54om78K20M00l11p2N9k22L80
6142A16k90K7R2K23j55J52j79j38R3J12j75J49J82j72kp4K77l5K22k72j31p4J0
6165d2K6j26K58n10M88K31m04o4N5o2J90J8k57K41o2N1R8K7l31O1k40R5K01J12
$$ y = [172, 61, -37, 150, -251, 137, 188, -320, 68, -30, 365, -83, 11, -306, 290, -196, 26, 96, -113, -83, -111, 29, 114, 79, -10, -179, -61, -53, 320, 216, 30, -76, 70, -25, 329, 91, 157, -166, -64, 46, 17, 61, 66, -135, -369, -449, 181, 91, -2, 171, -7, -18, -211, -66, 217, -56, -15, -3, 142, 174, 33, -88, -16, 137, -358, 214, 120, 93, 152, 175, 142, -160, -32, 0, -89, 137, -85, -110, -113, -180, -10, 240, -71, -16, -63, 21, -5, 117, 106, -101, 172, 152, -186, -42, -274, 50, 114, -14, 149, 182, -32, 263, -80, 254, -17, 169, -234, -187, 126, 73, 183, -156, -119, -158, 111, -70, 10, -106, 167, -2, -2, 46, -49, -131, 188, -15, -80, -41, -251, 143, 297, -144, -308, 146, 140, -338, -118, 282, -29, -101, -42, -264, 116, -174, -147, -55, 168, 13, 165, -14, -152, -59, 53, -122, 27, 209, 37, 35, -39, 238, 203, 425, 153, 22, -52, -42, -16, -142, 116, -394, 94, 325, -79, -143, -88, -150, 40, 58, -199, 42, -20, 31, 129, 156, -175, -114, -354, -259, -58, 54]
6189E4J17m20J64j51k1J80K67k14k9k49L14M4J37j43q7L9j34K44r3r9j43K71o8
6212b0J43j81J9J00j99m6J4J32K47j80Q3k58M63k15k18Q9J80k51P2p2K27k3k79
6235a73j05O64n96K18K6k94M63m36J83J74q0J69k47K85N2l78J48N3k48J69j89
6256a42Q8j42K09q0O2l3j60L62k81oJ80j83Q2K55m28L29j55K25j60j64K73j77
6278d6k03M87m9l77k12N55j48q5r5M7M5J26k43L33j68J7j52L11j85n5q4Q7K51
6301A57j37j8J37k01j12K98K3j73Pl1N1m4k91K20K08O7j50j96L66l28oK13J38
6324A98r4k2l50L98k53j17J23l2J82p0K92O2j65j71Q6o9j42L47j15k70J85n6j88
6347b41M24j73J92j63mQ6j23j90P6J34n6J07J43j12m68M56q3J44j95J93j40K2
$$ y = [54, 171, -249, -85, -236, -257, -77, 190, -24, -53, -302, 12, 56, 193, 50, -37, 2, -132, 112, 19, -80, -223, 48, -20, 123, -58, -39, 61, -138, -184, -170, -38, 209, 29, 112, -146, 317, 102, -116, -27, 153, -98, -26, -98, 129, 106, -173, -278, 386, -210, 8, 34, -260, 203, -233, -50, 124, 44, 213, -34, 251, 303, -75, 73, 126, -122, 47, -142, -54, -196, 13, -67, -5, -38, -198, 164, -117, -123, 57, -126, -44, 211, -217, 112, -43, 182, 22, -142, 131, -46, -249, 238, 189, -188, -400, 155, 7, -78, -173, -126, -81, 45, -198, 135, -33, -16, -168, 143, -42, -97, -181, -94, 157, 20, 2, 139, -62, -174, 124, 147, -26, -19, -50, 1, -43, -334, -114, 94, 161, 11, -185, 181, -147, -153, 60, 198, 104, 82, -268, 130, -123, -240, -117, -149, 33, -37, 255, 317, 152, -19, 67, -2, -144, 203, 88, -182, 3, -53, -241, 183, 10, 202, 39, 35, 121, -2, -192, -116, 18, -38, 69, 212, 100, -368, 88, 5, 149, -46, 147, 7, 29]
6369B9K79k87N4LK26p27O81j69q4l7Q5N6q6J43k00k5K69j51J12j07P3l07l0K76
6393G6M1L5k65J27n2Q4M0Pk35J93K08j18j66J63J58l11J21J8J38j71k33M31l34
6416d5J42J26n34L98j98L06n61M25O5m42K26J58k77q8M22m58N70k41K4M6j26P
6438e5J22j77j9R0pM10m58R0L66k38n6J69l53j68L97j75J84j33j44L23j80J64
6460A52j51O6k06L99l04Rk8k7J27j59k0L82k1m05J52p0m3K20q8k3o4K43l73M30
6484A98K9l34J05k0k98L7L36N5j18l6N5j56K36j83n2J14RJ76k36J34n1n9K8K22
6508A91j37j35J06J68j43j0M9j69l8l5K57l40L22j87K61k31K9O2Q1K28l33K36
6530B32j98l40L62o6P4RK94j53N9o20K68R8j48L62L3k66k06J39R7J05K30k71j17
$$ y = [29, 308, 21, 75, 78, 304, -423, 258, 89, 5, -32, 53, 109, 23, 166, -34, -59, 210, 59, 171, 64, 137, -170, -200, 76, 117, 152, -113, 14, -38, 46, 86, 93, -142, 51, 259, 141, -25, 138, 296, -15, 106, 124, 262, 91, -142, 289, -45, 97, 223, -311, 87, -111, 195, -366, 59, 124, -318, -92, 66, -211, -299, 123, -335, 235, -6, 18, 64, -62, -55, 67, -110, -129, -39, -46, 364, -94, -4, 362, 124, 68, 237, -116, -284, 113, -62, 122, -11, -155, 168, -12, 152, 1, 67, -139, 260, -44, -35, -63, -90, 37, -122, -142, 240, 219, -186, -34, -104, -147, 73, -15, -38, -102, 141, -232, 198, 227, -107, -2, -22, -320, -283, 53, 108, -10, -46, 9, -147, 89, -94, -146, -32, -23, 153, -83, 51, 0, -59, -31, 191, 54, -81, 25, 193, 50, 40, 89, -80, -118, -153, 104, -236, 86, -101, 160, -71, -42, 20, 101, 329, -4, 232, 34, -306, 56, -10, 64, 73, 367, 214, 273, -347, -79, 19, -129, 233, 266, 0, -206, -67, 30, 135, 365, 94, -23]
6553b3j80J37J04J9k22n4K18O4L3j81L2p6K38j94L98l26n5k25M8J22L9Q7p3Q1
6577A1K03j09l1r4Q9R6O7m57NL17J74p2l81J66k17K85k97L45K45m45L14n7q5j64
6601i2j40L62m1j84L61l07o0K75j16j40j10l0L49r9j80J00j26N62k01k9p2O0M0
6624A82j47j11MJ05n7J14j61J16J28j4j51p4N4J10L5k40jl2M98l45J66k42N6j70
6648a77P3J59n04K54L34Pl5R7k2k79L08R6m00J73k11L02j60j09k27L02m8j04P3
6671i8q4L76l51K80j48qK13j51N7l41K43J64k81J60k56M46l05j21Q6j37J82J65
6693I1q5j31J44M4l17O08k86k3j59O3N6l38N09n02N38q6k15L0L38j80l41M71j95
6716C4K14o7j43K60r6k47K80k40j2J16j68M0K36m55J66K52k28p7pj01J96K91k51
$$ y = [-23, -203, -66, 38, 57, -165, -219, -1, 63, 96, -85, -53, -129, 109, -85, 313, -13, -68, -293, -245, -123, -84, 3, -70, 11, 214, 105, 74, -20, 69, 165, 232, -225, -220, 97, 271, 199, -182, -16, -233, 52, -245, 100, 345, -100, 214, 157, 72, -92, -232, 130, 89, -95, 266, -41, -101, 174, 58, -82, -192, -222, 127, 28, -152, -52, -178, 384, 183, 154, 82, 142, 182, 35, -76, -72, 33, -24, 90, -71, 45, 173, 159, 8, -66, -12, 98, 133, -107, -108, -140, 358, 13, 179, -63, -7, -177, -104, 55, -449, -195, 139, 146, 111, 208, 186, -93, 215, 311, -89, 84, -127, 175, 15, -94, -321, -19, -67, -171, -98, -182, 194, -157, 123, -25, -33, 180, 29, 86, -255, -12, 152, -129, 31, -225, 221, -84, -205, -119, -256, -74, 91, 6, -125, 19, 63, -254, 354, 68, 45, -114, -51, 5, -333, 176, -326, 212, 126, -89, -59, 279, 99, -242, 229, 34, 248, 181, 38, 298, 202, -45, 235, -5, -17, 99, -69, -29, 207, -248, -82, 170, -58, -135, -142, -243, -47, 244, -7]
6739gj64M50l16rQ9j30K69l75Q6L0m5J84k09OJ82JJ38Q3k11o6R1K27l05j09J27
6764A7k60M34j25J95j17k61M17k24J00j09k20K02q7j61Q6N0K24j60J40m6l81L59
6786G3k14J18MK10k57P6J56m87M02j43p9J4j7J83j87K19K9j15j10L38j84j55j2
6809a38K67J25p6j16l63J91J60M9q8j4k58L04l3j35K21l57M03p2j47q5k6O8L0
6832i0J27o2j88J4L53m2k03K23l44j7L63N8j85k14K42j30J34j06k7M07l74L70
6854C09j70k78N9M48n20K61k06j40M8L64k13o1J55jm7N3J5k4j49J06Q6Q7j31j05
6878e4J74J35m24P8J07k75L85r6k8J07j02J34n14L11j58K33j37O9N5k8K97k60
6900Im3N3K0j24L6q8Q6K69q5k19K57j44j45N5l0K14m82N67j70j92K37k21J71j47
$$ y = [-7, -171, 279, -37, -46, 43, -87, 182, -193, -107, -77, -122, 62, -147, -141, 41, 42, 180, 263, 52, -14, 77, 304, -1, -110, 17, -243, 191, 66, 261, 144, -117, 300, 76, 176, 67, -153, 49, -38, -199, -113, -63, 161, 1, 141, 95, -286, 73, -141, -23, -19, 191, -66, 10, 166, -321, 81, -62, -141, -127, -144, 39, -148, 71, 100, -15, -125, 213, 29, -126, -138, 129, 254, 178, 62, -301, -110, 50, 99, 11, -3, -261, 43, 10, -125, 96, -261, 142, 70, -77, -162, -188, -120, -90, 37, -25, -213, -199, 154, 112, -91, 132, -212, -229, 134, 192, 7, -207, 35, -95, 39, -67, -94, 313, -61, 309, 139, -139, -80, 368, -152, 109, -97, -237, -189, 175, -38, -99, 56, 55, 8, 61, 76, 52, -97, 9, 95, 182, 51, -54, 120, 255, -169, -91, 16, -259, 126, 30, 2, 109, 7, 141, -373, -62, -220, 13, -124, -55, 0, -28, 269, 9, -34, 19, 39, -85, -49, -137, -51, 218, 133, -86, 171, 27, -118, -63, -93, 121, -361, 206, 36, -156, 81, -140, 31, -116]
6924a16j83M56k85m0l0J83j13q0M55m78J89J64n4J94k83J36j7j97J52k96L85j02
6946D0P0l59P8K24r2N5k17L12k25L9K99n4j17J66l88J88J98j76n15N12K5M9Q7
6969A99j95P1m1j96L05P5k64K6l4J04j57K56l02P5J97m16J15L79N3m09J0J81o3
6992c1l1J22r5M2K32q6k28K57j68O1J57n52M47j93K54k65K18l51J22o3j21J99
7014g3K63o8P8k34j55k6M13k12p0p3L33j10p6j61R8J97k52N6J90m74L24L03l3
7037B38l66L6k84L19J46K6R1m26K51L7J81l57O3K22j73J67j64p1j03N11j74j61
7059Ij78K51k62J38k66J24L9j44M93k19M5k9j36N9l1j1J04l34M16j93K6K28j75
7082d6J46j57K51k27J89l89K76k74l3L01m01M77k65K6R9K82j04m95N57j68J61
$$ y = [-116, -299, 157, -128, -168, -198, -15, -128, -208, 247, -231, -42, 122, 68, 262, -21, 115, 98, -99, 53, -243, 142, 40, 110, -249, -171, 53, -39, 16, -201, 111, -114, -75, 224, 170, 53, 219, -169, 19, 217, 41, -474, 38, 63, 112, 199, 4, 75, 34, -162, 143, 218, -46, -20, -54, 50, -107, 149, -153, -78, 119, -297, -182, 197, 250, -159, -149, 32, -31, -62, 60, -35, 7, 239, 153, -75, 182, 14, 75, 232, -320, 127, -66, 188, -77, 141, -210, -88, -151, -272, -73, 190, 122, 200, -34, -189, -215, 198, -14, -84, -157, 176, 66, -10, -171, -73, 124, -128, -72, 118, -356, -32, 271, 238, -128, -92, -376, -57, 89, 115, 206, -220, 31, 68, 249, -108, -45, 177, 4, 171, 7, -64, -167, 344, 170, 9, -169, 82, -180, -42, -308, -184, -145, -289, 204, -15, 30, 1, -135, -76, -107, -118, -14, -348, 68, -125, -99, 129, -46, 100, -57, 194, -33, 156, -233, 43, -231, -264, 37, -364, 113, -152, -126, -27, 255, 151, -344, 213, 45, 206]
7103B06m66M82m80M83l05K85q8p0j02j55L85l02J39j20M39l14J02j57j7P0R9k53
7125a39l3K00J54p8q3j14L38k29nj72L01j6k40R5m5K69j11O4j48j39J47J1k96
7148b69M57K90n69K99p4R6l74J53P2J3m1N9j90J40n4l37L81k6j30p2J20N8J03
7171A05R3k73J30J09J44l79k60L46J85r6n9J32j40j73o1m2l1N11l0j91J65m35
7193b50J53L82j40Q4j3k77K14k74%k8L60l74L81r0k07j03K52k61R7J69j71K1J3
7216f2JN0J2p4P4p7K41j13j59J59j12j18J87k08Q2O8k03J56K07k24J48j04J06
7239C7n6k23J20j4L51l38R5Lp8j4P7J65k31K58j62j47K3R0j00Q1J02j47J45J4
7263E1Q7P0l17K18j55J86J9j37K16j72m29M18l4Q1k13J88q4J85j49j41N0K68J29
$$ y = [206, -260, 222, -258, 225, -80, 205, 117, 47, -55, -210, 175, -127, 12, -108, 331, 17, 119, -38, -55, 15, 114, -139, -172, 28, 182, 104, 21, -93, 245, 16, 11, -161, 140, 124, -116, -21, -66, 203, 92, 156, 8, -131, 16, 27, -269, 188, 478, -91, 208, 134, 230, -144, 9, 81, 94, 53, 112, -78, 62, 8, -329, 52, 26, -104, -176, -56, 2, 105, 198, -75, 55, 164, 308, -71, -331, 15, 200, 104, 45, 177, 37, -136, -197, -239, -270, 241, 211, 20, 185, -250, -97, 285, 145, 229, 216, -61, 153, -121, -121, -149, 211, -163, 218, 128, -79, -182, 70, -191, -94, 75, -96, -75, -62, -61, -11, 1, -73, 1, -76, 165, 52, -107, 52, -60, -178, 9, -199, -117, -49, -252, -96, 111, -113, 35, -69, 37, -19, -242, -122, -136, 215, -123, -28, -25, -103, -117, -40, 125, -106, 152, -10, -157, -134, -44, -144, -63, 39, -108, 37, 51, 138, 208, -109, 109, -46, 140, 159, 22, 238, 66, -363, 55, 21, 102, -111, 77, -7, 178, 29, -112, -62, 206, 335]
7286C35k54j54j19J62j6j46J26M2j42M81k13l8O9O7j46nj20J82j71J64k35K22
7308I1n2M8J62k82j94J63J61j55K3J99l32J27J06l7j55J16J96O7n58K76K16p8
7330A08j05N6J16J60k85j31K92m01K67n9n4k41M58j05p4k89L10J52J58k80j33
7351h0j31L96j75J74l37M0l9p0K2J11L2r9K29k21M18l21J22q9j36L51J97m51K36
7374A79j53P2mo2L43m70J23J9K62j72m2j09q5J90k06N4K57j83L7Jj4j8j70J65
7398A4J3Q2K06m24r7M6J19J24l29K31K9MM7j89K15p4m7o3O3J7j4Jq2K52j73rj63
7425b01j11L11R8j42o4L70k54K00j21J19L0l29J21q3j34O0K26n6j16L45m28K83
7447A24j22p2J01k36J84J80j26N1k7M7K6k47L5O1J98j55L73k54m15O18l09j77
$$ y = [335, 81, -73, -192, -30, -46, -192, -66, -24, -166, 315, 102, 64, 133, 200, 54, 49, -71, 111, -60, 104, -131, 91, 39, 87, 249, -33, -227, -64, 97, -58, -35, 164, -168, -41, 65, 28, -127, -11, 185, 252, -306, -30, 186, 108, 3, 59, 175, 335, 50, -81, 211, -190, 77, 18, -36, -277, 181, 76, 2, -287, 23, 175, 333, 53, -80, -211, 185, 10, 184, -153, -113, -152, -222, -200, -89, -57, -156, 73, -148, 270, -51, 71, -18, -154, 197, 394, -57, 179, 26, 98, 94, 32, 375, -95, 28, 47, 309, 137, 95, -14, -99, 91, -115, -61, 196, 13, 50, 51, 37, 19, -151, 14, 27, 109, 315, -109, -206, -160, -41, 83, -246, -15, 14, 18, 65, -124, 91, 17, -30, -93, -30, -13, -27, -26, -108, 144, -29, -38, -201, -312, -1, 97, -45, -109, 261, 7, 207, 86, 205, 235, -94, 27, -56, -190, -130, 96, 40, -76, 269, -159, 124, 2, -70, 31, -205, -21, 159, 33, 84, 57, 104, 130, -117, -82, -21, 177, 22, 395, 141, -274, 344, 35, -142]
7469a42J17m1O6J10l15K00m7K40j72j25J18J0k8k49L17K37l71o6r5J23j06K51
7491C2Q6N0k01J06k92Q9L57k61K82j79k00j3L83j45M3j52J89j35k33J23k5J80
7513H4L8j03J47J26q7J3j08l25J78j7J54j86k76L65O7P6r5j79J53J08p3Ko3K13
7537B12k50J14j10p7K19k89L62q9j46L7P2r4k19O5K57j29j09J79P7k45M54l95
7559a04q0J00j12J22L20j98k80N41l01o5k89L39j44j37L55J99l06J80k53q5J34
7580f4k9J89j74P3j53J70K7q9P9%l09O87q7k44r0M3J02q7J50k50K04r6P2K23l04
7605D3j03K14k09O5k25M13J8j04K0l16M77m80J03j07K05o0j1R9R0k67K11j88K60
7628A48j64J10L9j80Q0R6J69k42p8k57O61n16L11k40l62L12K14j7l9j82k5K63
$$ y = [-142, -25, -66, 0, 110, -205, -5, -52, 188, 16, -109, 9, 19, -9, -258, 59, 296, -75, -141, -236, -113, -219, 32, 118, 168, -33, 73, -219, -130, 227, -34, 248, 69, -131, -144, 239, 94, 137, -15, 174, 39, -194, -71, -96, 84, 122, 19, 166, 292, 205, 218, 110, -215, -37, -54, 100, -86, -362, 3, 70, 146, 51, -128, 25, 133, 60, 62, -1, 212, -38, 76, -34, -111, 108, -181, 181, 92, -54, -17, 55, -39, -258, -193, 64, -65, -174, 5, 82, -163, 291, -104, -184, -84, -196, -74, 246, 48, -232, 309, 8, -57, -346, -7, -151, -288, 67, 266, -40, 140, -113, -198, -64, -93, 96, -78, -5, -158, 12, 39, -50, 29, 29, -280, 407, 320, 76, -14, 29, 131, 44, 194, -56, 148, 52, 124, 347, 43, -60, 154, -55, 10, -215, 198, 216, 112, 132, -184, 293, -187, -84, -191, 14, -46, -57, 42, 132, -135, 76, -112, 148, -16, 94, 133, -47, 33, 129, 298, 56, -22, -279, 382, -134, 177, -63, -425, -113, 101, 84, 45, -137, -162, 101]
7650A01j39j45J35j92M05o5k08J43j20J38K47k04q3k19J88Q0l5k34Q0L24j94K51
7672B54k01q2N3l01J78J53m8R4k75J36L4n5K34q8k06O7K4M9K15k65J58j48J22
7695A02m4l43J33P4J16l68L05q5P1L73k40Ll01M32m33N33l99J88p5n6K36l82q1
7718b41l5K89J60k06M44l84L9j78j71L53Q2j75L5l08J80K68l32Q4J60L0j59Q7
7740B2j00r0K63l63J92PO3q4l2l4l1N9q6J48J05j03M8j32K74n1j16K56k61j07
7764a53J26K2O3j33m5Q2K00l40P4J89j38K37r4m67N38l08K3M36k05p1K7j37J77
7787A03j92J56j19j76M19r8j08j00K65r9Qm2j4j5J75l31mK54p2J65k28L34l94
7810a13M3L67l98K10j91MjJ05J54j08Ok22Q4jJ49k65P0J61l31L20P9j85J89l21
$$ y = [101, -38, -183, -48, -240, 165, 100, -108, 35, -85, 53, 300, 96, 13, -206, -18, 62, 27, -207, -127, 197, 3, 254, 53, -29, 24, -277, -99, 54, 6, 100, -175, -39, -5, -60, 174, 86, -120, -53, -29, 20, 235, -30, 128, -20, 102, 58, -285, -152, -78, 38, -330, -25, -110, -39, 334, 94, 97, -204, 228, -205, 328, -71, 117, 42, -14, 222, -160, -241, -276, 13, 173, -33, 411, 27, 66, -112, -283, 70, 152, -23, 12, -296, -116, 152, -180, -96, 64, 94, -65, 22, -78, -168, 95, -268, -76, -69, -6, -90, -122, -156, -187, -128, -214, -66, 39, -64, -16, -148, 126, 75, -41, 215, -46, -153, -27, -5, 58, -75, -120, -38, 162, -178, -104, 85, -53, 184, 90, -377, 161, -147, -124, 312, 107, 36, 63, -74, 103, -89, 67, -52, -228, 191, 93, -15, -115, 150, 51, 59, 17, 3, -12, 163, -168, -172, 82, 10, 175, -53, 281, -113, -70, 297, -101, 109, -82, -78, -79, 26, 180, 72, 78, -144, -60, -61, 88, -177, -107, 54, -277, 43, 122, -63, 126, -195]
7834a95J4J74R6L07l97p6P8j86K84p5j46J83p7O5nM9j07m23K70L3Q3J63k65K20
7858F7k83K20J26j87%J83K35l72p8o8K98j08m5j52J54L37l77m4j86L94P5j36Q
7881F1J61j00lL0J72m89J87k13K17kJ82r6l63M24k48n1J4J4J70J09l86J35j68
7904b43K96m2j63L41k99J66P9k36L28l26lK96k14J33l64M16k39O3j18K20K96j48
7926B39q6m3q4k44L42k65J44k43K53J63j1k10P0M7l20P4M3J23J34j1k43Q9l17
7949c56L19l6N0R6n7Q1k9J09m60K48J80k58K62j33L7R7k34J63j95K34j69M9N1
7972D9k16J51L14j68l8j0q6O8j53K32j38k23J60M3m9J97k1j07N0qm3L12l08qK08
7997B08k38P7J62j28k04J37J09J9j40M8j72K33l27L78J3j80L6j75K95k78j26J01
$$ y = [-195, -181, -7, 89, 396, -1, -77, 1, -185, 99, 24, -122, 61, -16, 49, 44, 93, -14, -437, -167, -134, -51, 112, -153, 67, -216, 4, 130, -57, -57, 126, 361, -11, -89, -157, 141, 33, -12, -164, -10, 327, -50, -94, -280, 114, 189, 53, 61, 222, 122, 119, 149, 321, -168, 19, -194, 23, 21, 203, 107, -256, 168, -80, -131, -117, -103, 67, 176, -210, -75, -243, 53, 11, -152, 189, -110, 56, 135, -101, 227, -99, -102, 194, -20, 113, -251, 165, -74, -11, -129, 91, 387, 239, 153, 110, 26, -218, 124, -141, 3, -240, 13, 176, 165, -45, 25, 72, -248, -174, -131, -8, 126, 115, -128, -39, -356, -37, -73, -23, 73, 16, 97, 68, 177, -283, -35, 145, -113, 149, 16, 53, 150, -84, 79, -116, 118, -51, -2, 49, -167, -16, 298, 130, 92, 82, -4, 64, -89, 143, 5, -218, -58, -15, -64, 133, 112, 5, 55, 47, 4, 316, 8, 0, 208, -30, 47, 209, 81, -123, 14, 123, 142, 2, 50, -122, 111, -216, 162, 175, -5, 31, -144, 151, -127, -253, -152]
8019a52J14j19n1K31k00J5J32J44J6l35O8M4K59Q3l52k58K17K32k20K6Q0j9lO8
8043B0q7J80k19K6J66k81K19J90m19M0J28k63M39l10Q4k05j01O82n26J37P3K13
8065A86m02L48q7J25k25J74k51J77K8r4J09N7j48K8j29J49J30J96l19R7k39M1
8087d9j2J90N5k44P4J15m5k09J72J20Jl72J79J63q8k65M2J56j34K36J74k74L0
8110A5j8j77K41k20o2K55j59L9Q9j75l5L17p9R9K97l75j92p7K02K58j73k58K76
8133H8j98K71k53R5Q4k40N4K77O7j44o7O5k06J66o5Q9O6j79N0M85l84K34n8k58
8157C9K57k40j03m11O39k02K41l21J8J45j05K2o7k74K33K18p7j57lM6N9n6K23
8180A24k41J84k00MO6J9r4J30J22L06m16
$$ y = [-152, -38, -157, -208, 23, -177, -162, -30, 114, 130, -205, -137, -93, 166, 249, -103, -361, -144, 88, -132, -106, -26, -45, -48, 20, -67, 113, -106, -80, 86, -195, 24, 214, -205, -165, -37, -300, 139, -171, -87, -292, -393, 289, -237, -100, -27, 186, -216, 132, 45, 170, -55, 119, -132, 45, 73, -21, 88, 145, -3, 25, -104, 45, 175, 371, 52, 149, -90, -49, -61, 129, 184, -60, 14, 129, 84, -125, 47, 167, 168, -204, -25, 138, 50, -215, -173, -17, -151, 85, 259, -15, 15, -3, -180, 61, -159, -221, 34, -125, -86, 3, -172, -207, 110, 31, 130, 427, 52, -140, -217, -15, 243, 70, -188, 88, -110, 161, -92, 3, 87, -153, -99, 178, 245, 101, 34, 99, -107, 59, -6, 83, 149, -30, 20, 505, 121, 355, 297, 39, 296, 56, -47, -458, 181, -21, 220, -101, -83, 62, -43, -21, -88, -362, -129, 89, 12, -145, -148, -102, -43, -99, 124, -117, 67, -133, -129, -63, -44, -138, -8, 114, 420, 4]
8191D
$$ Imaginary data points
##PAGE= N=2
##DATA TABLE= (X++(I..I)), XYDATA
0@%%%%%%%Qj6J6j6K4l2L2m0N0n8P2q8J04j21J42j65J89k18K50k86L26l70M19m73
31b51N31n96O67p45Q31r24J027j140J264j401J553j719J902k104K335k595K887
48A522l222L610m067M613n277O106p182Q634j0714J3968j9817L3584j23050r8828
62b00120K15284M262j72691q2913J55412J03686l9613o4612k4380p5267l5336
73b16288R2226J11445k2816o1932M916K1660k4477j802K1067k2297l6891M5849
85h9340Q1067K2893j0459N503k7526n6139J1307P3579J5086l4380K7068O3158
97H1817j3496m2766K9847L2741n9300m9567P5240R1453k0089m9530K7630L0147
109A34127n2531n4221K4563L8013j4550j2965L6937L3540j9969l9360j6700p662
$$ y = [0, 0, 0, 0, 0, 0, 0, 0, 8, -8, 8, -8, 16, -16, 16, -24, 26, -32, 40, -48, 56, -65, 77, -88, 101, -117, 133, -153, 173, -197, 222, -251, 280, -316, 351, -394, 437, -487, 540, -600, 664, -737, 816, -903, 999, -1105, 1230, -1365, 1522, -1700, 1910, -2157, 2456, -2821, 3285, -3897, 4737, -5977, 7991, -11826, 21758, -101292, -200120, 15164, 19426, -153265, -236178, -80766, 22920, -16693, -81305, -105685, -180952, -216288, -124062, -12617, -35433, -97365, -92449, -70789, -95266, -97068, -76001, -98298, -135189, -89340, -8273, 14620, 4161, 9664, -17862, -74001, -62694, 10885, 25971, -8409, 18659, 81817, 68321, 25555, 55402, 88143, 28843, -20724, 54516, 145969, 125880, 76350, 103980, 134127, 81596, 27375, 51938, 89951, 75401, 62436, 99373, 132913, 112944, 73584, 56884, 49222]
121D9222j7745j1147J3677K3863O133j4617j3171n302j7859l4192j7883J3358
133b5663J4207l798K052J6193n984l9062k9353L027M254j3235m307K2401K1917
146c7351k429j8909j3828l040l859j1836k243K5724L1283N15j7735N296J2552
159c5860k3158l2155J7439M0702K053j2885L1659L9629j8377l9657R590K6654
171E634j4362j5493L4619L8370q281j4133J9113P595k8478j1984K7345J8195q987
184D9153O240K5945K090k5351j1246M467n906o526J1108J3413J288L269M157j7016
198E5085k5205j653P077j3421j0602K2572J9638k0757k5126P190K118l3061k2559
211c8704K1894J9177j7481j0148K0186M091l3148k1008J2103K772j9178N58K4788
$$ y = [49222, 31477, 20330, 34007, 57870, 64003, 49386, 36215, 30913, 13054, -21138, -39021, -25663, -11456, -15254, -13202, 2991, -2993, -42055, -71408, -68381, -64127, -77362, -81669, -59268, -37351, -39780, -58689, -72517, -75557, -79416, -91252, -93495, -67771, -36488, -35973, -53708, -48412, -35860, -59018, -91173, -73734, -33032, -30979, -43864, -12205, 27424, 9047, -30610, -21020, 5634, -8728, -24221, 10398, 48768, 40487, 26354, 45467, 53062, 24584, 12600, 39945, 58140, 49153, 55393, 81338, 83428, 58077, 46831, 51298, 45392, 38866, 49974, 63387, 64675, 67944, 72101, 55085, 29880, 28227, 35304, 21883, 11281, 33853, 53491, 32734, 7608, 14798, 16916, -16145, -38704, -16810, 2367, -15114, -25262, -5076, -985, -34133, -55141, -43038, -40266, -59444, -58886, -34098]
224c4098N194j9141n788R581r405j9262N844K1470M108m085J0486J0038j1058
237c6116j4415J339M223r03Q765J9390Q607J470Q808M055j4984r898J4906J2969
251H216o744M530K9010J2408k0415j0356J6474K802k0217P86K9727J2716j3307
264D5630p50J5380p420k3840l125J4444M07o594J1041J3484r083j6783k962l097
278B6732j3744o219J0308R028j075j192j4j0195j4678r063o669n633M449J0960
292g005J324n521J61k68j5892j8076K348J1038k206l768J1576J2275r614j7989
306d1617k175M422n409m673J1006J8272N057n149j801L64o289r260J162J1979
320b4111J1498O470O977P783k171j0957o469K253K040J686J0806J7474P993n237
$$ y = [-34098, -28904, -48045, -53833, -44252, -53657, -72919, -67075, -45605, -41497, -45582, -35096, -25058, -36116, -50531, -49192, -44969, -45872, -37107, -17717, -9110, -7640, 1168, 5223, -9761, -19659, -4753, 8216, 1472, 6002, 35012, 47420, 27005, 16649, 33123, 35925, 15708, 16494, 46221, 58937, 45630, 44880, 60260, 52840, 29000, 25875, 40319, 40726, 34132, 45173, 58657, 49574, 32791, 29829, 26732, 12988, 6769, 17077, 26105, 25030, 23838, 23824, 13629, -1049, -10112, -16781, -22414, -17965, -7005, -5681, -11202, -11041, -11309, -27201, -45277, -42929, -31891, -34097, -37865, -26289, -14014, -23628, -41617, -43792, -39370, -44779, -49452, -38446, -20174, -15117, -20266, -22067, -21703, -27992, -37252, -36090, -24111, -12613, -6143, 834, 8617, 6446, -4511, -10980, -8727, -6687, -5001, 5805, 23279, 31272, 26035]
334B6035k797O15o353j0524J82J2375R744L666L442K985l358r179q846m397K344
349A5934P531N901K298L201K646q404j6137p688K326p29k822P377J3232J34j1952
364A2848o513k975j1518j1206K975J0264K621J178N414m40j2963j2783k627j299
378b7024m585L345J2742P801l270m857j308o287r741l474N072Q253P051M848J821
393i613j620m092o436o380k69Q210R767N678M914N134J4q608q197j289L267M266
409e254O948R585Q418K273l058n874n839k868P24L744O862Q404N791L17m594o193
425A9386n054l228n60L116N679O428L271j667n767p032n135m395k189K866O619
440A2338M572o03l377m808o675q019n246J014M695M420K612J78k221m641p933
$$ y = [26035, 23238, 23853, 17500, 6976, 7158, 19533, 29277, 32943, 36385, 39370, 36012, 26833, 17987, 13590, 15934, 23465, 29366, 31664, 34865, 37511, 29107, 12970, 5282, 7608, 6879, 4057, 11434, 24666, 24800, 12848, 6335, 3360, -8158, -19364, -16389, -6125, -3504, -2326, 3088, 2648, -10315, -23098, -25725, -27024, -31609, -28264, -15522, -7721, -10991, -15848, -17156, -23443, -33184, -36658, -31586, -23333, -16282, -11434, -9613, -11233, -15325, -21761, -28141, -28410, -20200, -10433, -4755, 159, 5293, 5307, -3301, -11498, -12787, -9520, -5254, 1694, 11279, 19697, 21970, 18912, 13038, 7199, 4331, 5055, 8799, 15661, 24065, 29856, 30173, 25579, 19386, 14332, 11104, 10544, 13660, 19339, 25767, 29038, 27371, 21604, 14572, 9437, 5042, 2853, 5719, 12338, 16910, 16307, 12930, 8122, 1447, -6572, -11818, -10804, -6109, -1689, 923, 1101, -1120, -5761, -13694]
455a3694q375l442K629N137L302K192M268J041o638r057l112K446L12j26O664
470a6453Q875N19n237k350L75l136l571M828R164M077J043M202K174o342n922
485g754J873L358j36L555R833O549l595l620J207j281n747j161O162O159K619
500A8021J922J050k147l657l533l823j530N036N535K00j895L294O04r763q036
515A278L063L819m137j642Q031L678q375p116J417j104q125j414Q882L698m613
530b660p21M393m254j1661k965O129j92l794M317Q915l26p886k524K019l094m392
546a8696J830O829L623k85K07m55j439k499r89n34L558N546L279p41N06K248k259
563b71o222o81O476L544o25K581O733l09o864k159L291j161l691M843Q818M28
$$ y = [-13694, -22069, -25511, -22882, -17745, -14443, -12251, -7983, -6942, -13580, -22637, -25749, -23303, -22991, -23117, -16453, -7578, -7059, -12296, -14646, -14271, -17407, -20978, -16150, -6986, -2909, -1866, 2336, 4510, -1832, -7754, -5881, -2523, -2659, 896, 10729, 17278, 13683, 10063, 11270, 9989, 4242, 3081, 9243, 15402, 18021, 19943, 20993, 18846, 15189, 11656, 7833, 6303, 11339, 16874, 17074, 15179, 18473, 19077, 9314, 1278, 4341, 8160, 4023, 2381, 10412, 14090, 5715, -1401, 16, -1088, -9213, -10627, -1745, 1953, -2660, -3381, 1012, -3242, -14903, -17868, -11739, -11931, -15725, -11408, -2493, -2819, -10705, -13229, -11210, -14304, -18696, -16866, -10037, -6414, -6699, -6492, -6947, -8386, -10885, -11874, -12408, -8850, -3304, -25, -766, -260, 1988, -271, -6493, -7174, -698, 2846, 2221, 4802, 11535, 11226, 4362, 2203, 5494, 4333, 642, 5485, 14303, 14731]
579A4731m656K031L567o703q737L585P253j718l337O421O583n995q800N05K911
594G641m061m190N195N780j428l866n72j424m763k931M56J059J628L436J279l161
610G8l314j173l124m866L8M381K059l49J733K368l602n758r82J222j838o79O231
627g575N477k307l090K249K62o662l047O048O208j861m10O476L195o750n855L845
643c797L467l157p1Q542N097k954l429K078k12n141j146N399L431O1K876L517
659A4561l151n212p70R49l026j340O309M576k274j890K359k072p439j947L672
674C305k00j789M247M580m979n434K241Nq722l443Q682N013o184j828P425n92
690B327j0970l874O552n62n467M179Q476j872o490J825K787o678n482N529N784
$$ y = [14731, 10075, 12106, 15673, 8970, 233, 3818, 11071, 9353, 6016, 12437, 19020, 13025, 4225, 4730, 7641, 3580, -610, 4585, 10365, 8937, 5071, 4499, 3075, -1688, -4619, -4163, -3104, -1476, 1960, 3239, 78, -3236, -4409, -7533, -12399, -12361, -7980, -5921, -6270, -4537, -2169, -5771, -11529, -12511, -11289, -13127, -13806, -7575, -2098, -4405, -7495, -5246, -4984, -11646, -14693, -8645, -2437, -4298, -4708, 1768, 4963, -1787, -7642, -3797, -330, -3487, -3558, 4984, 10081, 7127, 3698, 5776, 5564, 423, -723, 4676, 8107, 8168, 11044, 14561, 11410, 6198, 5428, 6377, 3351, 2011, 8320, 12896, 10622, 8732, 11091, 9019, 1580, -367, 3305, 3105, 1316, 5563, 10143, 5164, -270, 1971, 1976, -6746, -10189, -1507, 3506, -2678, -4506, 2919, 2327, -8643, -12517, -5965, -6527, -11994, -7815, 661, -1211, -7701, -5876, -3089, -9767, -15249, -9720, -3936]
705c936k647M85O803M6o739j286L575k393m302N550Q053j248l039L496K016n803
721a369l617M403J924j976L130O828n01o221Q66L799m484n584M473P419r47l380
737D763L476K833n420n305J912J623k253O06M726K166l204j541J26j844m253k38
753a827K475J087L25J307O12j889l098j538m56j038J99K175J933l47j004l83j641
770c108k842r35J037J347M08J392K146m99l006j523P47j040j993K684M823J99
786a63k658J073K498l124m781J274M794n22j547L890L732k654l769J622J259k994
802b070r72N103K388k384L18L211j272m990J84L787mk183K622L740j818k814J099
819C945n6l079n38L503J102k125J183K796k476m270O31J887l002j479M179L040
$$ y = [-3936, -6583, -6098, 705, 751, -5988, -7274, -3699, -6092, -10394, -4844, 3209, 1961, -1078, 2418, 4434, -1369, -4986, -583, 1341, -635, 2495, 9323, 8822, 2601, 3467, 7266, 2782, -2802, 1671, 9090, 8143, 4763, 8239, 11072, 5652, 347, 2259, 3882, 1629, 2235, 6961, 9127, 5923, 4382, 4508, 2664, -1589, -1827, 648, 1735, 2060, 3367, 3979, 2090, -1008, -2546, -3002, -4040, -3841, -1666, 267, -80, -1084, -1467, -3108, -5950, -6885, -5848, -4501, -4093, -2701, -555, -1054, -4060, -5583, -4836, -5876, -7869, -5185, -362, -163, -2821, -1748, 750, -2374, -7155, -5881, -1087, -1609, -3156, 734, 4466, 1812, -1957, -335, 924, -2070, -3042, 2061, 4449, 2065, 2383, 5594, 4322, -668, -484, 3303, 3299, 1116, 3738, 7478, 5660, 2846, 3945, 3889, 810, 272, 3775, 4877, 2752, 3935, 6731, 4255, -15, 616, 2503, -499, -1978, 2201, 5241]
835E241l668k440L338j31o000j583M344J812l742L76L928p33m605p20K585j801
851c799k425K578L714j654k429J842J284l527k394J990K730q13q3K164R01j813
867a734j222O25p07p02K155J731J26o9J642N4k146j355J795Q95j126R47L611N3
885D573k287l56J309q19k744J112L354l5j329J179J592k046l258Q11J763j453
901A366o61K315J819k061j756J129o2l186j142K376J673j501j63J911o24k575
917a142j424O27j27r25J347J494k01o38o8m70k294l66J234L88l93J381J600o36
935f13j667m44O05j389m49J768K191m90r8J116j40k395r83J729O74o86J110K448
953B287M55j904o07Q87o92j745O11K596Q56r23K33J220j017j533q70O81O15J24
$$ y = [5241, 1573, -867, 2471, 2340, -3660, -5243, -899, 913, -2829, -2453, 1475, 742, -3863, -4583, -1998, -3799, -6224, -3646, 68, -1586, -4015, -2173, -889, -4416, -6810, -4820, -2090, -2903, -2986, -822, 79, -1734, -2956, -2331, -3038, -3740, -1585, 146, 272, 203, 1845, 1899, -247, -1602, 193, 1088, -38, 909, 4520, 4573, 2286, 1930, 3239, 2420, -324, 788, 4142, 4107, 2778, 3957, 5549, 3503, 245, 1056, 2819, 1366, 705, 3020, 4839, 2778, 1022, 2151, 2089, -1097, -2239, 137, 1810, 309, 146, 2057, 1433, -1142, -2566, -1939, -2066, -2991, -1644, -150, -351, -989, -1057, -1527, -3821, -4187, -2953, -2565, -2958, -1577, 23, -613, -2280, -2724, -2119, -3508, -3957, -2189, 2, -488, -586, 530, 390, -2005, -2988, -1259, -585, -1271, -161, 2287, 2742, 838, 231, 1118, 426, -1319, -708, 1888, 2744, 1821, 2054, 3274, 2257, 724, -146, 535, 1150, 1274]
971A274P57R66J2o69n15q69q56l7Q63P30j93P84L24p79j550o05p3l56m8P93J220
992A173J36k14n77o12j910J11J96Q25o83J105J548m64k238l53Q25j013j391Q93
1010b643K499j17o86J29P40j362j305J81J179m40N01J587N79q92p78j67j66q12
1028a973N67J197P15K30M93K89p09j260O6R2J80M26J074N32J00Kj98r84r80N85
1048D44R05j54M56Q71O95j330j050j77K44r95M6J138J078l16k67k83m96j057m12
1067f60K86J91J69M81P03n74o23o01m45o02l54P47N02N83L4p6l34m45j020l54
1087b392M06K50M96J24N08K82o32m14o11J56L72L43M62N19J96K31r44j53P1K4
1107g06l02N08J066M29L60o58Kj55p9o50N61M67O88j19L57J73q01m22j85l87J81
$$ y = [1274, 2031, 2997, 3009, 2340, 1825, 956, 100, 63, 926, 1656, 1463, 2247, 2571, 1792, 242, -363, -436, -792, -840, -47, 1173, 1309, 1095, 518, -94, -2004, -1893, -1697, -872, -1555, -450, 1098, 634, -1604, -1957, -1132, -2145, -3536, -2643, -144, -261, -947, -818, -78, -1440, -2745, -2564, -1385, -1825, -1324, 263, 842, -50, -828, -995, -1161, -1973, -1406, -209, 506, 736, 1229, 1518, 809, -451, -385, -293, -113, 313, 1387, 1919, 2019, 2021, 1823, 839, -141, 444, 1349, 1195, 1651, 2522, 3217, 1887, 837, 660, 904, -91, -45, 1093, 2171, 1855, 1588, 1305, 809, -248, -660, -374, -183, -14, 467, 1170, 596, -27, -628, -1073, -1675, -2029, -1282, -780, -197, -163, -239, -573, -1018, -2038, -2392, -1986, -1736, -1240, -1116, -608, -326, -958, -1372, -1983, -1827, -1455, -1112, -650, -131, 65, 296, -648, -801, -730, -706, -1008, -500, 566, 995, 1355, 697, 699, 544, 465, -185, 376, 843, 1531, 1412, 1769, 1942, 1141, 719, 534, 147, 328]
1128C28N60N38N94l99l08k11l13o27o0J19O39LK81k86k44j46j022j10L80R0j29
1149c23L89K23j39k55m67n53k96O4L44K95J18L55K60p31n39j28J47j95K46O28
1169e57M51k85nm8m03l99K16R8L27K67L91N78p23j94j23L3j24J49M43Q42K5l33
1191F26r7K14q28n03N38N93LL16M24k92j20k23j94m68K72K4P60k47K03M36l38
1212A099o30m60K18k18K36J6N96J22m74k90J6k18m60j04M05L79k42J6M77l26o06
1233d48j88j42l31J80O73M27m46o04L24j01n82o14Q93N63j26M13J74j57r90N1
1253a031L41k27j36M40N88K6k41K51j31m63r2L78K02k00N20O64m42m63K13K90
1273D87o22m5M49L60M10j34K08K98r35l79J82k8j5N77K69K35n47k34j9q6o35l4
$$ y = [328, 888, 1426, 2020, 1621, 1313, 1102, 789, 162, 102, 221, 860, 863, 1144, 858, 614, 468, -554, -664, -284, -194, -323, 66, 289, 150, -105, -572, -1125, -1421, -1357, -1013, -718, -600, -245, 15, -716, -1255, -1383, -1236, -1431, -1185, -557, -106, -391, -396, -444, -847, -1246, -1030, -932, -605, -338, 53, 631, -92, -286, -409, -376, -500, -351, 92, 934, 959, 626, 529, 743, -85, -588, -50, 543, 546, 862, 1286, 994, 874, 651, 457, -11, 261, 285, 1045, 798, 1001, 1437, 1099, 469, 9, 227, 9, 245, 261, 857, 979, 505, 215, 231, 13, -447, -551, -146, 233, -9, 7, 484, 158, -448, -636, -778, -1109, -929, -256, 171, -275, -879, -555, -656, -1238, -1852, -959, -396, -522, -109, 65, -92, -1082, -1031, -690, -917, -1053, -613, -25, 1, -240, 11, -120, -583, -675, -297, -95, -295, 225, 889, 447, -16, 197, 487, -135, -180, 269, 629, 1039, 905, 1113, 1411, 476, 97, 279, 251, 236, 813, 1082, 1317, 770, 536, 517, 431, -204, -238]
1295b38O31J07J01L87k86l57o83M19k04k03K74K41K29o48K09J58o48n42n5Q34
1315b74nk88J51N39k41q19p2J66k59j6O14O38m12j66J65J56p76Q3k44N45QL80
1337a27L11n9m28M9M80l83j59j84Q25R2J22J15j33l99k79K86P0j99m6Q11L00o48
1359D17N05j97m15r27Q45K76K19j98R0M41m86m36p0K70n55l42J058o0k54J57l53
1380a5J03m52n1K86Q6l59O84K76m91m24j85J67k26j21J41M64K2O6q6k18m85J28
1402f90L47k73K14J0L97J7l65j14M90n59j24J73M50J54m15L84K00p07k48M27L6
1423a96J9M2O54r9l99K30j67n1k57J00L83k4j86M08K17l54k30k6K14j02l32O06
1445D50L51m02J30r8k8o60J56M83O0l48K19L47n46k1r5K85n50k54K99P26l99p8
$$ y = [-238, 393, 500, 601, 988, 702, 345, -338, 81, -123, -326, -52, 189, 418, -230, -21, 137, -511, -1053, -1108, -274, -279, -567, -416, 123, -118, -937, -1009, -843, -1102, -1118, -504, 134, -278, -444, -279, -123, -899, -816, -1060, -515, -507, -127, 184, 125, -303, -254, 226, -157, -316, -500, 325, 417, 539, 654, 521, 122, -157, 129, 199, 0, -46, 765, 1065, 417, 922, 725, 310, -617, 228, 504, 723, 525, 615, 1056, 570, 134, 64, 334, -221, -563, 495, 435, 181, 338, -15, 88, -364, -415, -129, -43, -402, 282, 558, 67, -357, -542, -375, -601, -722, -581, -117, -95, -29, -115, -333, -818, -690, -343, -616, -402, -392, 5, 22, -343, -457, 33, -526, -650, -477, -27, 127, -288, 96, 296, -411, -659, -232, -196, -177, -135, 519, 420, 21, 251, 84, 33, -224, -124, 259, 235, 49, 457, 674, 320, 90, 64, 278, 176, -156, 450, 801, 399, 529, 431, 403, -257, -101, 382, 442, 94, 313, 660, 114, 93, -2, 283, -267, -521, -222, 504, 105, 27]
1467B7rJ22n18l70O66J23n09L30J19J35m27j09J89m60j68K44M36j18p1J85L51
1488A68p46l59M45L04j70k60N26M59l13Q8N0k04k92j00O04K2j33L78j72Pl11J20
1510A11K5l01K8N83P7k42j20L02k10l49J5L05K49j93K78J85j49o44Q7q8q0j32
1532b63K92M26K09n48J78k35k08k16M36k24j24L18k6K8l44l5L56o18M2J25J65
1553b66K44l39L11J07m18k65K96j60o8N7O03k94j42k08K54m2j34J49J77J38k03
1574b03K03J13k90kK98R5o44L59L70k3k44L32J80m13n21K21P7L84q1j50N88j46
1596E03l11J35j03l77J60M29K97n97M24r9k32k47j71M02n06L03L01R6k56k08J03
1617D6j52r1N0L26k4j46K03rk11l01j1J25J6l40K58M69m94M79j64j7l07j00n3
$$ y = [27, 18, 140, -378, -748, -82, 41, -468, -138, -19, 116, -311, -420, -231, -691, -859, -615, -179, -297, -368, -183, 168, -578, -937, -492, -188, -358, -618, -92, 367, 54, 142, 192, -12, -304, -404, 200, 222, 89, 467, 295, 302, -9, 111, 136, -165, -137, 446, 523, 281, 161, 463, 253, -96, -81, 224, 473, 280, 558, 743, 594, -50, 37, -51, -131, -263, 29, 455, 664, 116, 294, 59, -149, -365, 71, -153, -277, 41, 15, 43, -301, -336, 20, -598, -556, -431, -266, -22, -361, -50, 57, -361, -626, -330, -490, -558, -501, 102, -192, -334, -542, -288, -330, -464, -315, -138, 0, -203, 0, 113, -177, -179, 119, 214, -430, -71, 299, 276, 32, 364, 544, 131, -390, -169, -92, 292, 211, 61, 649, 503, 192, 327, 224, -153, 7, 436, 733, 136, 560, 461, 229, -18, -189, 213, -293, 10, 311, 407, 151, -57, 46, -106, -197, -147, 179, 155, 9, 212, 203, -8, -309, -320, -195, -179, -519, -261, 208, -286, 193, 29, 12, -295, -395, -448]
1640d48K36J41j04K70M1k64n28M3K91j14L05K19l59K87k51J62k0k60j00O24k49
1661g8K29J24N2j2m09J44j52J55j64L44r1M3RL11jj85m13K78P7j53J53N47l40
1684D68L6l85K14m21p0p3K62L44O2l11j1lk36J69k38J7j7L46J09j62jJ49m98j22
1708c72J63j5k4K90K3J03n33J07j69r6k09K77L56o3M3q2O0k46K01m32O9L10J07
1731a32r9J59P9j94J67N7q1j59K10J75K08j69j14J21k99kJ47n9k52N52K21l4l05
1754A97J04p0j30J6M4K66p8N8k83Q2K29o33K24k23Q8K74r5R2J44k94j7j03OP6
1778b6K7J54k54m2J86j26l68L2J23L4J19l4K17K8j69j18P2j91r4j4J7N12n8k21
1802a94qQ5j60L4j29J67J06J41J67j43K6p3k30n0J50m8M71k55K12J0k26o0J75
$$ y = [-448, -212, -71, -175, 95, 136, -128, -656, -613, -322, -436, -131, 88, -271, 16, -235, -73, -93, -353, -453, 171, -78, 151, 275, 327, 315, -94, 50, -102, 53, -111, 233, 142, 185, 194, 505, 504, 319, -94, 184, 261, 108, 261, 808, 468, 504, 119, 333, -88, -158, -231, 31, 375, 437, 126, 115, 112, -124, 45, -193, -176, -193, 153, 262, 100, 99, 248, -250, -372, -209, -224, -248, 42, 65, 168, -365, -258, -427, -523, -732, -455, -99, -162, -119, -201, -141, -387, -186, -618, -549, -239, -132, -231, -72, 7, -187, -20, 37, -44, -203, 7, 182, 390, 221, 107, 228, -71, -73, 74, 15, -237, 315, 536, 502, 197, 301, 231, 101, 117, 161, 427, 349, 407, 124, 206, 435, -198, 26, -197, -109, 165, 70, 162, 306, 12, -5, -108, -102, -26, 1, 155, -99, -141, 45, -81, -449, -417, -294, -260, -141, -175, 42, 70, -99, -217, -145, -336, -430, -444, -427, 85, 27, -194, -202, -117, -277, -243, -372, -205, -99, 42, 209, 66, 92, 19, -211, -261, -111, -159, 312, 57, 269, 279, 53, -7, 168]
1825A68p0P9m1K8L1J0J48k7q2l33L17K68k50n7L45k28Rl62P4r7J51k3R3J09J98
1850D58m86k12N61m18j8q8J42Q8N5m3p3K4p0r3j44m09L85L82l37N35m19P8k83
1873c85J17l46L49J26P8O6j08K11k79JKk43L88j45j43L19L2R5kp77O64Q4j88k38
1897c22K71L32L8l28Q5p6J04j83K99K21l9k76K61K9k27J25n98M06j22J5L19q8
1919B46J08k11J35l79PK49Q1k7l8R3m9k98JM2j57r6O2N09k43j25rK87o58j9O4
1944d25K04R2q3K66j37o0k43L9jk51L19K69m0k4K09j35J8k75K37M8j83l81N34
1967cL89j63k77q2K79k31l5M3O07o94N30K40k26j70l32qK70n03M12O38j37m86
1989F1P2J14k10q5k1L73K2k22J93j84J10j06j23Q1n4O7K14L6k3j67L0jo38M02
$$ y = [168, 98, 177, 136, 164, 195, 205, 353, 326, 244, -89, 228, 496, 246, 189, 534, 306, 315, -47, 27, -70, 81, 58, 151, 260, 458, -28, -240, 321, -97, -115, -203, -61, 27, 82, 39, -34, -10, -80, -173, -317, -726, -341, 41, -296, 239, -180, -102, -385, -268, -614, -265, -139, -61, 5, -103, 108, -171, -170, -168, -411, -23, -168, -311, 8, 40, 135, 133, -644, 20, 104, -84, -322, -51, 281, 319, -9, 76, 0, 104, -79, 220, 441, 402, 126, 387, 416, 189, 314, -284, 122, 0, 15, 334, 246, 354, 143, 278, -101, -94, 155, 236, 209, 171, 264, 215, -83, -82, -40, -197, -293, -231, 278, 35, -90, -99, 188, -470, -489, -425, -221, -129, -212, 54, -83, -143, -386, -347, -348, -599, -280, -11, -51, -75, 134, -1, 17, -258, -21, 27, -156, -537, -3, 386, 223, -54, -136, 143, -88, -123, -80, 527, -167, 363, 603, 377, 207, -125, -133, 137, -366, 46, 684, 547, 61, 133, 247, 37, -48, -69, 304, 326, 104, 297, 113, 223, 117, -6, 75, 21, 88, 302, 338, 315, 148, 178, 177, -461, -59]
2013e9J7l24L48J78K26l14j55lk75R1j13L48K16o8l16M68l4o28k48M63r3R3O87
2036E05l39j10j60L84m79k76R3Q9M87j70R6K59l76l46L00l3l44L35Q8J31J67k92
2058IM39l76n7k40L09J10m45M88K08m3n14L20m2k59J21n5J09R9j77K87j91K15
2080C15o36L69N6k83J82L02M6l40O7j39k84q2K26M64l00j83J96J29N1n21L26q1
2102a20p5ro7M72k54k78J33l6l87J14N56j31j79R8K35p9k37L3K78l13J7J80N84
2125E35j92k81K92m33N7J48J46k13N2L52J86l95k69l2M96m84k28M45K12J52l77
2146A69n9K31j23j26P6O7l68M21j90L05m80p9L91j37j67n18J041k58n42M90J74
2167C18k95l96J73r9J51j2Q7K07l11r5K39q9m28L22K70p1l6M1L31m75k08oK18
$$ y = [-59, -42, -366, -18, 160, 386, 72, -83, -86, -361, -270, -383, -35, 181, 113, -203, 265, 231, -397, -645, -182, -275, -182, 505, 166, 56, -104, 280, -199, -475, -382, -293, 194, 24, 120, 379, 3, -343, -43, -76, -420, -85, 3, 134, 301, 9, 448, 72, 15, -225, 84, 194, -251, 237, 445, 402, -112, 208, 166, -93, 28, -27, 82, 181, 4, 291, 100, 315, -321, 48, 104, -179, 3, 305, 351, 11, 78, -61, -345, -427, -201, 263, -37, -220, -24, 105, 156, -365, -39, -120, -195, -204, -271, 201, -53, -331, -198, -234, -621, -507, 49, -82, -261, -163, 72, -7, -244, -211, 67, -246, -229, -49, 535, 343, 62, 354, -79, -22, 126, 272, 59, 111, 463, 649, 254, -15, -47, 449, -35, -263, 182, 394, 546, 169, 110, 341, 218, 92, 168, 235, -133, 288, 98, 403, -77, -156, 235, 98, -69, -587, 454, 196, -346, 144, 318, 23, -373, -200, -299, -148, -160, -73, 134, -177, -272, -33, -122, -550, -228, 42, -29, -65, -24, 307, -168, -376, -382, -164]
2190a64j3J0J25K82l45J05j62J40k27j4L18J7j28rM43l80j70P3K71j45k82M16
2212A61J56q2k9K9J16m12k39N72K9p2j69L39k58k92K57J65p11K10O18J34m22l80
2234b80N47j06o7k58K89J01n26K91L17k42k09J05Q7l12K8JM52l61L61k71K76m16
2256a93l26M00j14j08J50J11L20k69j03Kk13Q1j36L72m48K32J81J65j95k09n6
2277c56L29j84k55L06L08j73k47N62l94j94P9Q7K62j63K62J20L0k29k2J42k34
2298C6J06JK37j11kJ36k63M7j97j21M6J18j20K52K62Mj73j0k46k71L44M4l92J72
2322a01O54m29j32L0l71Q7q4K36M56J3m33p3K97k12l00j7M0P7K47j6J39j07l71
2345c70k3J96j36J11K98o6k0PR3Pk48j64J95j06O8K32J92rn64O19k85m3k69L73
$$ y = [-164, -177, -167, -42, 240, -105, 0, -162, -22, -249, -263, 55, 72, -56, -65, 378, -2, -172, -99, 172, 27, -255, 161, 317, 235, 206, 235, 351, -61, -300, 272, 301, 229, 60, 399, 141, -151, 106, 271, -440, -230, 388, 522, 100, -280, 267, 161, 94, -164, 125, 226, -300, -9, 308, 66, -143, -38, 49, -263, -235, -234, 218, -143, 218, -53, 223, -193, -519, -119, -233, -341, -191, -80, 240, -29, -132, -130, -343, -262, -398, -26, -474, -242, -61, 104, -91, -300, -356, -27, -211, -466, -160, 148, -25, -272, 290, -104, -298, -219, -132, 130, -33, 229, 349, 379, 150, 128, 270, 36, 142, 143, 380, 269, 267, 403, 140, 187, -10, -131, -85, 33, -87, 165, 427, 431, 258, 248, 2, -269, 75, 119, -273, -101, 553, 124, -8, 22, -349, -262, -346, -110, 346, 359, -74, -147, 150, -62, -362, -379, -339, -262, -15, -31, 108, 1, -370, -393, -197, -333, -222, 76, 10, -10, -3, 90, 97, -151, -315, -120, -226, -158, 74, 266, 257, -307, 312, 27, -16, -285, 88]
2369H8M14j20j81K09j25m92O7J7J64j93M40J55j91l86L24J59m71j28K22J60k31
2390i9O9J69R2j94j62Q9n44M14J12K72k84q3J17K08k7n23J31M53m32J44R5p8m7
2413a08l01M0J16l17M51K27r0j03M35k89j70r2J18j77o6L77J74k20O6l45O4K37
2435B7r7j22K47q0J2j61N3L12j94l0n1J28k37N00j88J47j36j54L48m11o2K7K66
2458A44J35k37J90k41K77k77k4J96J06K4k6j52j78o2O8o4n9J40P0l41L38n8N19
2481D88m47k06J7k23M5k7J95J42r2J54k51Q1j76j02L99j04j20K63Olk25K40m11
2504c57rL50j90J68p0M5k38K65j03K21l18K19n0P5R8l9M9j98J14j03j25K27q5
2527e4J11L02J25j90k54J93k31L5J7K15P8J07k88k6j43K00m97L32J6K27k29O1
$$ y = [88, 502, 382, 201, 410, 285, -207, -140, -123, 41, -152, 288, 443, 252, -134, 190, 349, -122, -250, -28, 132, -99, -30, 139, 231, 37, -125, -36, -580, -166, -54, 218, -66, -149, -32, 176, 149, -374, -243, 210, -222, -78, 17, -61, -108, -409, -369, -253, -570, -119, 108, 18, -85, 350, 61, -109, -201, -83, -260, -326, 51, 225, 5, 71, -274, -210, 27, -70, -192, 55, -25, -13, -174, -121, 191, -3, -33, -84, 44, -193, 307, 119, 266, 130, -24, 324, -87, -149, -122, 144, 279, 42, 232, -9, 268, -9, -33, 163, 269, 293, 267, 115, -63, -125, -57, -121, -180, -40, 30, -311, 27, -31, 488, 41, -165, -148, -371, -326, -353, -158, -16, -108, 46, -205, -124, -300, -402, -3, -107, -227, 36, 42, 39, -186, 54, -357, -366, -16, -206, -38, -108, -63, -301, -36, -139, 82, -236, -17, -67, 8, 106, 67, 116, -82, 32, -71, -196, 31, -54, 57, 359, 484, 294, 40, 233, 2, 37, 54, 269, 347, 454, 166, 140, -3, 197, -300, 32, 48, 275, 46, 107]
2549A07O9m2l4j76k9j41K57j7n3J51j66J39k88J32p6J2j73L77J9k04O9j6J2l70
2573d41K06PJ69j24K88k70K73k00K9j72j10J96M3K55J41k08L8q4N1j24Mo1J68
2596G4r0M81l54k35J04J22r8J90r7J99m06L62j60l5mk22J77k36K29J18J12j84
2618D7K35m9k3l45ln8j39K74j14R6K01k19m8k10K43j5M33q3l31O8J66r1q5J7O3
2643C0m5m04K75K10J58j35r3J87l54P5P7P7k41L26R4j8k92Nn1K45k64R4L03k36
2667B3M1k13J56M3k89Q2P3o5L14J57m42M5J22j3k34K89k13L76J62m61L85l38K08
2690B08j69l4q9K84j19J86M8l16jj05Q8R6j47j75M35n8J2k47j75K52k6K71k46
2713b7k6M0K98l07j78P2O4n5j66L38K13k09l9J62j56n4j16L9K6l5%P9j38l0K76
$$ y = [107, 176, 134, 100, -76, -105, -246, 11, -6, -59, 92, -74, 65, -223, -91, -167, -155, -328, 49, 68, -136, -67, -83, -71, -441, -235, -228, -59, -183, 105, -165, 108, -92, -63, -235, -345, -149, -106, 149, 290, 82, 120, 36, 87, -37, -33, -94, 74, -16, 465, 111, -124, -20, 102, 4, 194, 97, 296, -110, 252, 92, 57, 53, -169, 8, -228, 1, 119, 231, 47, 282, 233, 210, -135, -138, -196, -335, -61, -175, -79, 122, -97, -145, -355, -112, -127, 306, 223, -108, -40, 126, 35, -50, -33, 30, -15, -419, -144, 66, 224, 89, -4, 183, -171, -96, -19, 58, -183, 143, 237, 219, -73, -68, -119, 126, -138, -44, 259, 23, 64, -149, 7, 50, -239, -157, -84, -149, 165, 322, -120, -75, 47, 34, -200, 89, -124, 252, 414, -47, 338, 0, 208, 39, 5, -84, 200, 81, 267, 315, -1, -2, -107, -19, 77, -70, -245, 190, 132, 144, -103, -278, -26, -52, 219, -27, -53, -13, 285, -22, -200, -128, -64, -119, -285, 53, 266, 57, 18, 180, 24, -30, -146, -107, -81, -116, -116, -37, -175, -205, 71]
2738G1q5q9J53k71L25m9K3N6J45m43RL07l84k6J35K30j19K49r2J23q5l25L15p0
2762A03J24k94O4O5p9P5M3n5p7J41k6J18j32Q4r9l1k42J58N5K3l25N08jj72p3
2787d5j35J03J98n25K89J11L30n97K24J32q4j10m9J63o9J91M3k51J24J07J23m88
2809b15k2L25k73P4j32M92Jl65P3pm8%j5L73k02N1L4J91l33k52K69j60L4J95J86
2834B74j45j31k11K51l26J22M70l89Q1L00k94M9O1k20K62l2j80J58l30L93J89
2855C52k60l95N26k98j53K56p5q6J39J67j18j54L2K91l51K7J55j19p8k1J78n6
2877d1R3J83l36N0O5O7q2QJ79k9j78J05j88k49L53O7n38M14K79p11N94l21L63
2900A47k90K7L75l40J20j10o2r8k6K42L47j03k64J19r3J72J0r4k23k7J51K41k08
$$ y = [71, -14, -103, 50, -221, 104, 55, 78, 134, 279, -164, -155, 152, -232, -258, -123, 107, -12, 237, 145, 268, 183, -142, 173, 103, 227, -67, -3, 62, -17, 58, 101, 46, -31, 110, 84, 202, 70, 154, 55, 24, -218, -60, -5, 18, -307, 201, 200, 28, -45, -180, -77, 121, -404, -115, -4, 326, -271, -47, 85, 1, -109, -158, 5, -64, 127, 170, -81, 43, 150, 273, -215, -237, 88, -185, -111, -243, 249, 250, -115, -42, -49, -97, -97, -112, 261, 59, 110, 144, 335, 2, -250, 19, -141, -107, 88, 274, 129, -2, -213, 38, -288, -166, 304, -85, -4, 296, 2, 51, 112, -108, 154, 122, -58, 100, -230, 163, 352, 92, -303, 223, -75, -228, 28, -47, -133, 6, 173, 55, -99, -67, 224, -127, -100, 55, -64, -142, -163, 15, -41, 52, 235, -101, -51, 14, 81, -1, 7, 186, 157, -21, 84, -104, -353, 0, 67, -471, -57, 222, -489, 105, -216, 147, -143, -116, 259, -81, 39, -71, -133, -231, -257, -15, 332, 229, -35, 84, -9, 163, 173, 79, -144, -171, -20, 221, 13]
2923A3J28j38Q9j3j77j09J59L06m47M16k3j47k03J05L14l24R5j09J99o4p0j5n9
2946g4J07k48O7L07j0R0o9L0k70J47j65r4L66j51J29m31J85m5J60p2j09J96j96
2969a50K73r4J00k15J23k14J33K78k99r2lK64n5J73o9k01R7J06k2M2j63K11k69
2992d6J8O5M4m5L1L9j54L06j37m0O6j50q3J14j18K36l27K43j62K98k95K60J1k64
3016i0J64q7P8l20j02L30p4o5M0J91k23K56l74N46n4k36k7K3oL5R7j02j05R5M7
3041C7Rj25l67M03J60Q5k58K26%P0l02L92l09J1rj72J34r0K84j07o6N3L45j57
3065B47k03n3q6J57j04kn8M6Jp5J46r2k17M26J91l23J27O5Q6j77j61N9RN7J70
3090B36l40J71j86j39K30j65K10J05j76M1j02K02q1J64k07R7k30J53r6M18n21
$$ y = [13, 141, 3, 92, 79, -98, -207, -48, 258, -189, 227, 204, 57, -146, -41, 273, -51, 44, -65, 134, 70, 0, -15, -74, 33, -215, -148, 159, 149, 239, 170, 200, -70, 77, -88, -182, 184, 33, 162, -269, -84, -129, 31, -41, -150, 46, -150, 123, 29, 129, -86, 37, -177, -44, 234, -65, -157, -160, 104, 49, 222, 153, -48, 49, 155, 133, 175, 12, 223, -46, -28, 37, 81, 36, 67, 106, -48, 258, 121, 81, 147, -3, -86, 28, -90, 146, -181, 62, -100, 198, -97, 163, 174, -90, 74, -13, 65, -255, -357, -27, -101, -166, -126, 65, -158, 98, -276, 270, 216, -20, -47, -24, -30, 5, 102, 0, -105, -10, 37, 46, -79, -446, -43, 117, 202, -56, 170, 170, 240, -62, 330, 21, 32, 23, -149, -15, -105, 179, 72, 6, 59, 404, 247, 44, -9, -95, 62, -42, -44, -102, -56, -55, -130, 16, -76, -293, 133, 324, 1, 128, 193, 279, 102, -59, 0, 9, 66, 236, -104, 67, -119, -258, -28, -193, 17, 122, -54, -13, -115, 87, 6, 170, -37, 60, -170, -17, -113, 305, -216]
3111b16J17L19l06K57k56j6j32J20N1N7J69j24l9L5J2MQ4l46L32j21q9j4K67l20
3135a55J58J85KJ7k71j47J77K64k46o8J31J16Q5l76n2K97j28K92l67K94j78j3
3157A7J77j83J3J1L21P3o24L2R7J51j0M3m31J76o0L18k73J65n6J26k02n7L56j7
3181A63k36j98K52K10k69M4J21j53O4pM6m40M84l30M34q8j44J34j7J7K2j27l7
3204e5J54l52J10J51j18M17p1l36J06j89J91P7l4M5K4k10N5R8j2Mj20J33l64O00
3228C04k21M2k29K31k01k19J53K18n9j93K12j45M22l87K44l79L58r9j24O0j86
3249a98M10k31m3L1J44j06J2p2l1K86j03pm3J61l7O2l49J93p4J03J7j27%L2L68
3274C98m95J3n4L25j30j50J29O3l00Q8J1j15J14P6K44k44j43P0J81j19k08K72
$$ y = [-216, -99, 220, -86, 171, -85, -101, -233, -113, -62, -5, 164, 40, 1, 36, 48, 52, 136, -210, 122, 1, -88, -102, 165, -155, 3, 188, 190, 207, -64, -211, -34, 230, -16, -84, 47, 163, 248, -128, -180, 117, -11, 281, -86, 208, 30, 17, 194, 11, 24, 35, 356, 429, -195, -163, -66, 85, 75, 118, -313, -137, -197, 121, -152, 13, -43, 83, -119, -176, 180, 163, -73, -271, -19, 191, -78, -34, 87, -66, -2, -9, 37, -403, 81, -249, 185, 97, -47, 87, 70, 87, 109, -18, -55, 99, -253, -143, 8, -110, 307, 236, -100, 6, -183, 8, 85, 51, 96, 120, -90, -35, 63, 51, 55, -65, 68, -296, 304, 83, 125, -104, 127, -74, -293, -140, 78, 19, -174, 38, -107, 315, -72, 172, -207, 151, 52, -72, -12, -198, 212, -19, -62, -31, 113, 7, 19, -53, -84, 202, 99, 92, 49, 210, 173, 235, -114, 79, 5, 108, 125, -2, -2, 30, 398, -97, -84, -138, 187, 57, -93, 36, 99, -201, -113, -102, -217, -103, -27, 217, -27, -170, -100, 81, -38, -246, 26]
3296B6p6j0J57j28k02M03m79J88K31J29j22j86J31l46L41r9M21j78k40R9k35M18
3318B43n43L05m4J89J01k45L8J61j36m1K85n69L16Kj41K63K22l70N9l28N55l10
3340A2k17j66M12K3l90M73r0j21O3Qk26J49r5K15J52l10K56r7n1J53l8N2k72j00
3364b05M95l56pP8L7k03k3K65J0j9l11L13l1j89P5R9J06l49J31j65M92m37J81
3387a3r6K60o7k30P3o8K67k45j74N98n30L15p5j06k6J07j10M2L06j70K09l8k62
3410c3J20n0k18P5M72m86PJ66k30M27l59Q7J29K7j23j92J37PJ92j3j80n%o9J56
3435D4n1k14M7M17n7k82l41L95j30M3K36K2q2k28K83j61J65k03N7j88M73k33K32
3458B44l88K10k10K8J29J8m4K9k6k2k3l8j74K70l1j16K16J15m26rL38l90J53K90
$$ y = [26, -50, -60, 97, -31, -233, 170, -309, -121, 110, 239, 117, -69, 62, -284, 57, -42, 379, 201, -39, 60, -175, 243, -300, 5, -39, 150, 251, 6, 44, 205, 69, 28, 313, -256, 60, 62, -79, 184, 406, 36, 95, -233, 322, 12, -205, -371, 41, 64, -326, 147, 57, -64, -1, 7, -219, -70, -165, 50, 202, -108, 148, 51, 0, 153, 115, 167, -105, -205, 290, -66, -73, 5, 42, -161, -184, 81, 91, 72, -239, 74, 43, -146, -71, 28, 134, -215, -84, -249, 243, -194, -13, -109, 151, 84, -146, -73, -141, 126, -119, -293, 305, -225, 90, 15, -91, -117, -10, -120, -78, 228, 58, 267, 229, -33, 87, 37, -181, -106, 366, -120, -113, 53, -177, 250, -109, -22, 107, 134, 11, -181, -44, -37, 155, 142, -38, -43, -43, -112, 44, -7, -221, -174, 243, 186, -96, -437, -42, -172, -129, 107, 129, 47, -181, 102, -59, 106, -97, -40, -228, 245, 12, 244, -144, 66, -144, -116, 13, 31, -13, 16, -10, -32, -55, -93, -267, 3, -28, -144, 72, 187, -239, -248, 90, -300, -147, 143]
3482A43j53l6K30q0j19J24K0j99J29k05J03j6l1M2K87n19L96k28P7J87k26n5n2
3505a81M03j22j8k21J09J5L3j08p3j96M28j96J82L6K4j85K16k10j15J35j00R5
3527d9q4j6N0p6j1K49l23M88m17K65k22Q8J72J35k52j67l2P7M7M4K7LJ72n21K86
3552f7k9p5O7K84q1j30J84J12J8n44L64j09r9j2J03J67k57n9L44R8l50n5L32j93
3576A3J43j08P9J65n20L38pK36k53j97K45L9l02K50k83J18q5K58J80n70K28Q6
3598E3K12k41J30l21J72M6j95L83l64k2J73j37K65m8k53p5N83n56J24L27j20J58
3620B94q33O21j9O2O8j46Q7k34J12J06R1J63l11R0j94N9J7N4l7j7l7j36J44j42
3644a38K98k55k17L23K37l08R9lj40j36K31K87l4j00k44J60j35M7J97k50j6K20
$$ y = [143, -10, -46, 184, 104, -15, 109, 129, -70, 59, -146, -43, -59, -90, -48, 239, -280, 116, -112, -35, 152, -74, -129, -181, 222, 100, 82, -139, -30, -15, 18, -90, -163, -359, 69, -127, 55, 91, 115, -70, 146, -64, -179, -44, -144, -49, -133, -149, -99, -175, -186, 63, -260, 228, -189, 76, -146, -58, 114, 249, -3, -170, -202, -125, -78, -34, -7, -4, 168, -353, -67, -96, -171, -104, 180, 99, -31, 153, 265, 283, -261, 103, -6, -105, -117, -14, 153, -104, -163, 181, 279, -71, -126, 206, 13, 156, 48, 127, 292, -228, 110, 103, 339, 86, -111, 134, 173, -129, 121, -162, -44, -129, 129, 309, -261, -33, 53, 265, 24, 154, -167, 5, 51, -144, 239, -125, -147, 26, -111, 154, 106, -147, -222, 361, -195, -71, 256, 136, 294, -539, 82, 63, 125, 193, 47, 134, -100, 12, 118, 209, 372, 61, 151, -43, 16, 33, 87, 50, 33, -4, -140, 4, -138, 160, -95, -312, 11, 248, -60, 39, 36, -104, -240, -9, 278, 244, 144, -100, 60, -75, -28, 169, -81, -97, 123]
3666A23j22j94K29k41n4M58j98R8k6l8r2mJ16n58K89J26K09j34j52J69P5l16J98
3689c9J27k86N55k08j18J53K14m84O6k1Q6O4n3m5K3JK31q1m04K01p6J53r7j5K36
3714A83R3m56J44j94J87o6l1K84P1j9r8j1j06j27L96j77j22K06J69l89K29k44
3736g8J89j14J34k19J55m97M23n4K16m30m5N15l08K03n6j46J51J7k55j13M11k6
3758G3o47M47J83l4K19j74J73k86J80l56L23l70K91L6j45j71K09j30kK63m6l5
3780AK6K06j40J95k10j63M7L7J34J89k19k1k43J34L26k22o1j59j09M28o1k2l06
3803b13L32j54J53j87Q4j15K39k91J13q1J8r8M36j21l21M38k62R3J6k22K54j85
3825g4PQQ5j91q4K59K02l64k76K30J7M07k07J40k97J06j89K78n5J3Q7l83K01n4
$$ y = [123, 1, -193, 36, -205, -259, 199, 1, 99, 73, 35, -57, -61, 55, -503, -214, -88, 121, -13, -165, 4, 79, -237, -39, 88, -198, 357, 149, 31, 184, 398, -86, -20, -41, 45, 109, 56, 11, 34, 35, 266, 185, -219, -18, -94, 59, -38, -53, 183, 276, -180, -36, -230, -43, -109, -140, 144, 215, 196, 98, 87, -19, -146, 250, 73, -49, 157, 326, -63, 166, -78, 111, -3, 131, -88, 67, -430, -7, -61, 155, -275, -320, 195, -113, 90, 34, -112, 39, 56, -199, -312, 99, 73, -574, -127, 56, 22, 241, 67, 240, -46, 134, -222, 101, -269, 22, 58, -87, -258, -49, -179, -181, 82, 36, 1, 27, 233, 93, 288, 78, -85, -38, -1, 133, 322, 103, 82, -161, -27, 299, 77, 16, -143, -252, 176, 115, 93, -213, 119, -35, 118, -69, 15, -100, 139, -152, -39, -120, -102, -200, 236, 115, -206, 232, -30, 63, 79, -143, 111, -74, -67, -59, 26, -165, -249, 10, 212, -152, -428, -198, -181, 226, 19, 159, -138, -32, -221, 57, 2, 15, 102, -281, -80, -134]
3849a34K85l81K42Pj14K88l12R0LM7j72J0Q1j1J13J06l46P4P5m2J64N4j42k17
3873b32J85j16M1j6J19p1J23K0j9j24j14M40l80NQ2M9J7k00J59O4K9j91o4L40
3897A46l06j9M06j82K2j74N0J55q0rq3Q3j59J25j48J07J05Kjj75K43q0k75J71
3921g6J82l83J17Q4j71J27J42J15k82J19R7k67k28N80j05k65K55j82o6J51rJ30
3943F5j42j7K86l17K16ro4l7l9K37j71JN5m57K46p4l8J80M9Q8m33K98Q1L02n23
3968b17L93k30K92k2j85L14m37J26p2j07rL51l40K90l08K87o33M78K91m5k42M1
3990A6O3o9m4mK4j01P2K50n2k52J48k15m5K34K24k53O0m7L3l11q2J46M1K47K39
4015C22j79o7j37J01Q2n2Rn6N3k65J09%j2k13K41l15M32j52K70l24J89m4R9J54
$$ y = [-134, 151, -230, 12, 19, -95, 193, -119, -29, -26, 21, -151, -141, -60, -71, 42, 148, -198, -124, -49, -91, 73, 127, -15, -232, -47, -163, -122, -138, -19, -90, 33, 53, 34, -90, -204, 236, -144, -139, -57, -8, 9, -191, -32, 32, 61, -130, -194, 146, -160, -179, 227, 45, 67, -107, -57, 98, 18, 9, -74, 9, -150, -25, -173, -66, 39, 41, 40, -135, 108, 28, -247, -76, 106, -277, -160, -76, -247, -120, 22, 137, -145, -26, 71, -196, -424, 156, 51, -214, 41, -141, -207, -56, -65, 65, -77, -94, 192, -125, 91, 82, 18, -19, -58, 179, 8, 9, 64, -393, -147, -221, -259, -79, -30, 58, -375, -77, 4, 306, -217, 176, -54, 238, 216, 31, 345, -92, 34, -38, -145, -154, 197, -143, 147, -161, 126, -507, -29, 262, 217, -25, 16, 79, 10, -34, -38, -14, -115, -43, 207, 155, -97, 51, -164, -209, 25, 249, -4, 56, 9, 42, -269, -351, -205, -164, 83, 322, 143, 76, -61, 40, 122, 70, 79, 23, 76, -189, -80, -80, -92, -305, -64, -379, 53, -99, 171, -153, 36, -8, 91, 245]
4039B45n04J69J90nn16M81j12k4M3J31m0j63J70J34k84M9O0q8J04M1j54M8J81
4062A56l91K66k2L03l67K1j05p3M91k85n3J91k57O9O2l6l9K33l5r2J5mp5J16l20
4087b31L3m6L15r5K73l93K26J59p8k06j69L0K86r8m22M62p2m9J43J06m05J71K50
4110A90j4J7o5Pj56k6K1j05J01o8J08k44J26L79l65N9j93K11J16N8n7j13J02j49
4134f0J29k61J74P8m1Q1R3l13K81k84J72K93l44L26n19K12K6J27j85j16R4j96
4156b33K26l08L16K23m55j42K86k18L13k12K48j52J21J37j48j04J76NM0m8q3K00
4178A88j34K96m48K50k8l03K62J8l49K44k3j15K07L0N0M6j97K4j9k9j16K14R1
4201A59j00j76J11K28j85j08j1Q2k03K53l28L00J78k49K0k08K91m5n4J71l6j36
$$ y = [245, -259, -90, 100, 95, -421, 60, -52, -76, -33, 98, 58, -105, 65, 199, -85, -36, 24, -64, 40, 81, -73, -25, 156, -235, 31, 9, 312, -55, -34, -139, -212, 279, -6, -59, 132, -125, -56, 6, -30, -69, 164, 129, 37, 52, 48, -27, 89, -231, -198, -244, 71, -24, 249, -144, 82, 241, 163, -43, -212, -182, 104, 6, -416, 46, -26, -75, 68, 174, -231, -60, 190, 176, 193, 128, 135, -21, -47, -26, -131, -30, -98, 10, -234, -108, 271, -94, -35, -228, -17, 99, 157, 100, -13, 89, -60, 69, -192, -18, 60, 19, 100, 193, -120, 161, -123, 49, 342, -2, 324, -195, 17, 43, 170, -15, -131, -37, -233, -7, -315, 1, 224, -231, -373, -87, -305, 8, -204, 44, -108, 13, 150, 2, -102, 74, 79, 119, 71, -12, 188, 54, 350, -98, 152, 124, -179, 83, 101, -248, -4, -27, -142, 65, 95, 145, 191, -6, 18, -1, -30, -146, 68, 159, 59, -117, -6, 222, 37, -71, -82, 0, -203, 50, -278, 22, 200, -49, -29, -237, 54, 9, -45, 126, 90, -46]
4223d6nN0nn39N83J28l11P9j33p0M41j04k97K20r9r6k1J97k67M82j23j47l8J18
4247cn3j27M2J51K99k75p5K30n6N2l75J4K48n6J31J30m58K19l89M54j29N9j09
4270g6K24l69L03J0k97J27O5j15j55J66jm2J55k73Q0L00m8k94K97j46J05j14j
4293i9J56j48L37l04O1r6K9k83L15l42N15n1k43L42k57O5P7k8K24k89P9J21l02
4316a21Q1K6L4o7J3Lj20L61n08L98j09k91K87L49n88L78k57L48l02R3k73K38Q4
4339E7j40J95k23J90o6o3k0L7N4j43k07L67J36m43K82K52l05J18O7k17J37n6K44
4362B53k75J09r2J37o2m91K01J12J76k54M42j10k23K29j35j00J79m1P0L5l74K72
4384E8n7k3m24N64p6lk62M40J0k55M0l70N47k53j31N01k74J18j86J91k39K42j82
$$ y = [-46, -51, -1, -6, -545, 38, 166, -145, -66, -199, -269, 172, 68, -229, -9, -108, -204, -225, -28, -295, 187, 64, -83, -121, -3, -56, -183, -141, 10, 309, 34, -41, 189, 133, 185, -190, -176, 72, 16, 147, 277, -181, 38, -351, 103, -26, 33, -76, 148, -221, 82, 92, -205, -78, -13, -128, -283, -117, -118, -160, -5, -278, -198, 102, 54, -240, 57, -89, 16, -98, -99, 57, -91, 246, -58, 3, -93, -64, -347, -32, -374, 141, 90, -153, 189, -68, -3, 74, 46, 270, -19, 60, 181, -121, -40, -14, 20, -47, -34, -31, -151, 210, -298, 100, -9, -300, -13, 336, -252, 126, -131, 217, -85, 8, -265, -27, 57, -83, 112, -111, 79, 13, -50, -70, -33, 21, -122, -329, 38, 174, -269, 13, 265, -40, 78, 145, -72, 65, 9, 253, -22, 87, -5, 132, 70, -421, -220, -108, 68, -186, 256, 146, -77, 152, 17, -83, 96, 55, 125, 160, -214, 58, 1, -22, -446, 118, 42, 39, -223, 217, 227, -28, 12, -358, 189, -64, -195, 306, 32, 150, -36, 155, -84, 158, -24]
4407b4PK0k66J31K76k3q9Jk90J54O2k77J73P7K78k25j01J57p3j75J82m8O2m2l18
4432c71N09j30J90j89J45r8k53J76Q3j92l9N2J96j26p8J46k49J25p0K43m4k10
4454a84n1K68q3M26l76RM9m7Lk76K05j45L4j35J81L36j8k44j76J03M01k12J90
4477B58k59L62m66j0J14Q1rOk07J02k94K73j29L7k3L25m83O5K81k71J41J04j0
4500a2j06J0J31q0j95M91q4J91m98K44q1N3k91K32j02L53l39M7J74p4Q7K6l1l9
4524A07onJ3l55N35Rj75q9O3P6j28o7j02K00j82J66k93J90j68K8L85j93R2k70
4548a69J48K37k48L3q5j05J44j49J72K83m37j02J03K14J45j31j70J79j62M27l48
4569b1k9K27k18J24n2k79L41R3l38J8K65O3l11J29j34P5J93j35%P2n2J15k41O7
$$ y = [-24, -17, 3, -263, -132, 144, 121, 32, 33, -257, -103, -41, -318, -145, -68, 210, -15, -116, 41, -32, -207, -25, -73, -11, -53, -371, 138, 8, 198, 9, 154, 56, -197, -21, 62, -130, -169, -117, 79, -47, -125, 21, -228, -103, -173, 70, 26, -184, -235, 33, -50, 376, 0, 9, 58, 11, 14, -262, -57, -202, -168, -303, -122, 214, 196, -48, -224, -121, 280, 68, 258, -1, 361, -105, -115, -1, 80, 71, 77, -130, -28, -322, -49, -178, -141, -164, 161, -322, -257, 24, -247, -106, -2, -12, -118, -108, 23, -57, -252, 239, 155, 346, -152, 92, 11, 64, -227, 5, -97, 256, -83, -36, 138, 64, 151, 177, 146, 107, 101, 96, 109, -246, 289, 298, 123, 34, 97, 173, 45, -22, -124, 76, -106, 60, -233, -43, -211, -183, 202, 9, 101, -169, -21, 216, -32, 1, -84, -189, -45, -194, -22, 261, -176, -278, -175, 39, 184, 53, -117, 62, -100, 327, -21, -50, 177, -41, 83, 31, -248, 93, 186, -152, -134, 131, 194, -117, 12, -122, -47, 146, 11, 11, 83, 31, 146, -95, -28]
4593b8J80j53r9k6L60l67L7J37j59M4j20K00j76J09M3k73J96L25l50%l3J20Q3
4616E0k40M6K09J3j8j88L66k00j21N5M7j7J28j71r5P6K17k00o1M5K65l37j00J74
4640e7J82j5j8j78J3k32r6N16k28K57l6j00J13j03o7k74O4L57M4j64K17j45O9
4663A19L8l01p0L63o8k15K76km12N26n2j7q7rL4l00r1L80j49l37K59J73q5J38
4687A11k35Q7j01p7L49j19K91l20k7J99p8l22P4k5L70j90j35J57K28m36J59Q0
4709D0J35k2j68m8l2K64j58k03M51l86K25p8J72j34k60L94l01L25l27J46J39j99
4731b5J37k08k1L62m51L54k65k9J70R7k48J07l8j30K21k04Q2K26k10K06j69m9
4753h5L42L3J17m18k72L72j40J27k08R7K18k62l9J40j61N2k7L4J24k20k9L62J46
$$ y = [-28, 152, -1, -100, -126, 234, -133, -96, 41, -118, -74, -194, 6, -170, -61, -18, -291, -95, 230, -120, -120, -153, -33, 50, -190, -144, 65, 78, 60, -128, 238, 38, -83, -28, 19, 2, 130, -41, -136, -60, 157, -43, -104, -59, 206, -131, -231, -57, 125, 110, 92, -86, -73, -305, -401, 115, -113, 144, 108, 8, 121, 18, -49, -323, -259, 98, 142, -22, 195, 50, 119, 157, -144, -214, 149, 81, -134, 142, 140, -272, 254, 202, 185, 98, 89, 123, -177, -268, 112, -37, -374, -115, 58, -27, 111, -124, -37, -138, -215, 134, 15, 306, -14, -41, 158, 80, -242, -168, -193, 177, -13, -148, 9, 237, -199, -40, 40, 175, 153, -15, -63, -95, 169, 11, -192, 259, -127, 98, 20, 192, 58, -202, 192, -109, 216, -111, 35, 174, -25, 112, -96, -117, 245, -206, 148, -117, -146, 24, 121, -127, -20, -58, -188, 33, -171, -89, 137, -73, 133, -36, -85, 257, 290, 407, -11, -283, 89, -51, 76, -132, -35, 183, -79, -118, 22, -139, -87, -114, -80, 44, -176, -205, 157, 303]
4776C03j44k11j81L11J8r4Q0p9L9J36l32K9L52l26J51q4Q4R8k21J6O2l01J63J84
4800E3J76r8k20MP9O5j02J1n4j88L19M4m66N72Nj32j91K75k18j34K60r5N2k5K10
4825B02J8j37k15L34m2j30N5k19K97q7m5m2J91l07K05j13J95k67o8P3q7M28l03
4848f4J60l10L32J34j76j11l1K53k54J77o0k64J36L6Qj45L14m29L12qj53k1K20
4871E6M0k28J74n1N9j01J7Oo2J69j53%J44j53L09k70J11M3j90K03j16K5J78k30
4895b0J76j44j16JM7o9K44k18J08J27o4j26j04K50r2k05M43j28j31P8k04L6m5
4918a56L25k52J18qJ29J10j07k27J62q4O2k76N94m41o4J90J27l20N18k51j42N8
4940F5P4N15r26K76j25q9L78J22l11l8kO9Jj4J50K2Pk38j32L23l03L12j35j89
$$ y = [303, 159, -52, -233, 78, 96, 2, 82, 3, 42, 178, -154, -125, 227, -99, 52, -32, 52, 150, -71, -55, 7, -294, -131, 53, 229, 131, -89, -85, -6, 59, -43, -32, -86, -274, 45, 89, -377, 195, 200, 68, -123, 152, -66, -200, 60, -35, 17, -8, 202, 220, 83, -132, 202, 160, 30, 85, -134, 163, 76, 31, -11, 180, -127, 78, -35, 160, -107, -175, -102, -189, 239, -64, 96, -214, 118, 252, 76, -35, -66, 187, -67, 110, 50, -214, -78, -42, -34, -179, 135, -294, 18, 10, -143, -164, 56, 96, -132, 42, -9, 50, -51, -34, -28, -90, 79, -74, -74, 70, -83, 226, -44, 67, 110, -80, 123, 7, 32, 210, -20, 156, 12, -104, -103, -56, -125, 119, -99, 9, 136, 72, -54, -158, 92, 0, -205, 238, 110, -21, 57, -147, -111, -156, 169, -83, 35, 27, 156, 266, 159, -68, 94, 10, 72, -204, 390, -51, -115, 75, 202, -118, 400, 149, 7, 65, 139, 654, -272, 4, -121, -210, 168, 290, -21, -59, -61, 8, 9, -5, 145, 167, 174, -64, -196, 127, -176, 136, 1, -188]
4964a88K30J92k99J18l78M17l83M85m42M56k31L4m0j26L44m49L32j46L04k28r4
4985i2Q7N0k55J78j01K2J00k10J80k2L3P3q2J33n4M8m0L1k22m9L18M01m15l05
5009a93K16rk10k5K48m8l7j83K89J63m36K08L49k21L2m69L80j45J29j85k7J69
5031ej63N2j29J70n1k81M37j36J04L13k26J16K7l52K21j51l4R4J34j36K47q2l01
5054a32P8K19k8R3r4k5l70L1J48J89K26l32J19l5J56j71K30j79J47k13k02N7l
5077i1K8J86J38m25P1J38p8J87l8N1l06K82l02K41M3j78L19l66r8n4L0N49l33
5100fp4L49n39J23P7J17j63l16M38jJ8j62L83j2j42K26k96r8k65M19j19k20L85
5123A22j55K12j69J9J13k23j8J97Ro3m9k10K59Q3P8J67j82m2k18J15j71mM73j64
$$ y = [-188, 42, 234, -65, 53, -325, 92, -291, 194, -248, 208, -23, 11, -29, -155, 189, -260, 72, -74, 230, 2, -92, -5, 45, -210, -32, -133, -111, -11, -221, -41, -63, -30, 43, -39, 94, 40, 88, 48, 79, -143, -192, 126, 527, 112, -193, 23, 14, -196, -221, 27, -21, -58, -241, 48, 211, -225, -17, 332, 111, 143, -326, 54, -91, 38, -147, -174, -5, -168, -116, -245, -75, -126, -407, 30, -106, -2, 311, 85, 201, 228, -124, 97, -54, -88, 6, 140, 4, 251, 169, -132, -54, 165, 137, 230, 136, 111, -259, -228, -80, 109, 335, 3, 122, 87, 243, 72, 302, 123, 270, 57, -145, -88, -91, -63, 123, 261, -164, -93, 45, -33, 154, 116, 167, -139, 143, -159, 82, 125, -53, 266, -100, -198, -252, -222, 327, -6, -80, 269, -270, -147, -70, 47, -116, -432, 6, 5, 23, -139, 244, 232, 90, 316, 20, -78, -343, 76, -43, -263, 122, -33, 179, 10, 29, 142, -81, -99, 98, 107, 44, -5, -215, 44, 127, 205, 372, 190, 148, -70, 45, -126, -130, 343, 179]
5147A79j25j12J4J19m8j1J58l00J69k91L62k11L42k32K00l28J01K9k89O17l01
5168D2M3J2l6Q5j42Kj90M18q2J23j95n75P70k30j31J51q0M09j63k88J15K37j51
5191A44j66K67k73J76j37k55K4L20j30J43K61m07j34j64K11M5J25j23K96k71k28
5212b76K13J79j59RK34p4r4J15o2k67J75J37m91K52P8M9L0j61J95r6J29j79N9
5235eJ8Q6j53k30K75J2j8j76K18P9m51L79p4L80l21J37j32J66j50p4J88l46J09
5258h3k9Jj24L74k37J14J62j39J24m5n0k16J7l2O5J72K8k03L15j72K3p7m9L2M8
5283A9o7j87j14J92J00j05P0L80l76K3P8L9R9m58K36L57j57j49K06l57K18K32
5305B79q6k31M0N1j8rm6J76p3j77L23j72j85O6R8R0k80J0J25N7J31j46P2m46M14
$$ y = [179, 54, -58, -44, 75, 27, 16, 174, -126, 43, -248, 114, -97, 245, 13, 213, -115, -14, 15, -274, 343, 42, 85, 97, 61, 146, 4, 6, -184, 234, 152, 275, 80, -495, 275, 45, -86, 65, -15, 394, 231, -57, 58, 295, 144, -22, 245, -28, 148, 11, -244, -220, 100, -30, 113, 374, -33, -167, -331, -120, -75, 50, -73, 223, -48, -276, -63, 116, -43, -34, 200, 126, 32, 147, 85, -182, -7, 130, -361, -109, -31, 18, 48, -113, 82, -14, 115, -64, -5, 13, 99, -54, -284, -9, 3, -15, -191, 27, 106, -345, 34, -40, 340, 19, 156, 24, 190, 40, -34, 154, -192, -83, -112, -111, -235, 139, -98, 16, 178, 39, 163, 118, 68, -148, -131, -163, -98, 74, 102, -101, 214, 42, 65, -12, -61, -29, 19, -48, -235, -349, -157, -57, -162, -92, 288, -88, -65, 13, 52, 151, -307, -71, 286, 129, -20, 186, -171, 47, 279, 193, -38, 2, 53, 35, 26, -20, 156, 83, -94, 229, 57, -128, -62, 36, 126, -154, -144, -19, 38, 169, 23, 95, -351, 63]
5330F3k25P6k5J10o7j24M80l46M0K51j78j03J2O9K0Ro3r8k09K25M02k18m7o6j69
5355a81J76R4k42K04l3L7p6K81k10J57k54J84j95M06l54J03J49j67k99R2n1L54
5377A75l80K97l62LM81O1j63m67M35j61j24k9M18k9k93N4K26j44K3k50Q1M3j07
5400b12K14J1j5k4M9mL79k85k47L59j25k47J85j21J53j19R8l9j68J48j3J00Ol80
5424b97J99Rn0M4n3J79N8j45l2O4K46l23J87j11L3k75L90j4l15L84k02j03KP3
5448e2J26k33K61L4O0l59Q9K96j65j0l03N44k28m5j5Jm4J30l7J8n5Q3k06N2J63
5473A05k28l0k3J41J05M6q0n1J59k72N0J43j28J90j12M5l17K73J02K67n00P0K15
5496A70k55K70l03K92j49J02J90k09J4j00j6r1K91l49k23K94J36K2M5l9k06K37
$$ y = [63, -162, -86, -111, -1, -68, -192, 288, -58, -18, 233, 55, -48, -36, 33, 53, 62, -1, -99, -308, -83, 319, 101, 54, -12, -181, -5, 89, -153, 51, 18, 55, -21, 260, 50, 207, -47, 137, -58, 348, -6, 97, 246, 79, -220, -128, -179, 175, -205, 92, -270, -267, 214, 275, 112, -355, 80, -81, -205, -234, 184, 155, -138, -84, 142, -2, 21, -229, -148, -105, -212, 2, 13, -2, -26, 23, 19, 398, 113, -134, 225, 100, -147, 38, -83, 70, -49, 49, 10, -158, -10, -23, 77, 83, -297, -98, -89, -139, -95, -148, 31, 89, -56, -88, -24, 222, -101, 86, -25, 8, -267, 123, 109, -206, 178, -24, -127, -125, -52, 74, -159, 102, 136, 196, -163, -74, 222, 57, 47, -256, 288, 60, 15, 0, 1, -43, 87, 50, 68, 13, 96, -110, -58, 105, -123, -153, -176, -35, 70, 116, 36, -15, 144, -128, -78, 65, -63, 127, 15, 60, -257, 16, 118, 385, -115, -45, 170, -85, 185, -118, 174, 25, 127, 317, 108, 122, 22, 6, -85, 206, -143, -366, -72, 64, 86, 131, 92, -114, 123]
5518A23m41L05P8k17Q2R8k09P2J31qP2R6k42J49J41k27K41r5J4r9J2O1J29m78
5542b12L80q3o0o6J79l0n9k02J94P5lk88J1L08l29J28K32k12O9J50j69m63O6N45
5566A61P1k55k9l0j14M86l33k3M5R2J73k94m3r9K15L6l35J35J90q7K01l34j26
5589b97N18j38j45L05k72l2J23m17M75j24J03l0j02j14P6L76l64k30L69l1J04
5610A53O5q0O2q5m8kj47K44k89L9J06k1j40m2J55R1q5J43p1k25L15m08K99L2L1
5635I2j48L57j23l52mJ36m3r7J03K60k56l06K88O2J97k24M9J24M3j94j38J76o1
5658e9r1l4J32j4k1K8M7J04k4k22J67L1N8k15n4J72j09J50p5L1L9k15J69O9J0
5683G4j16K0L42l21N6l44J46K58q1J82J09j92j66m1L40r0j83K69k23K26p0j67
$$ y = [123, -318, -13, 65, -152, -70, 28, -181, -109, 22, 14, 86, 182, -60, 89, 230, 3, 244, 149, 163, 64, 76, 137, 266, -212, 168, 85, 25, -41, 138, 108, 49, -153, 41, 116, 113, -175, -164, 144, -185, -57, 175, -37, 32, 182, 13, -450, -384, 161, 232, -23, -52, -82, -196, 290, -43, -66, -21, 71, 244, -50, -93, -192, 23, 59, -276, -141, 49, -38, 163, -171, -297, 221, 83, -62, 243, -29, -61, 62, -355, 120, -4, 99, 69, -33, -147, -71, 305, -59, -289, 80, 49, 153, 218, 138, 200, 115, 67, 65, -82, 162, -127, -88, 18, -3, -143, -185, -30, 61, -24, 119, 48, -177, 138, -270, 29, 61, 92, -56, 301, 178, -174, -178, -42, -85, -182, -79, 181, -75, -381, -93, -31, 166, -58, -9, 115, 158, -36, -174, 2, -59, -150, -184, -52, -66, -87, -59, -12, 92, 68, -154, 13, 44, 102, -113, -167, 5, -104, 46, -29, 2, 41, -174, -5, 64, 74, -42, -22, 320, -1, 55, -289, -143, 115, 34, 216, 325, 133, -33, -74, 266, 176, -7, 262, 39, 265, 195, 28]
5705B8K7K90l55K39l29J78l37J49Q3l4r7J60k3r1L15k68j75J19j13L54j53l6J5
5728e4j8R8k95J33J51L2P9k61O2j53Q8J23J5j01L35k08q4K3K09l51J85q6j63J96
5752d5o1J51k00K84k14K31k66p8J07J41j7J40k08Q5r1%J7m9o9L09j78J49k27K44
5776A55j55r8N1J87J4m21K00R4j15k8J09J32n3j70L96m29L27l61k5l3L80j18K53
5799B92k72N2p0o5p7N33m18k75J56m2j6M03l47K19p2Q9J7Mk97N16l97J13k65K74
5823E5j10r7J12J7K8j63pJ86P6n19O03k23J24J5n2k11PL00l66P8P9M03l05N2k68
5848a86J48j87J32M2m1L52l43O5J94k23l22L33K6r5L20n11M19J1j63J51j29J99
5870A92j76k10J51L09m47K82j52l2OO5J41n9j27ml3k34K85J73k30J32L0k0k0J33
$$ y = [28, 55, 345, -10, 229, -100, 78, -259, -110, -27, -61, -158, 2, -21, -112, 203, -65, -240, -121, -234, 120, -33, -69, -54, -72, 26, -269, -136, 15, 47, 126, -135, -73, -226, -138, -15, 0, -101, 234, 26, -58, -35, 174, -177, 8, -78, -241, -45, -106, 45, -155, 129, -85, 146, -120, -198, -91, 50, 33, 173, -35, 50, -41, -41, -24, -73, -142, 167, -11, 138, -89, 155, 0, -98, -47, 140, 154, -267, -67, 27, -88, -116, -7, 125, 72, -98, 298, -131, 196, -165, -190, -223, 157, 39, 292, 20, 72, 2, -63, -140, 393, -25, -300, -144, -186, -202, 201, -146, 73, 1, 90, 107, 111, -186, 330, -67, 46, -219, 55, -55, -152, -40, -23, 5, -158, -165, 21, 97, -422, 181, -42, 82, 97, 45, -166, -159, 141, -225, -147, -68, 335, 30, 82, -186, -38, -225, -93, -51, -92, 260, -83, -18, 176, -47, -369, -36, -10, -105, 215, -296, 123, 134, -29, 122, -7, 192, 16, -194, -43, 266, -181, 101, -51, -83, -77, -12, 129, 70, -57, -61, -94, -328, -43, 130, -100, 32, 62, 42, 22, 155]
5894A55k62K63k17M68m47J02q6l4K73l76J73L7J6k18o9J40Q8J05m3k6p6K91k02
5917E5M2j09L5J0j53K51l0o1m7P8K17m48L76j33J15k14N2k9%m8j18J45k42L45
5941H9J8J26l6j01k62J22j84K79j41J88k2J98m22K07m9k98L14j11M9M5l0K30q6
5964A23m9k33R1J7n5J00m1L9K37j81m4P7J0j42j21L2K52k03M02m92J32K51l30
5987a28K04j50K21m09N18J52k10l56N6K85k76L3j43K32L5j81N5J93j86jj58L4
6009a80J01j9k3J01n0M0N7q4O2j97J19Q2M0K5k33K14j73P8N4j7jl1k5K78m06J78
$$ y = [155, -107, 156, -61, 407, -40, 62, -24, -58, 215, -161, 12, 49, 65, -153, -222, -82, 6, 111, 68, 42, -34, 257, 55, 97, -12, 23, 33, -120, 131, 101, 40, -7, 71, 288, -160, 216, 83, 198, -16, 36, 7, 7, -41, -159, -14, -256, 89, 107, 233, 197, 96, -166, -44, -228, 51, -90, 98, 76, 274, -148, 59, 10, -288, 26, -85, -36, 9, -21, 209, 123, 74, -159, -68, -51, -106, -6, -47, -8, 229, 48, 4, 81, 91, -51, -172, -140, 112, -91, 311, -181, -49, 202, -128, 76, -74, 147, -262, 256, 408, 198, -158, -102, 183, -93, -60, -203, 29, 64, -117, -62, 131, -55, -56, -214, -180, -79, -98, -121, -20, -70, -30, 27, -57, 5, -192, -73, 9, 49, 74, -159, 55, -118, -40, 14, -3, -4, -35, -60, 218, -188, -10]
$$ [...]
8191e4
##END NTUPLES=NMR FID
##END=
