##TITLE=1H_LR-688B-C4-EtOAc2S
 DMsO-d6, 8 sc, 
 3.3.2020
##JCAMPDX= 6.0         $$ Bruker NMR JCAMP-DX V2.0
##DATA TYPE= NMR FID
##DATA CLASS= NTUPLES
##ORIGIN= UXNMR, Bruker Analytische Messtechnik GmbH
##OWNER= root
$$ XWIN-NMR		Version 3.5
$$ Tue Mar  3 14:41:43 2020 Russian Standard Time (UT+4h)  she@DPX200
##.OBSERVE FREQUENCY= 200.1315
##.OBSERVE NUCLEUS= ^1H
##.DELAY= (6, 6)
##.ACQUISITION MODE= SIMULTANEOUS
##.ACQUISITION SCHEME= undefined
##.AVERAGES= 8
##.DIGITISER RES= 18
##SPECTROMETER/DATA SYSTEM= spect
##.PULSE SEQUENCE= zg30
##.SOLVENT NAME= DMSO
##.SHIFT REFERENCE= (INTERNAL, DMSO, 0, 15.7039)
##AUDIT TRAIL= $$ (NUMBER, WHEN, WHO, WHERE, WHAT)
$$ ##TITLE= Audit trail, XWIN-NMR		Version 3.5
$$ ##JCAMPDX= 5.01
$$ ##ORIGIN= Bruker BioSpin GmbH
$$ ##OWNER= she
$$ F:/spectra/data/she/nmr/H-F/1/audita.txt
$$ ##AUDIT TRAIL=  $$ (NUMBER, WHEN, WHO, WHERE, WHAT)
(   1,<2020-03-03 14:40:33.39 +0400>,<she>,<DPX200>,
      <created by zg, POWCHK disabled, PULCHK disabled
       configuration hash MD5:
       00 E9 B6 7A A2 85 ED C7 34 08 36 98 17 FE 4E 26
       data hash MD5: 16K
       E8 E3 74 36 4E D4 FA 7E D8 6B FF 84 59 2B A1 87>)
$$ ##END=
$$ 
$$ hash MD5
$$ 9E 98 09 62 2A D7 65 9C 10 9C 50 E2 B3 FD 15 C8
##$RELAX= 
##$RELAX= 
##$RELAX= 
##$RELAX= 
##$RELAX= 
##$RELAX= 
$$ Bruker specific parameters
$$ --------------------------
##$DU= <F:/spectra>
##$EXPNO= 1
##$NAME= <H-F>
##$PROCNO= 1
##$TYPE= <nmr>
##$USER= <she>
##$AMP= (0..31)
100 100 100 100 100 100 100 100 100 100 100 100 100 100 100 100 100 100 
100 100 100 100 100 100 100 100 100 100 100 100 100 100 
##$AQSEQ= 0
##$AQ_mod= 1
##$AUNM= <au_zg>
##$AUTOPOS= <>
##$BF1= 200.13
##$BF2= 200.13
##$BF3= 200.13
##$BF4= 200.13
##$BF5= 200.13
##$BF6= 200.13
##$BF7= 200.13
##$BF8= 200.13
##$BYTORDA= 1
##$CFDGTYP= 0
##$CFRGTYP= 5
##$CHEMSTR= <none>
##$CNST= (0..31)
1 1 145 1 1 1 1 1 1 1 1 1 1 1 1 1 1 1 1 1 1 1 1 1 1 1 1 1 1 1 1 1 
##$CPDPRG= <>
##$CPDPRG1= <>
##$CPDPRG2= <>
##$CPDPRG3= <>
##$CPDPRG4= <mlev>
##$CPDPRG5= <mlev>
##$CPDPRG6= <mlev>
##$CPDPRG7= <mlev>
##$CPDPRG8= <mlev>
##$CPDPRGB= <>
##$CPDPRGT= <>
##$D= (0..31)
0 1.2 0 0 0 0 0 0 0 0.06 0 0.03 0 0 0 0 0.0002 0 0 0 0 0 0 0 0 0 0 0 0 
0 0 0 
##$DATE= 1583232032
##$DBL= (0..7)
120 120 120 120 120 120 120 120 
##$DBP= (0..7)
150 150 150 150 150 150 150 150 
##$DBP07= 0
##$DBPNAM0= <>
##$DBPNAM1= <>
##$DBPNAM2= <>
##$DBPNAM3= <>
##$DBPNAM4= <>
##$DBPNAM5= <>
##$DBPNAM6= <>
##$DBPNAM7= <>
##$DBPOAL= (0..7)
0.5 0.5 0.5 0.5 0.5 0.5 0.5 0.5 
##$DBPOFFS= (0..7)
0 0 0 0 0 0 0 0 
##$DE= 6
##$DECBNUC= <off>
##$DECIM= 24
##$DECNUC= <off>
##$DECSTAT= 4
##$DIGMOD= 1
##$DIGTYP= 9
##$DL= (0..7)
0 120 120 120 120 120 120 120 
##$DP= (0..7)
150 150 150 150 150 150 150 150 
##$DP07= 0
##$DPNAME0= <>
##$DPNAME1= <>
##$DPNAME2= <>
##$DPNAME3= <>
##$DPNAME4= <>
##$DPNAME5= <>
##$DPNAME6= <>
##$DPNAME7= <>
##$DPOAL= (0..7)
0.5 0.5 0.5 0.5 0.5 0.5 0.5 0.5 
##$DPOFFS= (0..7)
0 0 0 0 0 0 0 0 
##$DQDMODE= 0
##$DR= 18
##$DS= 0
##$DSLIST= <SSSSSSSSSSSSSSS>
$$ [...]
##$SUBNAM2= <"">
##$SUBNAM3= <"">
##$SUBNAM4= <"">
##$SUBNAM5= <"">
##$SUBNAM6= <"">
##$SUBNAM7= <"">
##$SUBNAM8= <"">
##$SUBNAM9= <"">
##$SW= 24.9337058887773
##$SWIBOX= (0..15)
0 0 2 0 0 0 0 0 0 0 0 0 0 0 0 0 
##$SW_h= 4990.01996007984
##$TD= 16384
##$TD0= 1
##$TE= 0
##$TE2= 300
##$TE3= 300
##$TEG= 300
##$TL= (0..7)
0 120 120 120 120 120 120 120 
##$TP= (0..7)
150 150 150 150 150 150 150 150 
##$TP07= 0
##$TPNAME0= <>
##$TPNAME1= <>
##$TPNAME2= <>
##$TPNAME3= <>
##$TPNAME4= <>
##$TPNAME5= <>
##$TPNAME6= <>
##$TPNAME7= <>
##$TPOAL= (0..7)
0.5 0.5 0.5 0.5 0.5 0.5 0.5 0.5 
##$TPOFFS= (0..7)
0 0 0 0 0 0 0 0 
##$TUNHIN= 0
##$TUNHOUT= 0
##$TUNXOUT= 0
##$USERA1= <user>
##$USERA2= <user>
##$USERA3= <user>
##$USERA4= <user>
##$USERA5= <user>
##$V9= 5
##$VALIST= <valist>
##$VCLIST= <CCCCCCCCCCCCCCC>
##$VD= 0
##$VDLIST= <DDDDDDDDDDDDDDD>
##$VPLIST= <PPPPPPPPPPPPPPP>
##$VTLIST= <TTTTTTTTTTTTTTT>
##$WBST= 1024
##$WBSW= 4
##$XGAIN= (0..3)
0 0 0 0 
##$XL= 0
##$YL= 0
##$YMAX_a= 200162
##$YMIN_a= -74739
##$ZGOPTNS= <>
##$ZL1= 120
##$ZL2= 120
##$ZL3= 120
##$ZL4= 120
##$ABSF1= 10
##$ABSF2= 0
##$ABSG= 5
##$ABSL= 3
##$ALPHA= 0
##$AQORDER= 0
##$ASSFAC= 0
##$ASSFACI= 0
##$ASSFACX= 0
##$ASSWID= 0
##$AUNMP= <proc_1d>
##$AZFE= 0.1
##$AZFW= 0.1
##$BCFW= 1
##$BC_mod= 2
##$BYTORDP= 1
##$COROFFS= 0
##$CY= 11.3945322036743
##$DATMOD= 1
##$DC= 2
##$DFILT= <>
##$DTYPP= 0
##$F1P= 16.9975609425685
##$F2P= -3.02152046262296
##$FCOR= 0.5
##$FTSIZE= 0
##$FT_mod= 4
##$GAMMA= 1
##$GB= 0.15
##$INTBC= 1
##$INTSCL= 1
##$ISEN= 128
##$LB= 0.24
##$LEV0= 0
##$LPBIN= 0
##$MAXI= 10000
##$MC2= 0
##$MEAN= 0
##$ME_mod= 0
##$MI= 1.114404
##$NCOEF= 0
##$NC_proc= 0
##$NLEV= 6
##$NOISF1= 3.799351
##$NOISF2= 2.8
##$NSP= 1
##$NTH_PI= 0
##$NZP= 0
##$OFFSET= 15.70392
##$PC= 1
##$PHC0= -9790.872
##$PHC1= 19.60082
##$PH_mod= 1
##$PKNL= yes
##$PPARMOD= 0
##$PSCAL= 0
##$PSIGN= 0
##$REVERSE= no
##$SF= 200.130013532006
##$SI= 16384
##$SIGF1= 3
##$SIGF2= 2
##$SINO= 400
##$SIOLD= 16384
##$SREGLST= <1H.CDCl3>
##$SSB= 0
##$STSI= 0
##$STSR= 0
##$SW_p= 3612.71676300578
##$SYMM= 0
##$S_DEV= 0
##$TDeff= 0
##$TDoff= 0
##$TI= <>
##$TILT= no
##$TM1= 0
##$TM2= 0
##$TOPLEV= 0
##$USERP1= <user>
##$USERP2= <user>
##$USERP3= <user>
##$USERP4= <user>
##$USERP5= <user>
##$WDW= 1
##$XDIM= 8192
##$YMAX_p= 0
##$YMIN_p= 0
$$ End of Bruker specific parameters
$$ ---------------------------------
##NTUPLES= NMR FID
##VAR_NAME=  TIME,          FID/REAL,        FID/IMAG
##SYMBOL=    X,             R,               I
##VAR_TYPE=  INDEPENDENT,   DEPENDENT,       DEPENDENT
##VAR_FORM=  AFFN,          ASDF,            ASDF
##VAR_DIM=   8192,          8192,            8192
##UNITS=     SECONDS,       ARBITRARY UNITS, ARBITRARY UNITS
##FACTOR=    0.0002004,     1,               1
##FIRST=     0,             0,               0
##LAST=      1.6414764,     0,               0
##MIN=       0,             -74739,          0
##MAX=       1.6414764,     200162,          0
$$ Real data points
##PAGE= N=1
##DATA TABLE= (X++(R..R)), XYDATA
$$ [...]
1900A61j33j31K20k54M30l19K34j0M4r4k54J80j83K07q1q5J51J6k8l18J72j98
1922b73K04J68j65K8r3M34o32M04L2k10q2K19j36K7J51k10K87r2p4Q1j64J3J47
1945F4m0p7L39l10rK90k93L16l36j04k6M7k96K70K51j90P1o9l5r0J79j90J60K06
1969A28l76J85j23M06j33j27R5l64K01L6l24M66j21LJ89p4k2K12m68L03j32j67
1991b07P9J84j02O1Q1m88M45O1m7j52k98N18k22N4j24j70L42M5j48K42j73K05
2013A86J19o40K76K69m25L08J60j70j55P3M0k06L8L30l53P8qk7J58k93J58j55
2035b39L3J20J80m5J34j70j05K0R6l20N11K27k01j83j77J53j75O19k09m9k53J12
2057G9n9j08L04j95J03l19M0J50j23J09K91l31K22l44J42J65j54J12J22j88K05
$$ plain form
1900 161 28 -103 117 -137 293 -26 208 198 242 148 -106 74 -109 98 17 -68 83 99 71 -247 -75 -273
1922 -273 -69 99 -66 -38 -131 303 -329 75 107 -103 -185 34 -102 -75 76 -134 153 61 -13 68 -96 -83 64
1945 64 24 -53 286 -24 -33 257 -36 280 -56 -160 -186 -139 -435 -165 86 -104 -33 -102 -137 -227 -48 -238 -78 128
1969 128 -248 -63 -186 220 87 -40 55 -309 -108 -72 -396 70 -51 -48 141 67 45 257 -211 92 -40 -207
1991 -207 -128 56 -46 15 96 -392 53 114 67 -85 -383 135 -87 -33 -157 -327 15 60 -88 154 -19 186
2013 186 305 -335 -59 210 -215 93 253 83 -72 1 41 -165 -127 203 -150 -72 -80 -107 51 -242 -84 -239
2035 -239 -206 -86 94 49 183 13 -92 -72 24 -296 215 442 241 58 -119 34 -141 478 269 220 -33 79
2057 79 20 -88 216 21 124 -195 -155 -5 -128 -19 272 -59 163 -181 -39 126 -28 84 206 18 223
2078B23n06M44k04K15k92K94q6k59O1K11J51k81J2j47oJ93L07k76J89k11j76L7
2100a07L29r5l3p8P0k53N47n04O4P0q1L12j79j37J7q2m5Lk39N95P3o0l87L32n08
2125c76N01l43L5N9L32L0j08o9N1k68j4J66j07L13j16j79K36N9k59Q8J36m13K40
2148fk0j03K76j57J2k47K68O2j61J65rj55j15pK48l96L12K71l24j05M52m65l0
2171b34K93o5J84j80j24L21k98o1L13m27K33P2O1k4J23j43J0J22j55l22J22K71
2193I2l12J61J42m0j6k01K28J69j00k12K12k77M51k36N0k21J89k73J32j25M8J73
2215C4j83K87l14K8K82j59J09M5J7k44l9j22J94K01j95J06K4k22R5q2K3PQ1m1
2239f8k6K39j29k2J90k82K74r0j96J73K75k74j53L06n41L81J17J84m64M3L00l72
$$ plain form
2078 223 -283 161 -43 172 -120 174 88 -171 -110 101 252 -29 -17 -164 -170 23 330 54 243 32 -144 -107
2100 -107 222 127 94 16 86 -167 380 -124 -60 10 -71 241 62 -75 -58 -140 -185 -182 -421 174 247 187 -200 132 -376
2125 -376 125 -218 -183 -124 208 238 130 61 112 -156 -170 -4 -111 202 86 -93 143 202 -57 31 167 -246 -6
2148 -6 -26 -129 147 -10 2 -245 23 85 -76 89 80 -75 -190 -197 51 -345 -33 238 -86 -191 261 -204 -234
2171 -234 59 -6 178 -2 -126 195 -103 -164 149 -278 -45 27 88 64 187 44 54 176 21 -301 -179 92
2193 92 -220 -59 83 43 27 -174 54 223 123 -89 123 -154 297 61 111 -110 79 -194 -62 -187 -139 34
2215 34 -149 138 -176 -148 134 -25 84 129 146 -98 -137 -259 -65 136 -59 47 71 -151 -56 -138 -115 -108 -27 -68
2239 -68 -94 145 16 -6 184 -98 176 86 -110 63 338 64 -89 217 -324 57 174 358 -106 -63 237 -135
2261a35K37p9p1k06P4K32o1j1J04o1J9k38K59r4J9n1K54j99j12K04m6k06J57K09
2285A98m6k40l0K57j52j09J56j37Q8J52M3N9j45j84K67r8J24l66N0K30m20K83
2307b0J37j76J43n21K83J22r1J96J19j30j31j3K67l75K40M5k53J68m2K04j80M8
2329D0m86M67j11o1L06J03l59K0j2J7Q3L0K01l17K44o9l75r8L71p1o9L06r1p4
2353el3j84K13j51O6j91P19l58o1K75k69p5K47j88q1R7j20J11j00K78l73R9J13
2376B9j02L25l69P7k25L63j60k82M06J01k05j09L39l32l9K38R6j86N2j50J43j74
2398a64K49L53l48j08Mj39J35P0j13K63l56J47J88q5L0j18j56K1M5J16J74j77
2420C1o6m0k26K96K11l38j29J94K24l0k66L92mq8k86O7kl1L4r3M92l34M4j68J88
$$ plain form
2261 -135 102 23 -48 -254 -180 52 -9 -20 84 23 42 -196 63 -31 -12 -63 191 -8 -120 84 38 -168 -11 198
2285 198 152 -88 -118 139 -13 -122 34 -103 -15 137 180 239 94 -90 177 79 203 -163 -113 117 -303 -20
2307 -20 117 -59 84 -437 -154 -32 -123 73 192 62 -69 -82 185 -190 50 95 -158 10 -32 172 -8 40
2329 40 -446 21 -90 -151 155 258 -101 -81 -93 -76 7 37 238 -79 165 96 -279 -377 -6 -77 -146 160 69 -5
2353 -5 -38 -222 -9 -160 -94 -285 434 76 15 290 21 -54 193 5 -76 21 -99 12 -88 190 -183 -84 29
2376 29 -73 252 -117 -40 -265 98 -62 -344 62 163 -42 -151 188 -144 -183 55 151 -35 17 -133 10 -164
2398 -164 85 438 90 -18 -14 -153 -18 52 -61 202 -154 -7 181 96 126 8 -148 -127 -82 34 208 31
2420 31 -35 -75 -301 -5 206 -132 -261 -67 157 127 -139 253 249 161 -125 -58 -60 -91 -57 -150 342 8 52 -116 72
2445G2l14L23k18Jl6Q1J25J78P4j54l26J85J88j64J20l20J95Q4k02M05m87J24
2467f6k88P00n12L02k43j12L05l7j73K86l81K03J05k64J21k98M31n8K12l62l9
2488a68J0K35N8m7l13L22J34l91L99j54R5k57J29j42L61l25NJ50j15o8N2M5Nm6
2512b6j45J38j21M54k12j22l3J50oJ9l33K62O8P8k41J65m03K89L4J76l02J07q
2535a2j19K33m00L58k59J15N9J48k03J3Rj52n2K33l5o9Q1j15K0J5q0K69R3L4k47
2560f3Pj21k3M47j18l59K15k45L36K56m69j7K20L3p6K6j17J55j48J31J18l70J15
2583f7m9q9L45m12K64J12M24m14k04O8M4J56L58o63J84Q5n1L0k88l2K88%O7j21
2607C5nK42m04j22J64J73p6o2J17j13k4k48R0J24J27n6K4J05j73M19j85l88L66
$$ plain form
2445 72 -242 81 -137 -136 -172 -91 34 212 286 132 -194 -9 179 15 135 -185 10 94 -108 297 -190 -66
2467 -66 -354 346 -166 136 -107 -219 86 49 -124 162 -219 -16 89 -175 -54 -352 79 21 233 -129 -168
2488 -168 -158 77 135 88 -225 97 231 -160 239 85 180 -77 52 -90 271 -54 -49 101 -14 -82 -30 15 20 -26
2512 -26 -171 -33 -154 300 88 -34 -67 83 77 96 -237 25 93 171 -70 95 -308 -19 15 191 -111 -4 -12
2535 -12 -131 102 -298 60 -199 -84 -25 123 -80 -67 -58 -210 -262 -29 -64 -133 -52 -167 -147 -132 -212 57 150 184 -63
2560 -63 -56 -177 -200 247 129 -230 -15 -260 76 332 -137 -154 66 99 23 49 -68 87 -61 70 188 -182 -67
2583 -67 -116 -205 140 -272 -8 104 528 114 -90 -22 22 178 536 -127 57 142 91 121 -167 -199 89 89 156 35
2607 35 30 272 -132 -254 -90 83 7 -55 62 -51 -75 -323 -233 -109 18 -38 -14 91 -82 337 152 -236 130
2630A30l8j69L36k67r0J78l9J13k16L52l34M0R2k1l6k57L33L3%o1j86K82K9j88
2654A6K35l58oP3L05k98N1N5OJ2k87K61j05m3m1Lj8j74L64j15j01Q5Q1K06R6l64
2680f1j32k99K08N84L4j47J4k33o1j35J82J09K9k07L35k96J15n2J80l79P7K76
2702A41l57M32p3o4j1R2o9k47L43l51K51j9k48j7N99r7l91K08k68K57r0N3j80
2725a06J73J55k24K77k82K52k28J38l15j6N7l1J92k05r1j81L16J26J71l44M16
2746B50k77K7k95M25r5L74n57K51l0j82J39k02L53j34P4j5J1k52k18J43L17k80
2768a73M15q3l02K91j23k41K88j83L41j30k22K16j52K24k26j54L01oJ6l98K33
2789f8OJ26k8L9l70J77J39k35N19k29j8J13p1j22j78M0J63J74k86m3k49K29L17
$$ plain form
2630 130 92 -77 259 -8 -98 80 41 154 -62 290 -44 -4 88 67 31 -226 107 140 140 79 -107 175 204 16
2654 16 251 -107 -113 -40 265 -33 18 73 79 91 -196 65 -40 -83 -124 -121 -139 -313 51 -64 -165 -80 1 207 303 -61
2680 -61 -193 -492 -284 300 334 187 201 -32 -93 -228 -46 63 92 -115 220 -76 39 -13 167 -212 -135 141
2702 141 -216 216 143 79 68 160 91 -156 187 -164 87 68 -180 -197 402 305 -86 122 -146 111 21 74 -106
2725 -106 67 222 -2 275 -7 245 17 155 -160 -176 -119 -150 42 -163 -254 -435 -119 7 178 -166 250
2746 250 -27 0 -295 130 35 409 -148 103 73 -109 30 -172 181 47 121 106 117 -135 -353 -210 107 -173
2768 -173 242 159 -143 148 25 -216 72 -111 230 100 -122 94 -58 166 -60 -214 87 81 97 -301 -68
2789 -68 -62 64 36 75 -295 -118 21 -214 305 76 58 171 100 -22 -200 -160 3 177 -109 -152 -401 -172 145
2812A45j82L32k09m28M88l51J11J56qn7k02l5M7O17n76M8M23k99k05M5K37k3o0
2835A4j17K08j73K8l6K00j13m41L04j42M07k51J80l0L16k73m3L8Q7k99K1j3K6
2858a02J55k02n3j04M64k47P4J17p9j55j34K67P2k10J88k53M98k63j09j16L39
2879A47o0q4o0Rnj02L06j67L0J95l05J89O2K06n69m7J18J15N44m05K09l23j31
2902a28K41k25M9J26J99l06J57k59K71m5l02L08J47M6o08K68j1J70o8k03M3O3
2924f7K67k69L42l75J39om6J36l00M04k60q9J61J74j23o6Q9k82J65m6k35L70J92
2947B75j87j88K41j00O9k86K39p5K41L37m18J61k94k71L72k24N2M4Q0r1l9j4k00
2970b76L07k61M4m5K08n2J19J92k06k31K44l3j2J41q5N1J0J74O8l08K63k73p9
$$ plain form
2812 145 -37 295 86 -342 146 -205 -94 62 54 -3 -205 -240 -193 424 -152 -104 319 20 -185 -140 97 74 14
2835 14 -103 105 -68 -40 -76 124 11 -430 -126 -268 139 -112 68 38 354 81 38 76 163 -136 -115 -128 -102
2858 -102 53 -149 -202 -306 158 -89 -15 102 23 -132 -266 1 73 -137 51 -202 296 33 -76 -192 147
2879 147 87 3 -57 -48 -53 -155 151 -16 14 209 -96 93 155 361 -208 -255 -137 -22 522 117 326 3 -128
2902 -128 113 -112 -63 63 262 -44 113 -146 125 80 -222 86 233 279 -329 -61 -72 98 30 -173 -130 -67
2924 -67 200 -69 273 -102 37 31 -15 121 -179 225 -35 -124 37 211 88 22 111 -171 -6 -52 -287 83 275
2947 275 88 -100 141 41 110 -176 63 -12 229 566 148 309 15 -256 116 -108 -56 -12 68 -23 -62 -76 -276
2970 -276 31 -230 -186 -231 -23 -75 44 236 30 -201 43 10 -2 139 54 105 115 289 357 49 312 39 -40
2993d0N8j76K34P0j82k6M47m03r6k65L38J32j45K13m25M5PL73Q6j15j74K8L6K00
3017B20k21l84L30K15n14NL48l86K60L1j54L86m18L02l05O8L56l18L24j63k42
3038b60K19j84j7L75M6o7k67L65l28O8k39L09Q3j92k64K42j16R7M12n85L49K5
3060G1k13j32M41P2l25N0j20%L60k05j94lL5K32Kp6k35J55O9L4J59j42J78m38
3084b25J46J16j43J2K6p3L20q0n5j7k52K21j97J39O0k03K76k48P9J17k46J77K90
3107B40k63k79M49k49J85j9r3kK05j60j20J45M5n7L04j96m1j25N7j22K3j79K90
3130C8O0j28P9j08O8K7r7O7%J11N5m26M60l11Q9K29l87PJ85j57Q6J84j89l2J95
3155A05l93J56K17J07J53k08n2l4l6K2k67K02K89J1j50k96pM89l87k19N47j47
$$ plain form
2993 -40 18 -158 76 146 -36 -62 385 -18 -114 -379 -41 91 -54 159 -266 -221 -214 159 245 130 -44 -16 20 220
3017 220 -1 -385 -55 160 -354 -349 -1 -387 -127 -96 -250 136 -282 20 -285 -217 139 -179 145 -18 -260
3038 -260 -41 -225 -242 133 179 112 -155 210 -118 -50 -289 20 103 -89 -353 -111 -227 -130 282 -303 46 71
3060 71 -142 -274 167 239 -86 -36 -156 -156 204 -1 -195 -198 -163 69 71 -5 -240 -85 -16 18 177 35 213 -225
3084 -225 -79 37 -106 -94 -68 -141 179 99 44 27 -225 -4 -201 -62 -2 -205 71 -177 -98 19 -227 -50 240
3107 240 -23 -302 147 -102 83 64 -29 -31 174 14 -106 39 84 27 331 135 94 -31 26 -96 -73 -252 38
3130 38 98 -30 49 -59 9 36 -61 6 6 117 172 -254 206 -105 -16 213 -174 -167 18 -139 -53 131 -58 -90 105
3155 105 -288 -132 85 192 345 137 85 51 15 37 -230 -28 261 272 122 -174 -181 308 -79 -298 249 102
3177A02L02k86l60J00J07O0N9k78Q2J57J93j23j54p9J62j45L20l23J8J72k08J50
3199B8J37P5k05k44M04l60L47j51j40O8o1QO5O7m01L86K95l82L81O5l15k87O1
3222a59K34J41p7Q0j73k45K84K20k27k45K51j98J52Pm89J80K21L46m42J46K08
3243B15k13k95L81k24K82k63J80p2j46q5j0K62J77j94K66j38k32K26l33j7L81
3264A48k54j07M06l44K43j12j63j2J63k52L65Q7l30P0K11j15M3j23%m7L11l38
3286a50m05O58j63%q3N14o93J77L05J98j61l27J24j49K68j4j8j10k35R2J19Q2
3308B9K8j63J47p7K52K3k93J3K05k08k62q4K98J6l6j44L96k15J41j03l9K81j58
3331D7j12k85J47O9K95l32J50J10j08Q8P8l0n09L46j68K72K6o3J02k2j35j85L63
$$ plain form
3177 102 404 118 -242 -142 -35 25 84 -194 -112 45 238 115 -39 -118 44 -101 219 -104 -86 86 -122 28
3199 28 165 240 35 -209 195 -165 182 31 -109 -41 -102 -94 -29 38 -363 23 318 -64 317 382 67 -220 -159
3222 -159 75 216 139 219 46 -199 85 305 78 -167 84 -114 38 45 -444 -264 -43 303 -139 7 215
3243 215 2 -293 88 -136 146 -117 63 -9 -155 -240 -250 12 189 -5 261 123 -109 117 -216 -233 148
3264 148 -106 -213 193 -151 92 -20 -183 -195 -32 -284 81 168 -162 -92 119 4 47 -76 -76 -123 188 -150
3286 -150 -555 103 -60 -60 -143 371 -322 -145 160 358 197 -130 -6 -155 113 99 81 -29 -264 -172 -53 29
3308 29 57 -106 41 -36 216 239 -54 -41 164 -44 -306 -390 -92 -76 -112 -256 140 -75 66 -37 -76 205 47
3331 47 -65 -350 -203 -134 161 -171 -21 89 -19 69 147 117 -392 -46 -214 58 84 21 123 101 -34 -219 144
3354A44k9L45l46j76N0L4L3j62N5rJ73j42J57l66R0K4K71k70L00l84K66k5q0k21
3378b68K06M03l54k10J63K02j60K7O2J82m68J49j41K47J24J2J15k10l79L59J74
3399B35k37p3J36j6k46K99K77j22j41j84n7L69l78K15l0l3J57j04r0O0k8k14L15
3422A10k24J71j31K52l7O7k84L17k33j96K80m1J20l29J99J10m5l36J32K1LR5k35
3445b14L03o9j28n6K95j08j47K8k45L57l1j11L06k71K80l45l3K73r3K3m1r5j57
3468b79L13K66k66J32j33N4j66j26L58j03j34J43j44L16l51J06J32j0j07P5O0
3489A36r2p5%k15K44J63k11J73J44j21m8J01j78j02K7J62K37m34k17K88K24lm74
3512b71J55M9J06L20k15P1k26q5P3j20L46k57j28L58N6j27K54l35M1O7M6jj10
$$ plain form
3354 144 115 460 114 -62 -12 22 55 -107 -52 -61 112 -30 127 -239 -149 -125 146 -124 176 -208 58 33 -47 -268
3378 -268 -62 341 -13 -223 -60 142 -18 9 71 253 -215 -66 -207 40 164 176 291 81 -298 61 235
3399 235 -2 -75 61 45 -201 98 375 253 112 -72 -129 240 -138 77 47 14 171 67 -23 37 9 -205 110
3422 110 -114 57 -74 178 141 208 -76 241 8 -188 92 51 171 -158 41 151 106 -230 -98 -77 -74 21 -214
3445 -214 89 20 -108 -164 131 23 -124 -96 -341 16 -15 -126 180 -91 189 -156 -189 84 -9 14 -27 -122 -279
3468 -279 34 300 34 166 33 87 -79 -205 153 50 -84 59 -85 231 -120 -14 118 108 1 76 136
3489 136 44 -31 -31 -246 -2 161 -50 123 267 146 98 199 21 -81 -54 108 345 -89 -306 -18 206 203 -271
3512 -271 -116 -67 39 359 144 215 -11 -96 -23 -143 203 -54 -182 176 232 105 359 24 65 132 178 177 67
3535F7j72L02R8l05l04P4J13J77j01J78n9j86L81j65L3m61M35J11o3m3j82p6J59
3558A1o3J47NJ51j36k19j89L96k04n7j77K96j88K70k30L2K34j32L67l45M43m89
3580g7l99M51r1m8Q9J04K80l01j84Q9L10j30j97P2j27Q0J30J2k58M7J82j50K62
3603A46J00l88jJ40R3k54K69j28j99L10l52N72m39K6K6K76m96M08k55J07n3J77
3625H5K5j03j20q2J73j38Q8RK53j06j02j16K98l73J74J72k99j70L79j54P8J25
3647I6ok36J42k53K03K4K12m33J40N2j38K88J4k02P8j49J08K8j59M76n12K01j69
3670a95J0J42J12K19m44L00l7l70K58J52n7R7k01L5qJ16J25J00k65j16j6J40q8
3693IK64j70J81r2l79J29r6R6p9L27Ol51K40j64n7J47Q9P9l61L06n6R0j35mK9
$$ plain form
3535 67 -105 197 295 -10 -314 -240 -127 50 -51 127 68 -118 263 98 131 -330 105 216 153 110 -72 -148 11
3558 11 -52 95 100 251 115 -104 -293 103 -101 -158 -335 -39 -227 43 -187 -155 79 -53 314 -31 412 -77
3580 -77 -476 -25 -116 -164 -75 29 309 8 -176 -87 223 93 -104 -32 -159 -79 51 63 -195 -148 34 -116 146
3603 146 246 -142 -143 -3 90 -164 105 -23 -222 88 -264 308 -131 -105 -79 197 -299 109 -146 -39 -92 85
3625 85 110 7 -113 -195 -22 -160 -72 -63 190 84 -18 -134 164 -209 -35 137 -162 -332 47 -107 -29 96
3647 96 90 -146 -4 -257 -54 -30 182 -251 -111 -59 -197 91 105 -97 -19 -168 -60 -32 -191 285 -227 -26 -195
3670 -195 -185 -43 69 288 -156 144 107 -263 -5 147 90 187 -14 21 13 129 254 354 89 -27 -43 97 9
3693 9 273 103 284 192 -187 -58 -154 -58 -137 190 196 -155 85 -79 -136 11 100 179 -182 124 68 158 23 19 48
3718D8R4N6k80R5k05j06K03P0o8PL20l12K01n3J90l14J18k12K12j25j94L93M8
3741A86k30nK51l16J14k41ML16n8l38L66J45j8j73pL05k08j90J27K9K23m98K50
3764C4l23N25k59j76J66k8J10j93j14K70l3j72K07j55J14%j09J17L5L2k0m9N6
3787C5j06K03k0K1k8j1j06Jj0K05l04O8K22l38J61R6l23J92K59k76J83r7m8K89
3811B68k24l90K72j19L70l5k27J23j69L10m3m91M16j92M46l18R2Q8J19m68J2L05
3833A45k75M4K7K08k92J19kl9m1p9k44L44j12K48l0k19K30k17J92P9j13Q0j28
3856g5L31J19l66J83o6k5m42L53J1j08K61k47K80j93o5qK53j22j19m0K89j67j93
3879a56J60J11j55J37k02M20l52J36j94J04P1j8j14q7M51m35K69J03k95N2K29
$$ plain form
3718 48 142 198 -82 13 -192 -298 -95 -25 -93 -86 234 -78 123 70 260 -54 64 -148 64 -61 -255 138 186
3741 186 -44 -49 202 -114 0 -241 -237 79 21 -317 49 194 176 3 -4 301 93 -97 30 59 282 -216 34
3764 34 -289 236 -23 -199 -33 -61 49 -144 -258 12 -21 -193 14 -141 -27 -27 -136 -19 16 48 28 -21 35
3787 35 -71 132 112 133 105 94 -12 -11 -21 184 -120 -52 170 -168 -7 89 -234 -42 217 -59 124 27 -21 268
3811 268 44 -346 -74 -193 177 142 -85 38 -131 179 136 -355 61 -131 315 -3 89 177 296 -172 -160 145
3833 145 -130 -86 -59 149 -143 -24 -26 -65 -106 -185 -429 -85 -197 51 21 -198 32 -185 7 86 -27 53 -75
3856 -75 256 375 9 192 126 101 -341 12 23 -85 176 -71 209 16 -49 -57 196 74 -45 -85 204 37 -156
3879 -156 4 115 -40 97 -105 315 -37 99 -95 9 80 62 -52 -139 312 -123 146 249 -46 6 235
3900B35j68J78j75j58J55J34l57k21L34R4j9K2J65j92j85J73R0j62j11Q8M2j61
3922a99K15L2k32k57M53o8n1J85j68L8O5J74l00M1P1J16j27j91K26J04j19Q4Q6
3945A78K2q1Jk65J59k43N8J62j3j2j95K72j18L96n60K47j16J30J53n29K10K8K01
3968H5l5k42K89j67k13L84j41n6j3O7J08Q0k02j67J36J95l07L11J9k10R3R2kk12
3992a08N5l5M94l84J21m97N22r8j37J26Mj10J68k31J02O9q9L0j9M1j56mk1J52
4016eK5J35m06K10L03j49n5p7j15n9M24l39J50K9j76L87r6l50K11j17O5P3k72
4039b04L52k46J90k04L20K5j83P7k37j42J93K26l08M96j39k17p9k52L73K64K0
4060C25k47O1K3o8j39lk1o0N8J90l98L49k9J59j81J78o08Q27p58L20J25l40L05
$$ plain form
3900 235 67 245 70 -88 67 201 -156 -377 -43 51 32 54 219 27 -158 15 105 -57 -168 -80 -38 -199
3922 -199 16 48 -184 -441 12 -56 -107 78 -90 -52 13 187 -113 -72 -1 115 -12 -203 23 127 8 92 178
3945 178 200 119 120 -145 14 -229 -171 -9 -22 -34 -229 43 -75 321 -239 8 -108 22 175 -354 -144 -116 85
3968 85 50 -192 97 -70 -283 101 -40 -96 -109 -42 66 146 -56 -223 -87 108 -199 112 131 -79 14 106 104 -108
3992 -108 -53 -88 406 22 143 -354 168 70 -67 59 63 -47 121 -110 -8 61 -28 2 -17 24 -132 -136 -157 -5
4016 -5 20 155 -251 -41 262 113 58 -19 -134 -193 231 -108 42 71 -105 282 186 -164 47 -70 -5 68 -204
4039 -204 148 -98 92 -112 208 233 50 127 -110 -252 -59 167 -141 355 216 -1 -80 -332 41 305 325
4060 325 78 139 162 94 -45 -48 -69 -129 -71 119 -279 70 41 200 19 197 -411 416 -342 -22 103 -237 68
4083F8k49K57m22L86j88k4K87l82O5J63k62K31L05l29P7L7p7%J38m2j37L30j42
4106I0k6l11K27l20K89L74l95K08j19M6o2K21j11j18J3J4m6J19k80P6J66l46L78
4129H7J2k09J93j32r4J83j73K88k30O2j46L94j12k91K23n7o1J30n8q1J39j8j2
4152C7mk74K79M7k14Q4Q8j64j08K77j07J73M2l32K33m0q9K01l3j48j13N19p38
4175c84K77L30p0M1p4j19j70K29p6k9r2R9p4K8J81J60l64N4J12o7J17m39L11O7
4199D8j80k09L13j02J85K65o31L14o1j84K25L24q1j80k23K0M9rQ8n3K05L1k97
4222a43J99J12m55M04P1k8j59Q6j50k9J55p6p7R8J9j31L4J4K29k03j8n2J51j31
4246h0p2K48JR4m02K34Q5j62OP7K55k4j35j36k32J64L14k53J92j15O6m44O65m71
$$ plain form
4083 68 -181 76 -346 40 -148 -172 115 -267 -202 -39 -301 -70 235 -94 -17 20 -57 -57 81 39 -98 232 90
4106 90 64 -247 -20 -340 -51 323 -72 136 17 63 1 222 111 -7 6 20 -26 93 -187 -111 55 -291 87
4129 87 99 -110 83 -49 -143 40 -133 155 -75 -13 -159 235 123 -168 55 -2 -63 67 9 -72 67 49 37
4152 37 33 -241 38 85 -129 -45 43 -121 -229 48 -59 114 156 -176 57 17 -72 129 96 -52 -165 354 -384
4175 -384 -107 223 153 194 120 1 -169 60 -16 -45 -137 -38 -112 -84 97 257 -107 -53 59 -8 109 -330 -19 48
4199 48 -132 -341 -28 -130 55 320 -311 3 -58 -242 -17 307 226 46 -177 -157 -108 -117 -29 -82 123 154 -143
4222 -143 56 168 -287 117 188 160 1 87 -63 -92 63 -13 -90 8 27 -104 -70 -56 173 -30 -48 -100 51 -80
4246 -80 -152 96 97 191 -211 23 108 -54 -48 29 284 260 125 -11 -243 -79 235 -18 174 59 125 -319 346 -125
4270a25p7J93O2K01m03J60K4k20J00rK86j33j98O50k56k72J47j52P8o3k70J44
4292a33J16N9J6p2K36j5k72K99k32l3k44L01R1o6j45J02p0k00qJ54J07O5k53K80
4316H3J2n3L28n55J95N6j70J77m9l7K90k23%k95K77J45m21K78j84L06j06K9j35
4339e2N0r0N3J91o5P7j89K23k27o4r4R0J95L4j6N5k55J80J39K7j95l0N6L1K34
4364C58j60n01K46M5Q9l14N8M37k88l63J25R8Q1J29k11M3J84M3j59L49k22j09
4386d2R6o9j12L84m66Q1J15K7o3j9M9J6J21k07MJ33l24K98K22l57K75k40P6K11
4410B09j37j70K7J23Rk11R2L6K94l14j20j09K83M4l04L13k3j04J11L46j37l07
4432d9K78l4q3J07o30Q26o45o7K28j32M95n99M76l82L49l32J91j32K85l91L64
$$ plain form
4270 -125 -202 -9 53 254 -149 11 35 -185 -85 -94 192 59 -139 511 255 -17 130 -22 56 -7 -277 -133
4292 -133 -17 42 58 -14 222 207 -65 234 2 -31 -275 26 117 51 -94 8 -62 -262 -270 -116 -9 56 -197 83
4316 83 95 42 370 -185 10 66 -104 73 24 -13 277 54 54 -241 36 181 -240 38 -146 160 54 83 -52
4339 -52 -2 -92 -39 152 87 164 -25 198 -29 -93 -187 -97 98 132 116 171 -84 96 235 262 67 37 93 124 358
4364 358 198 -303 -57 -12 77 -237 -179 258 -30 -393 -268 -170 -89 40 -171 -128 56 99 -60 289 67 -42
4386 -42 54 -15 -127 257 -209 -128 -13 14 -49 -68 -19 -3 118 -89 -85 48 -276 22 244 -113 162 -78 -2 209
4410 209 72 -98 -71 52 61 -150 -58 -22 272 -42 -162 -271 12 56 -248 65 42 -62 49 395 258 -49
4432 -49 229 195 112 219 -411 415 -230 -297 -69 -201 294 -305 171 -211 138 -194 -3 -135 150 -241 123
4453A23K5k85L94o9j14k57J46L1J38j70J08N2j48r8J09R1j70J90j64L0j9N4L01
4476B98k05j03J82k60J29k49O04j00j78j94K60J8j68L66l32j37m3L8K77l84N2
4497a29J49k20Q5m9J37p7K90o8p9l2k31J21O9J65P1l09L62n36K27J54j97J95k06
4520a08p9L57k32K90q5N6j7k27k07L45R9j75O7k22j69J83K68k58j58L44qj91k71
4543c98J03L73m2M8j25K00j32K14m21k20J42J30K3mK01N6l27K81O5j37P9m72M86
4566A23j24n6L32m89K71j04K72j02L5l86M42j0l70L30k40M6j34J88j06L60k65
4587A3j90L33n01J43K35R8j32K1J35l54O9J64J1p8O2j92M28j61Qk09J05L5J86
4610B29j47j47Q3j2r7j49N08k08j13J2P2j97L23j89q1k4L07l54m5K47K07k56Q3
$$ plain form
4453 123 148 -137 257 188 74 -183 -37 -6 132 -38 70 122 -26 -124 -15 76 -94 96 -68 -38 -57 -3 298
4476 298 93 -10 172 -88 41 -208 396 296 118 -76 184 202 34 400 68 -69 -112 -74 203 -181 -129
4497 -129 20 -200 -115 -164 -27 -104 186 118 39 7 -224 -103 -34 131 202 -107 255 -281 -54 100 -97 98 -108
4520 -108 -187 170 -62 228 143 199 182 -45 -252 93 192 17 84 -138 -307 -124 144 -114 -272 72 64 -127 -398
4543 -398 -295 78 36 84 -41 159 27 241 -180 -400 -258 -128 -105 -109 92 148 -179 102 167 30 109 -363 123
4566 123 -1 -57 275 -214 57 -47 225 123 158 -228 214 204 -166 164 -76 -30 -164 24 -82 278 13
4587 13 -177 156 -345 -202 33 131 -1 20 155 -199 -130 34 45 -33 29 -163 265 104 112 -97 8 43 229
4610 229 82 -65 18 6 -91 -240 268 60 -53 -41 31 -166 157 -32 -113 -137 170 -184 -229 18 225 -31 52
4633E2P6qom57J92L3P8J40l9j01J14m7k9L8M3j9j39K11l27K76pj99j10J34P7N9
4659C5M3l69J98K49k76O8J12p3p0J39K00k97O8L1J93j72k59j15M26k25J31K97
4681C34l11j11P9j0J22l64N13k93m8L12k87K27l28M2K1K46L3p9j13J12R2m8Mk78
4705a33J48q8K20k8j94Q3j6n6R2K41k42j37L7m6J73N5M7L5J2k42M0k72K25J44
4729I8j55p3L25k97J73k57J81j16M42n52K11Q4M8J43j22k46L42l06J70j09J13
4750I7j10J23k88J62J70m18M57l21L1j16L33q7l35L55Q1k47J70j45n1J62J01j69
4772d5j48J88L18j34j84J94j02J08k00m4l1j47K76j7O9n40L01M42k13j27PL73
4794C44k83ok76L71n01L09K13k83K21J12k11j99j78L29k79M10k7J78m2k10P2L99
$$ plain form
4633 52 128 120 114 -343 -151 -118 -40 100 61 -40 74 27 -2 36 79 60 -79 132 -195 81 74 -125 -235 -101 -24 35
4659 35 78 -291 -93 156 -120 -52 60 -13 -83 56 256 -41 27 58 251 79 -180 -295 131 -94 37 334
4681 334 23 -88 -9 -19 103 -261 252 -41 -89 223 -64 163 -165 -123 -102 144 177 98 -15 97 189 141 145 -133
4705 -133 15 -73 147 119 -75 8 -8 -64 28 269 27 -110 -73 -119 54 109 156 191 203 -39 1 -271 -46 98
4729 98 -57 -130 195 -102 71 -186 -5 -121 321 -231 -20 64 112 255 133 -113 229 -77 93 -16 97
4750 97 -13 110 -178 -16 154 -264 193 -128 -97 -213 120 33 -302 53 134 -113 57 -88 -139 23 124 -45
4772 -45 -193 -5 313 179 -5 189 87 195 -5 -49 -80 -227 49 32 101 -439 -138 304 91 -36 -29 344
4794 344 61 55 -221 150 -351 -42 171 -112 109 221 10 -189 -367 -38 -317 93 66 244 202 -8 64 463
4816D63k58L0l2k52n2J12L9k35M36j80l7mN3j43J07k9K1j07j34J43J12r2j00K81
4840A42p6J69l26J47j73K82l90J26J29k75J57L6K47k35J99o9k91K09q3QJ04l59
4862c22L55j74K03m3K45l6k53j1J13k24K83j81j29P0K65m4k4l70L67J07l30P4
4884e9l8J82K3m12R9kMM39m22K77j47k68N63q7K9m10M25l33M13k74K50j59R8k11
4908b0J82L9n06L60K39n18P7K70l62L16j6j92J17L4j86J22J79k16j02J74k78L09
4930B2Q2m6k38L88j58j05j78P14o36O0r1L95k94Q2j35K26J24k23kO1J7r3J11Q2
4954A65J02m41J19k0J64j20M33n33J27j9j17N1L80m92K06K61m07o0J09J50j3j41
4976i6N5k70L78o9J46n5o6k91K54L7j6j05J04r6K15K20j68j58j32n0M7J45M1K7
$$ plain form
4816 463 205 235 203 -49 -101 11 50 -185 251 71 34 30 83 -60 47 18 39 -68 -202 -59 53 -39 -139 142
4840 142 66 235 -91 56 -117 165 -225 -99 30 -245 -88 -52 195 -40 159 90 -201 8 -75 -67 37 -322
4862 -322 33 -141 62 19 264 228 -25 -36 77 -147 136 -45 -174 -104 161 117 93 -277 90 197 -133 -59
4884 -59 -97 85 108 -304 -205 -207 -203 236 -186 91 -56 -324 239 152 181 -229 196 -137 276 2 252 93 191 -20
4908 -20 162 201 -305 55 294 -224 -147 123 -239 77 61 -131 -14 20 -166 -44 135 -81 -183 -9 -287 22
4930 22 104 58 -180 208 50 -55 -233 481 -155 -95 -186 209 -85 -3 -138 88 212 -11 -13 48 65 -28 83 165
4954 165 267 -174 -55 -75 89 -31 402 -131 -4 -23 -140 -89 291 -201 5 266 -141 -201 -92 58 45 -96
4976 -96 -41 -311 67 -2 144 89 23 -268 -14 23 7 -98 6 -90 125 345 177 19 -113 -163 -116 29 70 97
5000I7m4nk4k57J06J62L9R7j89J10j9Q0p8q2j82n0mK41j97Q4lK78q2j43K46l0
5026A51r5J47l64Q5K45j35j20L05k56J88j40j26q6L0J80l5n5L77l26J00k80J75
5048c5Q3Q0n5k89K20k73P7N13n25L45n8k67K85L9L04k30K0l15J70k64K93j83Q4
5071A9p9l6j38O00l25Q5l46l2K76j05M71m02j96M56l47J52k53M52j91o2o1k78
5093c40L30J3K16k37k68K94N02l59k1J70l85M74m06l4o1L5K09l23J51L06n10L57
5115A13l36J06p9K73j02k20K08l2K08k82N2J71J67m38K88J64l67k0P0M0n2K17
5137A49j53J54M3j61l18M30j16k34K75J87j64j67J3K7J79k22P2p0L48r3r4O8j27
5160B6MK18l01n4j23K69j94M74k20j19K11l46J55J7J52n1k94J82J51j35K56l38
$$ plain form
5000 97 53 48 24 -233 -127 35 74 171 -18 92 73 153 75 -7 -189 -239 -243 -2 -199 -115 -118 160 78 -65 181 151
5026 151 56 203 -161 -76 169 34 -86 219 -37 151 11 -115 -201 -171 9 -26 -81 296 -30 70 -210 -35
5048 -35 48 128 73 -216 4 -269 -192 321 -204 141 83 -184 101 140 444 214 234 -81 89 -175 118 -65 19
5071 19 -60 -96 -234 366 41 126 -220 -252 24 -81 390 -12 -208 248 -99 53 -200 252 61 -1 -62 -340
5093 -340 -10 3 219 -18 -286 8 510 151 130 300 -85 389 -17 -51 -112 -77 132 -191 -40 266 -244 113
5115 113 -223 -117 -196 77 -25 -245 -37 -69 139 -143 -91 80 247 -191 97 261 -106 -126 -56 -16 -68 149
5137 149 -4 150 193 32 -286 144 28 -206 69 256 92 -75 -62 -35 144 -78 -6 -76 272 179 85 153 26
5160 26 30 248 -53 -107 -230 39 -155 319 99 -20 191 -155 0 17 169 118 -176 6 157 22 278 -60
5182f0M15q9k12J37k12J21k29L06k41Q8K12j09m3j04K67m06N16j44m5k61mj6J58
5205D5J60l76M7j02j28L69k85L30j22O3J38m42N73j59p2j86mj47l4K98J6k41K63
5228Dj90kR2J07l7L68k61P1j07lq3P4n6R7o8pj37J44K56k95l3K21K47m36J1O9
5254D6K08l50J06Q2o4M4j06K24p8P1j96J41n9k98J34j46M32J7l36K31p9j19J93
5277I8P3k57j72M85l32K4l1J13q7J17p2K3Mj78J93K49l98M4M17o55M66k18N6L9
5301Aj66Q6l1J74K25l15J14P3r6l00K32m25N61Q5l76j1L51J6j25M0j02K43o8o6
5325A20l02R8p2k49L81j30J34j15j99L05K07l03N7K97j58n4J20L3n01J33J39J88
5347A29j44K33k93J78N8Q2j03j34R7k11L10k66J4k66M89%K2m8k12q5L58j87J72
$$ plain form
5182 -60 355 266 54 191 -21 100 -129 177 -64 24 236 127 84 -20 247 -159 357 213 168 -93 -97 -113 45
5205 45 205 -171 -124 -226 -354 15 -270 60 -62 1 139 -303 270 111 39 -147 -151 -298 -332 -34 -18 -259 4
5228 4 -186 -188 -96 11 -26 342 81 152 45 42 -41 33 -23 74 6 -1 -138 6 262 -33 -66 155 402 -34 -23 46
5254 46 254 -96 10 92 28 72 -34 190 112 183 -13 128 69 -229 -95 -241 191 208 -128 103 24 -95 98
5277 98 171 -86 -258 227 -105 -81 -112 1 -86 31 -41 -18 -14 -192 1 250 -148 -104 313 -342 124 -94 -38 1
5301 1 -165 -79 -110 64 289 -26 88 161 65 -235 -3 -428 133 218 -158 -169 182 198 73 113 11 254 186 120
5325 120 -182 -84 -156 -405 -24 -154 -20 -135 -334 -29 178 -125 -68 229 71 17 137 170 -331 -198 -59 129
5347 129 -15 218 -75 103 161 243 140 6 103 -108 202 -64 -50 -316 173 173 195 147 -65 -150 208 21 193
5370A93k01N3O7p8K21k13K95k35k67O7L36n18N14n71L49J63k30Q1P1k0l49K26
5392d6K75Ok34L6j63K55l0P8l03m9K25m5K52m22M8M91k61j38m5r7N6oJ28r1m9
5417a29J74K3M2k75j9K93k60J81j64j13J16J63Q2J36j76k69K17K3K28k76q9M13
5439C21m48J28j08j3J82j13M0k7p6O1k06J51J97O9k10N0L6n6J8j9k0m8O1nJ48
5464A13K5pNm00K17L30k36L0k51K24O1l9L9k58K74j12j54L30j16qj42j6q6O2J21
5489Fk19L88j88nk96K71Qj38Q8K59j71J21k04M15r5L4m12J25j18O0k37J00K12
5512Dr0MK8J83j37J41k19J81k12pJ3J08j14R4j73J62O7q0k09M22m75N13K14l95
5536B3N8K0j9M2ql48K79m19M53j72M98l22j36J84J28p9l38L36k64K35j22k52K55
$$ plain form
5370 193 -8 45 112 34 255 42 337 102 -165 -98 238 -280 234 -337 12 175 -55 26 97 77 -272 -46
5392 -46 229 235 1 37 -126 129 99 177 -126 -175 50 5 257 -165 -117 374 113 -25 -70 -167 -111 -117 11 -80 -129
5417 -129 45 68 110 -165 -184 109 -151 30 -134 -247 -131 32 114 250 74 -195 22 45 273 -3 -92 321
5439 321 -127 1 -107 -120 62 -51 -11 -38 -114 -53 -259 -108 89 158 -52 -2 34 -22 -4 -23 -43 -91 -30 -35 113
5464 113 138 131 136 -264 -47 283 47 77 -174 50 111 72 111 -147 127 15 -139 191 75 67 -75 -91 -177 -115 6
5489 6 -213 175 -13 -18 -314 -43 -35 -173 -85 174 3 124 -80 335 240 274 -138 -13 -131 -71 -308 -208 4
5512 4 -86 -82 -54 129 -8 133 -86 95 -117 -124 -111 -3 -117 -23 -196 -34 33 -47 -256 166 -309 204 418 23
5536 23 81 101 82 124 116 -232 47 -372 81 -91 407 85 -51 133 261 182 -156 180 -84 151 29 -223 32
5559C2j10J24J75k35J35l74N45l59J70j62J54m1j22J98l80J88K74j38m8j46J75
5580E5r0J47r7J2J46k51K17l20J30J38l08N10j39m2k80J66k62J61M2j04K06k52
5602b15K21J9N1j46M6J48m23K60ro0J06j41OJJ95l3J06l66O6J06RK1J55k53J9
5627a11J69j88k9r3K57L6o9k7J62k70K71l9r2K07k78K79%p9o8l0l9P4J34N5n17
5652b85M50r5l34L42m18J94J46Q4k24J25j78K45L6j76j4K77r8M4J70k67j46L28
5674B06l4Q2J42k03l19J08J54n11M34k43RO01n28J62m5p0J63n4o4j43Q2k99J83
5697a87J12L07l25K75q1k39R2M21q2l59Q1K01j71l58K06n8P0Q8J1L91l94j43J85
5720D3J0JN0J94l59L78m20M5Q7j78m4L7L27k10K22l36j73K14J45Q6m9j37n9K05
$$ plain form
5559 32 -78 46 221 -14 121 -253 292 -67 103 -59 95 54 -68 130 -250 -62 212 74 26 -120 55
5580 55 -35 112 15 27 173 -78 139 -181 -51 87 -221 289 150 108 -172 -6 -268 -107 -65 -169 37 -215
5602 -215 6 25 76 -70 -24 124 -299 -39 -48 -108 -2 -143 -137 -136 59 26 132 -234 -168 -62 -53 -32 123 -130 -111
5627 -111 58 -130 -159 -252 5 41 -28 -55 107 -163 108 69 -23 184 -94 185 185 106 38 8 -31 43 177 232 -285
5652 -285 165 70 -264 78 -340 -146 0 84 -140 -15 -193 52 88 -88 -102 175 77 121 291 24 -122 206
5674 206 172 254 396 193 -126 -18 136 -375 59 -184 -175 426 -102 60 15 -55 108 54 -10 -153 -71 -370 -187
5697 -187 -75 232 -93 182 101 -138 -46 375 293 -66 15 216 45 -313 -107 -165 -95 -7 4 395 1 -142 43
5720 43 53 54 104 298 -61 317 -103 -58 29 -149 -193 -156 171 -39 183 -153 -326 -112 33 119 70 -67 -126 79
5744G9j0J2J99l19L21m37j05K83o3M2o8L32j41q5j98L4J92k07L01r1n1J43k15
5767e2l07L1mM17m1r3l16K05M06k68j04M9q9O3J18k51M95j13k71J00J4lj11P0
5791e5j0N7j81K93j15j61J30j77J33Q6p6J60l11L80j70K3J7j05K6j39K69j8J4
5814G0p6K44j13J12m16k02M42k12J26K5k67M26l8n2k9q8n5J70J32l06M6M9Q6L
5838G7Q1j07P9j56OJ1K6J15j83j04N6K41l79J36N3J23P7o4MO2N9p2j65M28o24
5863b20K12j81P4J79k10L14m37J7Q5J65j67Q6L69l11M21l83oo0Lr1q6L40K2o7
5887F8K38l04K6k51L09P8l37J47K18M2l06j99K94k80K71ON7k89J03K75lj81L0
5910A2j03P6J39l07j87N38k50J35j60K72k56m7K17j30j32J09K06Lk0j60O6j51
$$ plain form
5744 79 69 81 280 -39 282 -155 -260 23 -40 2 -66 266 125 40 -158 -124 68 -139 162 71 20 163 -52
5767 -52 -359 -328 -332 85 44 -49 -365 -160 246 -22 -126 -77 -166 -103 15 -236 259 146 -125 -25 -11 -14 -125 -55
5791 -55 -65 -8 -189 104 -11 -172 -42 -219 -86 0 -76 84 -227 153 -17 6 23 -82 -56 -195 74 56 70
5814 70 -6 238 125 237 -179 -381 61 -151 -25 0 -267 159 121 69 40 -48 -103 67 199 -107 -61 -12 74 77
5838 77 158 51 130 -26 -20 -9 17 132 -51 -155 -99 142 -237 -101 -48 75 152 88 92 154 213 141 -24 404 -220
5863 -220 -8 -189 -115 64 -146 168 -269 -252 -167 -2 -169 -83 286 -25 396 13 7 -53 -50 -141 -227 113 135 68
5887 68 306 2 28 -223 86 164 -173 -26 192 234 -72 -271 23 -257 14 20 77 -212 -109 166 163 -18 12
5910 12 -91 -15 124 -183 -370 168 -82 53 -107 165 -91 -138 79 -51 -183 -74 132 135 115 -45 21 -130
5932a30L30k09J0K3j7L23k67Q6k0j1l4l54N71l19J53k89K02q8RR2j87L50k04J46
5956A66m36K76K11j2j81j57K17p0N9J0m1k28J28K24k84M9q3j4P0J29J73k74Q3
5979A5k8k7o4L00l61oK29J35p0j95K44k75K7r6J31j01J59P5l34J91k09K92L0l13
6003b51L96k27q4k4K49k51K86J50l39L01k02M5N2P9l84J53k02K29K4p5M7J10n96
6026e14L89j18J16k12O6J12K69j42R9l7j62L6J10J00L4m2m0N1q5J10k65M25m25
6049a25L30r7j52j87J45j01R1K96k21Nj70J46j25M7P0Q0j69J07J0Q0o2K5n7J74
6073A40J01l84j56J35J00L9J18M6k42j19K41J03l10J05J22k34J36K0l7q5K9J59
6095B7K29k98K63r4j77j12M88j60j71m2R2m9R1J8l34L29j91k2K81o7j5Q3n5j71
$$ plain form
5932 -130 200 -9 1 24 7 330 63 149 129 118 84 -270 301 -18 135 -154 48 -40 -31 61 -126 224 20 166
5956 166 -270 6 217 205 24 -133 84 14 73 83 42 -186 -58 166 -118 -69 -152 -166 -96 33 206 -68 15
5979 15 -13 -40 -104 196 -165 -171 58 193 123 -72 172 -103 -76 -172 -41 -142 17 92 -242 -51 -260 32 62 -251
6003 -251 145 -82 -166 -190 59 -192 94 244 -95 206 4 49 101 180 -204 -51 -253 -24 0 -75 -28 82 -514
6026 -514 -125 -243 -127 -339 -273 -161 108 -34 65 28 -134 -98 12 112 146 104 64 115 30 140 -125 300 -125
6049 -125 205 108 -44 -231 -86 -187 -96 200 -21 -16 -186 -40 -165 -118 -48 32 -137 -30 -20 60 -2 23 -34 140
6073 140 241 -143 -299 -164 -64 -25 93 139 -103 -222 19 122 -188 -83 39 -195 -59 -39 -76 -161 -132 27
6095 27 256 -42 221 127 -50 -162 326 166 -5 -47 45 -4 87 105 -229 100 -91 -113 168 101 86 169 114 -57
6119e7L03j99j77j8L50k00j07J23j74L51M6m0l17k7J16L22q9j96k29L04Qj36j7
6142f0J3Q9j60K31l79M37j48Q6k61N6K13k25r3J31j8J82P1j06l60K85L76l25J65
6165B00l15o4L3L2j06M79m73L21P4j78l19N46j54J79l16Q0O1j60J03m4J66k2j32
6188im5J55M5lk57J24J73k16j46L12k03K73O4j16k06K01k34K11J42j86q0q6p7
6211a64R6K13j48J86k19K54j28j95J50n0J52k10J13J5k54k20L54P1j39L70Nm36
6233a84M44n08N01q7l58Q3K25k43l8J34J60j55m2k0p9M05L2k39J9L27m38J97m12
6256b76N32j31j78k32K40j36n4K55J08j08l14N02j94P5l11K36l0m22L91J8R4j39
6278g4K73j3m83J73M80m39j06K91j95K53j52J73k44J07p3q3J71j60J24P9j15P9
$$ plain form
6119 -57 246 47 -130 -148 202 2 -105 18 -156 195 241 201 -116 -143 -27 295 206 10 -219 85 93 -43 -60
6142 -60 -47 42 -118 113 -266 171 23 109 -152 -96 117 -108 -201 -70 -88 94 165 59 -301 -16 360 35 200
6165 200 -115 -179 -146 -114 -220 259 -214 107 181 3 -316 230 76 255 -61 19 80 -80 23 -21 145 123 -9
6188 -9 -54 101 146 143 -114 10 183 -33 -179 133 -70 203 267 151 -55 146 -88 123 265 79 -1 -87 -164
6211 -164 -68 145 -3 183 -36 218 90 -105 45 -5 147 -63 50 65 -189 -409 -55 16 -123 247 252 -184
6233 -184 260 -248 253 166 -192 -109 116 -127 -165 -31 129 -26 -68 -88 -167 238 270 31 50 377 -61 136 -276
6256 -276 256 125 -53 -285 -45 -181 -235 20 128 20 -294 208 14 89 -222 14 -16 -438 -47 -29 65 -74
6278 -74 199 186 -297 -124 356 -83 -189 102 -93 160 8 181 -63 44 -29 -112 59 -101 23 102 -13 66
6300F6K15p2l23K06l44J4K60j7J9k44pL83l26J55O5L0k87m8L8L47o4l24J97J90
6324A29M21m03k83J73o7P8Mk2j42L43J6m24M09l92J45j65L31Qk44n7J8J03q6K14
6348A07l30K13N2k8M7j02R9kj88J45j8p7K21p8j81J80k7K08m95L54R6l1j3m85
6372c33O37m64L20l29J76o0j51K54J41k43k68J86J59L9l0o3Q5q5n2L33m42q5L19
6395D4j10m0k47N18K6K06n32J61j22k4J60l5J78l38L55k4k78J58j56N05k09k25
6417b9n3nN38m89j3P6p2K02k7p3p1J54k43K34j64K99l40k03L92P0k99l8L31M2
6441B19Jm11O0J28p2J37j11p4J92m37K13Q0K79j68Q2k27L84k38K6r3M1J99l34
6464a24K04l41M49k53q7P2K00j95L12o1j14k24j06K54O8m01K58K12k15j56M90
$$ plain form
6300 66 281 209 -114 92 -252 -238 22 5 24 -220 -227 156 -170 -15 50 80 -207 -255 -217 130 66 -258 -61 129
6324 129 550 147 -136 37 -30 48 52 30 -112 231 247 -177 232 -160 -15 -180 151 159 -85 -142 -124 -21 -107 107
6348 107 -223 -10 42 14 61 -41 58 56 -132 13 -5 -82 139 61 -120 60 33 241 -254 100 196 165 152 -333
6372 -333 304 -160 160 -169 7 -53 -204 50 191 -52 -320 -134 25 64 34 -29 56 -29 -81 252 -190 -275 44
6395 44 -66 -106 -353 165 191 397 -135 26 -96 -120 40 5 183 -155 200 176 -102 56 -100 405 196 -29
6417 -29 -82 -87 451 -38 -51 25 -47 155 128 55 -16 138 -105 129 -35 264 -76 -279 113 183 -116 -154 177 219
6441 219 220 -191 -131 -3 -75 62 -49 -123 69 -368 -155 -75 204 36 118 -109 275 37 63 -30 11 210 -124
6464 -124 80 -261 188 -65 -152 -80 120 -75 237 176 62 -162 -268 -14 54 -347 -89 123 -92 -248 242
6485B42k17K8o9j85K21J26k56Q5o2J51KL4j5j67J80l80L35J11P7l73J80q6R4R9
6509A55j34p0K06q2k16m9K16p8K10k48J51l13R1O1M6K19n4j5qk7k0j0j27J71J81
6534B56m87L73k12j14K72%j71oR1j13Q4j5R6J66J05m56J57R5l10Q7K72j71K62
6557B61m35J29q8L02j86l7n1R7m0K0R3m4q9K4J06J42j95k39J86J00k99K17J24
6580I8Q7m5q3j71j53L74p5l08k4M62j94P3L05l16J85k23M2L35n36J10J04k24J02
6603g5K88m09L62j78l40J56J42L2L15k54k78K96j39K89k5J22l12K75l13M8j0l
6625a1O6k44L25j33J39j17l16N89r8J43l07K9j75K17p5o9P5o9J26o6J8JK3k93
6649b22L70j99R6J40j71r2p8J36L71o58M78m1k4j90n8j17K06K42k8J8m1l02L14
$$ plain form
6485 242 25 53 -16 -201 20 146 -110 -25 -87 64 66 100 85 -82 98 -282 53 164 241 -132 48 -38 56 155
6509 155 21 -49 157 75 -141 -190 26 -52 158 -90 61 -252 -161 -100 -54 165 111 96 88 61 41 31 -96 75 256
6534 256 -231 142 -70 -184 88 88 -83 -89 2 -111 -27 -42 54 220 325 -131 26 121 -189 -102 170 -1 261
6557 261 -174 -45 -133 169 -17 -54 -105 -8 -48 -28 65 21 -68 -44 62 204 9 -230 -44 56 -243 -26 98
6580 98 185 140 57 -114 -267 107 32 -276 -300 162 -32 41 346 30 215 -8 34 369 -167 -57 47 -177 -75
6603 -75 213 -196 166 -12 -352 -196 -54 -22 293 39 -239 57 -82 207 182 304 -8 267 -46 2 -8 -11
6625 -11 55 -189 136 3 142 25 -291 298 200 343 36 65 -110 107 32 -37 38 -31 95 29 47 48 71 -222
6649 -222 148 -51 45 185 14 -78 -156 -20 351 -307 171 130 106 -84 -142 -259 -53 189 161 179 138 -164 150
6672A50j24j74K59j25k32K07K9K00k25J54j34Jj86N4J19L36j52K59n06K22j32
6693@j04J78j74K37k44J52n7j08O3R6O1n0P4r0j02Q4q1N8p0J20k42M08k64J82
6717A27R6j70J20j61k4M6l7L7L4Q8r2k4K9L8k54K65k31K48N1k13K90l20p9K52
6741A16l71L41L3k28j48L30l5k98J43L64k13n1j70m8J28L94k06on8L01l12n8K57
6764B05k67K7K75k58L36k35J04k01J57j87J8l3J11L02l93L7rl8m8J9Oj42n9K73
6788@R1l0J01k47K09O6O8k50j13L60l34Q6J10l25j59K28L07n4j29q4J36j26N2
6811c7o5L90m83K76j11K53j54k09M4K00q2K10j41j84J02mr0j20j72M89k22J34
6833B4L5j23J51L5k52r4L05j57J4K7J21R9k13N3j49Q0K12j81m5L4K9M22k94k26
$$ plain form
6672 150 26 -148 111 -14 -246 -39 -10 190 -35 119 -15 -14 -200 -146 -27 309 157 416 -90 132 0
6693 0 -104 74 -100 137 -107 45 -12 -120 -57 39 100 50 124 34 -68 16 -65 -7 -77 43 -199 209 -55 127
6717 127 223 53 173 12 -12 34 -3 34 68 156 64 40 69 107 -147 118 -113 135 186 -27 263 -57 -136 116
6741 116 -255 86 119 -109 -257 73 38 -260 -117 247 34 -17 -187 -235 -107 287 81 75 17 318 6 -52 205
6764 205 -62 -35 240 -18 318 83 187 -14 143 -44 -26 -59 52 354 -39 -2 -11 -49 -97 -78 -72 -214 -273 0
6788 0 91 61 162 -85 124 190 258 8 -105 255 -79 7 117 -208 -367 -139 168 114 -15 -99 37 -89 -37
6811 -37 -102 288 -195 81 -30 223 69 -140 -96 104 22 232 91 -93 9 5 -85 -205 -377 112 -110 24
6833 24 59 -64 87 122 -130 -224 81 -76 -62 -35 86 185 -28 25 -124 -44 168 -13 -58 -24 5 427 133 -93
6857i3Q4n7P9j87J23l07J62L68k11j85j8L2J41K91j02k60J69l79M53j80P2P7M5
6880A17m27J5L86l71K17J00R3J52m87M25j82j5j58o7J36j16J86J20Kp5j81P8r7
6903a49J09j30P0K61l51j60L09M5j7j21L23j46j69J41r5J00k74J2M37J69n68M11
6925B07Pk57q0L05k35K23p3K8k48J06J39j91J43j65K43k10J88k78o3L22o2j79
6947a30J87j48M3J93k01j01j40M48k94K28m1J5N5p1k17K88l8J37k20K41k44J18
6969A08M7n0k1J05j44N3j51r0m1J80n5mK21l35K0K67k10J30j10J65RL0j66m15
6993d57N47k90K56j74J31k85J0O1K49J50m07R9K99j49j34K53J4j59j40l9J35J0
7015b0j25L6K30L07m71L9J19j06J85k60N2J17p2j12k02L29k5Oj13L1O8K05l09
$$ plain form
6857 -93 -9 -66 13 -174 -51 -358 -196 172 -39 -224 -242 -210 -69 222 120 -140 29 -350 103 -77 -5 72 117
6880 117 -310 -295 91 -280 -63 37 130 282 -205 220 38 23 -135 -202 -66 -182 4 124 126 51 -130 -52 -149
6903 -149 -40 -170 -100 161 -190 -350 -41 4 -13 -134 189 43 -126 15 -80 20 -254 -242 195 364 -204 207
6925 207 214 -43 -123 182 -53 170 97 125 -123 -17 122 -69 74 -91 152 -58 130 -148 -211 111 49 -130
6947 -130 57 -91 -48 145 -56 -157 -297 151 -143 85 44 59 114 43 -174 114 76 213 -7 234 -10 108
6969 108 155 105 84 189 45 98 -53 -143 -184 -4 -59 -63 158 -177 -157 110 -100 30 -80 85 94 124 -42 -457
6993 -457 90 -200 56 -118 13 -272 -262 -201 48 198 -209 -110 189 40 -94 159 173 14 -126 -165 -30 -20
7015 -20 -145 -109 121 428 -43 -4 115 9 194 -66 -14 103 31 -81 -283 46 21 27 -86 -55 13 218 -91
7038i1r9L20j36J26k83K63p8n3j3k9J06K77m43N6p8Q3N7j85J69K06k11N6J88j55
7062E3O8k13P9l4M28m62j14K86P3j28QK1n8PK37j19n3k59J22J21k57K7NJ54M6
7087C8o1j79L94k02j6K41q9k38M81p34L88j11J20k16K58n7N2k50J11k0J10j70
7109a50R6j23r5L43j09L61l41K24k90J53n9J2M05l31k12L73j32p32P89p7k03J69
7131G1k17K02m9J46j09j60J06Lq2K99j42j83M51m99J64j07R4K6J03k92n1M06j15
7154F5j4O5K5J04k59Mo2j06NJ89rj39K6L2K22k48M21r6l03J86j83N1K14j67L1
7179E4q6L1Nk01L91j48mP6j90N3O6p6K68k01k05K23J54l99K69J12k6J6l49N5K01
7204H9k32J84j28NK30r5j58J48k22J85Nk8K97k55L12k73J1l0O9j50K4n0J14o3
$$ plain form
7038 -91 -190 130 -6 120 -163 100 22 -31 -44 -73 33 310 -133 -77 -155 -72 -15 -200 -31 175 -36 20 208 53
7062 53 121 -92 -13 -47 381 -81 -195 91 164 36 44 65 7 14 251 132 79 -180 -58 63 -194 -167 -162 -8 38
7087 38 -23 -202 192 -10 -26 215 126 -112 369 -365 23 -88 32 -184 74 17 69 -181 -70 -90 20 -150
7109 -150 -54 -177 -272 71 -38 323 -18 206 -84 69 10 22 427 96 -116 257 125 -607 182 105 -98 71
7131 71 -146 56 7 153 44 -116 -10 -7 -89 210 68 -115 336 -163 1 -106 -12 14 117 -175 -226 180 65
7154 65 51 116 141 245 -14 -10 -72 -178 -173 16 7 -132 -106 -74 148 -100 321 225 -78 108 -75 -24 190 23 54
7179 54 -32 -1 4 -197 194 46 42 118 -72 -19 47 -29 239 38 -167 56 210 -189 80 192 166 182 -167 -112 89
7204 89 -143 41 -87 -82 148 53 -105 43 -179 6 11 -17 280 25 337 64 75 45 114 -36 -12 -62 52 -11
7228a1N9j15J68l41M41l6l17n3M44k96J39j36p5J36q1j09J32J54j89J92k85J35
7250d4j27P3J78j34m1r2J0L92j92o6j59J14P2k9j14J1L08R1m97J27K14k22K07
7273H0J96l16r7J69mK50k63k08L30j31l35L84j74J46J74j64j81M9J44m8r2K17
7295A26j39rL39m00L00m27L47j95J51J13l97L76K1k63L94l10Q3k12N8j72O3K8
7317a25N2L3J69k7l17L76j46M9NJ72l32k02L94K0l45M11k16L26l27n3j55K31p1
7340g8Q7R5j23j27L69k09j21J5L63k62n4pL1o8M01l49Q4J7j57K30j21L9K88n2
7364B91k70M0j46K09Kj96J12r1J18k05k03L79kO8p5k50K9L64j93j07J91l1N6j30
7388d0Lk30L23l4lm5k1J8R8j64L2K50j74Q8n05L18o1L32m34J63K69k07J48o8k4
$$ plain form
7228 -11 48 -67 101 -240 201 165 -152 -205 239 -57 82 -54 -129 7 -74 -183 -51 103 -86 106 -179 -44
7250 -44 -171 -98 80 -54 -95 -187 -177 215 23 -43 -202 -88 -16 -45 -159 -148 160 251 -246 -119 95 -127 80
7273 80 276 -40 -137 32 28 278 15 -193 137 6 -329 55 -119 27 201 37 -144 -95 49 1 -91 126
7295 126 -13 -22 317 -83 217 -210 137 -58 93 206 -191 185 206 -57 337 27 110 -102 -44 -216 -153 -125
7317 -125 -73 -40 129 102 -215 161 15 64 69 241 -91 -293 101 121 -224 187 -29 297 -30 -83 -238 -7 -78
7340 -78 9 104 -19 -146 223 14 -107 -92 271 9 -45 -52 -21 -89 312 -37 47 64 -93 137 16 55 343 291
7364 291 21 61 -85 124 126 -70 42 -49 69 -136 -339 40 38 106 31 -219 -190 174 -19 -126 65 34 90 -40
7388 -40 -37 -267 56 22 19 -26 -47 -29 69 -95 -63 187 13 101 -404 -86 -147 185 -249 -86 183 -24 124 56 32
7413C2m0p1K7m9L59l60J88Q4Q5l91m4K53j64Q3L8K79k21K1l28M01j39j48M30n01
7437a76Q0J44j22K8L7N4l7J7L4k42M78k77J10o4J03K9O4j34m87J48J26K38J39
7460B90m05M5J71j62J96l14l5L21p0m6j68N47l69J67k23k49J31K58M0j00L30l63
7482ho3m7K55j94o6J52J51k4j53K45k18P0k15k89K86J20K2j36J87O9l44K81k27
7505a46J5j0M77l22l6l38M95o7J58k37j85L76l15L48k11r6J97j29M7l0Qk6J90
7528A63k37l2Q4M0J32k81L05l71K00M5K14m0k48L0K01K40m98K07m6p5n0J52j11
7551B4L0J96k25j7K50m16o6K53j90K78n83N66m1J5k55J14L14j27n0j09qq8l04
7574d39M29M8k60L22l43J09J16L34l63k4R9L35l46kk11L60j84q3J58j46K99k98
$$ plain form
7413 32 -8 -79 -52 -101 258 -102 86 170 255 -136 -180 73 -91 -8 30 309 88 109 -219 182 43 -105 325 -176
7437 -176 -96 48 -74 -46 -9 45 8 25 59 -183 295 18 128 64 167 196 260 126 -361 -213 -87 151 290
7460 290 -115 -70 101 -61 135 -179 -214 107 37 -9 -177 370 1 168 -55 -304 -173 85 125 25 355 -8
7482 -8 -71 -118 137 -57 -123 29 180 156 3 248 30 100 -115 -404 -118 2 24 -112 75 144 -200 81 -146
7505 -146 -131 -141 336 14 -22 -360 135 68 226 -11 -196 180 -135 213 2 -94 103 -26 21 -9 -1 -27 163
7528 163 -74 -106 -22 18 150 -131 174 -197 3 48 262 222 -26 4 205 445 -53 154 108 33 -17 135 24
7551 24 54 250 25 8 258 -158 -224 29 -161 117 -466 100 59 74 -181 -67 247 120 70 -39 -47 -135 -439
7574 -439 -10 38 -222 100 -243 -134 -18 316 -47 -71 28 363 17 15 -196 164 -20 -103 55 -91 208 -90
7596i0L89L1l88J83J28j37j42p8K19J02j3j89j33L23j10qk08K63n8l69J37J19
7618b9j24K24n1j86K23L4j94K58P6j46r6N7k15l1R9R7k41q0N03l69J33k5k3L3
7642g3L5N4L0r4K3K49l68J59k3L0K54m09N1j70L31J7l14K28J03j1N2j78M5j8K09
7667B12l47J3J25J06p9k35O72o72L47k37R6J5k14O8j57L08on3L75r5n57M5K12
7690e8P7k71K41Lj9J06q7k70p8L42m0Q4k0l08J92R1R5k2r4k60J77L25m13L04m23
7715c26R2K0M39j30j31K23O2l81Q2l1L74l24j92J75j80K31j85k25J65L77l40K29
7737B4P9N1j54j67J01K42k63K40j79L5Q2k3K5l08J92K1O3J43r3l36j4O6j3K81
7761I5M4j64q2k42L82k4j24J80J21j59k8m7q3L53k38Q4J08j20j01n0J07Oj26P
$$ plain form
7596 -90 299 330 -58 125 253 116 -26 -104 115 217 204 15 -118 205 95 87 -121 142 84 -285 -148 -29
7618 -29 -153 71 20 -166 57 91 -103 155 231 85 -11 46 -169 -200 -101 -4 -245 -325 178 -191 -58 -83 -106 -73
7642 -73 -38 16 46 -48 -25 224 -144 15 -8 22 276 -133 -82 -252 79 96 -218 10 113 102 154 -24 21 3 212
7667 212 -135 -122 3 109 30 -205 467 -205 142 -95 1 16 -198 -130 -287 21 15 -38 337 242 -315 -270 -58
7690 -58 19 -252 -11 -8 -27 79 -8 -278 -356 -14 -54 30 10 -298 -106 -15 80 58 -36 -296 -119 206 -207 97 -326
7715 -326 -234 -214 225 95 -36 187 249 -132 -50 -81 293 -31 -223 -48 -228 3 -182 -407 -242 135 -205 24
7737 24 103 154 0 -167 -66 176 -87 153 -26 9 91 68 93 -215 -23 -2 61 204 111 -225 -239 -173 -186 95
7761 95 139 -25 -107 -349 33 9 -115 65 186 27 -1 -48 -131 222 -16 68 176 56 -45 -95 12 18 -108 -101
7785a01Q2l2P7N3O3k01j02JK65l34M81k74J95m44L52j18j37J99N2K65l20l2J95
7808A85j31O4k34K02P3l63K27j09j83jL14j28R6L12k18l48M09j62m61O61m13O7
7830a41K63k18r1J68K38m29J47r6J85rr6j8J84q7JJ9j03J99j00J40j91k72L03
7853dJ52j9j83K3L0l00M14K9r6L02p12J17K3J82K24j96J64k14n5k56N70m5r6p0
7877a6qj89K89j29K32j49l38L94k48M02r0j4kO7j73n3K32j55n0j76J13l51N95
7900A83k59Q4j92q0K28K76j27p6j94J61K8mk06M56l6k49m10K32J45q1Q2l0m9K17
7924I9j44j62K56k34q5P0L90k26M1J2O3j40K23K25j35m07n1J67O0K16l89J69J52
7947A70r4N3j77J99j06l84K40K7j04J67J15j21J15K90l38K4j18J16l4j63j82J77
$$ plain form
7785 -101 -19 -51 26 79 142 -59 -161 -160 105 -229 252 -22 173 -271 81 -37 -174 25 77 342 22 -10 185
7808 185 54 118 -116 86 159 -204 23 -86 -269 -270 44 -84 12 324 106 -242 167 5 -456 205 -208 -141
7830 -141 122 -96 -187 -19 219 -210 -63 -159 26 17 -79 -97 87 0 1 20 -83 116 16 156 -35 -307 -4
7853 -4 148 129 -54 -31 -1 -301 113 142 46 348 -364 -247 -224 -42 182 -14 150 -64 -119 -375 195 150 54 -16
7877 -16 -24 -213 76 -53 179 30 -308 86 -162 240 150 136 134 201 28 -25 207 52 2 -174 -61 -412 183
7900 183 -76 8 -184 -264 -36 240 113 37 -157 4 32 28 -178 278 242 -7 -417 -185 -40 -121 -39 -69 -118 99
7924 99 -45 -207 49 -185 -270 -200 190 -36 5 17 80 -60 163 388 253 -154 -205 -38 22 238 -151 18 170
7947 170 76 129 -48 151 45 -339 -99 -72 -176 -9 106 -15 100 390 52 76 -42 74 40 -123 -305 -128
7969a28K71P9q1m6m10l6P50o57K50o5K29k34J05l8m8R0r1o8j5j74J89K22m6j14
7993f6N1J84l77N4O8J96k82K15j32n3M06q5o2m4j59o3R4p6K03k44J33L6j89L40
8017A48k27J02K00n29o3M75j11kJ05p4l10L28j19J11M5j07O0j35J92j30K2n1l4
8040a04R4k66L01j47MPj52L25m51J22J43M33p8k02JK2l57J84Q1L06k41J67n14
8063c22M74N5k60K54k56K29K2o9P3m73L98Jj58J71K36r1j90k7j50L83o8m02j56
8086c26K31L61o9j5m10J88J04j55o7j25K49m7l9j64Q6K74oJ0P1J91m25j19L54
8109A52l2jj38O6r6k83L29k1J4p9K05p3J39j15p1K32l07K46q5k35K27k23J03m
8133e0p9k6K63L4k90K72P1l80j2J93p9J22j38Q9nk03L10q8m74N35n9j30J31L7
$$ plain form
7969 -128 143 222 141 95 -315 -351 399 -258 -8 -73 156 -78 27 -11 -59 31 -60 -128 -143 -317 -128 94 48 -66
7993 -66 -15 169 -208 -154 -86 110 -172 43 -89 -142 264 179 117 73 -86 -149 -55 -131 72 -172 -39 -3 -192 148
8017 148 -79 23 223 -306 -369 106 -5 -7 98 24 -286 42 -77 34 79 -28 32 -103 89 -41 -19 -70 -104
8040 -104 -10 -276 25 -122 -118 -111 -263 62 -389 -267 -124 309 231 29 30 52 -305 -121 -40 266 25 192 -322
8063 -322 152 207 -53 201 -55 174 196 127 200 -273 125 126 -32 139 375 284 94 67 -83 300 232 -170 -326
8086 -326 -95 266 197 182 -228 -40 64 -91 -158 -283 -34 -81 -120 -284 -198 76 70 80 151 342 -83 -202 152
8109 152 120 119 -19 47 -49 -332 -3 -24 -10 -89 116 43 182 67 -4 228 -79 167 82 -153 74 -149 -46 -50
8133 -50 -129 -155 108 142 -148 124 195 -185 -197 -4 -83 39 -99 -10 -15 -218 92 4 -470 65 6 -124 7 44
8157D4q8q9L12j20j25Pj6k8l9Q8l1K66n4l55R3P2k11m9K55k08kL49l59J60O75
8182E47n37J04j91J59m2k77N6M3K83
$$ plain form
8157 44 -44 -133 179 59 -66 -59 -75 -103 -142 -54 -85 181 127 -228 -135 -63 -274 -323 -68 -276 -278 71 -288 -128 547
8182 547 10 114 -77 82 40 -237 -181 -138 145
8191A45
$$ Imaginary data points
##PAGE= N=2
##DATA TABLE= (X++(I..I)), XYDATA
0@%%%%%%%qJ6j6J6k4L2l2M0n4O2p2Q8j04J20j42J66j90K20k52K88l28L72m21M76
31B53n35N99o73P53q37R31j036J150j274J411j564J732j917K124k356K616k912
48a535L250l640M101m652N320o157P240q699J0788j4052J9917l3711J24233R7759
62B00162k09534k3238R9440L5252r7358j9550M6458J9601j4271K8995m339n0418
74A1200j454O9080j3970q9204k677R9962K2234o8043j8149M4493r067l3826K4698
87C5277K0305n7436k4101Q2430M7737p8848n4469O5607M7296o7151n1264M4681
99A0064M0459k2452q442J9037j8282k3408L5987K5599o1011m7933N8549N8968
111F7135m2161m6317L8289L1278m1967k5027L2673M76m1222J6580N6162k0297
$$ plain form
0 0 0 0 0 0 0 0 0 -8 8 -8 8 -16 16 -16 24 -30 32 -40 48 -56 64 -78 88 -102 118 -134 154 -174 198 -223 253
31 253 -282 317 -356 397 -440 491 -545 605 -669 742 -822 910 -1007 1117 -1239 1377 -1535
48 -1535 1715 -1925 2176 -2476 2844 -3313 3927 -4772 6016 -8036 11881 -21830 102403 200162
62 200162 -9372 -32610 66830 102082 4724 -14826 31632 51233 36962 65957 61618 11200
74 11200 9746 78826 64856 -24348 -27025 72937 95171 27128 8979 53472 44405 10579 35277
87 35277 55582 -1854 -25955 56475 104212 25364 -29105 36502 83798 16647 -34617 10064
99 10064 50523 28071 19629 38666 20384 -3024 32963 58562 -2449 -50382 8167 67135
111 67135 24974 -21343 16946 48224 6257 -18770 13903 14379 -26843 -10263 45899 25602
123B5602o3175K3183O8920k4128p9172K839O0779M806l4305O157J8678j6314o330
136a2460K4537j0103m4557Q295N0846o216m8977J1687N3184j0583n0944L172L2346
149B27j4375k3372K7912K2519l4825j8324M3549K0047m6878k7912L4002J8734
161A304k6250m547K8994j832k4967J0444K1717k4748k7658K8072L0389k8115k8136
174d5333L1392L0521k4862k4539J6519P949k1173L315K8534o748l1021J4430L8956
187A7940j3071m3110N184L6473l485k7326N679K1138l290n444J1441n131k4271
200b7273O256L1323m213l4612M350L9133L122l0723l816K0247k279j5318Q810
213d993J0044j3705k709K6905O794l1921j2329K9960J3649k6247j3564K0471J2540
$$ plain form
123 25602 -37573 -14390 54530 30402 -48770 -45931 14848 19654 -14651 -8494 10184 -6130 -12460
136 -12460 12077 1974 -42583 -34288 16558 10342 -38635 -26948 26236 15653 -35291 -32119 227
149 227 -14148 -37520 -9608 12911 -21914 -40238 3311 23358 -23520 -51432 -17430 1304
161 1304 -24946 -29493 -499 -2331 -27298 -16854 4863 -19885 -47543 -19471 10918 -17197 -45333
174 -45333 -13941 16580 -8282 -32821 -16302 -8353 -29526 -26211 2323 -4425 -35446 -21016 17940
187 17940 4869 -38241 -33057 3416 -69 -27395 -21716 -578 -3868 -9312 2129 -3002 -27273
200 -27273 -21017 10306 6093 -28519 -24169 14964 18086 -12637 -16453 3794 1515 -13803 -4993
213 -4993 5051 -8654 -11363 15542 22336 -9585 -21914 8046 21695 -4552 -18116 2355 14895
226A4895q770K58P064j1688j0050J7235J1933k2739j4276K6170K1827j9153k0657
239g951J4123J5445j1004j1052O764J023m541J1505J2785j4572j8465J4288K1651
252B9999j4777k4520Q370K2881j483j2406L362M866o493P86P823p573j5848Q858
266C845K3325m136k1990J462K0633k04j8692l868Q966P26r24P203k11j2151J371
281E355J5897j325k2278n430J9199Q781j2374o231R064L352m853k55q07j0082
295a987j641J4811N480j4109p237J5020R465j3800j2743M972P105j972j053K422
309D733k746j912Q428L871j3984j1834J0020J2985o409j2031N412J1362j247p044
323c96k729j812k670L510N973m406p234O907J1134m535j4394j428Q701J522n745
$$ plain form
226 14895 6125 6383 13447 1759 -8291 8944 20877 -1862 -16138 10032 31859 12706 -7951
239 -7951 6172 21617 10613 -439 6325 7348 2807 14312 27097 12525 -5940 8348 29999
252 29999 15222 -9298 -928 21953 20470 8064 11426 16292 9799 10585 18408 10835 -5013 3845
266 3845 27170 23034 1044 2506 23139 22935 4243 375 9341 10067 9143 16346 16135 3984 5355
281 5355 21252 19927 -2351 -7781 11418 20199 7825 1594 10658 14010 9157 8902 8095 -1987
295 -1987 -3628 11183 16663 2554 -4683 10337 19802 6002 -6741 -1769 5336 3364 2311 4733
309 4733 1987 75 8503 12374 -1610 -13444 -3424 9561 3152 -8879 -3467 7895 6648 -396
323 -396 -3125 -4937 -7607 -4097 1876 -2530 -9764 -2857 8277 3742 -10652 -12080 -3379 -1857 -7602
338g602j240L070K167K885K238o125r057K025Q966n73r178m66J0147M476n148
353c415m714p30o44P31K456j623m933L418J0003J234j0634o159P473M475n439
368h501n025K839N673K141L3j948m124j438M187K104n909l697O880P961j674n925
384f423j772L147O31j637k580o90K399N388L201m087m663J539M144j435m831j585
400i254M876M912R68l374k513J898K722k60n272k822M403O827K41m228j681K618
416F1J778j397l386j301K036M508K132j784l319J139L613Q9n087l344L570O002
432E310Q37m038k109L093K982j148m481k380K279L892J527k150k221J491L738
447F622l22m608l445L022M859m54l412o39L299K503j719l459j664J122K399J282
$$ plain form
338 -7602 -8842 -5772 -3605 -720 1518 -4607 -13664 -11639 -2673 -3246 -12424 -12890 -2743 1733 -3415
353 -3415 -8129 -8859 -9503 -8772 -6316 -7939 -12872 -9454 549 1783 -8851 -15010 -7537 -3062 -8501
368 -8501 -13526 -10687 -5014 -2873 -2840 -4788 -8912 -10350 -6163 -4059 -9968 -13665 -6785 1176 -498 -6423
384 -6423 -8195 -5048 -4417 -6054 -8634 -9324 -6925 -1537 1664 -2423 -7086 -5547 -1403 -2838 -7669 -9254
400 -9254 -4378 534 1502 -1872 -4385 -2487 235 -25 -5297 -8119 -3716 3111 3352 -876 -2557 61
416 61 1839 442 -2944 -4245 -2209 2299 4431 2647 -672 467 4080 4169 -918 -4262 -692 5310
432 5310 6147 2109 0 3093 6075 4927 446 -1934 345 4237 5764 3614 1393 2884 6622
447 6622 6300 1692 -1753 1269 6128 5674 2262 1623 4922 7425 5706 2247 583 1705 4104 5386
463E386j093k421J228L196pl369l082J890K828L19k104r28R65K267J082k918l972
480g33P21M314O63l652k063L139K978j253k992j235O29J710N81j551k213P68L701
497C512Q84m318k730K551K757j718k529O19J116L24M64J39k455j736K235L331
513B446k757m237J513M430L36m294j190J940J265r18p96j236m6J559K239j970
529a716l054J023L251m16l530n57K022N48j97L09m81j908Q20L046p38m042o79
546f299M109J936l580k064K138K116r96j132o28m66J365J921j22l767p71M522
562a718K091m302k657K565K776j129j779P39M64j84J108N76k059k103L043L015
578D46k422l432J578L842n24k389q55J141K28J154Q37j764j719K482L061k216
$$ plain form
463 5386 4293 1872 3100 6296 6289 2920 -162 1728 4556 4875 2771 1843 2808 5075 6157 3239 -733
480 -733 -12 4302 4965 1313 -750 2389 5367 4114 1122 -113 516 2226 2807 1256 -957 -189 3512
497 3512 4396 78 -2652 -101 2656 938 -1591 -972 144 468 932 1071 -1384 -3120 -885 2446
513 2446 -311 -4548 -3035 1395 1731 -2563 -3753 -1813 -548 -1466 -2262 -3498 -3544 -1985 254 -1716
529 -1716 -4770 -3747 -496 -912 -4442 -4999 -2977 -2429 -2626 -2317 -2798 -4706 -3886 -840 -1578 -5620 -6299
546 -6299 -2190 -254 -3834 -5898 -3760 -1644 -2640 -3772 -4400 -4866 -3501 -1580 -1702 -5469 -6240 -1718
562 -1718 373 -3929 -6586 -4021 -1245 -2374 -4153 -3414 -2950 -3134 -2026 -1450 -3509 -5612 -2569 446
578 446 -1976 -5408 -3830 12 -512 -2901 -3756 -2615 -2387 -1233 -396 -2160 -3879 -1397 1664 -552
594e52l521J439L315o73k635J39K346j50n98R29l85k141J243K856l17l891K5M418
612A847P79l078r35J546J306j138RM63j176M74K608j08l740l55L831J313l605
629D1j509K495K164j386j177J240r16j039J996J380k485j259K301K468k711k280
645f77J953K197j549j308Q15L58k68M90J363j586k321J858K424j347k876P98K831
662C155n66j748K39J088j165lJ005j85k135J195K345j002k650K42K330K83k549
679a21J55J725q50l32P28P1j175p58J857J38k229k91K593K71k226j79J064q4j358
698a001Q26J135j584r60K176J066k038j559J778J237j658j849J605J077j101m67
714a317R55Q0j769N89J550m73k298J180J632r18j316M28P51l59j97O36n33j303
$$ plain form
594 -552 -4073 -2634 681 8 -2627 -2488 -142 -292 -890 39 -346 -2487 -1244 1612 1295 -2596 -2571 1847
612 1847 2626 -452 -1387 159 1465 327 336 799 -377 97 2705 2597 -1143 -1498 2333 3646 41
629 41 -1468 1027 3191 1805 628 1868 952 -87 1909 3289 804 -455 1846 4314 1603 -677
645 -677 1276 3473 1924 616 1431 1789 1521 2011 3374 1788 -533 1325 3749 2402 -474 324 3155
662 3155 2589 841 1080 2168 1003 1000 2005 1820 -315 880 3225 2223 -427 -185 2145 2428 -121
679 -121 34 1759 909 577 1305 1376 201 -557 1300 1438 -791 -1082 1511 1782 -444 -623 441 357 -1001
698 -1001 -175 960 -624 -1584 592 1658 -380 -1939 -161 1076 -582 -2431 -826 251 -850 -1317
714 -1317 -362 -282 -2051 -1462 88 -385 -2683 -1503 129 -789 -2105 -1677 -926 -1285 -1482 -846 -1379 -2682
732b682J000K056q81k698Q85K491o29k489M24K337l08j801N04R28n00r78J254
749a087L10j389K3J294M13j827J70J050k99q34L43J516r38q65J076J480k157q86
767b607R44J922j054j431R30J306o69q06N74j20Q1P0M26n64k64O71J100n77j347
786a415O73R92m62j055P04Q33n18M73L19m14j553R08R83q8j322Q38J265P0j457
805b26L8Q89j68j094N94O15k46L29N85j71q40L7M91L32j243J91J184L31j176M07
825H59P15l19j064M53P07j04o66K94R30J15p96J40J69p09J49K10j48j3R97O20
845B539q69p54Q4O63n77l38K71L99O7j6N38m56n42N7k6J65r63M09J026L30r70
866A037q5M03k38n47j27L85m16M30K29M05n06l64K5k53l53p8L26M95k70J93J88
$$ plain form
732 -2682 -1682 374 -507 -3205 -2320 171 -458 -2947 -2523 -186 -494 -2295 -1791 -863 -1363 -2341 -1087
749 -1087 -777 -2166 -2143 -849 -436 -2263 -2093 -1043 -1342 -2176 -1833 -317 -1255 -2120 -1044 436 -1721 -2607
767 -2607 -1663 259 -795 -2226 -1296 10 -659 -1465 -891 -1011 -930 -860 -434 -998 -1262 -591 509 -68 -1415
786 -1415 -742 250 -212 -1267 -563 270 -248 225 544 130 -1423 -515 468 380 -942 -104 1161 1231 -226
805 -226 -188 701 533 -561 33 648 402 731 1316 1145 305 342 833 1165 -78 113 1297 1628 452 859
825 859 1574 1255 191 644 1351 1247 581 875 1805 1920 1124 1264 1433 724 873 1083 935 922 1919 2539
845 2539 1670 916 1000 1663 1086 748 1019 1418 1485 1469 2007 1551 1009 1066 1040 1205 242 651 1677 2007 1037
866 1037 952 1355 1117 570 443 828 412 842 1071 1476 970 606 631 378 25 -53 273 768 498 691 879
887H79k35n91l5J65m27j35K08P43M64q56n33K53J34j58m93l0J42K65J05J34m40
908d41K75j09m29k70k33M74P57j4k70K30n49L82l97n56j3j2K31M26K12jj33k00
930f40m05R9l26L10%M3K94K83p4j57j39k54m77m29R12M04J86m29J61j71J95r1
952g05m3k64k21K61K21K65o2K33k5l68m10J3P62K77k67m34M72j3kK62p27j67J59
975g83L37K58p1L6M55J28m95j85O5L95l24K66l79Q0O35P8Q7m22m03p9M56r0J59
998B04J49L25l64o0M34k8p37j92L43L70j27M31K76q6p19K19J37J75k94K10o0J55
1020G61J04J38j13q2k79K00j21k82M08L52k8j43J59Q1k64k09j47J65q1o4K28M57
1042A240k29l88K18K7k30j89N93k47O3l54O74j76j82j99o1j79j32K34L41j65J79
$$ plain form
887 879 644 53 18 183 -244 -379 -171 572 1036 180 -353 -100 34 -124 -617 -647 -505 -240 -135 -1 -441
908 -441 -166 -275 -704 -974 -1207 -733 24 10 -260 -30 -579 -197 -594 -1150 -1163 -1175 -944 -518 -306 -307 -440 -640
930 -640 -1045 -946 -1272 -962 -962 -919 -625 -342 -416 -573 -712 -966 -1443 -1872 -960 -556 -370 -799 -638 -809 -614 -705
952 -705 -748 -1012 -1233 -972 -751 -486 -548 -315 -340 -708 -1118 -1105 -343 -66 -333 -767 -295 -308 -310 -48 -775 -942 -783
975 -783 -446 -188 -259 -223 232 360 -135 -320 -255 140 -184 82 -297 -217 418 496 583 161 -242 -321 135 45 204
998 204 353 678 314 254 688 660 -77 -269 74 444 317 748 1024 938 219 438 575 750 456 666 606 761
1020 761 865 1003 890 808 529 729 608 326 734 1086 1058 915 1074 1155 891 682 535 700 619 555 783 1240
1042 1240 1011 623 841 868 638 449 1042 795 858 504 1178 1002 820 621 560 381 249 483 824 659 838
1063H38K0l86j80J2M26m8o42K06K57K22k51k23J56p9m63J07J41J9J48J92m5l16
1085A11j3R0p5l57l22L75J13K64QJ39k75l72J57L46p48K26J68o0J38l9K7J28r4
1108f5m99J61N0J67l16L45J64l32O4J18l63m56j03N59L05K03j21n5j94q7k41N7
1130f39M4J7K65J0kk03K24q6j12m31L64j77J78J24J81j47o7L37k87m33Q4K57j13
1153f12L7M05J65n1j38j57j19j12p9k05M17K87k1K38K1l64j5j22J72q1J96k27
1175c65Q8L01M8q1O1l81K10l29M41j56L86k05K63o5J65o23O9J27lj9J35J54J3
1198B34K10k14l0j36k11L22J98j07M7R9K25l17k03Q5l26J41L02K06j94K57J2j82
1220D18L1j50k02L29m04N21j7j80K17K51o92K74j98J46J90k16j57N75j05j6j61
$$ plain form
1063 838 858 472 292 304 730 682 40 246 503 725 474 251 407 328 -135 -28 113 132 280 472 427 111
1085 111 98 188 113 -244 -566 -191 -78 186 194 333 58 -314 -157 189 -559 -333 -165 -225 -87 -126 -99 29 -65
1108 -65 -564 -403 -353 -186 -502 -157 7 -325 -261 -143 -506 -962 -1065 -506 -201 2 -119 -174 -368 -455 -696 -639
1130 -639 -595 -578 -313 -303 -305 -508 -284 -370 -482 -913 -549 -726 -548 -424 -243 -390 -457 -120 -407 -840 -756 -499 -612
1153 -612 -575 -170 -5 -56 -194 -351 -470 -582 -661 -866 -449 -162 -183 55 76 -288 -303 -425 -253 -334 -138 -365
1175 -365 -277 24 72 -9 52 -329 -119 -448 -7 -163 223 18 281 216 381 -242 -173 -46 -49 -68 67 221 234
1198 234 444 230 200 64 -147 175 373 266 313 412 637 320 117 202 -124 17 319 525 331 588 600 418
1220 418 449 299 97 426 22 543 526 346 563 814 122 396 198 344 534 318 161 736 631 615 454
1241D54q1j03L03n06K66q9j94N21N8j44k65N4l1N4m00M53j05K75K77l33N5m04
1263A15j38K25K31m18j23O81j25j31l3k6L0j23J49l45K37j58N12j90m78M78m31
1284f1k7J06l42P35k59M7M7N7m64k36L18J1n61L0L91N69n76R2L39l9m40J02r7
1307b58j28J11J65l6J18j10j45N6k06J86j31P6J35k61J06JJ4j38J72j81q9K36
1329c07M66m35j53N7K15m30K09l9M3k14J14P00m10k82N49l85K73l02k36N71l26
1350c22j29L34j55K32m40L15j64m3k05L59K55r5l89J97K32j26J63j70L3N2J3k47
1372c00J25k65P65j31j46l76K58L21m75m6L58J76k8l06L73j62j48j44L75L7l73
1393a12L26O2k57jJ42RK01m61M0J26J07j09M08l14l91J63N63k01k57K88J49k6
$$ plain form
1241 454 373 270 573 67 333 244 50 571 629 485 220 274 243 297 -103 350 245 520 797 464 519 115
1263 115 -23 202 433 15 -108 573 448 317 284 258 288 165 314 -31 206 48 560 370 -108 370 -61
1284 -61 -88 18 -324 411 152 199 246 303 -161 -397 -79 -68 -629 -599 -208 361 -215 -123 216 177 -263 -161 -258
1307 -258 -386 -275 -110 -146 -28 -138 -283 -227 -433 -247 -378 -302 -167 -428 -322 -321 -307 -445 -273 -454 -543 -307
1329 -307 159 -276 -429 -372 -157 -587 -378 -417 -374 -588 -474 226 -184 -466 83 -302 -29 -331 -567 4 -322
1350 -322 -451 -117 -272 -40 -480 -165 -329 -372 -577 -218 37 -58 -447 -250 -18 -144 19 -151 -118 -66 -53 -300
1372 -300 -175 -440 325 194 48 -328 -70 251 -224 -270 88 264 236 -70 303 141 -7 -151 224 261 -112
1393 -112 214 276 19 18 160 169 370 -91 -51 75 182 73 481 167 -224 -61 502 301 44 332 481 455
1415D55Rk66kJ19l44M39k07j44M47j19o6l03J10l3K12m53J5R0L81N3j57K71nn21
1439a9r2M61l57J65J29nj41j0k1K73k28n8Lm1K18L3J09j95l44J46J8Oj36K30j25
1464A9l88N90r6J36k92J91j12K43m98L70J71m18N16m05np1k23L55R1n09K57P8
1486@O5j38k74L89o8j48K03l4kJ52k21J76j70l6J16j60j20J22J00k5l8j18J85
1509d4N5J7j89n5J86k86N16l60L9m3K82J29k81qj17k1J32m2J17P9n96L76Q1R5
1533F2j93n25N72j34P6o2q7R8L58n06N47j97l51J34M47k02j37L6j35M7k54N30
1555A24l10J41K8Q1j78j46K16J22j82L3p9K55j84K9J47j89p3L04N3j30k14l8J72
1578a8L4N2l70N28k76N0K15k82n2M3K59k85J35j20Q7K26l56j51J16K75m19L88
$$ plain form
1415 455 464 198 196 315 -29 410 203 59 506 387 321 18 128 95 307 -146 -131 -41 340 393 236 507 502 -19
1439 -19 -111 350 -7 158 287 282 141 131 110 383 155 97 100 59 277 310 419 224 -120 26 44 50 -86 144 19
1464 19 -369 221 125 261 -31 160 48 291 -207 163 334 -84 432 27 22 -49 -272 83 174 -335 -78 0
1486 0 65 -73 -347 42 -26 -174 29 -5 -7 145 -76 100 -70 -106 10 -150 -270 -148 -48 -73 -111 -229 -44
1509 -44 11 28 -161 -216 -30 -316 200 -160 -121 -164 118 247 -34 -42 -159 -180 -48 -90 27 106 -490 -114 -33 62
1533 62 -131 -656 -84 -218 -142 -204 -291 -193 165 -341 206 9 -342 -208 239 37 -100 -64 -199 -152 -406 124
1555 124 -186 -45 -17 64 -114 -260 -44 78 -104 -71 -150 105 -79 -50 97 -92 -165 139 192 62 -152 -190 -18
1578 -18 16 68 -302 226 -50 0 215 -67 -119 -76 183 -102 33 -87 0 226 -130 -281 -165 110 -309 79
1600G9J04j96J12m3k3Op5K01j52j24J71J03p6m8J09j16K52k77P0K33k74kK16j49
1624A01lj04k52J91L93k4m41M08k64J78m9J69m12K88K02n46N6L24J45l61L46l15
1646C0K30O7m63RK50Jl4J94k30N0m39K72J73l41L01k02N43j93J4j59l19K17J60
1669A31l74J03L04k01j59L17k93R5J15J52j99j06K74l98M45m2k73j05L44o9j55
1690i4j4M7j3j5L6q6J10j8J56K5j54J01l16L55l06j0K04J28l67K62j86Q5j61J42
1714h9r2r2j0L81o6k05R7j13N8j31jJ84L6q3R6j33J14k68q3J23K97k8j26RK71
1739A46m37M37J3l97O0J08L33m53K08J61k41j9r8p9K75J2k15K34l45M85l96K98
1761I0M6j96K30j35j15j16J89%n8o6RK19q6p2J24p4l01L97k22J63j03L03j69K33
$$ plain form
1600 79 183 -13 99 56 33 39 -36 165 13 -111 60 163 87 39 148 32 284 7 77 310 36 34 250 101
1624 101 98 -6 -258 -67 326 302 -139 269 5 183 134 303 -109 179 381 -165 -109 215 360 -1 345 30
1646 30 260 327 -136 -127 123 124 90 284 54 104 -335 -63 110 -231 70 -132 411 218 232 73 -246 -29 131
1669 131 -243 -140 164 -37 -196 121 -172 -77 38 190 -9 -115 159 -239 206 164 -109 -214 130 61 -94
1690 -94 -108 -61 -74 -89 -53 -139 -29 -47 109 134 -20 81 -235 120 -186 -196 8 136 -231 31 -155 -70 -231 -89
1714 -89 -181 -273 -283 98 32 -173 -76 -189 -131 -262 -263 -79 -43 -126 -30 -163 -49 -317 -400 -277 20 -8 -134 -125 146
1739 146 -291 146 159 -238 -178 -70 263 -190 18 179 -62 -81 -179 -258 17 29 -186 48 -297 188 -208 90
1761 90 136 -60 170 35 -80 -196 -7 -7 -65 -131 -122 97 11 -61 63 -11 -312 85 -137 26 -77 226 57 290
1785B90l39J46K01k32j21Q6j69l02O07Pr6k53L59n23K49K7K17l6N0r3J15j19J45
1808B16k59q5L54k40l6P6P0k39K6J74R9j52N4j9M0L34l14p4P4Jp7n7p1K20j25
1833a0K35r0L4j08j5J0J14j64R4l1j58R8J66K3k47J7M7j25K50J59J0j35j43K19
1857B50m12J16K04k00R5m0l1k39K73J16j6j29j8Q9j40J83j30J97l2j20n5j86N40
1880C15m49l8m1K42O8j68O4j2J51n3k18J75p3O2K35l94k45L22M0J21j45J11M3
1903A13k43k51J74qK30j26k11K98q8J95J96m67O5p9J39J20k71J42O6o1j56O7L45
1926A89O5j87l61J78o9KJ55J07k55o6L41R3M4j58M6j22j68L64k40k0L66o5j25
1949A14k49K94k50m6K85o8o7j30Rk48K76J33j99L18j98o6j5M52p95L91K32J00
$$ plain form
1785 290 -49 97 298 66 -55 31 -138 -440 167 174 78 -175 184 -339 -90 -63 154 118 168 75 190 71 216
1808 216 -43 -128 226 -14 -50 26 96 -143 -117 57 156 4 58 39 79 413 99 25 99 100 23 -34 -105 115 -10
1833 -10 225 135 169 61 46 56 170 6 100 69 -89 9 175 198 -49 -32 15 -110 140 299 309 174 31 250
1857 250 -162 -46 158 -42 53 13 -18 -257 16 132 116 -13 -31 58 -82 101 -29 168 136 16 -39 -225 315
1880 315 -134 -172 -213 29 97 -71 -7 -19 132 79 -139 36 -37 25 260 -134 -379 -57 -17 104 -41 70 113
1903 113 -130 -381 -207 -215 15 -111 -322 -24 -112 83 279 -188 -123 -202 -63 57 -214 -72 -6 -67 -223 -156 189
1926 189 254 67 -294 -116 -185 -183 -28 79 -176 -242 99 192 236 78 124 2 -166 198 -42 -62 304 239 114
1949 114 -135 159 -91 -137 148 80 13 -117 -108 -356 -80 53 -146 172 -26 -92 -107 345 -450 -59 173 273
1971B73j05j89J50J17k86J52j08O0J17l10J22L03k56J85J24l75J32o5m0K25l85
1992a59K8K25kn8J44l50M83l77K38l0k59K08qp7J8K44j82J35j72k38R8J1K98J14
2016C32k31k90J00N2j1o3K66k00K54M0k29K05n7K20k31k80j79M84j77Q5k86M53
2038B57j33j72L44j07j95j75K61j95J62o0n1m2K93n57L62J58j25j3p5L67m39J71
2060C6k11L13L1k06J26k04K13P1j11K02k64r0J7K02J33n6k46n1N9K48j95o8j5
2083f6K59j68l8j27K83k03J2J29rj82L12k87L30l50k60K82K32l04L79k85J33k31
2105a59M04o0R2m95L32Ml08K98n6j17K0K94k56K19l23p3p6J66J65J02j34QN0j79
2129h2J69j81M83k96J06k18j93J17l3j32M36o0k63J33j8J47l5kK04J5m12K1J52
$$ plain form
1971 273 168 -21 129 246 -40 112 4 64 181 -129 -7 296 40 225 349 -26 106 41 1 226 -159
1992 -159 -131 94 92 34 178 -172 311 -66 172 142 -117 91 83 6 24 268 86 221 49 -189 -91 -80 218 332
2016 332 101 -189 -89 -37 -48 -111 155 -45 209 249 20 225 168 388 157 -123 -302 182 5 90 -196 257
2038 257 124 -48 296 189 -6 -181 80 -115 47 -13 -64 -106 187 -370 -8 150 25 12 -63 304 -135 36
2060 36 -175 138 169 -37 89 -115 98 169 58 260 -4 -94 -77 125 258 202 -44 -95 -36 212 17 -51 -66
2083 -66 193 25 -13 -140 143 -60 -48 81 72 -110 202 -85 245 -105 -365 -83 149 -155 224 -61 72 -159
2105 -159 245 185 277 -218 114 118 -190 108 52 -65 -45 249 -7 212 -111 -184 -260 -94 71 173 39 47 97 -82
2129 -82 87 -94 389 93 199 -19 -212 -95 -128 -260 176 116 -147 -14 -32 115 80 78 282 297 -115 -94 58
2152E8K21j42j39j12M7K39l64M10k93L57l80N6J10k07P3J34K93J21m35k12L46
2173A81k51L19k41l13N19l16L5K47l40j28O0M05q5M3k95K6M1m8K04j05r4K55k46
2196a27K94l02J18j1J68j51k14L30j46J10l8j0j31J21j96m9L52N6k02J4j1o8k7
2219a20M03l66Ok6J40k68M24k13K1J6j93K42j01J64l11K52k69J41k4J42J29k79
2241i0J78j3J85k31O7k8q0J0Mj6Q5j25k76J80K84m56R0J36j78J78J94j34j66P6
2265a26K25j95J3M10l33j52J4K40Mj43K29l4k32j77L87k8J33k08j53L34k5j74
2287Ik46K53n6r7J25kP7o9K3K59k21m9n9k1J86q2l5J95j99Mj31K47l2j01L2Q4
2313I4k5l38L41o5J35j58r3J10P0l59K50J12k05K3J9J08j50K36J90l17L8P3J21
$$ plain form
2152 58 279 137 -2 -114 -67 172 -192 218 -75 282 -98 -42 68 -139 -66 68 361 482 47 -165 181
2173 181 -70 249 8 -305 214 -102 -67 180 -160 -288 -228 177 92 135 -160 -134 -93 -141 63 -42 -136 119 -127
2196 -127 167 -135 -17 -28 140 -11 -225 105 -41 69 31 21 -110 11 -185 -234 118 174 -28 -14 -25 -93 -120
2219 -120 283 -83 -77 -103 37 -231 193 -20 1 17 -176 66 -35 129 -182 70 -199 -58 -82 60 189 -90
2241 -90 88 75 260 29 96 68 -12 -2 2 -14 71 -54 -330 -150 134 -322 -232 -96 -274 -96 98 -36 -202 -126
2265 -126 99 -96 -83 327 -6 -158 -144 96 100 -43 186 152 -80 -257 130 102 235 27 -126 208 183 9
2287 9 -237 16 -40 -137 -12 -14 63 -6 17 276 55 6 -53 -74 112 30 -5 190 -9 -5 -136 111 79 -22 10 94
2313 94 69 -269 72 7 142 -16 -109 1 71 -288 -38 74 -131 -108 -89 19 -131 105 295 -22 16 89 210
2336B10k44K22l89Q3M29k90q3K0M7M8j19K58o5j44j77J32J43m19N33j8j28j47
2358i8j02J90l0OJ75k12J48J2j60O26n15Mk97J44K60k25M4nN7k18o9M32l1j02
2382C4j56J79m7K09j24Q0l68L30L46m63j45j0J09L3M3K9Q8m62L46O7n6j06L02
2405B58k07p7K07O8k42j9r1J41O1j72J82k36J3M1J24j58J51Mj55K05j86J45r6
2428c9N3k4J28k30J92L6m06M18n56O15j26K07k57Pr6J60Q9k29l5K19p0l9J17j2
2452A22M7m25J14m1j9J62J87k34K05k24J29M08k68m18J37K94j40j90O1l2L55o3
2474A67k01l46J66K2k01K89K09J87l94R9j81K70Q8k92J98j14N7k65J23K38O9l66
2496a78L07l56J15M08l47n6K89j86j7q1J28k13K82j93j5j48N17j64k92L67m44
$$ plain form
2336 210 -34 188 -201 -118 311 21 -62 -42 5 53 -66 192 127 -17 -194 -62 81 -338 195 177 49 -98
2358 -98 -200 -10 -40 -34 141 -71 77 89 -71 555 40 44 -253 -109 151 -74 -30 -35 22 -196 -265 167 136 34
2382 34 -122 57 10 219 95 175 -193 137 483 20 -125 -135 -26 7 50 79 167 -295 51 118 62 -44 258
2405 258 51 -26 181 249 7 -12 -103 38 99 -73 109 -127 -114 -73 51 -107 44 48 -107 98 -88 57 -39
2428 -39 14 -10 118 -112 80 116 -290 128 -428 187 61 268 11 18 -78 82 171 -58 -93 126 56 17 134 122
2452 122 169 -256 -142 -183 -202 -40 147 -87 118 -106 23 431 163 -255 -118 176 36 -154 -93 -125 230 167
2474 167 -34 -380 -214 -192 -393 -104 105 292 -102 -3 -184 86 174 -118 80 -34 23 -242 -119 119 188 -178
2496 -178 129 -227 -112 296 -51 -107 182 -4 -21 -102 26 -187 95 -98 -113 -261 256 92 -200 167 -277
2517b77K51k65L94k80K14j81R6pK7N2K3L8l25L89l5l02J67o4L14k36k17M25J09
2540C10j37l52J09j06n4o8L27L37j85K07l70N1m9j43M16m73J64q7J10J52J59k74
2562D4j06K30k23k0J01rj17L09k60J53j89K42m03K16J11l80J51K84N7j95L26l96
2584g4p5J75o0N7q4j41j29L90k68J21J13l13N58k92J03j00K97k51k9m3m0K75j31
2607E9m5n9O0N2J21k69K26j59j01K2J19j88o7J18RJ7j1K79k84l2k13M72k88K81
2631A19l47k45O42k53K82n40K20J02J56O8m68J17LJ65j9J71j25j78K2N7j37J84
2653dj46J75J27j09j43J92l3q8n9J63r3K60k69R4m7j27J9J79l2l50K25N1J32q5
2677C2k14J65Q1J25k86P7Nk63J4J04L53m64K73L3r4M6N9O8k62J32R0j32l42L58
$$ plain form
2517 -277 -26 -291 103 -177 37 -144 -48 -55 -28 24 47 85 -240 149 114 -188 -21 -85 229 -7 -224 201 310
2540 310 173 -179 -70 -176 -230 -298 29 366 181 388 18 69 20 -123 293 -180 -16 -103 7 159 318 44
2562 44 -62 168 -55 -75 26 17 -100 209 -51 102 -87 155 -248 -32 79 -301 -150 134 191 -4 322 -74
2584 -74 -149 26 -34 23 -61 -202 -331 59 -209 -88 25 -288 270 -22 81 -19 278 27 -2 -45 -85 190 59
2607 59 14 -45 15 67 188 -81 145 -14 -115 -93 26 -162 -229 -111 -102 -85 -96 183 -101 -133 -346 126 -162 119
2631 119 -228 -473 169 -84 198 -342 -122 -20 136 204 -264 -147 -144 21 2 173 48 -130 -108 -51 -188 -4
2653 -4 -150 25 152 43 -100 92 59 -29 -88 75 -18 242 -27 67 20 -107 -88 91 59 -291 -66 -15 117 32
2677 32 -182 -17 64 189 -97 -20 -15 -278 -264 -160 193 -271 2 35 -59 -13 46 114 -148 -16 74 -58 -400 -42
2701d2m15R54n98l7q4N15n21K30n5L1j12m0J68k27K43k46J73q0K48r9m1r6K02
2724G1j20J12J18j10k12kR4J22J45j63j12Q5k00K57j47J30p0J02p9r6L10k86j5
2747f6K33q1k96K73J7rk92K80J71o03J89M65k41j82J04j67J00K90k54n8k61J78
2769b10N7J31qK81j22j54K57j96j60J60J79j1l15J39j19R1K16pj30j10J17J06
2791A92m2l88L90J51k90j5M4j07L5O3j23K03J20l30J43l21J02Q4k44L25r0K42
2813A44l00J77l35J44K51j42J88r3L1p1l04N75j66n5N9k9j3K6o6j73K7M6mJ98
2837A15j41j25J49l27M10k05N5N9j16O3o9J56O3j37J12j40lN3q0R9j46J96K26
2860B67k32j38j4Q9J73l33O2p6L72k59K86P8l46n4Jr8K64P0l4k19K94J16k78J86
$$ plain form
2701 -42 -457 497 -101 -138 -222 293 -228 2 -53 -22 -134 -174 -6 -233 10 -236 -63 -143 105 6 -35 -131 71
2724 71 -49 63 181 71 -141 -143 -49 73 218 55 -57 28 -172 85 -62 68 -2 100 21 -75 235 -51 -66
2747 -66 167 86 -210 63 80 71 -221 59 230 -373 -184 281 40 -142 -38 -205 -105 185 -69 -127 -388 -210
2769 -210 -153 -22 -30 251 129 -25 232 36 -124 36 215 204 -111 28 -91 0 216 209 79 -31 86 192
2791 192 150 -238 152 303 13 -2 42 -65 -30 33 -90 113 233 -97 46 -275 -173 -89 -333 -8 -98 144
2813 144 -156 21 -314 -170 81 -61 127 34 65 -6 -310 265 99 44 103 74 61 87 21 -152 -125 -79 -83 115
2837 115 -26 -151 -2 -329 81 -124 -69 -10 -126 -63 -132 24 87 -50 62 -78 -81 -28 -108 -9 -155 41 267
2860 267 35 -103 -117 -28 145 -188 -126 -202 170 -89 197 275 -71 -125 -124 -222 42 112 78 -141 153 269 -9 177
2884A77j65j61P2L28k90J31j36k42K67j12J06J94J10k37k5j14K3k37L43M5J36
2905B13j25o1k11J56j17n2J11K01j48O6M25n15M0J79k48K62j29L7l48K39Qj08
2927a25O8J37j19R0p5L45k29r8K19j95J45p1k68K96Rn4p8R5q3QK88j03j51q7K4
2952a2K02N3k43K85l51J48R4k62K13l9k20j5J95k81R3J27J33k01K01j10J46K34
2974C90m62j09K64J43k15J48l47K08J43j35m3K5J15l79L72m3m5j7q9K08l8J10
2996B04j63J55j08ro9J82k96O1J14j04q4P7J42J02j02p8j42o8Q3j06r2J41J93
3019C3K01j97mK9l14P6P9K15N2N7j28k44K42k34J65J51k44J50j96j38R7L68j46
3042G0R6k54Q4pj59q7K96J01J6j86J10p8Q3J78r5m28L80k09R5J66k29J45j14q0
$$ plain form
2884 177 12 -149 -77 251 -39 92 -44 -286 -19 -131 -25 169 279 42 17 -97 -74 -311 32 77 213
2905 213 88 27 -184 -28 -145 -197 -86 115 -33 33 458 -57 -17 162 -86 176 47 84 -264 -25 -17 -125
2927 -125 -57 80 -39 51 -24 321 92 -6 213 18 163 92 -176 120 129 75 -3 92 9 17 305 202 51 -36 -12
2952 -12 190 243 0 285 -66 82 176 -86 127 88 -132 -147 48 -233 -140 -13 120 -81 120 10 156 390
2974 390 -72 -181 83 226 11 159 -188 20 163 28 -15 10 125 -254 118 75 30 13 -76 132 94 204
2996 204 41 196 88 79 10 192 -104 -43 71 -33 -117 -40 102 204 102 24 -118 -186 -103 -209 -301 -160 33
3019 33 234 37 33 62 -252 -176 -97 118 170 227 99 -145 97 -137 28 179 -65 85 -111 -249 -152 216 70
3042 70 166 -88 -4 -11 -170 -257 39 140 156 -30 80 2 85 263 168 -260 120 -89 6 172 -57 88 -26 -106
3066a06l8K71l25K73J6j54J96K92l70o3N7R4o16K99L57j82N5J32k61Q2k42J86
3088d7R1k71L32k52L16j89K9k99R1K84l08K47l07L0r0K35K40q2N8m9l54K91r8
3111a02J59k44J98J20l88J38j70L01j99J55J6j6j42j30M72m36M06j10om6L8J52
3133A66j1k22k46J67J0L30J72k93m07L43K5k31L74l00k18O42m06J77L1Q6j07j75
3155i3J01q8M17k60J19p1k23O3j45L5L89l41J32L19l22J64m83N1L15p2r9k48N17
3178A77j52k03J70J94q8j43j39k49N60j91K70k19J78o5k70P2J70n8m4K2L38n6
3200B74l12j22J81K18k47j02L10l7j58O3J26l32j16N03O7j12n72M20k37K14O8
3221I7k16n7M29k08k37K20k13q4K44p3O8j35K09j87O06k70k27j31J56R9j72l8
$$ plain form
3066 -106 -144 127 -198 75 91 -63 133 425 55 -8 49 143 -473 -174 183 1 56 188 -73 9 -233 -47
3088 -47 44 -227 105 -147 169 -20 9 -290 -199 85 -223 24 -283 -253 -343 -108 132 50 108 59 -295 -4 -102
3111 -102 57 -187 11 131 -257 -119 -289 12 -187 -32 -16 -32 -174 -304 168 -268 138 28 22 -24 14 166
3133 166 155 -67 -313 -146 -136 194 366 73 -334 9 34 -197 177 -123 -341 301 -105 72 103 189 82 -93
3155 -93 8 -80 337 77 196 125 -98 -35 -180 -145 244 -97 35 354 32 196 -287 -236 79 7 -92 -340 177
3178 177 25 -178 -8 186 98 -45 -184 -433 127 -64 206 -13 165 100 -170 -98 72 14 -30 -8 330 274
3200 274 -38 -160 21 239 -8 -110 200 163 5 68 194 -138 -254 249 316 204 -368 52 -185 29 97
3221 97 -119 -176 253 45 -192 28 -185 -269 -25 -98 -30 -165 44 -143 463 193 -34 -165 -9 90 -82 -120
3243a20N7r4K06j06j09M05Jj6j89N0p3J02n6M0j67o4L51k11J58k31L27Oj62JL14
3268D20m20J18l76K92J75k87J58m56L88%l4K00k59J09nQ6J22k32q4N2L6K1K04
3291B28m03L43j57Q7J62k68K75q9k15k03M62n9j63j06N1j50J96J8l46K26J32K7
3313D8j06R6l60K04R1j25j43K20L53k24Poq2j70L54k31O8K21J5j00k18Q4K10k17
3337a1k88L26j59l9n1L93q4K0j17N5R0k72K90k93L4R6R2J36k12K93l19r2M96l92
3361hJ16j69k0J53N6q5l1k93J30L51k12j95J67J61l8pk32M78m36j54K01J13J54
3384B00j33R9j33o4K02j57k11N17m61K32k9p4K49l2M3j8l81J51k03J91p0J28r8
3407e2J27k01P8O3o4o1M18k83j53K00k08j06J39L5j69J35N47l17k16K21j85J6
$$ plain form
3243 -120 -63 -157 49 -57 -166 239 240 224 35 85 12 114 58 98 -69 -133 218 7 165 -66 261 267 105 106 420
3268 420 0 118 -258 34 209 -78 80 -376 12 12 -22 178 -81 28 23 109 231 -1 -85 -33 3 24 228
3291 228 -175 168 11 98 260 -8 267 178 -37 -240 222 163 0 -106 -55 -205 -9 9 -337 -111 21 48
3313 48 -58 38 -322 -118 -27 -152 -295 -75 278 54 61 55 -27 -197 157 -74 -6 215 230 130 -88 -4 206 -11
3337 -11 -299 27 -132 -171 -222 171 87 107 -10 45 135 -137 153 -140 -106 -10 82 218 6 299 -20 -112 384 -8
3361 -8 108 -61 -81 72 128 43 12 -281 -151 200 -12 -207 -40 121 83 76 -156 322 -114 -268 -67 46 200
3384 200 67 166 33 -31 171 14 -197 320 -141 91 62 -12 237 205 248 230 -151 0 -203 -12 -82 46 -52
3407 -52 75 -126 -48 15 -49 -110 308 25 -128 72 -136 -242 -103 -68 -237 -102 445 128 -88 133 -52 -36
3429c6n8j81M79J25k55j93Q7r3L19M0o1l32J07K6k96J38L25j21k35K19K77l87
3451a06M22l04jM1Q9l8k37K75j7j8r1Q6j68K63j71j7M0J86j8l78J10J63j51M2
3475Bl6j4j8J39j00q3L74k74k8N5K42j4l06M5J52mL1j57M5l35K43M6J17Qq4l02
3501b56M94m01n6J38J08p1l91N60l6n0K2kK34m99L07l31M90K41o07J31j44M0k42
3524c21K42K22q3m42K90K90l7L3j02j37k87N99j35r6O1k48L73l16j9J49k70L81
3546A47k0k34J28M7l18J73K30o57M34L06m52L81m03J19K83l36K13k91K77J22l5
3567A14P2k78l4K00p6m1K26k03J51oO4k43Q4n2J16k05J20M5K06k74R6k51J05O4
3591@J42j1k24o7K76LL2o6j17J59J26l25N0k20P8J05MJ23l39J13K04k08K67r9
$$ plain form
3429 -36 -94 -275 204 329 74 -119 -32 -125 194 234 173 -159 -52 -26 -322 -184 141 20 -215 4 281 -106
3451 -106 316 12 11 52 141 103 -134 141 124 106 15 101 -67 196 25 8 48 234 216 -162 -52 111 -40 2
3475 2 -34 -48 -66 73 -27 -110 264 -10 -38 17 259 245 -61 -16 136 132 163 6 51 -284 -41 5 122 130 46 -256
3501 -256 238 -163 -219 -81 27 -44 -435 125 89 39 61 59 293 -206 101 -230 260 501 -106 25 -119 -79 -321
3524 -321 -79 143 60 -382 -92 198 161 194 92 -45 -332 267 132 36 97 -151 222 -94 -113 36 -234 147
3546 147 127 -107 21 68 -250 -77 153 -504 -70 236 -216 165 -238 -119 164 -172 41 -250 27 149 114
3567 114 186 -92 -126 74 -2 -43 183 -20 131 125 189 -54 30 -22 94 -111 9 54 260 -14 82 -169 -64 0
3591 0 142 131 -93 -160 116 119 151 85 -32 127 253 -72 -22 -242 -164 -59 -55 68 -271 -158 46 -162 105 6
3615FR5k79J47J15P9k50J0J83j68k2j07K99j17k63K88n6J78j55J57l51J65J00
3637E4j06K3J25n5Qo7K57j32K71m98k6M9l7Q8nN0J45l23J66J16Lm79M63q2j35
3662a27L92m85K93k37L78k97L0O7k14K34k43j3nJ89n4L14m80L17J68l84M80K4
3684C47m46K40k0q6l48M98k73M83k80j57J87k05k05K75j29L51k88n3L24k25k79
3705b89jR6L31j86K73j30J70l53J70n9l01J40K21N8O2l06j78L81j87L20n70M05
3727F7J05j18j04J90k49l3L3kK87j49r7J10L1k59M01l74M30o1k08j66J65n2K9
3750b4j75J78l4r6L7j76RK21K4NL98l05k78L33K06n97L20J83k98K42k84J74q2
3773a9K36j44j08J21l9j35J10k23M6RL07k34k96O97j24l13J64j3j35M16N2n02
$$ plain form
3615 6 101 -178 -31 84 163 -87 -77 106 -62 -84 -191 108 -9 -272 16 -40 138 -17 140 -211 -46 54
3637 54 -52 -29 96 41 49 -18 239 107 378 -120 -146 -97 -134 -46 -51 -1 144 -179 -13 103 106 -373 90 8 -127
3662 -127 265 -220 73 -164 214 -83 -53 14 -200 34 -209 -222 -227 -38 -92 222 -258 59 227 -157 323 347
3684 347 -99 141 121 35 -313 185 -88 395 115 -42 145 -60 -265 10 -119 232 -56 -109 215 -10 -289
3705 -289 -290 -194 137 -49 224 94 264 -89 81 22 -279 -139 82 140 202 -104 -282 99 -88 232 -338 67
3727 67 172 54 -50 140 -109 -142 -109 -111 176 27 -70 40 71 -188 213 -161 269 208 0 -166 -1 -53 -24
3750 -24 -199 -21 -55 -151 -114 -290 -281 -60 -36 -31 367 62 -216 117 323 -274 46 229 -69 173 -111 63 -19
3773 -19 217 73 -35 86 47 -88 22 -201 -155 -146 161 -73 -369 328 204 -109 55 42 -93 323 375 -127
3795a27K50l32K19m4J58k29J49J87l01N19k98m8l43J19J18l9k6J32k6K46ok97
3817a9j91L01p0k04K84m4m2k2m3J71k68O9J7J91l15p2N13j37k85J28J00Ok3R4
3841A39m18L41o1k38J46P5K82l19k08M73j84j8j94k06M5K37K57m55K38K22J2J7
3863A83l35N2lj02L55k43M03n52K53n8l4j9R8l04L31j84L29k50K70k45O0j40J21
3886a4J11j43L64k14q6J36l72M1K11o7k08J49J79p7J44n2J33k81J26k4K7k65N2
3909a30J7R5J92m27P6J72k43J66J02k9J15k93M6m3K86l46N34l11j17J14QJ33m0
3932G7j96P6O0K0j17K20J4J14l07r4n5K70j18j10J8nK02PR0k34J00J89k51j19
3956a49J68P1m0l9jM5j74J47K2j73RR4K88n8l23L42k31J73l10K27l2j0q5r9K32
$$ plain form
3795 -127 123 -209 10 -34 124 -105 44 231 -70 449 151 103 -240 -121 -3 -42 -68 64 38 284 278 -19
3817 -19 -210 91 21 -183 101 57 15 -7 -50 121 -147 -78 -61 130 -185 -257 256 119 -166 -38 62 68 45 139
3841 139 -279 62 1 -237 -91 -16 266 -53 -261 212 28 10 -184 -390 -345 -108 149 -306 -68 154 166 183
3863 183 -152 -100 -103 -205 150 -93 310 -242 11 -47 -81 -100 -2 -306 25 -159 170 -80 190 -55 5 -135 -14
3886 -14 97 -46 318 104 18 154 -218 -177 34 -33 -241 -92 87 10 154 102 235 -46 80 56 83 -182 -130
3909 -130 -113 -18 174 -253 -177 -5 -248 -82 20 -9 106 -187 -141 -184 102 -244 290 -21 -138 -24 -16 117 77
3932 77 -119 -43 17 37 -80 140 154 268 -39 -133 -188 82 -36 -146 -128 -133 69 76 166 -68 32 221 -30 -149
3956 -149 19 90 50 11 10 55 -119 28 50 -123 -114 -20 268 210 -113 229 -2 171 -139 88 56 46 -39 -138 94
3981I4M7k03k2j15n1K81k82J70q4L74k78K79J64n58K35j65L33k3m34M03J37n78
4003b76R7O5L73j10Q0k69R8r4J39m38J15J59J02k34L33k63L90l09K78q6l9j39
4025b8K8j15J22l17K38R9n4J11l05K74N1k47K9K55k04J19j01rn2Q4k4k1J8k5J11
4050C7Q6r4L3M6l0k6K9m3l4Mj26%K83j43k24k86M85J46l92J19J91R8o3j6j22j21
4076a63J09Q0P8k94J39l8L01l37J50K3N0N7k09J50l0q6L7qN1j57J39J71m02J31
4100e8K95k30n9J68r3j43o6L4Q2n0K26l11K08j26l6R6J22M1r5k15J67p6J68L2
4124H1j23N5L0J70j33q6n2K68k34O9k09J99k77L19j28M0j57RK76j22mJ74J63n23
4148a95K40k72J69j92N35k78n9J26J43K59p51K63n9Q1k35L49PQ1k69nR0j12l2
$$ plain form
3981 94 141 -62 -84 -199 -250 31 -251 -81 -165 209 -69 210 374 -184 51 -114 219 196 -238 165 302 -276
4003 -276 -179 -114 259 149 229 -40 58 -36 103 -335 -220 -61 41 -193 140 -123 267 -42 236 150 111 -28
4025 -28 0 -115 7 -310 -72 27 -27 84 -221 53 104 -143 -114 141 -63 56 -45 -54 -106 -22 -46 -67 -49 -74 37
4050 37 123 29 62 108 78 52 81 38 4 8 -118 -118 165 22 -202 -488 -3 143 -249 -130 61 159 96 80 -42 -163
4076 -163 -54 26 104 -190 -51 -89 212 -125 25 48 98 155 -54 96 66 -20 17 9 60 -97 42 213 -189 -58
4100 -58 237 7 -52 116 23 -120 -186 -152 -70 -120 106 -205 3 -123 -159 -63 59 100 5 -210 -43 -119 49 81
4124 81 -42 13 43 213 80 -6 -58 210 -24 45 -164 35 -242 77 -51 -11 -168 -159 117 -5 -9 165 328 -195
4148 -195 45 -227 -58 -250 285 7 -52 74 217 476 -275 -12 -71 10 -225 124 131 212 -57 -62 28 -84 -116
4171a16J36j32L29j12l15J98r1j41J44K99j03O7j92j57L04l9k37j56M68j26n1
4192b3L0m2p6J71k5k04L48j39j20l6J96k58L39k00J73l10k52J38L14K26j82p6
4214h%lP8r9K09k51j19J10K18j30J74l43J90O1m09O52j66k22L61m24J52j4L0k60
4238b13J69K36r4k73P0O4pJ60j88J24k66NJ54J02R0m5l70J72j83K62n7N7J80l48
4262a99M66k68k83K96k9j75K98L1J95k85k42M8K61k28J73p7l4K46k76K24m1L34
4284D35o44O9K35j08j28J26j39K3j15M11k56%L46l41J95p5K1k9J53k51J46j93
4306a19J69k26K99k70n5L20n2kq2r5J55l0r8Q2Q1j98j14J36j7n5M9K70j52l97
4330d01L86M6j07J80n4p8O0j06L04j63K63l56j34p7J28J1o6J29j02o5K60j88K64
$$ plain form
4171 -116 20 -112 217 105 -210 -12 -103 -244 -100 199 96 163 -29 -186 118 79 -158 -314 154 28 -23
4192 -23 7 -35 -111 60 35 -169 179 40 -80 -116 80 -178 161 -39 134 -176 -428 -290 24 250 68 -8
4214 -8 -8 -11 67 -32 177 -74 -193 -83 135 5 179 -164 26 87 -322 330 164 -58 303 -121 31 17 47 -213
4238 -213 -44 192 98 -175 -105 -41 -48 112 -76 48 -218 -213 -59 43 133 88 -282 -110 -293 -31 -88 -31 149 -199
4262 -199 267 -1 -284 12 -17 -192 106 137 332 47 -195 -147 114 -114 59 -18 -52 194 -82 142 101 435
4284 435 -209 -140 95 -13 -141 -15 -154 -131 -246 165 -91 -91 255 -86 109 34 55 26 179 -72 74 -119
4306 -119 50 -176 123 -147 -202 118 66 64 -18 -113 42 12 -86 -4 77 -121 -235 -99 -116 -171 -122 148 -4 -401
4330 -401 -15 31 -76 104 50 -28 32 -74 230 67 330 -26 -160 -237 -109 -98 -164 -35 -137 -202 58 -130 134
4353A34k32J22k17K31J83k79n8J77k86O5J67j07K10j08o8J27J64k69mj02J38L59
4375C47m65l0N39n62P5j9L9jK26K2j74r0n8J00J9J26PM6j45M1j57K20J9o1O7J14
4401B45k42r9o7k6M58o50Q9Q1J45l3R4J05J05l38J58J73j45j19j28K19q8J38J46
4424B21l28LK3K74k21J07l60L18kK02k24r0L15l60P8p2M2K76p0l21K67j94L52
4447B36M0l35K45j7j00l8j44K02j62j39J61P4J87k45O5q4J14j97J07K8N2O8J77
4470B95l20K83l88M37j98k47J14j84L84k39J33jj8o4K66k40L3j63K31k78J57n6
4492f3mJ11m7J01o7j40J21k71K64k65K36k51K28L5O9L6mk8P3k77R8l37K93k5M2
4517g2J44k4K24k83j4K80l84K20l04K21J75j58r7J10m0R6K28m2l50J13j61M17
$$ plain form
4353 134 -98 24 -193 38 221 -58 -116 61 -225 -160 7 -100 110 2 -66 61 225 -44 -48 -150 -12 347
4375 347 -118 -148 391 -171 -96 -115 -76 -77 149 171 -3 -93 -151 -51 -32 94 101 147 2 43 -114 106 125 64 131 245
4401 245 3 -96 -163 -189 269 -381 -292 -211 -66 -99 -5 100 205 -133 25 198 53 -66 -194 25 -63 75 221
4424 221 -107 -104 -81 193 -28 79 -281 37 35 237 13 -77 238 -122 -44 -116 -74 202 132 -189 78 -116 236
4447 236 276 -59 186 169 69 31 -113 89 -73 -212 -51 23 210 -35 30 -54 60 -137 -30 -2 50 118 295
4470 295 -25 258 -130 307 109 -138 -24 -208 176 -63 70 69 51 -13 253 13 46 -117 114 -164 -7 -63
4492 -63 -67 44 -3 98 31 -109 12 -259 5 -260 -24 -275 -47 -12 57 93 89 61 134 -143 -45 -382 -89 -114 -72
4517 -72 72 48 272 -11 -25 255 -129 91 -213 8 183 25 -72 38 -2 94 322 280 -70 43 -118 299
4539B99k56j19J56j42M3p5J73j84p6n5J49J60j88K84j78J11r4k73J96R6j43J82
4561F6l3n0q4J5L8J65J00k55j05K06L11l25j92J22n4J60j80J6k06K01M5l1L1j98
4585b37K19qJK1J30j51j52K16p0r3M77n4l13R8j87M4n9M6K22l19N00l49J24j39
4609c3j2J54K6j25k9j42J43k78J33o3K85J0o3n1j57J12K34o9k47J73Q5j33p7j00
4633b24L12Qj38M1j06K3J53r7L0JJ56j52n9j9N9K55l72q8K79l22K35J45R2l34
4657a22N5J07k49L35J3l94N21j68P1k14J35l79J45O3Q0K5j07q2J55j65K27k9K40
4680B63k71J42O3k61J58r7j24j75K57J85l15J48j96M7J74n9k6J07j14L5J91K3
4702A55l94M11p7l37J07J87K07o2k5j43J2k24l4N9J23k6J62N0m0j98j33J38K49
$$ plain form
4539 299 43 -76 80 -62 -19 -94 79 -105 -181 -236 -87 73 -115 169 -9 102 8 -265 -69 27 -116 66
4561 66 33 -17 -101 -86 -48 117 217 -38 -143 63 374 49 -143 -21 -75 85 -95 -79 -285 -84 -39 -70 -39 -237
4585 -237 -18 -26 -25 -4 126 -25 -177 39 -31 -124 353 299 -14 84 -103 -59 -118 -72 150 -169 331 -18 106 -33
4609 -33 -45 109 135 10 -19 -161 -18 -296 -163 -226 59 69 6 -45 -202 -90 144 75 -172 1 86 -47 -124 -224
4633 -224 88 96 -42 -1 -107 -84 69 -28 2 3 159 7 -52 -71 -12 243 -129 -217 62 -260 -25 120 212 -122
4657 -122 -67 40 -209 126 139 -255 266 98 169 -45 90 -289 -144 -81 -1 24 -83 -165 -10 -175 52 23 263
4680 263 -8 134 197 -64 94 -3 -127 -302 -45 140 -175 -27 -223 -176 -2 -61 -87 20 -94 -59 132 155
4702 155 -239 172 95 -242 -135 52 259 197 172 29 41 -183 -217 -158 -35 -61 101 151 111 -87 -220 -82 167
4725A67k50K57l28N50m79J63J87l98K91k21q0L7L48l96R2J78k80J24LO1J84l17
4747a07K16j31k99L21J50k88K07l1L4j06J04l30J93j94J19L45m80J33N07j51J
4768B13k47L16n64L28J18L6R7l57R4K2o9p1J09N7J33l35Q6P1m6J32k93N2K9K70
4792A81q5k20J53k58K63R1j14K59l77r6J51j75K30l37K8M07l3k0Q6J0J8k26K4
4815d0j83J65J7K06J56m66L61l7kj46L9J46l39J44PJ16J0m81M45r7k47K49o1q4
4839a22k13o4L66K32l96j9Q6L06P1k48M9k14M05n5q4j27n1K42j69K50m12QnM6
4863a18J27q0K78p9p6l86M93q4j81q8O0K78o2j28j17N2J17O6k01M29k99L9q6j50
4887a96J20j35P2K27j02k48J92k89K78k5L9R1O4n4P5L6j66K04N2k92J35j70J21
$$ plain form
4725 167 -83 174 -154 396 -83 80 267 -131 160 -61 -141 -104 244 -152 -60 118 -162 -38 -35 26 210 -107
4747 -107 109 -22 -321 0 150 -138 69 38 72 -34 70 -260 -67 -261 -142 203 -277 -144 363 212 213
4768 213 -34 282 -282 46 164 200 297 -60 34 56 -13 -84 25 82 215 -120 -34 37 -9 123 -170 -118 -89 181
4792 181 96 -124 29 -229 34 125 11 270 -107 -203 -52 -227 3 -334 -306 101 68 48 134 144 162 -64 -40
4815 -40 -223 -58 -41 165 321 -145 216 179 177 31 70 216 -123 21 28 144 154 -327 118 21 -226 23 -38 -122
4839 -122 -335 -399 -33 199 -197 -216 -130 176 247 -1 48 -166 239 184 100 -27 -78 164 -5 245 -167 -159 -164 -118
4863 -118 9 -71 207 128 52 -334 159 75 -106 -194 -134 144 82 -46 -163 -111 6 72 -129 300 1 40 -46 -196
4887 -196 -76 -211 -139 88 -14 -262 -70 -359 -81 -106 -67 24 88 34 109 145 -21 183 235 -57 78 -92 29
4910B9k14Q1M9j00R7J89j82p9J30J80j21n9o6k80L78M9l5o3j50J68K10l00n3L16
4934A74k73o9K66m8r4J11o9j7k7k50Q1J18j18M23r4O2l56n2K51l6j20J29k43J69
4958h2N3M7K21m14J68n7k0k4OK43k56j03K44n23O77L3r6p2j75r2J76k9L59j79
4982A05j64Q7L9q5l6oK85k46O2K13m30k3R7r5M66l95K91m5j15n8J3j86K82Nq1
5007b0l4JL7L7p9J75O9p7m8j34L8K38q0j47j99J20J23p8N9J48O9m06M19l82L06
5032A55l32K91l14J19P0jm4L65k21j19M15o58Q4L16j50J04m23K72M05j62k54j0
5054i2N09n64OQJ52j73J27K88l24j5p0R3r7J99J04o4j43KJ5K44k12M0k96K73m2
5079c2J20m35K69J75J65k21m35M31k77l3K10j14n1K23N4k03L34j22R0J87k23l8
$$ plain form
4910 29 -185 -104 -55 -155 -58 131 -51 -130 0 180 59 0 -66 -346 32 81 46 -17 -167 1 211 -89 -142 174
4934 174 -99 -168 98 50 -44 67 -2 -19 -46 -296 -215 -97 -215 208 114 176 -180 -232 19 -17 -137 -8 -251 -82
4958 -82 -29 18 239 -175 -7 -64 -84 -108 -102 141 -115 -218 26 -497 180 213 117 45 -130 -222 -46 -75 284 105
4982 105 -59 28 67 -18 -54 -60 225 -21 41 254 -176 -199 -102 -197 269 -126 165 120 5 -53 -40 -226 56 61 -20
5007 -20 -54 -53 -16 21 -58 117 186 109 61 -73 -35 203 123 -24 -223 -103 20 -58 1 149 218 -188 231 -151 155
5032 155 -177 114 -200 -81 -11 -12 -56 309 88 -31 384 -274 -190 126 -24 80 -343 -71 334 172 -82 -92
5054 -92 417 -147 -141 -133 19 -154 -27 261 -63 -78 -148 -55 -152 47 151 87 -56 -54 -39 205 -7 33 -263 10 -32
5079 -32 88 -347 -78 97 262 41 -394 37 -240 -273 -63 -177 -228 -5 49 -154 180 58 148 335 112 74
5101G4J12J1j28J15k08q3J24J25k63j56K17K0R9Qj09J20M2k88J97l72M16o4k4
5124a5N9J36k1J13n76K51L39l35K52j95M60l95L1k59J27k9k0l6J55J6l1j95J55
5147a3k92M23k74k8N14k62k12P7J79k88Q3j80N80l15L51n22K1K40Q9j99J17J66
5169B55m35K18P9r0l70N42j46O0j14K2k58P6L61Jn3n5j02j37j64L56k35J12N5
5192b2r2J25l34J69J66j49J79o8M5k19O9K33K77n14K17J40l04jM13j00l83Q0M5
5215b8K70n31L25r6J61L3M3k15r2q1J79R8j35J84j32k9M13q43O36q3j11J48Q5
5238A99o8J8k43m9J36k2K06Q7k44O3q7p0m6K41j41n3O19r49K41q1J49K11j24l10
5262c17L52k46L58j30K13k95rK90k72k0K29Q8l66L12k09k00L38k60Q8J5r6k46
$$ plain form
5101 74 186 197 69 184 -24 -107 17 142 -121 -277 -60 -40 59 67 -42 78 120 -168 29 -343 73 9 -15
5124 -15 44 180 159 272 -304 -53 286 -49 203 8 468 73 104 -155 -28 -57 -77 -113 42 58 27 -168 -13
5147 -13 -305 118 -156 -184 330 68 -144 -67 112 -176 -93 -273 307 -8 343 -179 -158 82 171 -28 89 255
5169 255 -180 38 117 27 -343 199 53 113 -1 21 -237 -161 200 201 148 93 -9 -146 -310 46 -189 -77 -22
5192 -22 -114 11 -323 -154 12 -137 42 -26 19 -200 -131 102 379 -135 82 222 -82 -83 330 230 -153 -73 -28
5215 -28 242 -289 36 -60 101 134 177 -38 -130 -211 -32 66 -69 115 -17 -46 367 -476 160 77 -34 114 199
5238 199 131 149 -94 -143 -7 -29 177 264 20 83 -4 -74 -120 121 -20 -73 546 -403 -162 -243 -94 117 -7 -317
5262 -317 35 -211 147 17 230 -65 -74 216 -56 -76 153 241 -125 187 -22 -222 116 -144 -56 -41 -137 -383
5284c83M14QM4P3k52L62l82r5J68J91k20j09J22L7R5l55K35J60l39L49j68K68
5306B23k85r6j23K78k1j33L44M7n26M22P2r0j53R0J89l07L45n3l64M5K85j03k45
5329a59K47j22J67o13O95k70jK88k03j54M3k3L00k03J17j70j17K77L6m11J18K3
5351a35J89M7j55n0k5J69j73L6J45K32N4l17L55n38Q5J98j2l27M3L11J49rj86
5374H6K0k07K73K7k16r0l3K46p6j24K91k24j52L71m18K61k0mj72K37k17N05q6
5397B78k28n9O0P0j38J2p0K18J87r7j72j45O9r6J32M2o4j33J38j7j72p8J37J56
5421C0o7l06O65k95K11Ll11K69j78k69J75K59k78K06J14j30J52K69p06n3K50J85
5443A95k32N5l7J45p3j45k00J57L85j0m71J63j47N46j75m35K29l34L85j23r5p6
$$ plain form
5284 -383 31 39 83 156 -96 266 -116 -211 -43 148 -72 -181 -59 -22 73 -282 -47 113 -226 123 -45 223
5306 223 -62 -158 -281 -3 -24 -157 187 234 -292 130 202 112 -41 49 238 -69 276 223 -141 -96 189 86 -159
5329 -159 88 -34 133 -480 215 -55 -56 232 29 -125 -82 -105 195 -8 109 -61 -178 99 135 -276 -158 -135
5351 -135 54 101 -54 -104 -129 40 -133 -97 48 280 334 17 372 -166 -81 117 105 -222 -179 132 281 272 86
5374 86 106 -101 172 199 -17 -107 -140 106 30 -94 197 -27 -179 192 -226 35 15 11 -161 76 -141 364 278
5397 278 50 -9 51 121 -17 -5 -75 143 330 233 61 -84 -15 -111 21 63 -1 -134 4 -13 -185 -263 -126 30
5421 30 -37 -343 322 27 238 241 -70 199 21 -248 -73 186 -92 114 228 98 250 519 -187 -240 10 195
5443 195 -37 18 -19 126 53 -92 -292 -135 250 240 -231 -68 -215 331 156 -279 -50 -384 1 -122 -217 -293
5465b93K89j43L71K01k39o13M96l30J38K7j09j8M05M0o7j0o9K52m50p1M20k0j19
5488H8p4l08N4K90k91L14L1mk18j69L00O3j13P4o7J89l84M21r5j54L32n13J3J55
5512f6J65r6K5p7R7J82l89J2Q9j42J78k59L02l4m4O6J69j4n26L66j22J30K22l10
5536g6k3J16l13J94J08j4J34l29L65K6j93l27K76lj5r7J66L01j88j40p4j34L94
5559A54l56j14K96k75J15K85j81M7o9l3P0p9L31m79J07J57N7j0Nk11J11k11K82
5582aJ48k83K16J43r6j52K52l26L78o3n10K43L6J24l05J64L7M2O8p4j00K31r7
5605G5k11J58j63K70M5j73J50R8k28j75mL84l34K69j13pj49L33J66l90Q6kk87
5628b02K45o7J04J39J30j52j51k1k63M18j75j3N0J38l13j2J17m5J24k1K70k01
$$ plain form
5465 -293 -4 -147 224 425 186 -427 69 -261 -123 -96 -205 -223 182 222 155 145 76 328 -122 -193 227 207 88
5488 88 14 -294 -240 50 -241 73 104 100 -118 -287 13 76 -37 37 -30 159 -225 196 101 -53 279 -234 -221 -66
5512 -66 99 3 28 -49 48 230 -159 -147 -58 -200 -22 -281 21 -13 -57 9 178 164 -362 4 -118 12 234 -76
5536 -76 -99 17 -296 -102 6 -8 126 -203 162 188 -5 -332 -56 -59 -74 -171 -5 296 108 -32 -106 -240 154
5559 154 -202 -316 -20 -295 -180 105 -76 -29 -98 -131 -61 -140 191 -288 -181 -24 33 23 28 -183 -72 -283 -1
5582 -1 147 -136 80 223 127 -25 227 -99 279 216 -294 -51 -15 109 -196 -32 5 47 115 41 -59 172 75
5605 75 -136 22 -141 129 174 1 151 249 21 -154 -158 226 -108 161 48 41 -108 225 391 1 87 85 -202
5628 -202 43 -24 80 219 349 197 46 25 -238 180 5 -8 42 180 -133 -145 -28 -73 51 30 300 99
5650I9K2j70m9j0J39K77l0k87K0J61l36K65j03j82O0J36p2J76j73Q5J16j73O5
5673C6q7L06m09K28k99J57J85j53JJ59p9R4j73K68r8k35j06J47l5L7L26m00N1
5696g9J97j39Nj21K87K59l59J18l93M61k03j65P8N1K35k04L7p5j42J89k44L67
5718A60j72NJ61N7j1m29M10l27J60j78M19k08K6J19k02K59j47k68R9J23m88N37
5740A05j83K56q9j22K6j89L05J03j67l09J55k0R0k7L45l69P4o6K17R2j14j11J34
5763A36m10L08k46J44L47m53K82o6j46J15o4O5J99l71R7J14r1pq1M22m82MMK17
5787C7Q8j15K88o41M10J61m59O7j25J67pJ91M7o8R9Q9j89q5M77o00J62R0L1o4
5811E1p8nMK1o1l26M82qk02O1r6K87k7k38J62O2k85k4P0J57N4O0k68M58j32l35
$$ plain form
5650 99 121 -49 -98 -108 31 308 278 -9 11 172 -164 101 -2 -184 -124 12 -60 116 -57 28 144 -29 36
5673 36 -51 255 -154 74 -225 -68 117 -36 -35 124 45 139 -34 234 136 -99 -205 -58 -93 -56 270 -130 -79
5696 -79 118 -21 -16 -137 150 409 50 168 -225 236 33 -132 -54 -3 232 28 65 -10 -152 37 -207 160
5718 160 -12 -7 154 211 200 -229 181 -146 14 -164 255 47 73 192 -10 249 102 -166 -67 56 -432 105
5740 105 -78 178 89 -33 -7 -196 109 212 45 -264 -109 -129 -39 -66 279 -90 -16 -82 135 227 113 2 136
5763 136 -274 34 -212 -68 279 -174 108 42 -104 11 -53 12 211 -160 -63 51 -40 -47 -128 294 -188 -184 -180 37
5787 37 125 10 298 -343 67 228 -231 -164 -289 -122 -129 62 109 41 140 229 40 -45 432 -168 -6 84 115 51
5811 51 -27 -32 -28 -7 -68 -394 88 80 -122 -61 -157 130 103 -135 27 89 -196 -220 -150 7 61 121 -147 311 179 -156
5837a56K30r2l30N64j73m5N4j45K28k27L21L14m52j15L10j88k34n9M62m04k9J03
5859f3J3K26K17n10J95k26J61l2N3k1o3j90N12k82K32j52r9l3K1L82l21j02M12
5882C30k03l58K10L60k91j18k15Q5K82j05r6M5Q4K11k41rPJ56k3k5N6k31M72o64
5906b81K15L61l13O5J3J25j52Q3l80o9P21m18J07m5k6J35l52K6J16J53l62L15
5928C7M7o3l2ko8K92k46K20m6p7m3n1J90n2j14K11j99N3J97k15Q0k11J75k7k32
5953a76J73J32n3L5j71J5l08O45j74n5J80k79R9n7K46k44P4J13l96K05p3j75L78
5976A34l81l1K60l36L98j52j45N45l70J87j12L5K41j71n2J57k33k11L27M4K4k69
5998a11J06k56O19n15K59j45N5K55j61j28Q1j12j34K84j32L03k15m7M3k06J48
$$ plain form
5837 -156 74 -18 -348 216 43 -2 52 -93 135 -92 229 543 91 -24 286 98 -136 -195 267 -137 -166 -63
5859 -63 -50 176 393 -117 78 -148 13 -19 34 13 -50 -240 272 -10 222 70 -29 -62 -41 341 20 -82 330
5882 330 127 -231 -21 339 48 -70 -285 -200 82 -23 -119 -74 10 221 -20 -29 -22 134 111 86 142 -89 383 -281
5906 -281 -66 295 -18 47 60 185 33 116 -264 -333 388 -30 77 32 6 141 -211 -185 -69 84 -278 37
5928 37 84 21 -11 -13 -81 211 -35 185 139 62 19 -32 158 106 -8 203 4 57 254 39 119 -92 83 56 -176
5953 -176 -3 129 76 111 -60 -45 -353 292 118 63 243 -36 63 6 252 8 82 195 -201 4 -69 -244 134
5976 134 -247 -278 -18 -354 44 -108 -253 292 -78 109 -3 32 273 102 50 207 -26 -237 90 134 158 -111
5998 -111 -5 -261 358 -157 102 -43 12 267 106 -22 59 -53 -187 97 -35 268 53 6 49 -157 -9
6019in1k98L86j42Q4lOO9j24K0K26j30n6j20N3K44M6j58j70K61j23j28J62r0k27
6044b72O03m10m7K56m21L54k67L85K5mk9k07J83k68j56L53mJ81j30k02n3N34l64
6067D0p5r6n4N33o9j46mj41K04n22N54j23j15J54j60k19K10j66K5K57k54J67l3
6090c3j1J53J19n83P1K45j42K48R6k54K23J92l08J24l15R6K43k94R7j64m1J17
6112a21J6J81j44L9OM7q8K63j55L20k95J48O9m21J87K5Q4kk98k5J73K3K89k12
6136A09n6o3o7R3J55k34Q4n1j30K57k6j13lq0J79m8k5O8k96M48m87J23L17k30
$$ plain form
6019 -9 -60 -358 28 -114 -30 -33 -27 42 -82 -62 164 34 -22 -142 -89 155 201 43 -127 134 11 -117 45 -45 -272
6044 -272 331 -79 -126 130 -291 63 -204 181 206 202 173 -34 149 -119 -275 78 74 255 125 -77 -130 404 40
6067 40 -35 -131 -185 348 279 133 129 -12 192 -330 224 101 -14 140 -20 -239 -29 -195 -170 87 -167 0 -33
6090 -33 -44 109 228 -355 -284 -39 -181 67 163 -91 132 324 16 140 -175 -79 164 -130 -33 -197 -238 -121
6112 -121 -105 76 -68 -29 -23 24 -64 199 44 364 69 217 286 -135 52 77 161 159 -139 -164 9 32 321 109
6136 109 53 -10 -77 16 171 -63 21 -30 -160 97 71 -42 -45 -125 54 6 -19 49 -247 201 -286 -163 154 -76
$$ [...]
8191A36
##END NTUPLES=NMR FID
##END=
