##TITLE=1H_LR-688B-C4-EtOAc2
 CDCl3, 8 sc, 
 16.10.2019
##JCAMPDX= 6.0         $$ Bruker NMR JCAMP-DX V2.0
##DATA TYPE= NMR FID
##DATA CLASS= NTUPLES
##ORIGIN= UXNMR, Bruker Analytische Messtechnik GmbH
##OWNER= root
$$ XWIN-NMR		Version 3.5
$$ Wed Oct 16 15:31:31 2019 Russian Standard Time (UT+4h)  she@DPX200
##.OBSERVE FREQUENCY= 200.1315
##.OBSERVE NUCLEUS= ^1H
##.DELAY= (6, 6)
##.ACQUISITION MODE= SIMULTANEOUS
##.ACQUISITION SCHEME= undefined
##.AVERAGES= 8
##.DIGITISER RES= 18
##SPECTROMETER/DATA SYSTEM= spect
##.PULSE SEQUENCE= zg30
##.SOLVENT NAME= CDCl3
##.SHIFT REFERENCE= (INTERNAL, CDCl3, 0, 15.7039)
##AUDIT TRAIL= $$ (NUMBER, WHEN, WHO, WHERE, WHAT)
$$ ##TITLE= Audit trail, XWIN-NMR		Version 3.5
$$ ##JCAMPDX= 5.01
$$ ##ORIGIN= Bruker BioSpin GmbH
$$ ##OWNER= she
$$ F:/spectra/data/she/nmr/H-F/1/audita.txt
$$ ##AUDIT TRAIL=  $$ (NUMBER, WHEN, WHO, WHERE, WHAT)
(   1,<2019-10-16 15:30:24.29 +0400>,<she>,<DPX200>,
      <created by zg, POWCHK disabled, PULCHK disabled
       configuration hash MD5:
       00 E9 B6 7A A2 85 ED C7 34 08 36 98 17 FE 4E 26
       data hash MD5: 16K
       40 16 D6 0A D5 76 86 F9 04 FC 83 15 F6 6A B9 14>)
$$ ##END=
$$ 
$$ hash MD5
$$ E4 56 84 13 39 4C B3 14 82 7D 76 39 3D 13 06 4B
##$RELAX= 
##$RELAX= 
##$RELAX= 
##$RELAX= 
##$RELAX= 
##$RELAX= 
$$ Bruker specific parameters
$$ --------------------------
##$DU= <F:/spectra>
##$EXPNO= 1
##$NAME= <H-F>
##$PROCNO= 1
##$TYPE= <nmr>
##$USER= <she>
##$AMP= (0..31)
100 100 100 100 100 100 100 100 100 100 100 100 100 100 100 100 100 100 
100 100 100 100 100 100 100 100 100 100 100 100 100 100 
##$AQSEQ= 0
##$AQ_mod= 1
##$AUNM= <au_zg>
##$AUTOPOS= <>
##$BF1= 200.13
##$BF2= 200.13
##$BF3= 200.13
##$BF4= 200.13
##$BF5= 200.13
##$BF6= 200.13
##$BF7= 200.13
##$BF8= 200.13
##$BYTORDA= 1
##$CFDGTYP= 0
##$CFRGTYP= 5
##$CHEMSTR= <none>
##$CNST= (0..31)
1 1 145 1 1 1 1 1 1 1 1 1 1 1 1 1 1 1 1 1 1 1 1 1 1 1 1 1 1 1 1 1 
##$CPDPRG= <>
##$CPDPRG1= <>
##$CPDPRG2= <>
##$CPDPRG3= <>
##$CPDPRG4= <mlev>
##$CPDPRG5= <mlev>
##$CPDPRG6= <mlev>
##$CPDPRG7= <mlev>
##$CPDPRG8= <mlev>
##$CPDPRGB= <>
##$CPDPRGT= <>
##$D= (0..31)
0 1.2 0 0 0 0 0 0 0 0.06 0 0.03 0 0 0 0 0.0002 0 0 0 0 0 0 0 0 0 0 0 0 
0 0 0 
##$DATE= 1571225423
##$DBL= (0..7)
120 120 120 120 120 120 120 120 
##$DBP= (0..7)
150 150 150 150 150 150 150 150 
##$DBP07= 0
##$DBPNAM0= <>
##$DBPNAM1= <>
##$DBPNAM2= <>
##$DBPNAM3= <>
##$DBPNAM4= <>
##$DBPNAM5= <>
##$DBPNAM6= <>
##$DBPNAM7= <>
##$DBPOAL= (0..7)
0.5 0.5 0.5 0.5 0.5 0.5 0.5 0.5 
##$DBPOFFS= (0..7)
0 0 0 0 0 0 0 0 
##$DE= 6
##$DECBNUC= <off>
##$DECIM= 24
##$DECNUC= <off>
##$DECSTAT= 4
##$DIGMOD= 1
##$DIGTYP= 9
##$DL= (0..7)
0 120 120 120 120 120 120 120 
##$DP= (0..7)
150 150 150 150 150 150 150 150 
##$DP07= 0
##$DPNAME0= <>
##$DPNAME1= <>
##$DPNAME2= <>
##$DPNAME3= <>
##$DPNAME4= <>
##$DPNAME5= <>
##$DPNAME6= <>
##$DPNAME7= <>
##$DPOAL= (0..7)
0.5 0.5 0.5 0.5 0.5 0.5 0.5 0.5 
##$DPOFFS= (0..7)
0 0 0 0 0 0 0 0 
##$DQDMODE= 0
##$DR= 18
##$DS= 0
##$DSLIST= <SSSSSSSSSSSSSSS>
$$ [...]
##$SUBNAM2= <"">
##$SUBNAM3= <"">
##$SUBNAM4= <"">
##$SUBNAM5= <"">
##$SUBNAM6= <"">
##$SUBNAM7= <"">
##$SUBNAM8= <"">
##$SUBNAM9= <"">
##$SW= 24.0689530833862
##$SWIBOX= (0..15)
0 0 2 0 0 0 0 0 0 0 0 0 0 0 0 0 
##$SW_h= 4816.95568400771
##$TD= 16384
##$TD0= 1
##$TE= 0
##$TE2= 300
##$TE3= 300
##$TEG= 300
##$TL= (0..7)
0 120 120 120 120 120 120 120 
##$TP= (0..7)
150 150 150 150 150 150 150 150 
##$TP07= 0
##$TPNAME0= <>
##$TPNAME1= <>
##$TPNAME2= <>
##$TPNAME3= <>
##$TPNAME4= <>
##$TPNAME5= <>
##$TPNAME6= <>
##$TPNAME7= <>
##$TPOAL= (0..7)
0.5 0.5 0.5 0.5 0.5 0.5 0.5 0.5 
##$TPOFFS= (0..7)
0 0 0 0 0 0 0 0 
##$TUNHIN= 0
##$TUNHOUT= 0
##$TUNXOUT= 0
##$USERA1= <user>
##$USERA2= <user>
##$USERA3= <user>
##$USERA4= <user>
##$USERA5= <user>
##$V9= 5
##$VALIST= <valist>
##$VCLIST= <CCCCCCCCCCCCCCC>
##$VD= 0
##$VDLIST= <DDDDDDDDDDDDDDD>
##$VPLIST= <PPPPPPPPPPPPPPP>
##$VTLIST= <TTTTTTTTTTTTTTT>
##$WBST= 1024
##$WBSW= 4
##$XGAIN= (0..3)
0 0 0 0 
##$XL= 0
##$YL= 0
##$YMAX_a= 208241
##$YMIN_a= -181679
##$ZGOPTNS= <>
##$ZL1= 120
##$ZL2= 120
##$ZL3= 120
##$ZL4= 120
##$ABSF1= 10
##$ABSF2= 0
##$ABSG= 5
##$ABSL= 3
##$ALPHA= 0
##$AQORDER= 0
##$ASSFAC= 0
##$ASSFACI= 0
##$ASSFACX= 0
##$ASSWID= 0
##$AUNMP= <proc_1d>
##$AZFE= 0.1
##$AZFW= 0.1
##$BCFW= 1
##$BC_mod= 2
##$BYTORDP= 1
##$COROFFS= 0
##$CY= 11.3945322036743
##$DATMOD= 1
##$DC= 2
##$DFILT= <>
##$DTYPP= 0
##$F1P= 20.1720416913024
##$F2P= 0.152960286110954
##$FCOR= 0.5
##$FTSIZE= 0
##$FT_mod= 4
##$GAMMA= 1
##$GB= 0.15
##$INTBC= 1
##$INTSCL= 1
##$ISEN= 128
##$LB= 0.24
##$LEV0= 0
##$LPBIN= 0
##$MAXI= 10000
##$MC2= 0
##$MEAN= 0
##$ME_mod= 0
##$MI= 1.114404
##$NCOEF= 0
##$NC_proc= 0
##$NLEV= 6
##$NOISF1= 3.799351
##$NOISF2= 2.8
##$NSP= 1
##$NTH_PI= 0
##$NZP= 0
##$OFFSET= 15.70392
##$PC= 1
##$PHC0= -9570.181
##$PHC1= 13.60091
##$PH_mod= 1
##$PKNL= yes
##$PPARMOD= 0
##$PSCAL= 0
##$PSIGN= 0
##$REVERSE= no
##$SF= 200.130013532006
##$SI= 16384
##$SIGF1= 3
##$SIGF2= 2
##$SINO= 400
##$SIOLD= 16384
##$SREGLST= <1H.CDCl3>
##$SSB= 0
##$STSI= 0
##$STSR= 0
##$SW_p= 3612.71676300578
##$SYMM= 0
##$S_DEV= 0
##$TDeff= 0
##$TDoff= 0
##$TI= <>
##$TILT= no
##$TM1= 0
##$TM2= 0
##$TOPLEV= 0
##$USERP1= <user>
##$USERP2= <user>
##$USERP3= <user>
##$USERP4= <user>
##$USERP5= <user>
##$WDW= 1
##$XDIM= 8192
##$YMAX_p= 0
##$YMIN_p= 0
$$ End of Bruker specific parameters
$$ ---------------------------------
##NTUPLES= NMR FID
##VAR_NAME=  TIME,          FID/REAL,        FID/IMAG
##SYMBOL=    X,             R,               I
##VAR_TYPE=  INDEPENDENT,   DEPENDENT,       DEPENDENT
##VAR_FORM=  AFFN,          ASDF,            ASDF
##VAR_DIM=   8192,          8192,            8192
##UNITS=     SECONDS,       ARBITRARY UNITS, ARBITRARY UNITS
##FACTOR=    0.0002076,     1,               1
##FIRST=     0,             0,               0
##LAST=      1.7004516,     0,               0
##MIN=       0,             -181679,         0
##MAX=       1.7004516,     208241,          0
$$ Real data points
##PAGE= N=1
##DATA TABLE= (X++(R..R)), XYDATA
0@%%%%%%Qj6J6k4L2l2M0n6P2q7J02j19J38j62J92k24K60l00L44l97M56n17N85
29C11o63P49q44R46j060J187j322J471j635J814k014K232k469K734l028L354l719
46a956M129m593N124n739O459p316Q354r648J1313j3544J6715k1609L0251n0065
60c2125J77473N8392k58384J5309r76k5831M2576J74347L6497r6076r0936l2844
72c2578n5432M8793J68210P9248j39881j26457J4346K5323k3885Q2433J36631
83A76751k3325j64450o8009L7679J1364J8474J08953O4447q7697j07377j4535
94d7725J460K996Q8864R1364p3576j39096L952Q6550l735k3831P6749N3214r7685
107A9501j15046O407N2699K8331N8375N5307o0469j09907m277N9509k988r055
$$ y = [0, 0, 0, 0, 0, 0, 0, 8, -8, 8, -16, 16, -16, 24, -32, 40, -47, 55, -64, 74, -88, 104, -120, 140, -160, 184, -213, 243, -274, 311, -352, 397, -447, 499, -561, 626, -696, 775, -860, 954, -1060, 1172, -1297, 1437, -1591, 1763, -1956, 2173, -2420, 2704, -3035, 3424, -3892, 4462, -5186, 6127, -7417, 9298, -12311, 17940, -32125, 145348, 203740, -54644, -39335, -40311, -66142, -23566, 150781, 187278, 91202, 266, -32578, -88010, -39217, 128993, 208241, 68360, -58097, -43751, -18428, -42313, 40120, 176751, 153426, -11024, -79033, -41354, -29990, -11516, 97437, 161884, 74187, -33190, -47725, -46265, -43269, 45595, 136959, 63383, -75713, -71761, 14789, 11054, -12777, 63972, 117186, 19501, -95545, -89138, -36439, -8108, 50267, 105574, 45105, -64802, -69079, -9570, -12558, -21613]
119b1613O4490K9778q7894p1967M1563M9287p029J7961L7804m9518r3661K205
131h8594P1680K3031k3L5824m253q5978m6914M8586L5317j6428K1822M6292l7433
144B929q0717J0531O9869J0348k4120J3945j483o1932k8305N6150M4121j5020
156c684n39K0477l6339o3267J2250O0297J2122j6230J3891l7m9754k1861M5348
169b7326L1354j9799p513J4480k1885l4874K2613M9641K165k1055L374j0164m2547
182f1536p468M8598K8259j7941m760J1005k3263l1413K0486L9715n127k1371N565
195a9251j017k6367J095M0565J6502k3806r849N388j7618j6901K8749L5895q348
208E037k2016K412l818k2691L599L3944R729k0178m305P730j2865r790K5194K1805
$$ y = [-21613, 42877, 72655, -15239, -87206, -45643, 3644, -3385, 14576, 52380, 2862, -90799, -88594, -16914, 6117, 6094, 41918, 37665, -48313, -95227, -46641, -11324, -27752, -5930, 40362, 2929, -77788, -67257, 2612, 12960, -11160, 2785, 1302, -60630, -88935, -32785, 11336, -3684, -4223, 16254, -20085, -83352, -71102, -10805, 1317, -14913, -1022, -1059, -50813, -72674, -27326, 4028, -15771, -23284, -8804, -30689, -65563, -42950, 6691, 8856, -12199, -8825, -18989, -61536, -69004, -20406, 7853, -10088, -14848, -3843, -27106, -58519, -38033, 1682, -3445, -24816, -19251, -20268, -46635, -45540, -4975, 11527, -12279, -22128, -16740, -34358, -51259, -22510, 13385, 5037, -16979, -14567, -18385, -41076, -37477, -3533, 6196, -13982, -18287, -10557, -23422, -33212, -8018, 13787]
222A3787j7731k0676N832J146j3786J0350L1636L087k3568o158O530j0331n992
235b5874K3440J7816j5404j4575Q671O73j3622Q253K3504l057k1539q26J1887
248f53o043l270J9402J0785j8555j4293Q291K081r065J0390K2962l817k0415o94
262b894R683o575m561J5899R366j5343r442J0512M090p507O431J4517p946j8468
276b238K012J1052k145J8J4276M384j6714r821Q689K326n920P400J2710o249j3242
291F538M929Q310n511k842J0252J210j6125m131J4022N779o313L631Q029q787
305A8991j4570K794R290j928p30J0380K253j2241m854Q622J909p655M11N852l742
320A4782p477N259R025j623l507K325k588j0711k312Q773L898k317M017L760p623
$$ y = [13787, -3944, -24620, -18788, -17642, -31428, -21078, 10558, 13645, -9923, -16081, -9551, -19882, -25874, -2434, 15382, -22, -14597, -5926, -5253, -18875, -10622, 12882, 9825, -11714, -12540, -653, -6696, -9966, 9436, 20221, 1666, -12627, -4336, -2255, -11320, -930, 22032, 18215, -2200, -2894, 6789, 214, -4347, 11552, 20918, 5575, -3867, 6645, 10735, 3228, 9659, 24176, 16230, -2238, -226, 10826, 8681, 8699, 22975, 27359, 10645, 824, 9513, 11839, 5919, 13319, 26029, 19780, 6538, 11467, 19777, 14266, 11424, 21676, 22886, 6761, 2630, 16652, 22431, 16118, 19749, 27778, 18991, 4421, 7215, 16505, 14577, 13847, 24227, 26480, 14239, 9385, 18007, 19916, 12261, 12672, 18524, 14782, 7305, 12564, 21589, 19966, 16459, 18784, 16196, 5485, 3173, 11946, 15844, 13527, 17544, 21304, 13681]
335A3681p969L102M183m680k686O688J974o901J49Q184R21p073k936Q46n331m880
351b728O526Q475l7k358J900j551q390m446M504K160k235M66L032k15j270J845
367E678J207l448m067j392r36r68L546O732J211k850j513k558n506l423L221M045
383a021o2M66L368N10l392r01K40k897m500r60K563K006J165M869L774j975n686
400b433l320j536j367o25L056M035J562l97o15o12j212k595k106r47M31J321K278
417e082K447K296m0l067l575k929j697k0K727L617K578J525M68j373k694l126
433g945j638p42k92M98K174M040K668l59j488k070k289m395j680J792L899J519
449f308J675J718j29k669l242q71n83q96J070L166K023J235N87J1k648l468j692
$$ y = [13681, 5712, 8814, 12997, 8317, 5631, 12319, 14293, 7392, 7541, 15725, 16646, 9573, 6637, 7483, 2152, -2728, 3798, 12273, 12236, 9878, 11778, 10227, 1837, -2609, 1895, 4055, 1820, 2286, 5318, 5103, 3833, 5678, 6885, 3437, -630, -2022, -2958, -3926, -380, 6352, 7563, 4713, 3200, 642, -4864, -8287, -5066, -1021, -1083, -617, 2751, 3261, -131, -1032, -792, -3689, -8189, -9149, -6586, -4580, -3415, 1454, 5228, 3253, -2433, -5753, -7289, -8656, -9281, -6225, -2190, -628, -1025, -1640, -2252, -3464, -6059, -8165, -9112, -8681, -7360, -5082, -2635, -339, -379, -3446, -7021, -9950, -11647, -11667, -8940, -5323, -2745, -1220, -752, -2125, -4819, -7945, -9583, -10325, -10617, -10119, -7945, -3905, -1237, -1596, -3084, -5154, -7443, -11838, -13518, -11726, -7827, -6308, -4633, -2915, -3044, -5713, -8955, -9826, -10409, -11305, -10235, -7069, -5046, -3811, -3224, -3213, -5861, -9329, -11021]
466a1021o70n08J624M135L153P25O1j672k988k714j315q19m9K840L824R62O9J140
484c223J118l367m346L12J112p33J219M550K555j611r61K09k478l441N52K814
500e719P77K11L687K333k199k563N05q03l959o59L571J926O01L399K882j788l032
517h30M35j573l433N0M977J768j471K236M169j997m723M99K141l185j788M166
533A441L060j444J76L461r94n207j46K786j420k176M583M419k063j836K807Q33
549H280n721k459L904N10k695K633N440r36l223K166J151n437k950M155J528l821
565B525J546O336m63n627J013L587l645m780L705M109l020j235M851J292o090
580D104j042M480k051o029L404O496k560m233M750L663o330m589M449J068o262
$$ y = [-11021, -11691, -12199, -10575, -6440, -3287, -2562, -2501, -4173, -7161, -9875, -11190, -12009, -12058, -9218, -5394, -4432, -4363, -3223, -2105, -5472, -9818, -9506, -8394, -9127, -7908, -3358, -803, -2414, -3375, -3166, -5644, -9085, -8533, -5719, -4942, -4731, -1044, 1289, -910, -3473, -2968, -3771, -7730, -8389, -4818, -2892, -2291, 1108, 3990, 2202, -830, -395, -1968, -5401, -5351, -374, 1394, -77, 2159, 6328, 4331, -392, 107, 2248, -937, -2725, 1441, 4501, 3057, 3233, 6694, 5700, 493, 347, 3133, 1713, -463, 4120, 8539, 6476, 4640, 7447, 8280, 2559, 100, 4004, 4514, 1819, 4452, 9892, 8956, 5733, 7899, 9050, 3613, 663, 4818, 6346, 2525, 4071, 10407, 9944, 4317, 5330, 8917, 5272, 492, 4197, 8306, 5286, 4051, 8902, 10194, 4104, 3062, 7542, 5491, -538, 2866, 9362, 6802, 2569, 7319, 10982, 4652, 63, 4512, 5580, -682]
595f82P59P516k86n594K385N066m630o196L858M048n429k729P375K566o876r79
611A72O489j441p989J645O288k282l902M326L842o168k878N533L00p693J76P646
627D064l69o395L456N794l718n857M168K352o672k030Q082K137p163O88P188k051
643C674p939K155O282m669m559O599M317o881k765P478J011r143n65P184o65n725
659d211L868N948m650m634N757K286q378k603Q045J852o793R28P524k129o402
674c592L254L914o505l799P595L994p987j685Q909O94r034k50O788k884o453N153
690a888O521n747l955P173L299r415l766P655J341p110J297P891j972o249L916
705a009N156o800o418O740M058o615j542Q136P94p327J488N478n070p146O106
$$ y = [-682, 77, 7593, 7307, 1713, 4098, 9164, 4534, -1662, 2196, 6244, 815, -1914, 5461, 8027, 1151, 172, 6661, 5220, -2769, -1124, 5164, 2882, -1020, 3306, 7148, 980, -1898, 3635, 3935, -3758, -3582, 4064, 3695, -2700, 756, 6550, 2832, -3025, 1143, 3495, -3177, -5207, 2875, 5012, -2151, -1463, 5725, 3674, -4265, -2110, 4172, -497, -5056, 1543, 5860, -1021, -3786, 3692, 4703, -4440, -5005, 2179, 1514, -4211, -343, 5605, 955, -3679, 2078, 4364, -4014, -6617, 1428, 3280, -3513, -2585, 4939, 2810, -3592, -338, 3576, -2929, -6728, 867, 4861, -3126, -4811, 4098, 4792, -4242, -4492, 2296, -588, -7041, -1888, 4633, -1114, -5069, 2104, 5403, -4012, -7778, -123, 1218, -5892, -4595, 3296, 1324, -4925, -1009, 4147, -2653, -9071, -2331, 1727, -4888, -6430, 1706, 2500, -4827, -3339, 2139, -2931, -10077, -3971]
720c971O787o499m654Q612L905q013k984O435o28p911K716P371l085n422O535
735h06O013p913o005N882L195p583j426Q750J398p336K237P309m311p678L809
750d465N423n924l321P757L365o430m31P400k622r051K668P265m012o126P029
765a475P409o149m643O190J660q348j230P864n43o728M529Q198m293p190M712
780c7M858p129n139P701M224o402n43Q142k60p481M09N758l920n712N178N267
796D914m266k048O834J805q235j417O202j059p295K675Q035k195n151M795L880
811G474o389l914N188J004o599J136P866m63o085L198N128m823p081M403M694
826D737n008k683P103K823o046j073N120j439p021J712N394k737l890N446M989
$$ y = [-3971, 2816, -3683, -8337, 275, 4180, -3833, -6817, -382, -1010, -8921, -6205, 1166, -1919, -7341, -806, 5207, -2706, -8711, -2829, 366, -7217, -8643, 107, 1505, -5831, -3594, 3715, -596, -8274, -4465, 958, -4966, -8287, -530, 2835, -3595, -4026, 3374, 752, -8299, -5631, 1634, -2378, -8504, -1475, 5934, -215, -4858, 1332, 2992, -5356, -6586, 1278, 735, -5993, -1464, 6734, 2441, -4749, -37, 4821, -2308, -7447, 254, 4478, -1924, -2467, 5675, 5415, -2066, -1657, 4101, 181, -5531, -353, 4914, 648, -1400, 5434, 7239, -996, -2413, 3789, 2730, -4565, -1890, 6145, 3950, -1201, 3594, 7474, 1085, -2829, 2359, 3363, -3236, -2100, 5766, 5303, -782, 2416, 7544, 2721, -4360, 43, 4737, -271, -2954, 4149, 6972, 926, -147, 4973, 3534, -3487, -1775, 3619, 882, -3008, 2438, 7427]
841G427n615l466M750N33o569j121O114M00m745K710N408k972n252L106K514n690
857b468k249N770K395n069M50N725j413n937Q88M240l030l805M097L971l603j557
873a595M322O07n655o67M040j426l938K842N217k578l357L679K049n182k235L803
889g4P61l897Q91N171l3m183J729K658l415l285K741K614l088o47M808N34m402
906a117j94M115j928m276J812M045k059k211L495K185l703j856L497m02m147P54
922a990M096P0k858K005K682k539k869K218R48k978j024M012O78k713M57L014
938C209j291l538J008K117j970j901L387J927k736j001K609k59l589M17K570p35
954B24k029K299K033j941j769K110J61l009r83L053Pj853J329K162j374k008J033
$$ y = [7427, 1812, -1654, 3096, 3629, -2940, -4061, 2053, 2453, -2292, 418, 5826, 2854, -2398, 708, 3222, -2468, -4717, 1053, 3448, -1621, -1171, 4554, 3141, -2796, -1908, 2332, -698, -4503, -406, 3565, -38, -1595, 2727, 3334, -2321, -2988, 1052, -374, -4312, -1470, 3747, 1169, -2188, 1491, 3540, -1642, -3877, -74, 687, -3210, -2319, 2852, 2819, -1364, 365, 3023, -392, -3677, -936, 1678, -1410, -2057, 2751, 3285, -1117, -1311, 2804, 876, -3400, -1588, 2457, 398, -1813, 1682, 3867, 164, -1692, 1805, 1403, -2744, -1990, 2106, 2176, -682, 1323, 4005, 1466, -1403, 815, 1763, -1215, -2239, 1773, 2451, -262, 195, 3209, 1918, -1620, -612, 1505, -465, -2366, 1021, 2948, 212, -789, 1820, 1561, -2028, -1611, 959, 224, -1805, 494, 2527, 586, -1183, 927, 1088, -1921, -2904, 149, 156, -1697, -368, 1794, 420, -1588, -555]
971e55R61k317j048K372J105k327J81K873l49k646k27J746r53k069J754J994r81
988d86r66J311O62k459p67J758m31j426J138K228n93j433J191R09k376j197J714
1005a223J18r78N59J817J15j579N37J099j874j125J327J106q77l09J728R44j806
1022d21m52J169l37j678L66J651j62m74J275Q97j494q53O50P2j234O55J248M10
1040A288p94P59O00p97r35j04P07j035J78J011O88n59M50M80o84j187M30K46l75
1059C67m88J273R82m72n97L79Rj245k46Q96j62k0M33Q91m19m27n76O5o44m91M43
1080d9Q21q5M31J36J02o88n30k5p74K29L49N39l25P77J07n00o80l35M2j80j29
1101g67M44K45N58k70K22n49m71o57o8J67j65O49J024j0o52l7Q6n75n43k92M02
$$ y = [-555, 406, -1911, -2959, -587, 518, -1809, -1628, 1245, 896, -1750, -1977, -231, -1184, -3253, -1499, 495, -486, -1452, -141, 521, -1938, -2705, -947, -1378, -2804, -1666, 562, -31, -1464, -273, 636, -1740, -2937, -1223, -1105, -2083, -1524, 293, 408, -1171, -634, 465, -1409, -2534, -1207, -101, -978, -1287, 441, 1385, -421, -873, 296, -41, -1719, -1353, 298, 136, -338, 937, 1834, 340, -513, 137, 209, -1025, -370, 878, 1288, 494, 1253, 1853, 1056, 121, 17, 724, -311, -133, 878, 1566, 1007, 1457, 1937, 1253, 66, 496, 742, 367, -121, 1152, 2134, 1662, 1065, 1444, 1453, 208, -38, 858, 696, 676, 1109, 2000, 1581, 1154, 578, 643, -1, -492, -49, 772, 687, 1118, 1254, 1356, 668, 138, 113, -661, -432, -83, 456, 131, 908, 1015, 515, -165, -500, -458, -638, -767, -323, -78, 480, 210, 432, -117, -588, -1245, -1313, -1146, -1311, -662, 362, 352, -300, -337, -251, -826, -1369, -1661, -1259]
1122a259N85l56Q65L99j05r36J86n76J77k27l65P28P49J88p9p7m49k04j46n90
1142a492L22L81L43M26L1J24J21o59m48k87Q6M47L70L66K63L12k90K07o54r49
1162i80K23N10k75L93M76J212n08o70J43m70k29l77N94N21J0L83O17l94m36m45
1182B98L34o18m46L35N90J45K70N81m23n57k67j64k59o2N60K29K60L66K02l22
1202A052q78l08l54J52J24K56J169j78m07L94l72p82l38M6K4j47O26P95j9o60
1222A95J33o7q08o37K39L16l15P57Q37j73m20m91K97q29n27P14J46k4M59K72L68
1243D42j031J83r6n62n72J51J051M61o17Q43p7l96p11M21l27p66L26J153L06q55
1263f73R46J28o23p66K30P77r85M22Q40L60o86J0P11q46q34J82P44k17p5R70R38
$$ y = [-1259, -674, -1030, -165, 234, 129, -807, -621, -1197, -1020, -1247, -1612, -884, -135, 53, -26, -103, -552, -756, -902, -1492, -1170, -789, -446, -20, 11, 135, 256, -403, -851, -1138, -1052, -605, -235, 131, 394, 706, 416, 623, -31, -980, -757, -247, -522, -129, 347, 1559, 1051, 381, 524, 54, -175, -552, 42, 563, 573, 956, 1573, 1179, 743, 298, 632, 14, -432, -97, 493, 638, 908, 1489, 1066, 509, 242, 78, -181, -243, 317, 546, 806, 1172, 1374, 1052, 174, -134, -488, -336, -212, 44, 1213, 1035, 628, 1022, 650, -132, -470, -424, -400, -547, 79, 874, 855, 195, 328, 261, -547, -1184, -945, -629, -944, -187, 650, 477, 57, -434, -137, -966, -1493, -779, -633, -657, -198, 74, 442, -589, -406, -502, -1064, -1636, -1485, -434, 27, -590, 253, 176, -220, -931, -510, -837, -1603, -1277, -124, 182, -673, 273, 401, -222, -988, -758, 19, -966, -544, 296, 656, -30, -20, 691, -155, -989, -807, -63, -280, -355, 615, 1553]
1284A553j248l13R16k72j392J58R90o2l15R56R26p44r81N25J69j192k96J480M69
1303A327j050M34J252o51j190J26P16o42q13J023Q58r68L2R55K83j821p2O54j27
1322C26o90R16J048q02p22P66N23j550l97P44J96o08M62J007o4j008N60K17j228
1341c04j119J205N85r30R9J803m74j205J71M04q46j400J307J168r19l32P12J197
1359A122j608o47J068l68j273K25J716k89r84J090P28j117j201P64L34q43n32
1376a815J646N62j225N47R79r08j373M66J067j128m11J375O25p06m4P49n28j208
1394a330L4J094m82l10J046J405j358o35J227n21j257l19J610m7q11Q26J005n96
1412E81q83O78J68j291m0J301L24j119M59J568o04j056N9P82j173l67J023R44
$$ y = [1553, 305, -8, 908, 636, -756, -598, 392, 330, 15, 971, 1897, 1153, 172, 697, 866, -326, -622, 858, 1327, 277, 711, 1963, 1312, 122, 248, 964, 322, -491, 532, 1390, 422, 454, 1409, 1692, -129, -201, 453, 326, -364, 552, 1600, 798, 76, 842, 1365, -185, -582, 162, 358, -250, 212, 1219, 1155, 147, 707, 924, -304, -1423, -218, 367, -563, -464, 1339, 865, -340, -169, 235, -611, -2011, -704, 464, -455, -787, -75, 1122, -486, -1133, -65, -433, -1706, -1481, 235, -54, -1038, 52, 780, -337, -1538, -774, -440, -1283, -1815, -169, 393, -832, -285, 694, -214, -1587, -1121, -54, -1182, -1593, -218, 407, -299, -343, 406, -122, -1330, -1296, -202, -684, -994, 52, 1457, 99, -536, 691, 170, -1087, -1406, 204, 157, -654, 172, 1177, 581, -302, 376, 544, -747, -787, 514, 838, -281, 178, 1746, 1142, 86, 145, 927, -246, -613, 410, 1354]
1430A354q70l08J373l90j294M34P06o42j047R00J311r15n38Q61N21j725l43J104
1448D92p0j055N73J450o79n60N62N26j368r51J493J27j031P7J568J59j570L88
1466A31M11p84q43M81R44q05l90J432M21j633J09P52l10j550P03J411n97j048
1484a165J152P21j101q99J135j31j009k84J668K75j212N72Q88r05j110R29L56
1501a20r71n18J935J00j067N8J100o02j168L05R24m07r15J196R46j319k45J300
1519E32p3j367k60J380k27j038Q72J332p66j205R05Q83j520n39J611O0j054M31
1537d3J614o82j417L95J165q13j151J266R96j116l66J387L88j472l68J096k35
1554F44r65N38J395n34j068J087P90j419j084J445J22r78k22J348L32j478M56
$$ y = [1354, 484, 176, 1549, 1159, -135, 299, 1005, 363, -684, 216, 1527, 612, 74, 935, 1456, -269, -612, 492, 422, -633, -60, 1390, 711, 151, 713, 1239, -129, -1080, 413, 540, -491, -414, 1154, 1313, -257, 131, 542, -242, -1085, -604, 340, -465, -855, 577, 998, -635, -526, 226, -84, -1634, -931, 480, -117, -1165, -13, 708, -393, -1292, -157, -288, -1297, -1581, 87, 362, -850, -278, 610, -295, -1405, -476, -120, -1091, -1609, 326, 426, -641, -583, 517, -85, -1253, -948, -24, -431, -1346, -150, 796, -523, -768, 532, 459, -908, -1168, 212, -15, -1053, -181, 1151, 385, -820, 85, 968, -552, -1091, 520, 580, -474, -43, 1571, 889, -528, -133, 1032, 219, -932, 334, 1330, 214, -152, 1235, 1623, 151, -217, 879, 644, -321, 217, 1612, 1078, 10, 1097, 1887, 468, -616, 829, 951, -27, -249, 1099, 1431, -47, 409]
1571D09R25q59j169J115M83o35o86J302O03j202k18J117l19j724P37P69m12n42
1589c06R89M91j091o12J045l02j066J57J303k6q69L55J043r86j049M65Q05r60
1607f14m29R11N68q27j09O76M5r92O6N54l87n63R13M26p35l09O48K38j333J69
1627a084R14J4p75M35O64l29n82N02K23p85n73J102L02o30J61O61q5q08J51M46
1647g6m55m02M87O98n01q9J035o14o10j73P11k86l94L42R82l87l99M76M36q32
1667e1q3K00R4j65J72N55J09k60l55N89m24p54M10L88l02kO17J19l58k08K17j26
1689C82o62K74P29j61k02N81j97n89k77L74J59o49K36L92J48j41m2N79l79p56
1709b01L42j9o09L20N40Ql37L17K24m21q08R2L40q6o8L16K14j89jL68k74m25o4
$$ y = [409, 1334, 475, -694, 421, 904, 269, -417, 885, 1488, 286, 68, 1185, 866, -858, -121, 648, 236, -306, 683, 1174, 83, -529, 516, 214, -852, -695, 608, 582, -287, 68, 1111, 125, -924, -459, 346, -614, -1043, -132, 436, -391, -500, 176, 221, -771, -705, -151, -538, -1101, -188, 238, -497, -806, -158, 80, -1253, -1084, -170, -156, -931, -496, 168, -161, -743, -241, -18, -803, -1376, -274, 28, -602, -441, 220, 135, -673, -522, -76, -531, -933, -446, 252, -249, -338, 697, 83, -527, -700, 11, -275, -669, -327, 655, 268, -131, 345, 781, -51, -134, 66, 160, -5, 167, 722, 831, 571, 216, 805, 381, -373, 37, 425, 123, 121, 738, 857, 499, 291, 508, 382, -280, -6, 723, 562, 360, 941, 744, 155, -122, 252, 411, -238, -2, 390, 538, 397, 355, 934, 555, -201, 141, 122, -487, -167, 373, 381, 44, 361, 585, 164, -644, -552, -212, -298, -366, -50, 164, -25, -26, 342, 68, -357, -421]
1732d21r3j65j44N03K22p0J75k9K0p98K2l5M29l68O22J96k27k79j7J9m24l83O10
1755f35J39k6P8L58o7l33L9j4k51k26M6N11J60K05J78j48m83J32p4l33m4L90L15
1778h3J83Q5J17j71p4o22K17n9N4J93M58N2K00r3p8k19n97K92M2K67p5L39J43
1801E71j46O4M3m19R8M3o0m3L36J98K48j62q3l31l0k24O2q7N4K31J31J92J35l03
1825E18k94k09J74k33M70k11J90K59l45M27m83m60K78m1oo3L8K45j8J43j90j27
1847F2l18j67l8J97MK18q9M75k80p4j11k55k04j3J68M10j18N40k73j78m08J57
1869b95j25m46L73L67l59K41K73m38L82m92J33J97q35N41r5N62l19K15O2l99R9
1890c58j83K02j06m8J40Q9J23K92k18j05m29J96J38NK00J54L37j52k99J87n0l1
$$ y = [-421, -514, -679, -823, -320, -98, -168, 7, -22, -2, -800, -778, -813, -384, -752, -130, 66, -161, -440, -457, -438, -862, -1245, -635, -496, -522, -444, -86, -153, -486, -447, -461, -712, -938, -892, -381, -221, -16, 162, 14, -469, -337, -411, -744, -788, -398, -83, 100, 185, 302, 131, 57, -565, -348, -407, -353, -160, 298, 350, 550, 457, 379, 160, -437, -145, -103, 164, 89, 428, 571, 425, 489, 532, 113, 211, 254, 194, 151, 487, 685, 933, 771, 688, 357, 327, 103, 165, 78, 132, 363, 494, 686, 821, 518, 224, 15, 189, -44, 426, 215, 405, 664, 319, 746, 263, -197, 81, 40, 34, -29, 9, 254, 236, 379, 189, 62, -256, -423, -461, -264, -260, -42, -131, 344, 64, -10, -121, -376, -580, -593, -425, -15, -133, 407, 134, -44, -452, -295, -420, -866, -493, -126, -485, -244, 29, -409, -27, -519, -386, -189, -1024, -483, -578, -16, -335, -120, -58, -457, -358, -541, -339, -445, -493, -353, -264, -141, 151, -67, -172, -601, -405, -267, -262, -62, 92, 429, 277, -22, 165, 115, 84]
1912H4l41J03L24l66L63J16N77n03J01L1n43K4J8M38l79J21J86J69n5l66J54l3
1934B23k05M42J39J51k30J23q4j60j92J23l5n7k9k8M76l99M94m45q2l19L64l56
1956h6K21K85r4K33j22j97L4l11QOj35J85l9J19O1oj68K56k41k49J48j12K24J60
1980A80k83j34J51J5p5k00k61K04J35k0k05K84l9J17m16L68n2m77K70J60l58N6
2002e80J96J43l26q3J17J30j65J38N29n84M52l72R2j31j78N31Q3l00J25j52R7
2023b38r9M1J97K2l93K73J38q5r6j1L58Pn87M90k66L9J20L94R6k68M52l78Q7L5
2047C28j82J4r6M6K59J26m09J96K24k82l24P1q4J99N2L60K99n59j87O80l06k92
2069A33l1L02k51nR41k17j85l85j72L70p45J43L39N38r74N87K43k61l04k8j5k71
$$ y = [84, -257, -154, 170, -196, 167, 283, 860, 357, 458, 489, -54, -30, -12, 426, 47, 168, 354, 523, 468, 102, 256, 223, 18, 460, 599, 750, 520, 643, 559, 399, 207, 330, 295, 238, 209, 181, 657, 258, 752, 307, 225, -94, 270, -86, 135, 420, 326, 559, 437, 240, 274, -37, -29, -23, -158, 27, -12, 107, 168, 162, -6, 250, 9, -240, -92, -204, 20, 180, -103, -237, -86, -71, -146, -346, -607, -403, -268, -288, -493, -209, -248, -131, -547, -179, -231, -708, -438, -278, -636, -580, -384, -241, -567, -650, -533, -403, -568, -430, 99, -485, -33, -405, -313, -444, -622, -91, -8, -308, -183, -335, -238, -337, -296, -99, -77, -470, -197, -59, -144, -240, -251, 107, 114, -473, 17, -249, -210, -90, 304, 400, 132, 584, 206, 293, 328, 146, 160, 64, 110, 369, 495, 86, 282, 506, 224, -100, -29, -113, 86, 138, 498, 797, 238, 51, 731, 425, 133, 102, 404, 153, 148, 1089, 872, 687, 302, 130, 500, -245, -102, 237, 775, -199, 388, 631, 370, 66, 38, 23, -248]
2091b48K0K80K14k03k52N13k0l75J97n0o4n39L16N95m13P4K87m12j55l95J15L01
2113b14k92L10J93k68M45k20J79n96J56j18O7j15J09J01M07l57p3J50l36k48K30
2134d90J18J43j08K68K38k34k23k8Q7J44l20J39P1o7L2O02o47K97L05l44l27j42
2156d86M97L8k82M01O37o15j20K96j71m09n5P30o7k7q9L84k92q6j40N1o5j25P83
2179G88k09Q5l69J33K78m94L9J4J49j70J04L72l10k6L40J18r84L67J67L4J54n17
2201F3O54J8n22L00K83k84n47K50k9q3P6P5K81k81n8N9l19k90M08N97q89K22J71
2224A55L80m10k22J56l27k9j08N13K6l54L37J74m37m89O30k23m70K89K58Q4m60
2245e27M24m5J10o44K27J91j22j27J84K24k67j08L60j16m67K9L43L6l08J60M57
$$ y = [-248, -228, 52, 266, 63, -189, 324, 304, -71, 126, 76, 12, -527, -211, 384, -29, 45, 332, -80, -235, -630, -515, -214, -506, -196, -3, -271, 174, -46, 133, -463, -307, -425, -358, -473, -364, -263, 144, -213, -286, -136, -472, -720, -490, -372, -229, -337, -69, 169, -65, -288, -316, -229, -85, -405, -266, -195, -262, -230, 372, -275, 22, 327, -17, -344, -486, 11, 49, -233, 168, 805, 190, 70, 366, 195, -214, -269, 461, 394, 367, 278, 662, 370, 284, 144, 195, 130, 5, 788, 579, 664, 295, 428, 706, 212, 251, 265, 414, 244, 348, 720, 410, 384, 724, 842, -142, 225, 392, 426, 580, 63, 717, 735, 213, 513, 796, 512, -35, 215, 186, 103, 179, 254, 535, 254, 196, 255, -64, -354, 54, 651, -238, -16, 155, 535, 125, -97, 59, -268, -297, -405, 108, 134, -220, 117, 291, -146, -635, -5, -228, -698, -409, -151, -67, -527, -103, -148, -38, -682, -455, -264, -386, -513, -329, -105, -372, -480, -120, -236, -703, -674, -331, -295, -603, -443, 14]
2266A4r6k04j39K34l05J07L24k04L37m90L58k91ml9K72k37j24L43L49l16J9o4
2288a56L08m70M1K28k32J99KL4k23N07j92N3l28L28J57k0o17O10j39L35l64k03
2310a42L83k7k73L13j35j31k0J81R5O5j18L16k34l02k91L81j79r8N76J51n17J3
2332GK1j19q7LM62l30k91M31j03j5j16K0K50k46n8J99j43J41j65q5K86j78k93
2355d09K69k7KJ58R2m65Lm9J28N5M6J79k21J39j70q4J12Q5L3K0j21q9L41l43o6
2380c82J90J65k07j68M2M21m92q5M86p1j56K8R3j13R2j00j3J14J41l66P95j41
2402B73m1J60m16K56l34L18n2J22m9j3K37j98L47k02k26J02P9J46r0j52N03l93
2424C77k7o5m9k2R5J44L1J08L3K87k80o1k35M71k97k12K75J66n2k63J80p3J89
$$ y = [14, -82, -286, -425, -191, -496, -389, -65, -269, 68, -422, -64, -355, -359, -398, -126, -363, -487, -144, 205, -111, -92, -156, 152, -318, -277, -49, -281, -82, -80, -46, -269, 238, 46, 99, -229, 99, 256, 236, -381, 229, 90, 425, 61, -142, 241, 214, -59, 254, 119, -12, -32, 149, 244, 309, 191, 507, 273, -29, -320, 61, -118, -216, 360, 511, -6, 7, 28, -91, -178, -175, 287, -43, -334, 97, -6, -21, -137, -117, 133, -113, -171, 28, -115, 26, -139, -224, 62, -116, -409, -140, -167, -165, -7, 85, -380, -377, -426, -298, -243, -197, -18, -239, -100, -270, -354, -242, -157, -124, -104, -225, -314, 27, -316, -382, -192, -27, -234, -402, -360, 61, -431, -516, -30, -101, -257, -229, -136, -249, -157, -257, -270, -156, -15, -381, 414, 273, 232, 392, -24, 232, -102, 216, 164, 286, 237, 224, 461, 263, 610, 408, 182, 284, 363, 509, 419, 267, 770, 377, 350, 285, 236, 214, 309, 453, 484, 592, 625, 912, 632, 571, 336, 807, 510, 298, 573, 739, 687, 424, 604, 531, 720]
2447G20l38o0Pj38j6L34Q0n71O76j44l38J50k09Q5N0J83j84J42k93M85k92j08
2469B21m0K01j53p4l49L30nj00j13L2R5l30J35m4J40m4J32l2J71j53j77q2pk1
2493b67j88L49M5k6m9j13j64j8Q1L0j12N0J2J69J1j93J82j38j56J72o9K03o6j07
2517c62M7K00j59R4l3j1k14J64k5J40P1j37N9R3k14J07%k16L94j76m7K14J82j61
2541A0j00j81R8M1j22Q0P8P0K2J55j69J13L3j22j77K24j32L99k60J56l2j41K82
2564C25m84O8J5K14m9k65K98J35O2l84N9j95J46k07M21n2j29K01R0N5j37l2p26
2587e71M32LK6K59j03k38M95o26J72j04p5J27j37n1P4J0o0M26k32j0k36J73l5
2610b81o1K94m36K71j56K69l21R3Q8l62M6K04J3J52j33J2l3K34J0l14L49m47O3
$$ y = [720, 382, 322, 329, 191, 175, 509, 589, 18, 694, 550, 212, 362, 153, 238, 288, 471, 287, 429, 136, 621, 329, 221, 181, 382, 229, 155, -194, 136, 131, 31, -82, -50, 45, -285, -150, -194, -54, -98, 34, 2, 173, 20, -157, -239, -246, -267, -455, -106, -61, -87, -136, -249, -413, -431, -350, -320, -432, -382, -370, -201, -190, -383, -201, -339, -495, -323, -392, -189, -255, -362, -315, -115, -274, -180, -213, -224, -438, -274, -299, -159, -88, -225, -166, -73, -287, -180, -180, -396, -2, -178, -225, -11, 171, 10, -90, -271, -173, -132, -254, -174, -96, -26, -4, 151, -18, 95, 128, 6, -171, 53, -79, 320, 60, 216, 184, 43, 325, -159, -91, -76, 138, 89, -176, 122, 257, 319, -65, -6, -201, -55, -262, 159, 107, -22, 179, 269, 324, 187, 155, -571, -139, -136, -110, 149, 46, -192, 303, -323, -151, -255, -330, -203, -340, -391, -317, -307, -367, 59, -173, -183, -419, -246, -281, -342, -48, -484, -213, -369, -100, -421, -328, -240, -602, -556, -352, -339, -187, -320, -308, -341, -107, -97, -411, -62, -509, -446]
2633d46J63K31j30Q7j21p0j64L43l9k88L60p1J61J75k94k7l6M89o07K84j61m8
2655b09J51j9R6J04k28L68n10J48J37J5J35J83k26J03j4K27l91j8J93p3J13j14
2677A71P9N7J44m4j86M34l31j82J35J96m5m6L32m00J53q2k74L28n6j19J91n9J41
2700E37j17M4j38j71K78k25L08m0k18K18k57R7K8Qj36J99l66J69R5k21K28o7j80
2723G3J18n6j11J60j04j70L38j32L5J44l23k47L04j08J17J89l7n3l79K73J87l27
2745a09l4J15m47L56K34k35o7J56k39N3j4O6j42l3J65K83l11q1J45Pm4j49j38
2768d63N52j37j52M3R7k4j86M5K18k44J99J53k91K05m57O37n62K67k58K36P2J84
2790A34l35K22R8J58n04L49J4m5j33M6Q1j71K48k00P1j03K1j7K35k26K47l45M61
$$ y = [-446, -283, -52, -182, -95, -216, -286, -450, -107, -146, -434, -74, -145, 16, 191, -103, -130, -166, 323, -284, 0, -161, -209, -58, -77, 19, 123, -105, 263, -247, -99, 38, 53, 188, 371, 145, 248, 234, 461, 70, 52, 245, 172, 285, 171, 250, 307, 451, 407, 221, 655, 324, 142, 277, 473, 428, 382, 714, 314, 467, 385, 111, 439, 383, 264, 455, 396, 537, 420, 464, 326, 155, 433, 208, 516, 476, 258, 476, 219, 316, 344, 352, 216, 415, 49, 218, 313, 92, 320, 253, 73, 191, 135, 24, 184, 80, -90, 248, 116, 151, 295, -28, -275, 29, -79, 38, 227, 190, 137, -242, 31, 218, -109, -143, -28, -475, -119, 115, -120, -187, -31, -270, -217, -231, -165, -307, -340, -175, 108, -203, -284, -139, -132, -176, -325, -463, 89, -48, -200, -157, -60, -84, -270, -225, -7, -251, -52, 101, -190, 15, -442, 195, -367, -100, -358, -122, -50, 134, -201, 21, 119, 277, -227, 122, 136, 91, -42, 4, 85, -86, 162, -38, 33, -70, -49, -66, 169, -57, 190, -155, 306]
2813C06k83m76Q11l46r1P4M9R9K24j19m7j01m11L05j6K08o1j04j13J77k7k73K83
2836F8ol10L47K5k67j79K67l64N89q6k66K4J47l62L6L23l8K33k79j57K68j70J39
2859a8l12LJ12l9O4o2M15n66K45rP6m24K18J37O2l43J63O2J81j15l16J51J30m22
2883f07R2J96L17J2L2l8r8N7k6l42k4m6M89l32J89O5O5K20n45J69O2o4L47j92
2907bJ80J31j58q0J59n60K11K57k26J35KJ46k27M6K0M31m57J59l8j50J11OK46
2930C42j65Q7j10J27k47M43k47jk14L68k47M68j46Po7k20j51K40J40k4q2J97j40
2953C58k35r4L39j75j67J46j12N27m68J8J46k32j68L39m7J12J40j05lK09n82R4
2975D0l4J5J7K46r1k22K70jj70j34J58r4K41k11%J2j50J71r1M06m39J85l43J22
$$ y = [306, 23, -453, 358, 12, -79, -5, 44, 143, 367, 248, 201, 100, -311, -6, -22, 186, 125, 21, -92, 85, 58, -215, 68, 62, -248, 99, 124, -143, -322, -55, -419, 170, 84, -182, -158, -11, -373, -337, -14, -52, 181, -98, -255, 13, -157, -18, -330, -327, -215, -254, -190, -252, 163, -403, -158, -167, -91, -515, -297, -160, -98, -441, -278, -216, -35, -150, -466, -315, -185, -607, -515, -319, -2, 10, 42, 4, -94, -37, -63, -405, -429, -475, 14, -318, -129, -64, 1, 221, -324, -155, -93, -157, 190, -2, 178, 309, 151, 71, 230, -330, -119, 138, -88, 47, 49, 195, -32, 14, 34, 465, 8, 167, 129, -21, 90, 96, 342, 177, 264, 154, 281, 34, 477, 230, 229, 15, 383, 136, 604, 458, 465, 398, 178, 27, 267, 407, 383, 301, 498, 358, 123, 29, 368, 193, 26, 172, 60, 587, 119, 137, 283, 51, -117, 222, 175, 287, 427, 322, 319, 528, -54, 40, 6, 21, 38, 284, 193, -29, 241, 240, 70, -64, 94, 0, 241, 30, 30, 42, -108, 63, -28, 378, -61, 124, -219, -97]
2999i7J90l36J14kJ2N5o2J60j39j10r6M05j5l9l44K66k88J56J78p5p8j10K65l6
3023b6l59J14K90k15J2j10j27L21j49K2RL94j52K36n61L45l72L94q7o7L48m46
3045a86K44K44j19L7r9r3K3j95L31j34L68j93p7J8P1K94n02o4L73k77N3J59k64
3068A2R7R1k17j8L1L52k85n7L0l1M3Nj63J60o8j09q9L35l34M40j27k2K1j4q2k45
3094b44L85k32p5M16k24k65Q1R4j15r9J93L09m96J83J51j7O4l82L11j73m2R4p5
3117a58l41L12J47k04k22J17K51Kk40K16j40K37j72j20L8j6L9L8k80L25j19j00
3139c90O4q0K12J2j71K45K2R6l90P0J61j25J72j12Q3m8J6K5KM3j41M35k06j47
3163a52K18J90M5m70K30n2K82m40K94J08j87r5O8R9K34j99j36k03N08m01L03k41
$$ y = [-97, 93, -243, -129, -131, -119, -64, -126, 34, -105, -215, -311, 94, 79, 40, -304, -38, -326, -170, 8, -67, -145, -255, 10, -26, -385, -271, 19, -196, -184, -294, -421, -100, -249, -227, -218, 176, 24, 260, -301, 44, -328, 66, -21, -88, 260, -186, 58, 302, 183, 220, 121, 28, 51, -144, 187, 53, 421, 228, 151, 169, 240, 534, 32, -32, 341, 64, 117, 276, 12, 109, 200, -17, -35, -4, 348, 63, 6, 36, 5, 48, 53, -110, 50, -18, -127, -216, 119, -215, 225, 98, 76, 97, 83, 1, -244, 141, -91, -166, 250, 26, -239, -158, -64, -179, -278, -85, 224, -272, -89, 62, 45, 109, -273, 38, -135, -177, -83, -158, -499, -187, -40, -244, -466, -349, -98, -96, -336, -120, -260, -23, -195, -315, -277, -293, -254, -216, -496, -171, -290, -390, -326, -406, -194, -182, -353, -108, -86, 10, -380, -310, -149, -274, -102, -214, -131, -179, -163, -138, -136, -93, -234, 201, -5, -152, 66, 256, 301, -169, 61, 9, 291, -149, 145, 253, 66, -29, 39, 138, 372, 173, 37, -166, 342, -59, 244, 3]
3185CK77J26j31j5k67K58j24J58k58M73j06j29m33l5M61q6rj7j55J04M3M27l10
3208B55J98m28N4K37n70L82j63J52k10J91Q3k4m1L0ql17M22J49n26j0M8Pj90J55
3232a24r7L46m4j24P1j77R8m7r4J17n1J55j29k41K86lj18m1k4j05L31m22M22J51
3256A36l13k39M11k22R1O7N2j70J02L1qm1qp2J68pk77L16j16j39Q2L08p7j60J46
3281F1L6j18J03k47K86k49L72j71n6L53l87j3K03j46J06j57L42k06j42K35p6J13
3303B42k04q3J84j19K02o0j76K08O1q2j00RR6J8K66o01J50K51k44M7K27k67J21
3326A46Q3M9j63R5k18j4L55k54j81P4k77M45l35K10j09O7J78k59K4k51M8K06Q0
3349aN3Q8n3J53o22L31K5k18j1J12O1K64j92j22K36J07k59j25N0q2m5M3J15k4
$$ y = [3, 280, 406, 275, 260, -7, 251, 127, 285, 27, 500, 394, 265, -168, -203, 258, 172, 163, 146, -9, 95, 138, 565, 255, 453, 25, 79, 316, -254, 128, -35, 117, -93, 98, 181, 157, 116, 146, 138, -179, 243, 392, -134, -144, -96, -89, -279, -124, -221, 125, 81, -43, 28, -149, -51, -98, -192, -75, -126, 29, -100, -341, -55, -58, -176, -217, -241, -346, -15, -437, -15, 136, -177, -416, -5, -227, -136, -69, -17, -187, -85, -54, -62, -103, -111, -183, -15, -22, -299, 17, -99, -238, -156, 152, 75, -85, 61, 97, -21, 82, -165, 121, -128, 244, 73, 17, 370, -17, -30, 173, 27, 133, -24, 318, 112, -30, 205, 129, 242, 38, -45, 139, 20, 222, 162, -14, 194, 255, 173, 73, 82, 178, 196, 462, -139, 11, 262, 18, 65, 292, 25, 146, 229, 278, 115, 210, -8, -22, 333, 79, -102, -28, -305, 140, -195, 15, -94, -27, 151, -108, -84, -335, -287, -81, -1, 52, 140, 87, 240, -382, -51, -26, -244, -255, -143, -82, 182, -10, -132, 104, 211, -48, -173, -123, -205, -250, -207, -92, -116]
3373a16o5J12j03K49k55j87kM11l42K63p0n5J86o66P82l71J39k0M95l45l84M02
3395E8k35J64k28N7k5K40k83L03K60n98N73m21K60k07J61l24J73j45K87O0l01
3416a71k20O45m22q3J54J07nK5J37q7o4J92N4j63J1j71K69Pk29K67j93Q9Lj28
3440B4N7k2J80M1k98L20m8K76l22j47J37r1k72M54k10m5j37K54j20q7L31k95K87
3463B67k37L71n94L67j08Lk1l9J50j37k7j54k67K41J58J84R2J13m10n9J20N5k29
3486a61k8j4K65j35Jj58L30j76k21K69k03l3n4K37j13j65K28J24k24J0kj98J31
3509b90L90k3j08m5k8K80n58J45k6J06Q5LK30j13l00L4J28j13K11j07l6M02j55
3532A12k56O2P0K7j63J85P5R4k04P3N4m5m02M65l8J29j63j83K83J13p2l1j58J59
$$ y = [-116, -181, -69, -172, 77, -178, -365, -367, 44, -298, -35, -105, -160, 26, -640, 142, -229, -90, -110, 385, 40, -344, 58, -177, -13, -241, -184, -209, 31, -252, 51, 311, -287, 286, -135, 125, -82, 79, -245, -72, -217, 70, 130, -171, -391, 254, -168, -251, -97, 10, 5, 30, 167, 80, 16, 208, 262, 99, 110, -61, 208, 215, -14, 253, 60, 149, 152, 24, 81, 59, 239, 280, -18, 302, 254, 530, 208, 61, 198, 107, -165, 289, 79, 34, -103, 151, 31, -56, 275, -20, 267, 30, 401, -193, 174, 66, 69, 48, 9, 159, 22, -5, -159, -426, -185, -27, 157, 249, 362, -48, -107, 13, 68, -161, -189, -203, 62, -73, -72, -230, 100, -76, -297, -28, -231, -264, -318, -81, -194, -359, -131, -7, -231, -221, -223, -421, -290, 100, 77, -31, -76, -104, 176, -382, -237, -263, -157, -72, -69, 161, 48, -252, -218, -90, -203, 8, -99, -135, 267, 112, -144, -82, -12, 15, -148, 37, 112, 206, 2, 75, 129, 84, -318, 147, 109, 238, 75, -108, 175, 288, 216, 185, 27, 186]
3556A86j67Q9j66J89K31m47K18M3N7k25J52j88k4O4J6J70K8p2j17K60k04J47k74
3579c4O5J14J80j49m56L29M34l95J22j6k03J32j25M6K65k98J13p2Pn9J92k97R6
3602ij2N8j85L6N0J12o2k07K61j08J85o9k61K32qj23N1p3r6L01r2M2l72J73j8
3627a94O8j17j25M06L9r2j14K83j27m4Q1j27j01m4L05m18K41k84M91l16K24l12
3649b77L80j16j58L07l31K04m6k13M2M10m60M68n07K13L61k78r9p8N91l66j4J56
3671A89j6k00j9Q9M3R8n4Ml32M29J72l76J14j70J91k5J31k56J4o3J11K16o9k23
3695bR8L57j95p6j23N3J78k92k88M14R4j43M9J27k63j56J24L79N1m76J02J1j92
3718a69K68rJ4NL6l26J84k8O5k08J45j02kO0N0r4Q1J8N4n0j5j67m9O7J66rR8j62
$$ y = [186, 19, 108, -58, 131, 362, -85, 133, 176, 233, 8, 160, -28, -52, 12, 28, 198, 226, 154, 37, 297, 93, 240, -34, 31, 145, 325, 176, -280, 49, 483, 88, 210, 194, -9, 123, -2, 44, 309, 11, 124, 52, 59, 0, 192, -105, -9, -21, 37, -148, -112, -62, 50, -12, -219, 42, -66, 119, 50, -211, 21, 13, -110, -59, -132, -228, 73, -19, 23, -349, -176, -194, -126, -243, -368, 38, 77, -15, -129, 154, 27, -17, 64, -63, -164, -208, 97, -321, -80, -364, 127, -189, 35, -277, 103, -13, -171, 136, -195, 9, -37, -250, -208, 202, -258, 210, -297, -84, 277, -1, -100, -178, 413, 47, 33, 189, 173, -27, -46, 43, 86, 184, 130, 134, -198, 231, 403, 27, 141, -29, 162, 137, 268, 12, 26, -37, 74, 290, 221, -2, 96, 453, 258, 182, 59, 112, 290, -2, -290, 124, 218, 75, 124, 251, -12, -168, -44, 335, 386, -90, 12, 23, -169, 99, 90, 104, 109, 145, -181, 3, -25, 40, -168, -23, -125, -127, -67, -17, -111, -30, -12, 42, -8, -23, -190, -239, -172, -6, -15, 83, -79]
3746g9M30m70o9M5J09M4k02p3L01n37M52Jk70K1K42j86K41m9N7K94j67k50K20
3769A05l29J38J13j21pk62K90K8J39J55k11k72K93k06J06j7j34J39k89L28L1P0
3791H7j07j22l0P0L60O9l54j77J87J31J49l01J07l8Q0Q5l92O12o62J27K53j01
3813C3j6M4mL1M70m52K23k24k14J57L36j49o6j4l01K34J97l09Q4J61o3k29J89
3836A18J9R5j68j20J58n0N1j82L39m76L78k77R0K21l60L86l39r2j06M18N9k50
3858h8j52J93r1M7J12j72M1k90M54j89J4KL3K20n58N61k30J12k85L27j63J76j82
3881a08k5l2J08j72K84k42M46m57r1J82l1O3PK77l18K80l63J01R9k03K96J62k71
3904hOL35j30m13L06l3j77J51j1r6j6j41K2K38L3j24M24l51M6k95M87k56J16j22
$$ y = [-79, 351, -119, -188, -143, -34, 10, -192, -265, 36, -501, -49, -48, -318, -297, -55, -241, 0, -49, 8, 302, 135, -115, 105, -224, -86, 27, -94, -101, -363, -73, -45, 94, 249, 38, -234, 59, -147, -41, -58, -192, -53, -342, -14, 17, 87, -20, -142, -172, -102, 258, 327, -27, -204, -17, 114, 263, -38, 69, 31, 111, 196, -196, 416, -246, -119, 134, 33, 17, 61, 57, 88, 558, 106, 329, 105, -109, 48, 384, 235, 169, 155, -146, 88, 285, -24, 60, 221, 158, -71, 118, 137, 232, 64, -56, 102, 52, 103, -79, 260, -216, 162, -115, -25, 196, -164, 222, -117, -209, -315, 103, 162, -88, -240, -47, -138, -91, 21, -151, -110, -400, 54, -135, -121, -119, -86, 134, -424, 137, -93, 19, -266, 61, -102, 74, -108, -133, -165, -57, -229, 55, -187, 259, -198, -289, -107, -138, -75, -68, 209, -109, 171, -192, -91, 8, -195, 101, 263, -8, -2, 333, 203, -210, 96, 63, -114, 37, 26, -70, -86, -227, -205, 33, 66, -58, 366, 15, 61, -234, 253, -3, 113, -9]
3928iK70k05j7l1k0M57m31N6l6L34l53O6J89m5j06q7k23K94j31n1j24N91k69l2
3952H7r8P3m26N71k15J85j42K23j03j59l5K94j83j8n6K49k01j73L56m06o8l5L17
3975C7j81n3K52j33L8j31J27M0J58j27l83M1J90J03l50K33m0k7J59o2J5O6J2j41
3999a57L6j18K10j86J36j70K5J14o8N2Q1j23j13K39K19j00o2oJ01k30j1N0j30
4022b11J59J41l37M2J75Q6r5K77l52J98N8o08O71l3q2J43k81J60M0L8n12O6M32
4045A75j18q3NJ65k08J60j52J32J64j92J9j84K29m2kr4j43J94K07l81K33L15l73
4068B6L3M4k18m9J50J84m05K87Q6O1k0J08m27N06l77J3m2K12J49j31j84o9L9K00
4092A76l54O9p5N0J73j30J38k07M76j25j60J42o6k69J21k08O9M1J69j35R2J37
$$ y = [-9, 261, 56, 39, 8, -12, 445, 14, 70, 34, 368, 15, 81, 270, 225, 119, 32, -191, 103, -28, -79, -203, 388, 119, 87, -11, 62, -364, 207, -8, 177, 35, 258, 155, -4, -39, 255, 72, 54, -2, 247, 46, -127, 229, -177, -245, -280, 37, -144, -197, 55, -78, -40, -171, -44, -4, 154, 27, -356, -315, -125, -22, -372, -139, -179, -206, -47, -109, -94, -28, -16, -157, -121, -239, -29, -215, -79, -249, -224, -110, -178, -126, -45, -168, -281, -42, 177, 77, 15, 9, 110, -120, -131, -81, -211, -52, 89, -248, -206, -31, 55, -40, 237, -115, 83, 141, -467, 204, 171, 89, 232, -49, 111, 151, 189, -323, -257, 175, 57, -26, -21, 144, -64, 96, -56, 76, 240, 48, 67, -117, 112, 70, 68, -26, -169, 25, 232, -149, 84, 399, 26, 59, 103, -115, -164, -14, 170, -235, 52, 138, 199, 179, 287, -140, 366, -11, 2, -40, 172, 321, 190, 6, -63, -24, 176, -178, -109, -184, -134, 39, -91, 47, -160, 316, 191, 31, 173, 107, -162, -41, -249, -180, -139, 30, -105, -13, 124]
4114A24j81j96L29J31k84J12l13L47m67J51N7k3K56l53L59Nj28j30L8j8l7K19
4136bJ2q0N5k42K69j08Q8n0k16K26j75L63J6j81kpM7J67j28K52l66J73l19K50
4160D2K34j16J05k50P2p0K15l51J67J21k72R1L78o79N08j22O3k15K09l01L40j5
4182A54J49l29J70r4J56j80j9j57J96K45R9j45l97J69J94j47Rj88L75j40L8L7
4204A95j33L34k94L62l56J64l22nK11K37o3l18ML9k8K12k65J31j68J6nq0J72J54
4228A94k65K32J5j75j4kJ27k0j22O9j60N3n8m50N40j44O9k55K74p4L75k35j03
4251a29K79k07j74J03P1j21O6j5%J54p2J85k86K11l41J35L17l98m8J83K60l94
4273b21L27j96j59L68j64j4j82K11J03j63j70L04J31l23K6K33j57j35J01j22M11
$$ y = [124, -57, -253, 76, 207, -77, 35, -278, 69, -398, -247, -190, -213, 43, -310, 49, 54, -74, -204, -166, -184, -221, -2, 10, -70, -15, -257, 12, -96, -8, -58, -274, -48, -223, 140, 156, -25, -27, -34, 13, 180, 52, 304, -62, 111, -208, 42, 276, 160, 265, 15, 87, 17, 232, -119, 48, 169, -103, -12, 366, -313, 195, 73, 136, -79, 130, -171, 169, 154, 303, -26, 144, 50, 206, 26, 7, -150, 46, 291, 390, 245, -152, 17, 211, 64, 73, -115, 260, 120, 158, 195, 62, 396, 102, 464, 108, 272, -50, -55, 156, 393, 330, 12, 16, 55, 27, 239, -26, 105, -63, -47, -52, -132, 40, 194, -71, 161, 176, 1, -13, -15, 112, 92, -30, 39, -121, -68, -126, -576, -36, -180, -111, -366, -92, -166, 209, -26, -129, 150, -57, -231, -128, -57, -178, -112, -127, -127, 27, -45, 140, -146, 65, -276, -141, 176, -222, -270, -87, 173, -221, 106, -90, -249, 119, -45, -59, -241, -30, 73, -90, -260, 44, 175, -148, -122, 111, -46, -181, -80, -202, 209]
4294B09k00Q4M9j92m4P1L18o44L66K9j15J76k13L17J21m51L71J4l43O8j39L68
4316B20j44o9L6r0O0J9J8R7k78M23k40k08R9K32q1j03J54j76P5j4l7L04j12l97
4340b12P7j7L74k2l19R4N3j65l5K89om13K93l27N46j98n1J01J0j43K93k7j70p6
4364e1Rr1p5l0N00k32o1J07q6k36M3O6J93l14J92J41j06j9l8K0L82l63Q5K39k9
4389B46k46p8P2k45J96n4K39j51K6k93n7N53j39j35k72P2K72j62J08m5Kl2M3j14
4413a94n1M42j48k25J24M0J19k2k2J19k59J84J45j41k57L12oj34J64nl96K76j7
4436D8J91j51L48m11n6K62j01M6j75K72n88M09J29k18J33J30l85L21j04j03J50
4457A47n3J39k80Q5K0j14l0K49k3m6l30J15P6o0K47M1o3m19L95q7q4P4j24J55
$$ y = [209, 9, 93, 142, -50, -94, -23, 295, -349, 17, 46, -69, 107, -106, 211, 332, -119, 252, 266, -77, -9, -148, 220, 76, 7, 43, -47, 13, 32, 50, 147, -131, 292, 52, -156, -57, 175, 94, -9, 145, -31, 44, 30, -7, 297, 185, -212, -135, -152, 222, 200, -119, -25, 28, -137, -172, 117, 111, -302, -9, -336, 210, 12, -39, 62, 72, -71, 222, 195, 25, -51, -42, -133, -208, -238, 262, 30, -31, 76, -10, -246, -203, -137, 56, -258, -66, 75, -31, -50, -88, -68, 314, -49, 36, 275, 246, 0, -78, -6, -251, -55, -109, 130, -21, 5, -288, -345, 208, 69, -66, -338, -266, 6, -156, -48, -93, -91, -123, -80, -194, -245, 197, 49, -176, -52, -12, 107, 85, 63, 182, -77, 107, 252, 111, -146, 166, 160, 26, 190, 185, -211, 65, 48, 239, 88, 436, 25, -31, 231, 130, 176, 1, 273, -315, 94, 223, 5, 138, 268, -117, 204, 100, -3, 147, 94, 233, -47, 38, 58, -56, -86, 163, 140, 94, -236, -121, -45, -105, 142, 183, 120, -299, 96, 9, -75, -1, -125, 30]
4481C0p5j56K85P0K9k81J17n0J16j50J68j56n4J42l4P9j91K67m77J05J64j2Pj72
4505b29l2K85k21O9L0Q8o1r6K74j36q2J32k11J71K2K8m0j85l3R8k2P8j39J03K01
4530I2j21J40j27J18j41LQ6n4J06l8Or5K55j50O6j72j20M05k45m3Q4m00O07k73
4554a1J94j03K53k25j95RJ43j64J25qJ81p6P3j75r6L43j30j6j78k17K70KJ39k04
4578f6J80M5q8j86L62k81R3J7J72n0O3k53p5j5L1O9L09k43R6l38K95p0o7k91J10
4603a81J43MJ50k56J83k52M42j05m2Q6j77K28k74L90l25m3p1j14J53p6n2J9K77
4626A07l02j07J95j2K26k14j46J72Q0n6j89P5R7O3j41j56K00kJ96l97K30j14J66
4649b9j55J24L7k16N03k70j99J45P6j50MJ45l00M04m5j92j21J77j7K46K04l77
$$ y = [30, -45, -201, 84, 154, 183, -98, 19, -31, 85, -65, 103, -53, -107, 35, 1, 80, -111, 156, -321, -216, -52, -64, -57, -229, -261, 24, -197, -128, -98, -10, -71, -167, 107, -29, -111, 21, -190, -19, 3, 31, -9, -194, -227, -129, -151, -73, -212, -109, 92, -29, 111, -16, 102, -39, -36, 50, -4, 102, 64, 70, -25, 230, 80, 146, -26, -146, 259, 14, -29, 55, -345, 262, -11, 183, 80, 333, 108, -87, -78, 65, -99, 26, 18, 199, 123, 196, 21, -75, 268, 138, 122, -56, -273, -3, -1, 138, -66, 114, 159, 71, -115, 247, -34, 59, 76, 248, 198, 261, 8, -67, -82, -51, 18, 327, 84, 180, -158, 137, 67, 0, -291, -181, -38, -34, 116, -140, 43, -209, 233, 128, 86, 172, -5, 223, -51, 339, 14, -29, -100, -214, -61, -137, -189, -170, 107, -195, -302, -107, -119, 107, -107, -253, -81, -1, -57, -246, -171, -74, -11, -152, -308, -108, -110, 86, -311, -81, -195, -29, -184, -60, -23, -239, 264, -6, -205, -60, 16, -134, -130, 15, -285, 119, 74, -118, -239, -62, -79, 167, 371, -6]
4671fJ19nq9L6k93K64N3R7n0q0n3K76k82J88L1J09j81k66Q2J70l9j33n7K49P2
4696B12j28k22P2K40j34j76m4J85J48k16K42O2m04L50O4m36L93k95K36p3L1J9
4718A26j29K04k15K97n42L56q7p4j17J24j85K78l92L48L07k19O0j66L24j51j64
4739a7k2J30k50ML41l27l5L23j75M2j42J73k1J89m08j2J89N7K7k00j46J12J06
4762f2J86P2l46P5J44q9J8J91K2m29L72l98K08J18l44K19N5K5p3K50k12K44m34
4785a88L82l15J40L9Nl3k59O15l68pJ22Q2k37J15J43k06p7k1J97k2k8L4j70J31
4809G4j0k81M15k01P8J15j22Nn19K89M46l02K52j07j1J06k54M19m35l7L11k66
4831c5O5j29J69J42O6j04k25J28K19k45j93K70Q8k28Oj63K80P6j78n0L44k97j02
$$ y = [-6, 113, 108, 19, 55, -238, 26, 79, 176, 126, 46, -7, 269, -13, 175, 206, 315, 134, -132, -50, 120, 81, -52, -109, 140, 212, 84, -138, -66, 174, 40, -136, -180, 5, 153, -63, 179, 241, -163, 187, 251, -185, 208, -87, 149, 76, 107, 126, -3, 201, -14, 283, -259, 97, 10, -64, -181, -57, -242, 36, -356, -8, 299, 80, 140, -26, 298, 147, -17, -39, 91, -159, -155, 186, -141, -176, 147, -28, 14, -128, 45, 24, 213, -195, -207, -18, 39, 66, -134, -280, -168, -62, 124, 196, -150, -75, 69, -20, -2, 189, 211, -218, 154, -244, -36, 82, -262, -43, 12, 37, -36, 214, 2, 246, -188, 194, -121, 19, 58, 63, 30, -229, 386, 18, 11, 133, 215, -22, 93, 236, 30, -47, -68, 129, 107, 79, 113, -57, 74, 64, -217, 198, -3, 75, 190, 68, 73, -446, -157, 289, -13, 239, 132, 121, 227, -27, 392, -43, -80, 231, -35, 30, -99, 70, 212, 278, 174, -51, 77, 296, 51, -142, 128, 216, -12, -6, -169, 111, 187, 9, -41, 303, 6, -96]
4854i6j31J13N34m76K35j74q2J60j83J0N2P1m00M14n4J56J58l68j77K4K48j06
4876g2j86K26M8p9K17p3m37L18J79m83N43j36r6j31L77n11J36J1JJ64j54k4M0
4899a22J07mj41K32q7j54j62L17o2j55K21J67l43L95n2j66k20J66j10J61O2l32
4921b82N34o3k22J80m34K61j77K18Q5k7L7k31L62k09J15j57M8R9Nk00K2Q5k0K48
4945B77k68J0J19P4j38O0q9J23k73m1M07l21p5K50j19l78N28j88L14k54m1Q5R5
4968A57k12J50K1j37J07J1N7l97M37J83p09K79J43m1J6l6rk03m0K20J10n6k53
4991b02M03J1l78L12j2l3k12K59j22l4j73Q5J95p5k09K59j01j44J88n8Q1n4J67
5014A53J38l03j52R2k03K72j88O0O2O7L3l15J47J32o9K45k91K87l18Q9J89j77
$$ y = [-96, -227, -114, 420, -56, 179, 5, -77, 83, -100, -90, -38, 33, -367, 47, -7, 149, 307, -61, -238, -214, 34, -72, -258, -32, 16, -63, 154, 81, -356, -38, 141, -342, 201, 65, -31, -162, 215, -296, -160, -149, -148, 16, -138, -162, -122, -15, -19, -160, 72, -15, -169, -331, -14, -76, -231, -10, 157, -186, 209, 157, -9, -229, -63, -173, -12, 50, -282, 252, 189, -33, 147, -287, -26, -203, 15, 100, 73, 110, -121, 241, 32, 147, -10, 38, 137, 142, -58, -36, 49, 29, 277, 9, 19, 138, 212, 74, 134, 45, 168, -105, -146, 261, -60, -135, 115, -4, -382, 146, -42, 272, 18, -23, 62, 157, -55, 95, 116, -21, 86, 97, 154, -243, 194, 377, -332, -53, 90, 49, 65, 29, 20, -183, -223, -3, 107, 51, -202, 201, 212, -166, 146, 134, 101, -111, 148, 26, -8, -181, -96, 99, 24, -185, 74, -27, -171, 17, -41, 40, -14, 153, 291, -12, -164, -72, -275, -3, -191, -131, -69, -2, 31, -284, -137, -5, -74, 171, -120, 167, -151, -62, 127, -50]
5036e0N0l7k15N72k87j46J55J23k2r8K46j38q5J12j36p9O6l72K63O2J17j98k05
5059c02J43M31m67L57Om68K83Q4J96k43j34K99k45K07j44K34k06Q8R3m6n7o9M9
5082H9J62j57P6j57K39m37Q7L84m90L59m1K91K4m04j22J74l4l47L71l38K78j02
5104i5j13L67j85j57L11l9K6j76J44j10N4j58L77j77l15L00J00l33L50j86j58
5125a73J01m9K03Rl02J96j37J88nj65J27q6j41J47j68j8K97k15L3N9j64J52r3
5148b04K76l5J06k33q4j23Q1K56jL4k70K13k1Q9l1J28j31L8J58L0o64L32m7J0
5172i3K2m2J33N9N2l04Q9n1j86L15q2l5r9J79r3J64J43j47L48l12R7j10J26k15
5196d2J51j24M0K95m21M6M5k2M8j38P7R3K8r3J26r2P7j35P0RN5l9P5l19R8J62
$$ y = [-50, 0, -37, -252, 320, 33, -113, 42, 165, 143, 45, 291, 153, 68, 180, 44, -35, 31, -341, -78, -16, 101, -97, -302, -159, 272, -195, 162, 168, -300, -17, 67, 263, 20, -114, 185, -60, 147, 3, 237, 31, 119, 212, 166, 109, 40, 89, 251, 94, 170, 13, 252, -185, -98, 286, -204, 155, 114, 405, 429, 25, -97, 77, 43, -304, 67, -271, 7, -95, -208, 159, -26, -183, 128, 89, 115, -61, 83, -27, 27, -131, 246, 69, -246, 54, 154, -179, 171, -15, -173, -72, -121, 82, 91, -211, -15, -152, 36, 31, -134, -7, -93, -234, -87, -255, -273, 24, -191, -158, -99, -263, -111, -204, 72, 37, 143, -90, -174, -297, -216, 40, 39, 73, -197, 16, -5, 84, 53, 181, 50, 88, 246, 276, -388, -56, -103, -93, -71, -113, 20, 79, 131, -173, -84, -135, -321, -6, -88, -123, -222, -43, -136, 28, 171, 24, 372, 60, 157, 47, 173, -42, 109, -15, 25, 320, -101, -55, -10, -32, 16, -122, -45, 48, 76, -17, 109, 17, 94, -41, 29, 38, 93, 54, 129, -190, -92, 70]
5222G0j57Q3Q2k39K23j59J60M8J9k31K42J02m7j08r5P5k74K96j58J60k52L01j42
5245aj10K0k95N4L95j61K51k00J14l70L23J8q9K14m10O3J19J71k03l2K41l11k67
5268d66K97J53l53L34R2j24R3o2J22m14M76p6Q7k87L1K77k61j55K22j99j39K77
5290g5K23r8m1j13M3M16k19j67j27L03J1l6K27j61m86K88M6r9L8K8K58k6m00J67
5314@K7p2J33O9n60N78k03j8R0L8o8K91k02J77j87J20j37O1J04j20q4k27K40K11
5338B61l43K80L7j15j28R9m7J09j07q6j30K6M17j68J67m91L16l40K58j64J22L30
5360C03l42K31j78K27o3l37K78j94j69K00j77K90j08N16n39K51n56O20k96M8K64
5381B69p01M66j27Op1Q9J20qj57l6J8K85m47L88n1P8k46J86m67L02nN2J77j59
$$ y = [70, -87, -4, 78, -161, 62, -97, 63, 111, 130, -101, 141, 243, 196, 88, -7, 68, -206, 90, -68, 92, -160, 141, -1, -111, -91, -386, -332, 63, -98, 153, -47, 67, -303, 20, 38, -51, 163, -247, -184, -65, 106, -97, -129, 112, -199, -466, -169, -16, -369, -35, 57, -67, 26, -36, 86, -328, 148, 72, 159, -128, -97, 180, -81, -236, -14, -213, -352, -75, 148, 50, 9, -104, -61, 355, 136, -31, -158, 145, 156, 120, 347, 186, -300, -12, 34, -65, -27, 1, 259, 233, -167, 0, 27, -45, 88, 157, -403, 175, -28, -46, 44, 82, 14, 305, 103, 280, 93, 213, 76, 137, 241, 121, 37, -190, 50, 261, -82, 198, 235, 120, -8, 91, 44, 153, 46, -40, -170, -144, 273, 105, 272, -219, 97, -243, 15, -149, -27, 303, -39, 192, 14, 241, 178, -159, 119, -75, -244, -44, -221, 69, -39, 477, -62, 189, -367, 253, -43, 5, 269, -432, 34, -93, -87, -158, -69, 51, 43, -114, -150, -132, 153, -294, 94, 43, 121, -125, 61, -406, -104, -109, -57, 120, -39]
5405c9L8J44k38J81J25l92P5R8Q6r3k14K63k11K10J32o0j72K67k19J33k2k02K29
5428A19r4j55J04Q6k38J79K5l3k21N79j13l98L78j21j9j8J39p5k34L83j37Lk48
5451a09m4L30k2l0k4K0L9m43L92j25R3k86J75l0L17j77L45k49j05P4m02rN58l40
5475e2m9q0m5L94k4j34J56Pk95N4O0j13J6O9j17O4k24K56L4r7n9M98k08n46M27
5500hq1K49k60J74Ml20K81j14k84K92J21l75K25P4J28l15P4j45L47l17L01k67
5522b16O0L68k79j74K20j15J98L06m26K17o0j77j64L55j35L5o9k2K6K13m66M63
5544A58j98k00L30m44L39r4K4nn8K05Mj52K10r1K17Rk74J69q1p8M3J47k19l6L9
5569c6L23R7l73O9P2M9j06j59K85j92o9R3j67J28p8L7K02r8j39J82k1QK6k12L95
$$ y = [-39, -1, 143, -95, 86, 211, -181, -106, -8, 78, -15, -229, 34, -177, 33, 165, 105, -67, 200, -19, 114, 92, -110, 119, 25, -130, -26, 60, -178, 1, 26, -7, -228, 351, 238, -160, 218, 97, 78, 60, 199, 124, -110, 273, 136, 139, -109, -153, 177, 155, 125, 101, 121, 160, -283, 109, -16, 77, -209, -34, -64, 253, 76, 421, 172, 67, 141, -261, -270, 288, -52, -101, -181, -226, 168, 144, 10, 166, 173, -122, -68, -8, -121, -105, -36, -153, -89, -313, -57, -23, -120, -179, 319, 111, -435, -8, -89, 160, -100, 74, 78, -242, 39, -75, -359, -67, 54, -321, -96, -22, 106, -209, -135, -280, 67, -250, 51, -216, -156, 212, -67, -241, -21, -136, 62, 368, -58, 159, 99, -78, -242, 113, -22, 13, -56, -78, -52, 161, -305, 158, -40, -240, 90, -354, -15, -109, -85, -90, -148, 57, 61, -91, 119, 28, 245, 254, -20, 149, 68, -10, 33, 180, -39, -75, -36, 287, 384, 11, 80, 152, 201, 95, -64, 221, 29, -40, 53, -114, 14, -64, -27, 175, 77, -62, 120, 99, 107, 133, -79, 316]
5594C16k26r0L02K1r1L9m82M23m12J9K58o1J81k14J42J2j29P0k25J35N9m9j7k11
5618b30L2K82K11k06k06J8J01j31K18n8lj24L43m44J79J43j43p3J07r3O7j03n9
5641a72p0K84j67N24l29j46J94l4N7l31K25k60J65k65M08p4p0K28J53k11n44N60
5663A25k06p2J92j8P2J28L8m65J43M7R3k82Q1J09j06J53p3RrK10k56K1q4L30j18
5688F2j88J32J83j35k47J98L32m97J99L75k44j32L2j46J33q9J59p0P8n5J21k68
5710f7Q0k01J62L19k96kL96l28j99j29J94L5n1K67q5j93K25kN6k40J4k79J99K0
5734a05K55j07j65J77k13K36j52o3j14R6J15j3j3J06j49K31k42K59j99O8j47K12
5756G3r2J11j55K1j74P0m9N8K02p1j93J50Q1k33L77k99J62k31J90Oj09Q9j92K96
$$ y = [316, 90, 0, 302, 323, 232, 271, -211, 212, -200, -181, 77, 16, 197, -17, 125, 137, 8, 78, -147, -12, 47, -2, -19, -230, -198, 84, 295, 89, -117, -99, 2, -129, 89, 31, 28, -96, 247, -197, -18, 125, -18, -91, 16, -77, -10, -113, -172, -242, 42, -125, 399, 70, -76, 118, 84, 141, -190, 35, -225, -60, -325, 83, 9, -61, 167, 320, 109, -435, 125, -81, -153, 39, 21, 93, 221, 259, -206, -63, -16, 77, -205, -124, -15, -121, 32, -41, -32, -41, 169, -87, -66, -150, 180, 62, -126, 6, 189, 54, -193, 5, 337, -160, 39, 414, 170, 38, 70, -76, 57, -32, 127, 57, 135, 80, 201, -67, 13, -188, -26, 293, -3, -5, 391, 63, -136, -265, -71, -36, -87, 180, 95, -98, 127, 125, 181, -59, -45, -324, -125, -105, 150, 43, -122, 55, -158, 78, -74, -137, -251, -155, -40, -53, -66, 40, -109, 122, -120, 139, -60, 8, -139, 73, -19, 92, -63, -42, -216, -146, -195, -137, 65, -6, -199, -49, 32, -201, 176, -123, 39, -192, -2, 4, -105, -16, -208, 88]
5780H8P0p8p1l20M04j33J34k66J18j92K20l52N37m08J96j9n9Q9P7k22J40J8o8
5803i7J32k71R3J0J69J01j99r8J38O1N3j99N8L00J26l46k78L77j65K15k12J14
5825H2Lr9j48J72K37k10J4QJ5J15k44K17m2l18K96K3l72J05L92m21J32J38q7M2
5849E0j09L11k35j52K70l48K25o7l0M5K07j01J03p1j75L38j80l72L32j50O1r6
5871a44O9J81j92J07n6r6J61J00J58j07q0l36R8J58J59j85j04K1K0J44j96L65
5893B45l74J03q7L02k7k09J17J37m37j45N28P1k10k77J78k0K20Ol80J15J96l25
5915b73J1K53j9J13j04Q5J59k47j72L86k43o5L21l30k63M12j33K70k27l5M80m65
5937h6K43L5q3N0l7P3l08J02l28M42p4J17o8L5j37J75l75J53J76n9k30L69k19
$$ y = [88, 158, 80, 9, -311, 93, -40, 94, -172, -54, -246, -26, -378, 159, -249, -53, -72, -131, -42, 35, -187, -47, -29, -97, 35, -236, -143, -133, 36, 137, -62, -160, -22, 39, 92, -107, -49, 251, 377, 31, -247, 130, -35, 180, -32, 82, 85, -14, -162, 10, 247, 37, 51, 59, 74, 189, -55, 162, 120, -198, 98, 121, -251, -146, 246, -175, -43, 95, 8, 50, -59, 252, 17, -135, 135, -213, 12, -55, -85, -40, 167, 66, 169, 98, -77, 261, 81, -291, 41, -109, -48, -144, -75, 106, -86, 21, -35, -131, 30, 130, 288, 181, 101, -235, -137, 21, 180, -5, -109, -88, -68, 76, -120, 245, -129, -26, -113, 189, 162, -47, 70, 207, -230, -375, 153, 224, 14, -263, -85, -105, 115, 121, -259, -144, 52, -273, -262, -9, -28, 85, -19, 66, 225, -22, -194, 192, -51, -116, 205, -125, -388, 24, -109, 161, -66, -101, 379, -86, 157, 192, 109, 159, 122, 195, -113, -11, -339, 103, 29, 146, 78, 113, -24, 151, -224, -71, 105, 46, -184, 185, -34]
5960c4K79k05J11l10j38L92n4j98K69N6k03L8j27L00j98q1R3j3j27N96m61p5N0
5983d0J04o7k36K98K3K1J68J68l75J13m7j70l7J97m24M18k21J91k78L24j10j13
6005i3k2J48L5p0O4k2l72M07j55k77L45J44Onom23L89L7k4l01k4L2K89q9k34k2
6031b43O6J94j69K15j24j10k9J68j8J22R5l35O3j05J77k65M36j16Q2j89p6K53
6053I2O5k30k8k9L05L5k68j26N6L58l03K71l5n1k38K24L3r9J26j00m4L0k11L31
6077A64l06J82%j73L41l03K31Ml63J97O8M1q2M42n2j96l13J62Pk73K40k50K33
6100Aq9l2K54R3k87q5J13p6K88m6j40L3n5j86K32pl8j44K44mp8j67L46K17m00
6125a3J9K26k78J76j0k64L5q0K0K4j08K81L6l6N4k8k23J27J18j68JM30n24om0
$$ y = [-34, 245, 40, 151, -159, -297, 95, 41, -157, 112, 168, -35, 3, -124, 176, -22, -103, -10, -23, -150, 446, -15, -90, -40, 64, -3, -239, 59, 82, 103, 271, 439, 64, 177, 130, -40, -77, 120, -304, 114, -107, 84, -194, 130, 20, -93, -115, 33, 68, -2, 62, 40, -332, 75, -80, -357, -12, 132, 138, 133, 127, -296, 93, 130, 106, -195, -219, -187, 102, 13, -221, -243, -177, 17, -152, 63, -61, -171, -200, -32, -50, 72, 167, -168, -105, -210, -33, -298, 138, 22, 104, -85, -161, 92, 157, -73, -101, -130, 175, 210, -58, -184, -128, 230, -73, 198, 163, 112, -126, 98, 131, 32, 158, 58, 14, 44, -167, 164, -142, 40, 40, -133, 208, -95, 136, 140, -223, -26, 42, 83, 1, 443, 391, 195, -118, 44, 51, -222, 18, -232, 1, -88, -120, 134, 227, -60, -145, -32, -108, 180, 134, -6, 27, -28, -214, 18, 11, -27, -171, 73, 69, -9, -176, 170, 387, -13, 6, 232, -46, 130, 120, -144, -109, -189, -169, -145, -253, 28, 64, 28, 82, 54, -169, -42, 76, -92, -91, 339, -185, -191, -231]
6150b31M91j23k93O4J11lK11k86j39j18K37P5J16p0O2M1j17J31k04J11l7J71R8
6173B98n47K02N7n1l7J97R8k45K75m83k3L33j50N0j2K01J37k43m87N61l43K37
6195B5%m55P28k22j36R7J19K14m20J2M53l32j63R0K46l3k86l2J90k1J13k07j24
6218a44K47p1P5l35L69j14K11p2n00M15l3P8J03l54L1L9p8L02p3k94L10j35l5
6241e8L8J81k94j53J73Q6j7J27j40K82O3k52J39r8l56K4N3N6K06Q4j1k9N9j93
6265c0J30l47J65J87p3q5Q2k30K74n3l52L69l9K2j08o1q1L54j63j42j54L90L8
6288I3j41M12l76J08J94m57n5L2K93l1p2k5k35J96K03q8k9j39p4K23r6J5J58K09
6312C18k61L4j59k7J86kj70k69J41M15K7l00J22q5K4k9j9K28q6j46J49J07j63
$$ y = [-231, 260, 137, -156, -92, 19, 16, 227, -59, -198, -316, -79, -4, 112, 42, 104, 145, 28, 159, -45, 66, 29, 200, 298, -249, -47, 10, -41, -78, 119, 217, -28, 247, -236, -259, 74, -76, -26, -38, 163, 300, 57, -430, 131, -212, 25, 25, -430, 298, 76, -60, 37, 156, 370, -50, -38, 415, 83, -80, 10, 256, 223, -63, -95, 95, 74, 187, -20, -144, 103, 32, 107, -228, 141, 27, 238, 166, -334, 81, 48, 126, 229, -125, -94, -55, -133, 169, 96, -198, 112, -23, -58, -20, 161, -133, -286, -113, -27, -44, 83, -57, 225, 288, 36, 175, 77, -279, -255, -202, -146, 60, 144, 133, 104, 163, -30, 100, -247, -82, 105, 32, -53, 29, -201, 73, 20, -332, 37, -2, 20, -88, -149, -230, 124, -39, -181, -335, 55, 93, -48, 364, -12, 96, 290, -167, -222, -190, 103, 72, 0, -25, -260, -64, 139, 51, 22, -117, -191, 32, -64, -49, 109, 318, 57, 91, -68, -95, 91, 89, -81, -350, -209, 206, 233, -67, 55, -30, -6, -35, -54, 174, 88, -58, 91, 198, 35]
6335C5J33j74K84k78K93j25k61J92l3nj75K74j78OK07j25p8Q9m36K63n4K58k72
6358a60K49p3k01O3J23q2K6J94J76l93J27j57J35j53K48j79q7J52j87K53m3K11
6380B42k02n9l5J29m75O11l12j5q9n7K25J00k51Q1j1r2J89J4J96j51j59KJ88j35
6404f6K92j12k78K56k77L27j60J93o6q9l13J84P7j92N6P5R8M8J55n04O41n32O3
6427a24oJ43J45j80P2k3j7R2j64J10r2Jl8k30M56p0j46L18k43K08m09J98J76j97
6451b0r7R1K56J9L9j15k13L28j35J09k40O7k32K51O7l36J72m0J63K24k34j65k19
6474b60M51k55L58j53r2k74K11K20q2l1j43q5O5J38l48J56M0o8K61k45J54K15
6496B33l64M08k95k29J99L9J06l10J60J02J76l50J56k3j37K14P4j58j42J45j37
$$ y = [35, 168, -6, 278, 0, 293, 168, -93, 99, 66, 61, -114, 160, -18, -12, 195, 70, -8, 81, -355, -92, -146, 112, -160, 89, 16, -185, -122, 1, -81, -55, 139, 315, -78, 49, -108, 27, -126, 122, -57, -144, 8, -179, 74, 31, 242, 40, -19, -54, 75, -400, 211, -101, -116, -205, -262, -37, 63, -188, -107, -118, -210, -21, -7, 189, 38, -121, -119, 69, -66, 226, 114, -164, 92, -185, 142, -18, 175, 109, 20, -293, -109, -32, -224, -168, -93, 5, 53, 208, -296, 345, -187, -124, -130, 13, 158, -22, 50, 27, 10, 102, -62, 48, -44, -43, -81, -311, 145, 75, -71, 247, 4, 212, -197, 1, 177, -20, -117, -26, 230, 249, 288, 173, -40, 288, 153, 262, 22, 89, -143, 108, 175, -161, 11, -29, 134, 358, 124, -41, -260, 191, -64, 294, 141, 49, -225, -14, 206, 124, 93, -50, -135, -70, 68, -280, -124, -84, -152, 109, -136, 18, 233, -131, 277, -18, -247, -48, -9, 97, -213, -53, 49, 225, -125, 31, 8, -129, 85, 159, 1, -141, 4, -133]
6517a33K40k70j28K87k02L68j87n1K15j08J89j58j14Q4l11L50j99p7L00j91J88
6538I2k83P2JJ56j70J11K04k33j46J59l0J84L25m15k46L74l35n4L87k9n8J1j0
6561F7l0k24J12J03J42j4J82j41k38K06k8k84L24J5j71j14L67l42K38j90R0j59
6583h9m7K88O8k12J8m0n2M7k9J60K7m2J9j27l0j9r5J41J15j62J31qK1j14p6J88
6609H1j20j64K25OJ0k55K55jj55M76l19J4j55o7J95k11N8P3K43O3j57k49o2J72
6633d4K85l76m5L2L34k61J70n0j66P3k37M02J13l88R4o1K76l01P7L20n44J49K66
6656A18l63K19k07PP9K29m5l7Q8k94Q2J33L7j77J27l96J38M64k22k27M58j56n2
6679CJ1J70jk80K54k59m9QK46K0Q3o53O39k04L67m32M1L5R1J30k70Q3k46N03n03
$$ y = [-133, 107, -163, -291, -4, -206, 162, -25, -76, 139, 31, 220, 62, -52, 32, -279, 71, -128, -205, 95, -96, 92, -191, -119, -118, 38, -132, -21, 183, -50, -196, -37, -67, 117, 442, 27, -219, 155, -180, -234, 153, 124, 66, 77, 67, 37, -187, -75, 28, 170, 156, 338, 197, -41, 165, 137, -147, 177, 192, 21, -93, 274, -68, 170, -20, 70, -89, -136, 152, 220, 8, 26, -14, -66, -19, -48, 112, 139, 97, 116, -11, -41, -60, -155, -14, 101, -61, 70, 62, 83, -31, -107, 81, -39, -203, 22, 28, 38, -217, 38, 37, -118, 358, 39, 53, -102, -169, 26, -185, -127, -54, 189, 252, 95, -154, -216, -44, 241, -135, -180, -148, 186, -75, 95, 45, -121, -48, -285, 117, 230, -158, -64, -125, 151, -150, -73, 247, -297, -148, 118, -245, -26, -233, -226, -147, 82, 37, 0, 88, -206, -124, 9, 46, -131, -4, -400, -262, 202, -20, -247, 211, 55, 3, 14, 184, 183, -97, 157, -102, -151, -143, 103, 123, 206, -447, 192, -12, 355, -77, -36, -1, 90, 220, -50, 33, -213, 290, -213]
6704b13L52j18J75k07N9M4j97L81j68m2K7k22K08l82J51K79J5l6j06j74J06r2
6726a60N50r4j64K10r8j51P6k24J43Nk94K46p5J88k15R7L7L6J5j08k19K26k72
6749b45n6L07k3o2n5J79k29J85J48p7j31K28l3R3l70l02M73N1j97J49k65J14l83
6772e01M35R6J44l15k84N01j14j66J34p4j12N95l59L2k34J21M8O9j5n8j89L90
6794A44j0k13m6Q1J67j30j34K84J53m42J95L4L8n0m0L60n04J22m8K6J76j21L9
6817H1k8K15o6j32j28L30j45p2N5j29J4q3L6LK1L1jk4l06L44r8K8j3K89k57p3
6843a08J8K18l27M13l7o7l9j43K13J36k59J98k94J03O7j09M57m00j73JK64l1k0
6866H1l32L15m8J2P7o9j58J59J7o1L7q6j87L03j50R0p9P4o0R2nk21J24J39o3j72
$$ y = [-213, 139, 21, 196, -11, 48, 92, -105, 276, 108, 66, 93, -129, 79, -303, -152, 127, 142, 106, 0, -174, -68, -160, 390, 296, 132, 342, 244, 93, 169, -55, 88, 93, -201, 45, -30, 158, -57, 40, 77, 113, 128, 20, -199, 27, -245, -301, 6, -17, -79, -134, 45, -184, 1, 149, 72, -59, 169, 136, 229, -141, -443, 30, 81, -116, 33, -232, -118, -501, -66, 30, 174, -141, -425, 76, -38, -204, -70, -144, -256, 339, -20, 12, -222, -101, -53, 16, 1, -57, -246, 144, 134, -79, -125, -44, 123, -7, -141, 143, 296, -146, 49, 83, 121, 71, 31, 391, -113, 9, -39, -13, 163, 42, 81, 53, 268, 202, 70, -58, 272, 127, 55, 110, -19, -5, -88, -52, -49, -28, 3, 2, -22, -328, 16, -82, -54, -67, 222, -35, -108, -90, 128, -199, 214, 177, 110, 71, -72, 141, 277, 18, 216, -78, 25, 92, -17, 440, 40, -133, -132, 132, 101, 81, -251, 64, 16, 28, 105, 36, -122, 37, 54, -7, 30, -56, -243, 60, -90, 0, -79, -5, -65, 27, 22, -199, -75, 64, 1, -171]
6892a71J58J67n73K24K70k11L22k61N0j30K59k16rK7O1J63rl31KL81k68n1K72
6915A26l85J91R3j05J74l32K49J37k87N3J82j20K4j17K24N1L1m50K05p2K87j07
6937E2k48M33k07j09K3P4Lk8k5l7l1K44j77J32J1j51ML8J43j53l89P08n16M9J38
6962a9J40k06K18j51r9PK71k95Q5J39J46n2J04l91m0k4M0P43o25J47k98K86N9
6985A85j25J22j25J75k59K03l05K71l0l23L13o0pr6K7q6J22R9j84m9q2M79n73
7008c08M04j36J18j40M7L6l7J49j62p0K79j2q7j7m10M85k39K07k8k48J63L6l26
7031b96K76R7j81p5O0R4J15j21j76L83k39qL45l61J21k0j64M8J16J19r6m17M87
7054A07j04m3J06k65L92k32L6J96m81K33K71l46J74p8OK49k40K6l21M64j40O8
$$ y = [-171, -13, 154, -419, -195, 75, -136, 186, -75, -25, -155, 104, -112, -121, -94, -33, 130, 121, -210, -208, 173, -95, -146, 126, -259, -68, 25, -80, 94, -238, 11, 148, -139, -86, 96, -24, 0, -117, 107, 158, 189, -261, -56, -128, 159, 52, -196, 237, 30, -79, -56, 18, 21, -7, -32, -69, -100, 144, -33, 99, 110, -41, -37, 1, 144, -9, -398, 310, -206, -157, -19, 121, -85, 133, -18, -117, -110, 161, -134, -49, 90, 236, 184, 288, -103, -143, -167, -127, 616, -9, 138, -160, 126, 185, 60, 182, 57, 232, -27, 176, -129, 142, 112, -211, 102, 42, 35, -61, -34, -120, 2, 101, -83, -132, -214, 265, -308, 96, -40, 78, -62, -15, 21, -16, 133, -29, -99, 180, 168, 81, 64, -346, 139, -100, 107, 79, -169, -6, 30, -296, -20, 77, -104, -179, -119, -25, 90, -31, -207, 176, -63, -71, 274, -87, 34, 14, -150, -102, 14, 133, 37, -380, 107, 3, -40, 66, -199, 193, -39, -3, 193, -288, -55, 216, -130, 44, -34, -28, 221, -19, 7, -314, 150, 10, 78]
7076G8k8j08j71O65n37J92n2N5m6J90p5j37j24K78m5L8k53L2k2J98j29r5l3M3
7100h6K00n2J30m1J9j10j97J41p6Q8M0j94K11K3J02j87Km8r3J68R7m2j60K26j12
7125D9J45j04l36L94k50r4L51l4k73N7K05m9j56K25P2k39k7q8K95l58J44K71j20
7148H0OK7k60J64j34K9L9k28Q5K90k16q6K12K52l66n0J96k23K51J70k05K55k42
7171D6j21J24j15j58K60m8J30l88J51L89k69N9K8k16k7P0L39m02L11j20K0K15
7193B78l86J36l7j07m6K69J08k20m9p3P3K29M9l48J8K26j14J47j44lK98k51j91
7216a38K95k87Q0J21l10L42r4M5j22j46K35J65k21m6P0K3J79k83J13l2Q2k14K92
7239A49j49J62jj10j21R2J68K6k66K4J26j43k8J50j88P0O9N8j77p9K92m0j36N3
$$ y = [78, 50, -58, -229, 436, -101, 91, 39, 94, 48, 238, 163, 26, -98, 180, 135, 173, -80, -48, -70, 128, -1, -96, -129, -86, 114, 62, 192, 151, 170, 60, -137, 4, -72, 16, 56, -138, 73, 96, 198, 11, 13, -35, -128, 40, 137, 95, -65, 161, 49, 194, 90, -246, 148, -102, -196, 155, 121, -152, -95, 110, 61, -95, 130, 202, -37, -64, -152, 143, -215, -71, 200, 80, 86, 113, -147, 17, -117, -88, -49, -277, -192, 98, -118, -204, 8, 260, -106, -156, 40, -183, 68, 238, 33, 288, 46, -75, 49, -66, -224, 36, -12, 118, -270, -119, 270, 1, 60, 88, -128, -155, -85, 254, -148, 163, 43, 63, 278, -108, 28, -9, -116, -162, 107, 215, -5, -54, -127, -54, 175, 224, -124, -106, 120, 6, 153, 9, 6, 304, 53, -138, 157, -130, -50, 71, -239, 103, 9, 54, -68, -214, 21, 186, -35, -81, -11, 12, 191, -92, 21, -11, 71, -143, 149, 0, 162, 161, 51, -70, 22, 190, 216, -50, -26, 100, -43, -71, 79, -109, -39, 30, 88, -89, -168, 124, 84, -52, 1]
7263Al4K96l97J17K5J63m11J88J09K40k82j23K93l35K93m77J98PK00J22o18L81
7285d4L65n72N9L06O6q3j03J07o5k9j33J51q9J57j43J38J28o2p7j94K33j75j92
7308b51K76J41l43J84J06J2l86J73J34q7J70j47j08K35k87K01o6J11j1J4Oo9R9
7331A07k60J73K74m19k61M88K19k60K13m09J95k26O3P1r2j07K09q9J97K9r0J84
7353B09R5k24k91J11L3K9q8M24m61O32o59K38J88m22M85k02l98M95n7j86nK5n5
7376h4o8O4j5m7N7O8J77j98j16R9J7J67l22J80q5l3l2J85R3k62R2k05J44P3K23
7401A72l7j57k28K11l0J75K84n95n8M09k75M86l09j16k32P4K36J29rJ00l36O0
7423d6J35k22L34J3k83j05J85M7l05KL57p8j55L08j92J2k39J38J58o9K17l82J15
$$ y = [1, -33, 263, -134, -17, 8, 171, -240, -52, 57, 297, 15, -108, 185, -150, 143, -334, -136, -129, 71, 193, -425, -44, 321, -251, -192, 114, 180, 97, -6, 101, 36, 7, -126, 25, -64, 93, -50, 88, 216, 154, 77, -117, 116, -59, -251, 25, 166, -177, 7, 113, 125, -261, -88, 46, -41, 129, -18, -126, 109, -178, 23, -43, 68, 57, 71, 77, 8, 107, -153, 20, 294, -125, -386, 102, 321, 61, 274, -135, 60, -166, -103, -32, -124, -231, -22, -111, 86, 115, 25, 209, 304, 80, -211, -100, -67, -38, -126, 298, -163, 469, -190, 48, 236, -186, 299, 97, -301, 194, 137, -49, -54, -29, -84, -152, -88, -103, -150, -93, -25, 152, -46, -162, -63, -46, 121, -201, -21, -106, -139, -171, 14, 107, -155, -63, -268, -124, -51, 172, 135, -22, -250, -39, -69, 106, 390, -205, -263, 146, -129, 357, 48, -68, -300, -226, 10, 139, 130, 230, -106, -46, 89, -133, 201, 214, -69, -174, 11, 58, -247, -245, 112, 34, -121, 187, -5, 7, -232, -94, 64, -5, 212, -170, -55]
7446e5K33k24J20l2k85L64j06l6L13k76j70L42j39M21m61L63m29P7j89K25K47
7467C03k47l6m8k59O04k74r9R6K03J86o44M92j07j70K4j38K75q5j95M54l75L1
7489iK3K4j10k5J11P1K49l31L58k52J35m37L47j19O1j6k77m3m2M93j84j53K6N1
7513d9q6J65o2Q3P4j88J11q4p8L5j75M36l36q4L82J25m0K6k42l60K60R1q6K85
7537B03l98K32p8K7m6J23o7L2k75J42J19q3J49k15M41k85m7J83j07m2N7L9K1J30
7561B55l39K88j20j85J19j03J23j35J24Kk06J84L5P6k14K34m08M09k06J0K66k25
7583a6L09n16J24K39k45M15P9r8n3M0m08K86r8p5j01J66l38L21j6j50K96l97L17
7606H1k40O0L4R2k33L00l42N20k26k38K5K51m64N48l06J15p0J15j27R7j17L32
$$ y = [-55, 178, -46, 74, 42, -243, 121, 15, -21, 292, 16, -154, 188, 49, 470, 9, 372, -57, 20, -169, 56, 303, 56, 20, -28, -287, 317, 43, -56, 40, 243, 429, -215, 277, 170, 0, 24, -114, 161, 76, -119, 335, -40, -9, 14, 38, -72, -97, 14, 85, 334, 3, 361, 109, 244, -193, 154, 35, 96, 80, -197, -240, -282, 211, 27, -126, -100, -49, -135, 30, -32, 51, 125, -63, 48, -36, -114, -79, -254, 182, -154, -238, 144, 269, 229, 255, 13, -347, -87, 4, -82, 203, -195, 37, -41, -14, -60, 63, -4, 28, -247, -105, 14, -69, 80, -135, 306, 21, -26, 157, 50, 8, 65, 104, 125, 255, -84, 204, 84, -101, 18, -85, 38, -97, 27, 29, -177, 7, 42, 118, -96, 138, -270, 139, -67, -57, 209, -16, 293, -223, -99, 140, -105, 310, 389, 291, 238, 278, -130, 156, 58, -17, -118, 48, -290, 31, 15, -135, 161, -236, 81, -159, -99, -65, 27, -206, 94, -248, 272, 46, -192, -167, 84, -380, 168, -138, -23, -93, 22, -105, -8, -125, 207]
7628B07k07K5J61o13L29K5K04j08l84M81p1j51lP5k25J81m9j93K91k04L99m06
7650b36J45R4%k53L40j74mL14o04K02K58j30M3o1j77K72l0J7l18K73r9J49J09
7673A30k17J50J8J18k31J12j12J65j91m12M70K0P3j3Q4P6j04k53K85n3J90l49
7695d4K7Q4k14J84j05M6j44K27L2J84j55p9K3n02M79m4L37m81J60q0l9J65n7L9
7719D3J00l4Qk30J23J47R0l9j07o9j53J69j48j67M34j50q7J79l03L21k53J88p7
7742a5M1r0L53l90J6K81k78M5J56j01J77o2q4O4k4J9k64m4J50O8m9mJ65j74M7
7767CP8k03J21J62l89K92m8k73L83r0j20k3r3r9K73j47J31j37L24j61L3j87L28
7790A58k45l5L53k64m3o1j33L82k16J5L15k42j07P0L38m83N9N56k05J8l16j68
$$ y = [207, 0, 25, 186, -427, -98, -73, 131, 23, -361, 120, 49, -102, -105, -30, -255, -74, -123, -316, -25, -229, 170, -236, -91, 3, 3, -250, 90, -84, -88, 226, -378, -176, 82, -48, -5, -66, -243, 29, -1, 16, -302, -29, -128, 21, 130, -87, 63, 81, 199, -32, 80, -32, 133, -58, -470, 0, 20, 93, 80, 164, 240, 136, -117, 168, 115, 305, -44, -17, 67, -147, 37, -68, -22, -166, 61, 93, 277, 122, 43, 66, -436, 43, -1, 336, -145, 15, -65, -104, 61, 4, 43, 143, 109, 117, -113, 10, 157, 247, 208, 101, 32, -121, 48, -100, -267, 167, 17, -70, 109, -194, 127, -126, 62, -15, 26, -64, 289, -101, -85, 196, -82, -37, 119, 18, 195, 133, 49, 113, 89, 108, -156, -200, -50, 18, -31, -35, 130, -44, 3, 81, -122, -1, 161, -228, 64, 16, -257, 126, 36, -84, -107, -200, -299, -26, -173, -42, -179, 145, -16, 17, -170, 158, -87, -122, 231, -33, -76, -137, -270, 112, -104, -89, 226, -16, -123, -53, 285, -198, -139, 417, 212, 230, -86, -254]
7812b54M53n9j65J59k06j09P1J85Jk23K22J76r0l05K47j05n7L3R4j22j61m5J33
7835a27L99l71K57r3j91M66m54O9J25N4nO0j64p1O4J46j21J23l12K22l21Q2k11
7858c74J08O04m03N3n8o6r6N62j88l03r1J60j9kM34r2n24K47k37K89K17k31J04
7881I4j06O8k9J00l98L43j04K3J81P5l11J84l06M69l98K39KJ84j90nk59L19pj74
7905fj2j5J3R2k1j54J48q7k08M25j83K3Jk68K61j86k0M06k80P1k47J94K6L51l00
7930B4J23m49J50J16j2J03j42nK03k77J47Q5j21R3j81Q7j35L33l14K26j63K16
7952A07Q9m11L56l94J80K14q0Lr7j09M13j5k24p5j22L4L50j1l05L62k82J95k47
7975f9J46r7l63M27r6J35N5j23k5N7j65J51l74K16J04J00L7q9o8l7J25Q8l20Q1
$$ y = [-254, 199, 140, -25, 134, -72, -181, -110, 75, 76, -147, 75, 251, 161, -144, 103, -2, -59, -26, 68, -54, -215, -260, -127, 272, -99, 158, 65, -126, 340, -114, -45, 80, 134, 129, 189, 25, -46, 18, 164, 43, 166, -146, 76, -245, -163, -374, -266, 338, -65, -12, -70, -136, -232, 330, 142, -161, -252, -92, -111, -113, 321, 229, -295, -48, -285, 4, 221, -10, 94, -12, 56, 27, 127, -271, 72, -32, -9, 172, 247, -64, 120, -186, 283, -115, 124, 126, 310, 120, 115, -144, 175, 168, -6, -18, -33, -20, 72, 51, -103, 45, -42, -250, 175, -8, 15, 16, -252, 9, -177, -197, 209, -71, 0, -247, -53, -27, 324, 24, 147, -302, -152, -36, -48, 55, -87, -92, 111, -166, -19, 66, -55, 38, -143, -56, -191, 142, -172, 54, -109, 107, 196, -215, 141, -253, -73, 141, 61, 64, -33, -142, 271, 256, 32, -43, -165, -131, 219, 208, -97, 265, -17, 178, -69, 77, -20, -383, 44, -52, 83, 138, 15, -10, 47, -118, 33, -341, -125, -21, 79, 116, 27, -41, -78, 47, 135, -185, -104]
7999a04R0J23j21J18j82L2O1J03k91p8M21l90M94j99n2kk46K77J83k22j4J25Q2
8022B08k71l06M58k52n3K74j44K69j61J09o5k6J81k11Kk27J74j68K67k2%Rk72
8045b27L65k43j26K70n9Jk16K02m8K29L51r80M41L3J02k33J21J21m9qN8K3K65
8068C93o54L15P4r0J12k55K00l9Jk72J92k45N25m43K48Q6q1q9j11L31k79m7K13
8091H5j72j26M66l46L76j87j00O2j47J52J8J1m15M52j80k04L91M15m07n2n1K52
8113B93k44K3k32J91r8j29J90J12J3l30L97k75L31j87q5L5m54O15m29K78K25n60
8135c20M20k65o0J32M25k98j85J49K8m4o0J75p4R2k56J03J56j45M6j81K56l34
8157b40L9K74J2Q8j76nj7O4j50NJ03k3J45l48M19j45K4L7K6o3r9O0n4J29k62K29
$$ y = [-104, -14, 109, -12, 106, -76, -44, 17, 120, -171, -249, 172, -218, 276, 77, 25, 23, -223, 54, 237, 15, 1, 126, 208, -63, -369, 89, -163, -216, 58, -86, 183, 22, 131, 66, 40, 221, 10, 12, -215, -41, -209, 58, 36, 36, 45, -227, 138, -105, -231, 39, -20, -19, -235, -33, -81, 148, 499, -481, -40, -7, 95, -138, -17, 104, 55, 47, 105, 128, 393, -261, 54, 128, 38, 150, -105, 95, 56, 57, -215, -23, -268, 257, -186, 62, 148, 67, -22, -133, 198, -81, -128, 85, -87, -213, 253, -93, 283, 96, -4, 58, -89, 63, 81, 92, -323, 129, -51, -255, 136, 551, 144, 92, 41, 293, 49, 72, -160, 31, -67, -196, -6, 106, 119, -211, 186, -89, 242, 55, -30, 5, -449, 166, -263, 15, 240, -320, 100, -165, -225, -93, 332, 34, -151, -2, 26, -18, -78, 97, 23, 115, -141, -38, 118, -27, 19, -162, 94, -240, -201, 73, 85, 173, -3, -8, -25, 39, -111, -106, -3, -26, 119, -229, 190, 45, 69, 106, 132, 69, -30, 30, -24, 105, -157, 72]
8183G2j65O0j13K26k24J96k19L7
$$ y = [72, -93, -33, -146, 80, -144, 52, -167, -130]
8191a30
$$ Imaginary data points
##PAGE= N=2
##DATA TABLE= (X++(I..I)), XYDATA
0@%%%%%%%%%Kj0J6j6J6k1K9l3M1m9N7o9Q1r2J04j21J38j58J80k04K32k61K92l27
33a73L66m09M57n07N62o26O95p69Q51r42J044j156J281j425J587j772J986k238
51a188K540k908L371l974M793n971P828j1198J9190o8659n1769K10662O3648j78505
65a2140j69539M2761Q7178N5642P8760M1925j19915j38606M472N6998l471N8802
77a7133J35555j853j80737j00446O7420N7423N18O6429O7629q9272j43899M195
89a34171R3493L6401J6349L7712m6118j22733k8755P8725L4474L148Q0792N2469
101A01786j25090j51324L2321J21488K4325k0598K6857q296q3707k6178O6693
112d1723L8870p597K8307J0987r6029q7264O1043J05897R678k4451J6567k7571
$$ y = [0, 0, 0, 0, 0, 0, 0, 0, 0, 0, 2, -8, 8, -8, 8, -13, 16, -17, 24, -25, 32, -37, 44, -48, 56, -65, 73, -85, 95, -109, 123, -138, 154, -173, 193, -216, 241, -266, 296, -330, 365, -404, 447, -495, 549, -607, 674, -751, 836, -936, 1050, -1188, 1352, -1556, 1815, -2159, 2634, -3337, 4491, -6707, 12483, -56176, -107945, 102717, 166365, -12140, -181679, -138918, -51740, 3902, 82662, 124587, 4672, -133934, -129462, -72464, -75935, -17133, 118422, 116569, -64168, -164614, -97194, -39771, -39253, 27176, 94805, 5533, -138366, -134171, -40678, -4277, 12072, 49784, 3666, -119067, -147822, -69097, -34623, -31475, 49317, 101786, -23304, -174628, -142307, -20819, 3506, -17092, 9765, 1469, -82238, -108416, -41723, -2853, -10450, 17857, 28844, -67185, -154449, -93406, 12491, 22169, -2282, 14285, -13286]
124a3286r2272j7320Q5808M9487j7936P019J3735n9674n8403M5780O9763o416
136F285k1604J3809k7439o6733J6941R6498L2946m5683j3695Q864m9544m7618
148i6973M9108P3250l611k8052P641j5358n1279Q840P1997K1387m3223j5559J1753
161a0079k4885k0568M8707N2884k0270l9522J32p943l0068J8229O4452J7132l7863
174A0338j6983L445k2195j2419M0163L4235k3883k7858J0070J228j9292J8341
186d810M6367k416m3559j3480J1024r532k090L9082K7882k6078k8838N994L13
199a41j4237J6976L6259m981l3172l828J3640q993l920K8444J4246k8929k1792
212a0428J2175O086o134J8159K6065j3326l2156j798J0749p759J413K8559J0437
$$ y = [-13286, -105558, -122878, -37070, 12417, -5519, 1500, 15235, -44439, -102842, -57062, 12701, 6285, -15319, -1510, -28949, -95682, -78741, 17757, 50703, 5020, -8675, 189, -49355, -96973, -47865, 25385, 21774, -6278, 1363, -13995, -65274, -56434, 15563, 36950, -6273, -21832, -10079, -34964, -55532, -6825, 46059, 25789, -13733, -13601, -21544, -51612, -33383, 31069, 48201, 10338, -6645, -3200, -25395, -37814, 2349, 36584, 12701, -15157, -5087, -3859, -23151, -4810, 41557, 39141, -4418, -17898, -6874, -16406, -18496, 20586, 48468, 22390, -6448, -454, -141, -14378, 2598, 38857, 33876, 704, -3124, 10516, 1523, -2397, 26047, 40293, 11364, -10428, 1747, 7833, 1699, 19858, 45923, 32597, 441, -1357, 9392, 1633, 3046, 31605, 42042]
225D2042k6251j5153J3499L704q650J2070J8895j4194k5517M763J4520m286J523
238A6965K0340P66k8529j1456J5455N629n746J3489J5329j5595k3346M615J2561
251B0477n409L46J6344j44k2196m600J7561L830r318P014R341j6300j8384R374
265G936J5641k876j335J1210l636k0979m562J4590K874o374O833Q309j2310j2810
279B511Q946R793p299l162Q114l175j5112Q50J6053K076p449L457K437j4237j1045
294g242J1121J0286n717j431R955l091j6390j131J2491j13q937K499N569p776
308I3n962J0783P709q178n469L663m020j1424K032J3482L712n633M96J119q016
323e613p123O210M971m503j829N161n71o149L554P016l447q446O91J142n501p47
$$ y = [42042, 15791, 638, 14137, 17841, 9191, 21261, 40156, 25962, 445, 5208, 19728, 15442, 16965, 37305, 38071, 9542, -1914, 13541, 19170, 13424, 26913, 42242, 26647, 3301, 7916, 20477, 15068, 15414, 31758, 31614, 9418, 4818, 22379, 26209, 16891, 23905, 33246, 16946, -1438, 7936, 23577, 20701, 19366, 30576, 26940, 5961, 1399, 15989, 18863, 12489, 19322, 27631, 15321, 2511, 11457, 21250, 13951, 10789, 18903, 15728, 616, 1466, 17519, 19595, 12146, 15603, 18040, 3803, -7242, 3879, 14165, 8448, 7017, 16972, 13881, -2509, -3640, 8851, 8738, -199, 2300, 7869, 93, -5869, 4914, 12623, 4445, -1024, 2639, -1381, -12805, -10773, 2709, 6421, 788, 1284, 2403, -5613, -12736, -6526, -1555, -6058, -7887, -2726, -3297, -9446, -5892, 1124, -2323, -10769, -10078, -8936, -14437, -15184]
339a5184J1218O539o467m591J972l438q421J595P779N02l317L164L962l586l784
354a2057M078J951p622m910L521L032o48K945O666r9n133l583j602k582m42M947
370a1538L371J36O21J385k065l544K57J114l285k192K503M111Q05J664L859n92
386c390n740m721k80n33k30M955O138J035j440l63j19k869l642m37J328M08m35
403a0335K671M161K082j246j607k184l364k724K84L314M313K619Q01n23j865l021
419f624k151o47R92Q45J811K287K432J309K49j044k715l763l188k39K538L453
435d455L387K364J868r97m176l759r84J94j90R47L193L274M23j12O58n81l440
452b386k833N3J046J411L328L607J481j753k292k536k666j174R91K860K311J707
$$ y = [-15184, -3966, 2573, -3894, -8485, -6513, -9951, -18372, -16777, -8998, -8496, -11813, -8649, -4687, -8273, -12057, -7979, -6028, -13650, -18560, -15039, -12007, -12655, -9710, -3044, -3143, -8276, -11859, -13461, -16043, -16485, -11538, -8167, -8031, -7410, -6025, -8090, -11634, -11377, -10263, -13548, -15740, -13237, -9126, -8321, -6657, -2798, -3390, -9130, -13851, -14131, -14664, -14894, -9939, -3801, -2766, -4206, -4569, -4688, -7557, -11199, -11636, -10308, -9900, -10335, -7664, -3503, -1421, -2667, -4274, -6458, -9822, -12546, -12262, -8948, -4635, -2016, -1215, -1738, -3603, -6624, -8775, -9422, -8430, -7585, -5774, -3487, -1055, 254, 503, -541, -3256, -7019, -10207, -10446, -7908, -4455, -1068, 1296, 3164, 2167, -2009, -5768, -6752, -6558, -6748, -5801, -2608, 666, 1089, 977, 1635, 1054, -2386, -5219, -5166, -4120, -2709, 619, 4226, 5707, 3954, 1662, -874, -3540, -4714, -3723, -863, 1448, 3155]
468C155K243P30j343j956j659j949j996M51J721K588L329L400M25l123j149r54
484C913l179k125K659L933Q22J52K505P43l057k117M9q15k053K033L524J477j3
501H451J972N56l950l531j57P57j299J688N680J899j114k20P37l344l494M38N64
518E633j630O86M892J838k239K55K940l593n584N86K866j119j034M377L185l290
534H769k509J652j083m261J77M311k51k238L134M051l299m559J880L44n070j878
550h30N150K339k452J825L339k658n216O34J623m228j704N187K287m039ON259
566F522q60o558m54M137k465m141L937M799k800k856L516P35o580j295M948m62
582A23m679K948O575k629o264L034L659o010m511M957K786m882qP342R6o572N91
$$ y = [3155, 5398, 6128, 4785, 2829, 1170, -779, -2775, -2324, -603, 1985, 5314, 8714, 9139, 6016, 4867, 3913, 734, -1391, 1268, 5201, 6023, 6175, 8680, 9423, 6366, 4249, 4298, 3483, 1430, 3463, 6987, 8464, 8451, 10423, 10979, 7029, 3498, 3341, 4098, 2799, 4487, 10167, 12066, 10952, 10732, 11469, 8125, 4631, 5069, 5633, 4003, 4689, 9581, 11419, 9180, 9435, 12375, 8782, 3198, 3784, 6650, 5531, 4497, 8874, 12059, 8769, 6260, 7912, 6829, 2568, 2745, 7056, 6805, 4567, 7701, 11752, 8453, 3894, 5774, 6118, 1048, -830, 4320, 6659, 4207, 6032, 9371, 6713, 1497, 2131, 3754, -474, -2178, 3009, 5296, 1257, 1263, 6522, 5662, -896, -1350, 2787, 322, -3819, 118, 4917, 2117, -739, 2777, 3512, -3068, -4363, 585, 123, -4556, -1608, 4967, 2338, -3926, -892, 2767, -3243, -7754, -2797, -11, -4893, -4901, 2441, 2537, -4035, -3444]
599c444M286l569o469M823N542m532k864O546K207p370k065O670l70p354J706
614f257O985j525m702L701L486o080l415N621J167o413K63Q561L56p176J525N650
630A747l656o232L987M246n095k015P721K265p628r56P470j823q016K058P011
645A084l024m938O023M646o882l757O598J652q227q44Q400P64o269K309N669m191
661i87o074M873L347o778k705Q807K871p302l80O998j799p830K685M781m727l760
677g980Q034M623q385l277Q741Q55r483n11Q100j281o208M210P002n514n675O056
693f93L624q889l633R002L095p144L29P849j725p942K585N577n705n317P342M970
709C325n686k469O780J244p796l34O138k995o191O298P026n796n211P327M105
$$ y = [-3444, 842, -2727, -9196, -4373, 1169, -3363, -6227, 319, 2526, -4844, -6909, -239, -609, -7963, -6257, 728, -797, -5499, -1798, 1688, -4392, -7807, -2186, -1019, -7432, -7169, 1392, 1748, -5428, -3903, 1747, -1909, -8141, -4154, 92, -5003, -7018, 703, 2968, -4660, -5616, 1854, 31, -7985, -5927, 1084, -1940, -6878, -855, 3791, -3091, -6848, -250, 1402, -6825, -7669, 731, 1495, -4774, -2465, 3204, -987, -7061, -2188, 1159, -5619, -8324, 483, 3354, -3948, -4328, 2670, 871, -6959, -4274, 507, -4220, -7980, 54, 4677, -3708, -6985, 1756, 2611, -6872, -7383, 717, -564, -6772, -2562, 4440, -1074, -6749, -693, 2931, -5958, -9591, -589, 2506, -4638, -4309, 3540, 1815, -6127, -3542, 2035, -3670, -8987, -1645, 3325, -2361, -4830, 1950, 3194, -4602, -4936, 1202, -1793, -7984, -1686, 5340, -456, -5667, 1660, 5765]
724E765q557m414P414J604p085K175Q476k760o213M467N487p438o448P017N190
739D680o877j659Q957J288p669L27O770m001p508M085O838m032l906P223L482
754G998p181k259O678j527q259K747Q737l147o285O308O538o853o115N160L165
769E705p751j019Q442J109o560K294P181m778q094M161N894o103m714P780N412
784H959o615k369O721n2q508J02O410k227n212M708O350m843m104N600J412q461
800b129j955P464K04o569K816P658k263o988L161M055n976m494N944K642n594
815b024M34P655o15p686J080N579m515o618M865O251m198l653O252L089p029k581
831c714N204o79o407J958O801k011m168M265M082n867m818M711K010n721j038
$$ y = [5765, -2792, -7206, 208, 1812, -5273, -3098, 5378, 2618, -3595, 872, 6359, -1079, -7527, -510, 4680, -2197, -3856, 5101, 6389, -1280, -953, 5817, 1816, -5692, -1607, 5231, 1199, -2707, 4516, 7998, 817, -1442, 5236, 3709, -4550, -1803, 6934, 3787, -2498, 3810, 10348, 3495, -2620, 2540, 5705, -2046, -3065, 5377, 6486, -74, 2220, 9401, 4623, -3471, 690, 6584, 481, -4233, 3547, 8959, 2344, -25, 6696, 6644, -1864, -1762, 4648, 2421, -2791, 1917, 8267, 3424, -680, 4920, 6332, -2129, -4084, 3380, 3584, -2985, -169, 7489, 5226, -1762, 1399, 5454, -522, -5016, 928, 3570, -2024, -1590, 6065, 5450, -2236, -1156, 4423, -92, -6710, -1845, 4406, 208, -3445, 2807, 5896, -1133, -3714, 1490, 811, -5596, -3638, 3163, 1152, -3016, 1249, 5331, -536, -5354, -643, 1367, -4354, -5392]
846e392P159R47n173J504M950l711n417K503L887m095k009O260K119n018p02N104
862B916j570n949P88N262j708m074L879M552l546l253M101M42n580o99N267j11
878G17l532K448M818k872m362K704K188m242k443N184J659l625K79M908q29m868
894a868R54K918k927l047L590L273k904j328M141K22m618r01L687n88l807J988
910a215M182j440k869K967J486m074k329L410P59l478R25M587o15l334O83K409
926B054k307l185K291K196k329q29L398R42l384K39J944j079l183Q15L171j487
942g33j636K847J696l248j306K259J68l140P21K923o84j863J868J730k407j787
958b592J845M54k974J19L135O69j920N30K126j636k778J369J510j690j079K908
$$ y = [-5392, 1767, 2714, -2459, -955, 3995, 284, -5133, -2630, 1257, -2838, -4847, 1413, 3532, -1486, -2188, 2916, 1346, -4603, -3815, 1447, -261, -4335, -456, 4096, 550, -2703, 1398, 1840, -3740, -4439, 828, 717, -2815, -367, 4451, 1579, -2783, -79, 2109, -2133, -4576, 608, 2267, -1358, -1079, 3829, 3000, -1868, -914, 2004, -923, -3970, -380, 2893, -11, -1339, 2802, 3024, -1594, -2495, 1192, 604, -3203, -1215, 2967, 1527, -1342, 1625, 3111, -963, -3292, 118, 877, -2601, -1676, 2911, 2296, -1038, -355, 2054, -253, -3438, -1147, 1049, -1280, -2109, 1289, 2231, -1153, -914, 1030, -49, -3232, -2417, 754, -733, -2369, 478, 2174, -1074, -2380, -121, 47, -3093, -2372, 551, -133, -1996, -128, 1602, -805, -2592, -747, -293, -3267, -3148, -13, 656, -1264, -734, 1392, -244, -3022, -1653, -143, -1833, -2912, -4]
974dJ222k146l05K055j72l019K51K103p12j267J570K305j672j363J286M49j993
991a412p50K436K71j378R44J975o60j725P31O30j878o46J821P59q79J02J797o3
1009B075k248K39J301j233j227J897J480j434n91J947L44k140n79J160L35j655
1025c29R69J800o32r32J187J47j387r86N54N77n72K62J337K24j117L47m6p76j035
1044d08M28Q19k58J01N97N84j318K23M52j004j119N51J098l45l77Q97Q28j507
1062B42n32J56j52o46l4R40L41l96K65N07o14j083l83J19J68m13J265N69l66k36
1082b83L9l32n31n60L10j74L93M81L12J20j56J8o86o97L30N2K29P5P27M44l22
1103b11l18n20kl27j77L61P18j50M54M63Np18k18k48k44r1L36O89O61K60j09r9
$$ y = [-4, 1218, -928, -1233, 822, 650, -2369, -2118, -15, -727, -1994, -424, 1881, 209, -1154, 132, 581, -1412, -2162, 274, 545, -833, 111, 2086, 1426, -299, 432, 1062, -816, -1462, 359, 1118, 239, 341, 2138, 2075, -173, 66, 1367, 134, -1093, 804, 2284, 850, 259, 2206, 2550, 410, -169, 991, 1326, -329, 640, 2440, 1808, 876, 2063, 2210, 823, -163, 391, 968, 396, 658, 1995, 2219, 1102, 1449, 1403, 627, -408, 20, 839, 581, 682, 1279, 1863, 545, 768, 1220, 216, -903, -352, 746, 401, 24, 921, 1749, 242, -290, -134, -286, -932, -966, -26, 315, -81, 184, 691, 77, -1006, -1389, -1270, -1102, -1515, -250, 319, -47, -283, -244, -576, -1107, -1667, -1357, -1531, -1138, -657, -345, -225, -381, -363, -1049, -1746, -1416, -1364, -1135, -1060, -333, 111, -211, -529, -1049, -1051, -1378, -1555, -1194, -476, -626, -172, 291, 296, -422, -640, -888, -1132, -1223, -887, -198, 463, 723, 614, 515]
1125E15j35m44r31K76K58K19K04L51P72l61m45m5l81j53m4L48N22J36N89K59n19
1146I91k71m00n69o9K02M57M66J84K71q5k60l70k34kp22K66P13O06n2J89Ko30
1168F83o76L5q3J44O4M24N51n9j9J03q09l71m99K76j17J46N45N77k33j02k72n57
1190b49m36j31K09J79Q7P67L48l74j75l25j38j008K73K1J88N22K88L41k58j035
1210i06K80k03m29j52P41K33J18N07N09o79n45m00J69m96m9N26Q43m30P6Q25k86
1231B52o84l39R8k21j04N34R31l59M25J9j59r70n19P40N0l74N44Q21J91o87K70
1252D59J22p50m57P12K57l24J2J479o4j028J58N36j124p37R23K96p0J38R83M3
1272A564j122r6K88j41q82M27J163l29k74O81K26r71o79P84N6j203L36J471k7
$$ y = [515, 380, -64, -995, -719, -461, -242, -38, 313, 1085, 724, 279, 234, -147, -300, -344, 4, 526, 662, 1251, 1510, 991, 720, 320, -249, -318, -116, 341, 807, 991, 1262, 1177, 917, 547, 313, 311, -411, -145, 568, 1174, 1122, 1311, 1313, 683, 7, 42, -41, 103, 167, 591, 1142, 1083, 1064, 1167, 358, -13, -512, -236, -353, -207, 338, 915, 682, 580, 308, -249, -685, -816, -607, -428, -341, 426, 774, 400, 225, -100, -238, -1246, -973, -952, -764, -242, 46, 387, 129, -906, -626, -829, -1258, -1410, -669, -436, -318, 189, 698, 19, -526, -926, -757, -1253, -1302, -776, 67, -363, -287, 538, 252, -432, -771, -673, -894, -998, -464, 467, 108, 533, 552, 393, -577, -1096, -356, -306, -680, -136, 685, 876, 189, 459, 581, -169, -626, 86, 343, 19, 31, 1510, 1446, 418, 576, 1112, -12, -749, 174, 470, 400, 538, 1521, 1564, 442, 346, 634, 493, -389, 38, 1201, 872, 598, 1279, 1505, 534, -145, 639, 695, -508, -172, 1299, 1272]
1291A272q05N58N52q01j265N04J75p48R1J858J3j219j2R80p99j435L72J131q22
1310d00k08R41R34j190p99J192m02j004o43J520r1l87L88J234q74j173M01O43
1328H2j434q43J713M03o10j19J408n37j027j38M35p23p21J354O96n66P1Q52o8
1347B28j749K47R50o78o95P78J531n51q45R18N59j634o36J339l05r79O23K021
1365A122o81j091N27Q79j154j340R35R51m02j90J148K49j035n6J040q93r34O00
1383c25R95l74m31Q26P81j084k96M33n4j373M41J472k32p22J011P73j494o94Q89
1402E42L18j167K36J127K61r85L64J223j328q06O05M79j162j8J129Q02j168K22
1420F74N77m12j478J15J268n86p87J178R83j049o88Q08J25j741M9J602n91p77
$$ y = [1272, 467, 1025, 1577, 776, -489, 15, 190, -558, -467, 1391, 1404, 185, 173, 1153, 354, -1081, -709, 422, -400, -608, 333, 1267, 77, -722, 470, 68, -936, -1579, -59, -150, -537, -149, 1085, 211, -962, -561, 82, -1352, -2195, -482, -79, -689, -808, 600, 63, -964, -1102, -667, -1390, -2111, -757, -61, -627, -556, 296, 228, -1521, -1274, -324, -1002, -1697, -919, 612, 61, -784, 134, 693, -941, -1577, -238, -543, -1522, -899, 1122, 441, -650, -123, 756, -398, -1738, -803, 148, -254, -444, 704, 953, -82, -138, 902, 9, -925, -325, 670, 296, -135, 691, 1472, 388, 92, 525, 471, -902, -461, 1011, 779, 57, 1068, 1841, 347, -347, 542, 860, -307, -71, 1056, 1317, 332, 696, 1919, 591, -215, 390, 869, -293, -311, 818, 1620, 452, 674, 1251, 839, -639, -524, 744, 158, -629, 549, 1532, 483, -205, 603, 728, -1013, -964, 638, 47, -730]
1438g30J101Q32r15q71P94L50j261r24J400M94j096M89J315n67j431N02M88j032
1456a062p54J345Q54j297j20J432K8j515K58O00m77j094J026J137o93n38J077
1473B07K33j554k59J431k86j333O60J633o28j230R82R20j314j209J355P10j145
1490h27j7J691nj405M65R16j068j415J312J109j377j94J681N92j359o01J628m20
1508G06j613M63J348k56j071Q53J143j138p37J271j02j203m46K030p9j444R21
1525F46R87o84j243L11J279j275l61J449L92j142j31J343n96j436K35J222p91
1542B05o90R62J036j106o81J258K41j751k35J500o6j319Q46J158o01j432R12M41
1560F78j018n54J018J52o56j58J230K1j527K13O36j32j067P79R11p91n91J201
$$ y = [-730, 371, 1203, 288, -583, 211, 561, -700, -1624, -224, 270, -826, -337, 978, 411, -1020, -518, -30, -1062, -1816, -471, 383, -914, -1034, 398, 426, -1089, -831, -231, -708, -1802, -776, 361, -332, -870, 207, 440, -1114, -1373, 58, -228, -1561, -901, 732, 104, -1126, -144, 776, -538, -1747, -392, 318, -827, -844, 847, 842, -563, -98, 818, -250, -1665, -353, 756, -621, -815, 866, 1458, 99, -502, 1126, 706, -907, -444, 904, 648, -423, 430, 1573, 435, -302, 969, 867, -336, -782, 1248, 1169, -275, 646, 1633, 949, -294, 17, 1296, 21, -340, 1109, 1501, 359, 228, 1571, 975, -461, -226, 996, 205, -485, 477, 1513, 407, -274, 984, 1225, -526, -761, 739, 673, -646, 200, 1358, 757, -675, 237, 678, -340, -894, 124, 276, -380, -538, 692, 713, -814, -601, 35, -97, -1164, -385, 526, -265, -856, 345]
1578C45J43j233m23R03M3j190M69J130m71p53P94L97q86m86O07M82j085J81R88
1597d5J10j034K03J245r10r03M48Q87o87k70J009M31j081k4P01j06j072M63Q36
1616B01P7j245N98J127j017q23J188k30n65j10R02P0m96K71O32o16k51J87O47
1635E47m71m54O13P52p75j25R94o19o81m2Q11q1n61M13R33p22m75P29j26o20k25
1656a85N39J64m97L63N43Nj003M94L19o83o37J102J38n61K66N65q1p50K30j78
1676A53K0n29N89K81j62l83M58r8l53m02M04O5p79O15Q04m89l11L38j46l40l20
1697e85J82j25j12J58Q32k67k04kk9l60p4j23N22k84J23K56J83j48O0m87k9l89
1719i02K26K89j14k55P15J35n60k46P15p88k99O23J08J26P8K83N8k57j92k12J51
$$ y = [345, 488, -745, -1168, -265, -222, -1412, -943, 187, -284, -1037, -243, 154, -732, -1218, -611, -129, -1214, -1033, -45, 65, -969, -766, 479, -431, -1334, -886, 1, -686, -956, 53, 484, -597, -621, 80, -26, -1098, -635, 201, 278, -967, -369, 758, -259, -1082, 106, -124, -689, -799, 103, 173, -323, -52, 580, -36, -287, -100, 547, 76, -378, 235, 987, 212, 87, 1081, 462, -219, -261, 550, 469, -92, 321, 1254, 532, 57, 786, 660, 40, -185, 354, 518, 21, 384, 927, 932, -71, 423, 742, 59, -578, 524, 662, 101, 367, 932, 851, 101, 331, 153, 173, -356, 233, 514, 352, -31, 427, 329, -24, -426, -22, 43, -736, -121, 683, 194, -117, 221, 75, -265, -585, -403, -528, -640, -482, 350, 83, -121, -123, -152, -512, -586, -709, -187, -471, -348, -92, 91, -57, 3, -484, -513, -902, -676, -387, -501, -756, -41, 94, -466, -712, 3, -785, -1084, -461, -353, -227, -149, 134, 192, -65, -257, -469, -318]
1740c18j95K9L39Q0J23Q0K42l28M1m94P3Q5L27M6K31M29o37L03k4m44l15K12J77
1763F2j7J80L59k6K57l08no89M7jK68rL58L74q0j72k25r0j08j10LJ33L92NJ94
1788G92l41L28j25n68n6M5j30R5R2O57P9k48l3m90K41m68j12J62j01M29K49m8
1810D49r5k56o8j17J06m38L41K38Q3j29R1j42q9k36q2K27j25n4n0L57N5J05k63
1833i2M9n15kn6r8N65j03O4K50l30j51J42l38Rj37L15N6J34pK06p5j59l98l4J69
1858e36k61N46K16p6K36k92j52j33K83l41J43RL26L60l06L5R4m72M12k46q6K08
1880c3k22L73P2L59m74L17k27j23L8r2J33P6K38p7M89k82k98k08K3KN8L74j33
1903C83N1J75j94J21k49Q5r9l21J68L36J10j01q8O8K92p66L15K00l47J35J48j69
$$ y = [-318, -513, -484, -145, -65, 58, 138, 380, 52, 93, -401, -328, -243, 84, 130, 361, 790, 153, 456, 432, -12, -327, -115, 62, 45, 225, 584, 558, 815, 507, 502, -187, -140, -141, 127, 118, 476, 850, 770, 598, 373, 283, 175, 65, 68, 201, 593, 598, 792, 451, 779, 654, 86, 30, 75, -55, 40, 132, 789, 868, 620, 587, 97, 338, -130, -242, -80, -181, 248, 497, 449, 354, 98, 30, -87, 19, -419, -78, 160, 243, 114, 205, 63, -26, -262, -344, -117, -242, -296, -346, 11, 66, 171, -92, -43, -558, -560, -616, -714, -149, -252, -188, 62, -268, -419, -277, -615, -606, -743, -428, -372, -238, -245, -39, -114, -273, -671, -705, -536, -797, -251, -35, -111, 125, -167, -319, -452, -169, -510, -367, -358, -32, 328, 22, 57, 151, -321, 91, -155, -241, -33, -255, 118, 190, 549, 75, 392, 165, 42, 80, -12, 121, 197, 435, 358, 847, 565, 267, 59, 82, 84, 142, 516, 383, 434, 609, 415, 536, 287, 372, 273, -48, 120, 456, 566, 465, 377, 445, 737, -29, 286, 486, 139, 274, 422, 253]
1925B53m0J03K2j43k96J25j08J31M0j97N64l72J4j29j91q4J20l5q3K03k0K19Q3
1948A79m60K09o5l26J25k68L24j15O2K5Q7l49M37j92k11N6L3L3R8p3J78L7k14
1971c90k11L57k49pK93J21J5l33K89k92m36L83L29l39j32L38J7J76k93K03p0o7
1993b98K5J43j9j94L21J25p8l30K0L95k56K44M7N3k49J94K26n7j97N8o8J15n07
2016b87K55O12l92O2J78rm26J73J79j22%J88j3j24K94j35J41l63j95K22N6M0k2
2039C12Q5Q2K4k40p6Q4l24J22L44j8J9j21j39J17k5J29m07k23M95K38k99r5L04
2062C88m1n20J3J56j95j13L2M88k0m15M25Ro58n9Q9M06n27L04L48k97O2k76P07
2085C06k76l83j47P2j48K91L9N19l92k1l1j50l08m00Q73l75K81L17J92m76M4j79
$$ y = [253, 213, 316, 338, 195, -101, 24, -84, 47, 87, -110, 454, 82, 96, -33, -224, -308, -188, -223, -306, -103, -123, 96, 179, -281, -72, -137, -463, -338, -606, -282, -397, -335, -310, -223, -572, -135, -327, -538, -482, -449, -416, -318, -391, -213, -176, -390, -601, -244, -493, -500, -207, -86, -71, -404, -115, -407, -843, -460, -131, -470, -602, -264, -247, -71, -364, -161, -231, -298, -273, -130, -149, -343, -22, 103, 25, -305, -285, 110, -146, 98, 145, 198, -51, 143, 369, 312, 115, 173, 105, 220, -287, -32, 580, 188, 250, 428, 419, -7, 166, 345, 223, 223, 411, 398, 274, 568, 433, 574, 211, 16, 238, 294, 334, 312, 397, 479, 503, 263, 187, 271, -53, 69, 413, 395, 414, 293, 154, 271, 246, 375, -32, -255, 240, 478, 179, 84, 388, 347, -173, -160, -4, -199, -312, -280, 208, 188, -227, 198, 207, -451, -510, -421, -15, -542, -238, 110, -187, -125, -401, 306, 30, -353, -500, -428, -576, -285, -246, 273, -119, -140, -171, -321, -629, -1029, -156, -531, -250, 67, 259, -217, -173, -352]
2107c52M45m13j08K70j28O6K90J22l50K00k33o4j92j3M29LR3j90N73n7l56J73
2129B08P4k83n17N21L02L5l47M72p1l43j04J40L21p15M46K39J0p2L80n6n97J5
2151E8L01j54Pj02O26J2m45O13k74o31J15J16J94k45o6N08Jn26L55K9l15k50j25
2174a98L67Rk87L85J94k78j82J12M0m23M7M57M0k93K66J81j78m08P6J51p00J85
2196d37K98l9k28K52Q7J17m95N8O6r4K0n7K31k48N2N39l63l72R1R8Kl99M72L28
2220b1m32k25L00M10q47J05L04m64K19L07O9K01l36O1MRk77J24J30J02K0K11K60
2243B34l30j38j05O2%M4o0Q2k55O24j75J03j89Pj91p7Q2M03n9Rm0O86o90k05K70
2268I2L3k24J10L06r4j23q7K38N5j70Q4j48L0j47L46K83o23L40R8M50o68j98K75
$$ y = [-352, 93, -320, -428, -158, -286, -220, 70, 192, -158, 42, -191, -255, -447, -460, -31, -28, 65, -125, 448, 391, 35, 208, 282, -1, -518, 3, 305, 340, -7, 465, 394, 51, -53, 87, 408, -307, 139, 378, 388, 316, 696, 640, 43, 58, 359, 205, 212, 110, 736, 748, 303, 916, 642, 11, 126, 242, 436, 191, 125, 633, 634, 108, 463, 492, 177, -73, -198, 169, 178, -109, 276, 470, 192, 10, 122, 162, -261, -214, 243, 283, -10, 256, 437, 259, -149, -73, 78, -622, -437, -139, -178, -406, -154, -67, 50, -445, -387, -321, -415, -395, -452, -221, -469, -417, 122, -241, -613, -522, -424, -422, -821, -349, -21, -453, -678, -378, 32, -815, -710, -406, -870, -651, -344, -275, -74, -410, -349, -345, -336, -613, -489, -359, -257, -237, -26, 234, -96, -234, -339, -277, -277, -233, -293, -211, -466, 158, -17, 86, -103, -96, -287, -364, -282, 121, 62, 71, 31, 717, 27, -178, 92, 125, -99, 11, 317, 223, 100, 13, 251, 306, 136, 220, 72, 102, -45, 301, 584, -39, 301, 399, 849, 181, -17, 258]
2291B58j25j98j17M11J16k52Q4L13n35J07K21j20k80K8L88q4j70J63j43Lk66N41
2313C43k30jj6L70j18l93J55m3l1o75L86O87l38m6L4O2j09m36K89J19k28j02K42
2336g9O4l35K37O6n2k86J52J97m75L42L35k60J0k56L58k40n7L00rj54k3J77J32
2359A44k56J20k76L21j88j8j33N15l75J46L72n06L48j38O6j25j18L75k14o2K34
2380B32K15l32m92O52q1L6k29L62M7m49L75M87m30l93K66p4J85n9J38Rj79k61
2402B5N29n50M49l91K88P6P1r1j4R5q4k13R4j14K07K4J35j42l84L39j52L87m64
2425A20K05j4o9K80l4k00JRk81p1nj32J51J27j04K90j79l10L37k17k38J16j64
2448c82K37J52p0j03Q3l74L96k52kp1L06k42j74J79J19j39J93l25j85n9L71p9
$$ y = [258, 133, -65, -182, 229, 345, 93, 177, 490, -45, 62, 283, 163, -117, -89, 299, 215, 45, 208, 65, 68, -198, 343, 113, 112, 96, 466, 348, -45, 110, 67, 36, -639, -253, 434, 96, 50, 84, 146, 37, -399, -110, 9, -219, -321, -79, -15, -350, -113, -47, -99, -385, -233, -36, -511, -169, 166, -94, -84, -340, 18, -222, -279, 21, 12, -142, -165, 12, 144, -112, 8, -268, 53, -135, -153, -286, 229, -146, 0, 372, -134, 214, 76, 142, 17, -101, 274, 60, -2, 232, 447, 115, -377, 275, 194, 230, 1, 363, 410, -39, 336, 823, 393, 0, 266, 192, 377, 318, 456, 465, 286, 25, 554, 4, 453, 62, 350, 426, 497, 406, 392, 487, 403, 190, 284, 170, 377, 401, 536, 394, 10, 349, 197, 584, 120, 325, 311, 242, 522, 488, 288, 289, 298, 17, -54, -59, -191, -40, 87, -17, 273, 94, -216, 121, -96, -334, -218, -382, -145, 7, -63, -166, -83, -457, -61, -313, -315, -386, -80, -322, -496, -317, -198, -337, -144, -469, -654, -713, -342, -421]
2470d21l1J16K4k3K00k82j14r1L36q3J50Rj06k76L55Q3k13j08l4m3m3J07L31m19
2494e76P5m2J82J11m00L93k55K56L0j16N70k39n8M2l51L25n4Q3N4l14P7L48l32
2517a91N84l98J2m5q3K79p3J14P1j90j24L95m04RJ34K21k06k30O04m66L24l0m1
2540B66k4k33J70l8Q9p4L8P7l30j38M93l42O4l57J72J7K0L99j95J49l51K39k87
2563a76K01r0J30J9L3j10J0j32L23j75j69P7k58N3J20J51r1J88m2k27j92L56k39
2586b40O4K2L61r7j14J68k39j78J26m1j71J78N3K37k60q7J45m4Mm2K41l00n4K91
2610B3j95L12R2j48k90N5j1J27L40l21q8L18j22N5L9j11m6M3m2L48K22m21J09
2633B88J55r2l9p8K33j70JL03j97l21L55l14K04O5k5k02K75j93L0R5K77j98k4
$$ y = [-421, -452, -336, -312, -335, -135, -417, -531, -622, -286, -369, -219, -210, -316, -592, -237, -154, -367, -475, -509, -552, -595, -488, -157, -576, -501, -543, -361, -250, -650, -257, -512, -256, -226, -342, 228, -11, -69, -27, -378, -53, -107, -24, 30, -284, -207, 141, -191, 393, -5, 7, -38, -121, 158, 85, 199, 270, 80, -44, 351, -53, -44, 90, 311, 105, -125, 479, 13, 337, 307, 266, 242, 9, 179, 141, 230, 156, 194, 271, -59, -197, 296, -46, 18, -339, -167, -150, -130, 269, 74, 223, -128, 111, -176, 25, -65, 65, 84, 117, 7, 17, -115, 208, 33, -136, -59, -317, -264, -144, 7, -84, 104, 62, -165, -357, -1, -240, -176, -154, 207, 110, -4, 164, -75, -253, -127, -168, -339, -161, -108, 129, -131, -218, -73, -117, -113, -155, 86, -214, -268, 23, -172, 140, 232, 84, -206, -151, -162, -35, 305, -16, -104, 214, 92, 147, 186, 75, 29, 72, 30, 378, 600, 179, 288, 443, 351, 312, 234, 467, 297, 298, 601, 404, 83, 438, 124, 328, 393, 368, 166, 441, 248, 278, 373, 650, 452, 428]
2656D28m4O7m4k04J64k30K42J6j63K40m9J23j86p9k0kj66K11K87k77P8k06R2l9
2680B39j82n3J65L7K14n11J79N2j5K04n30J46l15K91j6K30k06j21K71l42O2J00
2702a01k04M89l56j23J41o5J8j37J37j95n6J24k22L57k50N1K31o44L35L25K14
2723F9l45m01M28J26l22K67q9l7j74K43J01k25k35K74Lo4l3J63K12L8l04j68K
2746d71M86l86K5J46l20L97l66K03L05j78L08k36j96J69j52J33j52L02j53j73
2766c09K61J85j92j84L51q8O5j67O1J81l29L67l83LL9K49M2r8L7O2k29K33lr7
2790E7K87o9j55Q5r5j75K29k60q0J97L37k77j06r4K45K11m45L56K63o23j6J35
2812GJ06j79j46p7N93m64r0M14j48l2P3m1j43Q2k50N1KK21q7j51j1L51n7k19R3
$$ y = [428, 384, 451, 407, 203, 367, 137, 379, 395, 232, 472, 423, 546, 360, 281, 261, 259, 93, 304, 591, 314, 392, 186, 278, 239, 57, 4, 169, 206, 420, -91, 88, 140, 125, 329, -201, -55, -370, -79, -95, 135, -71, -192, 79, -263, -201, -101, -305, 184, -172, -295, -154, -219, -201, -338, -201, -396, -452, -328, -550, -193, -443, -392, -161, -805, -470, -145, 69, -276, -677, -249, -123, -445, -178, -267, -304, -478, -235, -134, -359, -594, -320, -317, -381, -414, -251, -39, -1, -305, -473, -471, 15, -371, -346, -200, -520, -123, -489, -286, 19, -159, 149, -87, -283, -114, -266, -133, -285, 17, -136, -309, -48, 137, -55, -239, 112, 24, 89, -78, -17, 164, -165, 202, -181, -178, -139, 110, 152, 54, 91, 153, -76, 157, 154, 57, 344, 275, 120, 205, 110, -65, 164, -96, -176, 21, 358, 81, -25, -119, 126, 337, -108, 248, 511, -112, -128, 7, 113, -66, -212, -289, 304, -160, -250, 164, 16, -16, 57, 16, -127, -45, -295, -244, -242, -21, -108, -259, -270, 81, 24, -195, -102]
2837a02j43K38j2j48p7L66n28N7J15M2r7K86J59m95L79K15l64j07kr8m5K1J39
2860b01L28j62R3K38l00j8k6nJ73j3m16L01K64M7p5j82j61K86r8jN0m6J16n1J68
2885C09j8k54l9j72K47Km7K3L35k89q8K55Qo9K70k76N5J3j13r2N08n18M08m88
2909c0L46K75o18K30L27m22L59J20k78J53l37K99l38J81j35%J85j12k76L66J69
2930D64l16j3J27J07l20k1J67n7K06l1p5J70l22l4k87L17J01k93J72Qk6j43k1
2953a20j31K09k74K95j33J25K21n44J12j8j49J62K10n19K28K96L1j23l3k48J76
2974b27j29j95N08m0J94k62Q5k50L86l14L07r6k62n3J52J42rk1j95P6Q9j64p6
2997c54L78j79j92Q1J18K70K6m04J84o8J93k72J74k4J33J02l23kK33k36l6L12
$$ y = [-102, -245, -7, -19, -167, -244, 122, -406, -349, -234, -192, -289, -3, 156, -339, 40, 255, -109, -216, -218, -316, -361, -340, -201, 127, -35, 58, 296, -4, -22, -48, -53, 120, 107, -309, -8, 256, 303, 228, 46, -115, 171, 73, 72, 122, 76, 192, 141, 309, 291, 37, -2, -174, 73, 75, 28, 51, 386, 97, 9, 264, 272, 203, 473, 197, 252, 265, 152, 60, 568, 50, 458, -30, 316, 591, -27, 203, 530, 108, 467, 587, 309, 462, 125, 424, 86, 267, 132, 132, 317, 205, -71, 295, 464, 148, 135, 262, 369, 49, 28, 195, 138, 344, 313, 238, 408, 86, 52, -235, 82, 183, -110, 62, 70, 44, -99, -120, -251, -42, -316, -21, -154, -29, 192, -352, -240, -258, -407, -245, -35, -554, -326, -30, 1, -122, -155, -403, -227, -356, -551, -43, -83, 111, -151, -66, -316, 70, -244, 63, -33, -295, -348, -196, -54, -63, -84, -279, -203, -114, -278, -354, 24, -155, -347, -266, -148, 122, 148, -256, -72, -140, 53, -219, -45, -69, 64, 166, -157, -159, 74, -162, -198, 114]
3019A14l74K91J77n9k76K34k01L20k41P4j97K84o8J44j82K25L2j58j49J82R1p8
3041A85l1q2o1M4J19N5l6j21K36j43m30K69J33j4p5k6L1p6J09J26J8j20J55m05
3065a40J86L3m4j19J29l22L39k95r4j06K46L44k33l30L49N3m2j97K76m05J06q9
3087c55OJ73O1m6m8qj48n1K32LJ76j9Q4l18J94j35J32l44M09j90J53j40K32J8
3111G1l03m8m9J90k2L3o0R0K72k84j36J9M1Q2O4J88j92P8j43K95j71R1m8P1J74
3136C03k29k3Q7n5j16K09J01J7l23J06Q8j28J22J39k1j83r1K86J29l59j10J03
3158E2P8j84L08q4K96j03m93L03j5o8K25P8n9q4o0k1L49j49p7k73J10J78k17n8
3182C2j46L73k55J65P4j04j62M04m30j31k7K51J03J18k61L32m69j11J42jO4j29
$$ y = [114, -260, 31, 208, 149, -127, 107, -94, 226, -15, 59, -138, 146, 78, 222, 40, 265, 297, 139, -10, 172, 263, 185, 154, 72, 11, 55, 174, 229, 193, 72, 308, 165, -265, 4, 137, 123, 48, 22, 53, -23, 86, 212, 230, 110, 265, -140, 46, 79, 35, -84, 45, -277, 62, -233, -327, -433, -187, 157, -76, -406, -57, -4, -46, -243, 33, -372, -266, -355, -349, -176, -115, -161, -209, -217, -365, -416, -184, -181, -5, -24, 60, -258, -64, -199, -67, -411, -2, -192, -39, -179, 53, 71, -232, -280, -329, -139, -161, -128, -188, -98, 174, -110, -246, -227, -186, -104, -40, 148, -44, 34, -109, 186, 15, 106, 58, 129, 303, 74, 51, 138, 83, -33, 176, 277, 294, -29, 77, 165, 37, 159, 298, 277, 94, 3, 289, 418, 59, -51, 52, 130, -54, 254, 170, 466, 363, -130, 173, 158, 90, 315, 393, 334, 250, 190, 169, 518, 369, 292, 19, 129, 307, 90, 32, -114, 259, 4, 169, 243, 139, -23, 381, -49, -180, -207, 44, 147, 265, 4, 336, -133, -244, -102, -103, -39, -168]
3204a68K2J39p5J3K25m58l7L56m58N00j13n3j12J34n0K9j09J49J1J39k6l24J70
3227i6J29k60J91n8p0K07j57k22J40J04k11J39j57J32Q8NK2j37P5J90Ok97J10
3250a27L15k55N3J49k84j21M75j97k06M62j41o3o6l8K75k02jJ80r3L1J52k16m4
3273C8M0m2L27m85J75J52l56K86q5j97L00k91L41j75n7J68j66J40j59J14J56L7
3295B61k84J11K45k67J06j09J31l31J12O2j74mK08J21L9j34j52j17J44P2p5k36
3317b71L04mK54m11m0J89o3JL6kRM0j96J05J64J8l47J67m4j70o4J16J44k64L16
3342a3l64J4N7K41k72k1L75k08l67L28O4N2k62L41k19J98j90K31k62K13O6j50
$$ y = [-168, -146, -7, -82, -69, 156, -302, -339, 17, -441, 59, -54, -107, -219, -85, -135, -106, -215, -66, -55, 84, 58, -266, -96, 33, -227, -36, -94, -164, 43, -114, -336, -196, -92, -303, -164, -321, -189, -101, -96, -74, -211, -136, 54, 60, -237, -127, 188, -67, -14, 135, -149, -270, 205, 8, -198, 264, 123, 60, -6, -44, 231, 29, 28, 208, 115, 146, 298, 82, 38, 78, 36, 363, -122, 53, 205, -151, 135, 50, -147, 153, -138, 203, 28, -29, 139, -27, 113, -46, 68, 224, 261, -23, 88, 333, 66, 172, 63, 194, -137, -25, 37, -137, -141, 67, 188, 227, 93, -59, -176, -32, 40, -35, -271, 33, 29, 283, -128, -168, 21, -42, -41, -5, -7, 2, 42, -154, -49, 115, 133, -214, -47, -91, -261, -325, -209, -65, -329, -13, -377, -363, -306, -65, -337, -358, 17, -191, -558, -230, -166, -114, -376, -35, -254, -56, -246, -15, -277, -64, 2, -148]
$$ [...]
8191a43
##END NTUPLES=NMR FID
##END=
