##TITLE=1H_LR-688B-C4-EtOAc
 CDCl3, 8 sc, 
 23.9.2019
##JCAMPDX= 6.0         $$ Bruker NMR JCAMP-DX V2.0
##DATA TYPE= NMR FID
##DATA CLASS= NTUPLES
##ORIGIN= UXNMR, Bruker Analytische Messtechnik GmbH
##OWNER= root
$$ XWIN-NMR		Version 3.5
$$ Mon Sep 23 14:34:48 2019 Russian Standard Time (UT+4h)  she@DPX200
##.OBSERVE FREQUENCY= 200.1315
##.OBSERVE NUCLEUS= ^1H
##.DELAY= (6, 6)
##.ACQUISITION MODE= SIMULTANEOUS
##.ACQUISITION SCHEME= undefined
##.AVERAGES= 8
##.DIGITISER RES= 18
##SPECTROMETER/DATA SYSTEM= spect
##.PULSE SEQUENCE= zg30
##.SOLVENT NAME= CDCl3
##.SHIFT REFERENCE= (INTERNAL, CDCl3, 0, 15.7039)
##AUDIT TRAIL= $$ (NUMBER, WHEN, WHO, WHERE, WHAT)
$$ ##TITLE= Audit trail, XWIN-NMR		Version 3.5
$$ ##JCAMPDX= 5.01
$$ ##ORIGIN= Bruker BioSpin GmbH
$$ ##OWNER= she
$$ F:/spectra/data/she/nmr/H-F/1/audita.txt
$$ ##AUDIT TRAIL=  $$ (NUMBER, WHEN, WHO, WHERE, WHAT)
(   1,<2019-09-23 14:33:27.40 +0400>,<she>,<DPX200>,
      <created by zg, POWCHK disabled, PULCHK disabled
       configuration hash MD5:
       00 E9 B6 7A A2 85 ED C7 34 08 36 98 17 FE 4E 26
       data hash MD5: 16K
       77 37 C4 0C 54 AF 95 77 ED AB 6E 2C 87 02 00 7E>)
$$ ##END=
$$ 
$$ hash MD5
$$ 08 65 20 C6 75 A4 63 36 05 C4 41 81 63 CA C3 A6
##$RELAX= 
##$RELAX= 
##$RELAX= 
##$RELAX= 
##$RELAX= 
##$RELAX= 
$$ Bruker specific parameters
$$ --------------------------
##$DU= <F:/spectra>
##$EXPNO= 1
##$NAME= <H-F>
##$PROCNO= 1
##$TYPE= <nmr>
##$USER= <she>
##$AMP= (0..31)
100 100 100 100 100 100 100 100 100 100 100 100 100 100 100 100 100 100 
100 100 100 100 100 100 100 100 100 100 100 100 100 100 
##$AQSEQ= 0
##$AQ_mod= 1
##$AUNM= <au_zg>
##$AUTOPOS= <>
##$BF1= 200.13
##$BF2= 200.13
##$BF3= 200.13
##$BF4= 200.13
##$BF5= 200.13
##$BF6= 200.13
##$BF7= 200.13
##$BF8= 200.13
##$BYTORDA= 1
##$CFDGTYP= 0
##$CFRGTYP= 5
##$CHEMSTR= <none>
##$CNST= (0..31)
1 1 145 1 1 1 1 1 1 1 1 1 1 1 1 1 1 1 1 1 1 1 1 1 1 1 1 1 1 1 1 1 
##$CPDPRG= <>
##$CPDPRG1= <>
##$CPDPRG2= <>
##$CPDPRG3= <>
##$CPDPRG4= <mlev>
##$CPDPRG5= <mlev>
##$CPDPRG6= <mlev>
##$CPDPRG7= <mlev>
##$CPDPRG8= <mlev>
##$CPDPRGB= <>
##$CPDPRGT= <>
##$D= (0..31)
0 1.2 0 0 0 0 0 0 0 0.06 0 0.03 0 0 0 0 0.0002 0 0 0 0 0 0 0 0 0 0 0 0 
0 0 0 
##$DATE= 1569234806
##$DBL= (0..7)
120 120 120 120 120 120 120 120 
##$DBP= (0..7)
150 150 150 150 150 150 150 150 
##$DBP07= 0
##$DBPNAM0= <>
##$DBPNAM1= <>
##$DBPNAM2= <>
##$DBPNAM3= <>
##$DBPNAM4= <>
##$DBPNAM5= <>
##$DBPNAM6= <>
##$DBPNAM7= <>
##$DBPOAL= (0..7)
0.5 0.5 0.5 0.5 0.5 0.5 0.5 0.5 
##$DBPOFFS= (0..7)
0 0 0 0 0 0 0 0 
##$DE= 6
##$DECBNUC= <off>
##$DECIM= 24
##$DECNUC= <off>
##$DECSTAT= 4
##$DIGMOD= 1
##$DIGTYP= 9
##$DL= (0..7)
0 120 120 120 120 120 120 120 
##$DP= (0..7)
150 150 150 150 150 150 150 150 
##$DP07= 0
##$DPNAME0= <>
##$DPNAME1= <>
##$DPNAME2= <>
##$DPNAME3= <>
##$DPNAME4= <>
##$DPNAME5= <>
##$DPNAME6= <>
##$DPNAME7= <>
##$DPOAL= (0..7)
0.5 0.5 0.5 0.5 0.5 0.5 0.5 0.5 
##$DPOFFS= (0..7)
0 0 0 0 0 0 0 0 
##$DQDMODE= 0
##$DR= 18
##$DS= 0
##$DSLIST= <SSSSSSSSSSSSSSS>
$$ [...]
##$SUBNAM2= <"">
##$SUBNAM3= <"">
##$SUBNAM4= <"">
##$SUBNAM5= <"">
##$SUBNAM6= <"">
##$SUBNAM7= <"">
##$SUBNAM8= <"">
##$SUBNAM9= <"">
##$SW= 24.0689530833862
##$SWIBOX= (0..15)
0 0 2 0 0 0 0 0 0 0 0 0 0 0 0 0 
##$SW_h= 4816.95568400771
##$TD= 16384
##$TD0= 1
##$TE= 0
##$TE2= 300
##$TE3= 300
##$TEG= 300
##$TL= (0..7)
0 120 120 120 120 120 120 120 
##$TP= (0..7)
150 150 150 150 150 150 150 150 
##$TP07= 0
##$TPNAME0= <>
##$TPNAME1= <>
##$TPNAME2= <>
##$TPNAME3= <>
##$TPNAME4= <>
##$TPNAME5= <>
##$TPNAME6= <>
##$TPNAME7= <>
##$TPOAL= (0..7)
0.5 0.5 0.5 0.5 0.5 0.5 0.5 0.5 
##$TPOFFS= (0..7)
0 0 0 0 0 0 0 0 
##$TUNHIN= 0
##$TUNHOUT= 0
##$TUNXOUT= 0
##$USERA1= <user>
##$USERA2= <user>
##$USERA3= <user>
##$USERA4= <user>
##$USERA5= <user>
##$V9= 5
##$VALIST= <valist>
##$VCLIST= <CCCCCCCCCCCCCCC>
##$VD= 0
##$VDLIST= <DDDDDDDDDDDDDDD>
##$VPLIST= <PPPPPPPPPPPPPPP>
##$VTLIST= <TTTTTTTTTTTTTTT>
##$WBST= 1024
##$WBSW= 4
##$XGAIN= (0..3)
0 0 0 0 
##$XL= 0
##$YL= 0
##$YMAX_a= 144947
##$YMIN_a= -138329
##$ZGOPTNS= <>
##$ZL1= 120
##$ZL2= 120
##$ZL3= 120
##$ZL4= 120
##$ABSF1= 10
##$ABSF2= 0
##$ABSG= 5
##$ABSL= 3
##$ALPHA= 0
##$AQORDER= 0
##$ASSFAC= 0
##$ASSFACI= 0
##$ASSFACX= 0
##$ASSWID= 0
##$AUNMP= <proc_1d>
##$AZFE= 0.1
##$AZFW= 0.1
##$BCFW= 1
##$BC_mod= 2
##$BYTORDP= 1
##$COROFFS= 0
##$CY= 11.3945322036743
##$DATMOD= 1
##$DC= 2
##$DFILT= <>
##$DTYPP= 0
##$F1P= 20.1720416913024
##$F2P= 0.152960286110954
##$FCOR= 0.5
##$FTSIZE= 0
##$FT_mod= 4
##$GAMMA= 1
##$GB= 0.15
##$INTBC= 1
##$INTSCL= 1
##$ISEN= 128
##$LB= 0.24
##$LEV0= 0
##$LPBIN= 0
##$MAXI= 10000
##$MC2= 0
##$MEAN= 0
##$ME_mod= 0
##$MI= 1.114404
##$NCOEF= 0
##$NC_proc= 0
##$NLEV= 6
##$NOISF1= 3.799351
##$NOISF2= 2.8
##$NSP= 1
##$NTH_PI= 0
##$NZP= 0
##$OFFSET= 15.70392
##$PC= 1
##$PHC0= -9564.183
##$PHC1= 12.20095
##$PH_mod= 1
##$PKNL= yes
##$PPARMOD= 0
##$PSCAL= 0
##$PSIGN= 0
##$REVERSE= no
##$SF= 200.130013532006
##$SI= 16384
##$SIGF1= 3
##$SIGF2= 2
##$SINO= 400
##$SIOLD= 16384
##$SREGLST= <1H.CDCl3>
##$SSB= 0
##$STSI= 0
##$STSR= 0
##$SW_p= 3612.71676300578
##$SYMM= 0
##$S_DEV= 0
##$TDeff= 0
##$TDoff= 0
##$TI= <>
##$TILT= no
##$TM1= 0
##$TM2= 0
##$TOPLEV= 0
##$USERP1= <user>
##$USERP2= <user>
##$USERP3= <user>
##$USERP4= <user>
##$USERP5= <user>
##$WDW= 1
##$XDIM= 8192
##$YMAX_p= 0
##$YMIN_p= 0
$$ End of Bruker specific parameters
$$ ---------------------------------
##NTUPLES= NMR FID
##VAR_NAME=  TIME,          FID/REAL,        FID/IMAG
##SYMBOL=    X,             R,               I
##VAR_TYPE=  INDEPENDENT,   DEPENDENT,       DEPENDENT
##VAR_FORM=  AFFN,          ASDF,            ASDF
##VAR_DIM=   8192,          8192,            8192
##UNITS=     SECONDS,       ARBITRARY UNITS, ARBITRARY UNITS
##FACTOR=    0.0002076,     1,               1
##FIRST=     0,             0,               0
##LAST=      1.7004516,     0,               0
##MIN=       0,             -138329,         0
##MAX=       1.7004516,     144947,          0
$$ Real data points
##PAGE= N=1
##DATA TABLE= (X++(R..R)), XYDATA
0@%%%%%%%qJ6j6J6k4L2m0M8n6P2q8J01j17J36j56J81k09K41k77L17l62M11m64
$$ 0 0 0 0 0 0 0 0 -8 8 -8 8 -16 16 -24 24 -32 40 -48 53 -64 72 -84 97 -112 129 -148 169 -193 218 -246
30b46N25n90O60p40Q28r23J027j143J268j405J558j726J912k116K342k599K889
$$ -246 279 -311 349 -391 437 -486 541 -602 666 -739 819 -907 1005 -1111 1231 -1368 1521
47A521l212L582m015M520n117N843o750P915r477J1696j5120K1169l5042J23427
$$ 1521 -1691 1891 -2124 2396 -2721 3122 -3628 4287 -5190 6506 -8614 12555 -22487 100940
61A00940M4007j73875K1504r19m2164j073J18568N6241k4839l2562k4717q7349
$$ 100940 144947 -28928 -7424 -8343 -50507 -51580 66988 123229 98390 65828 41111 -46238
73d6238l6321Q1974Q8297k2691k3240L1848k0800j03276k3071Q4660M9906k0726
$$ -46238 -82559 -585 87712 65021 41781 73629 52829 -50447 -73518 11142 61048 40322
85D0322J9440L0871n8775r2972L785N8322K4855K5026M7048j6277q3229m2653
$$ 40322 59762 90633 31858 -61114 -57329 993 25848 50874 97922 81645 -1584 -44237
97d4237R594j8271j996R5050R3742m1701r9599k4591Q542l0357j867P1727N1824
$$ -44237 -34643 -52914 -54910 40140 133882 92181 -7418 -32009 -23467 -53824 -55691 16036 67860
110F7860j9141k5319j6285n4248l7796O0092Q2395l845l8352M199j2943o7935
$$ 67860 48719 23400 7115 -47133 -84929 -24837 57558 53713 15361 19560 6617 -61318
122f1318k1479O7234N0535j0232O468J7427n5375q1399P448O3020K0371O377M1679
$$ -61318 -82797 -15563 34972 24740 31208 48635 -6740 -88139 -80691 -17671 2700 9077 50756
135E0756N448p3200n4964J6237J2034q567M5260P1121j4876p3047j9699J8835
$$ 50756 56204 -16996 -71960 -55723 -43689 -52256 -6996 64125 49249 -23798 -43497 -24662
147b4662k0006j3084N6198N0175k8645m3631k329j2766l2234K4877P1241J7984
$$ -24662 -44668 -57752 -1554 48621 19976 -23655 -25984 -38750 -70984 -46107 25134 43118
159D3118l6682j5892n413m3651k8513M6107N6470K453p948R972k8913o5007j2062
$$ 43118 6436 -9456 -14869 -58520 -87033 -40926 15544 17997 10049 20021 -8892 -73899 -85961
172h5961N0236L2968M086K1265J1111m5205m9762M770K0797L18K0782M5351k322
$$ -85961 -35725 -2757 1329 22594 33705 -11500 -61262 -56492 -35695 -35377 -14595 30756 28434
185B8434n3096k4435J5279n65o011L6476L8706k1400m4076q681q46j6226J4776
$$ 28434 -24662 -49097 -33818 -34383 -40394 -3918 34788 13388 -30688 -39369 -40215 -56441 -41665
198d1665N2703K1426k7104j8317l630k8397k6510L1030N1920P714j3702K744j3571
$$ -41665 11038 32464 5360 -12957 -16587 -44984 -71494 -40464 11456 19170 5468 8212 -5359
211e359m4580j6840L4929L0481K261J0984J1171k9110m1582M48K4236O183P290
$$ -5359 -49939 -66779 -31850 -1369 892 11876 23047 -6063 -47645 -47197 -22961 -16778 -9488
224i488K7302M446l8876k8113R965J1273J654K3094K9005j1811l6800j4040J596
$$ -9488 17814 22260 -16616 -44729 -34764 -23491 -21837 1257 30262 18451 -18349 -32389 -30793
237c0793o605J0036L8934K2187j8398k1174o380j6645j7120K0060M0077J1687
$$ -30793 -37398 -27362 11572 33759 15361 -5813 -12193 -28838 -45958 -25898 14179 25866
249B5866j1768m318r419k8944j2690K4756K5100K943L596P981j8164l2432k153
$$ 25866 14098 9780 361 -28583 -41273 -16517 8583 11526 15122 23103 4939 -27493 -29646
262b9646K3623J1460K880J5555L456k7910k4663P327J4197L379J5056K2808n962
$$ -29646 -6023 5437 8317 23872 27328 -582 -25245 -17918 -3721 -342 14714 37522 31560
275C1560l1650j6196M018K92N995K6890K1690j1350k2196q109p677j1441J0036
$$ 31560 -90 -16286 -12268 -11976 -5981 20909 42599 31249 9053 944 -6733 -18174 -8138
288h138L1205J4802r426q972n978j6708j2534J4931K3987N218k903J009r290k1428
$$ -8138 23067 37869 28443 19471 13493 -3215 -15749 -818 23169 28387 25484 26493 17203 -4225
302d225o757J7484J6253L800L891r23j6806j9459O80J3169R438J0282J2247l579
$$ -4225 -10982 6502 22755 26555 30446 29523 12717 -6742 -6062 7107 16545 26827 39074 35495
316C5495k1854j7838j760N129Q997J7510J4296m395j5974j2104q315n688P635
$$ 35495 13641 -4197 -5957 -828 8169 25679 39975 35580 19606 7502 -813 -6501 1134
329A134J9336J1444l613q050p800j1673n624R783J5070M979k529l325r312j4583
$$ 1134 20470 31914 28301 20251 12451 778 -4846 4937 20007 24986 22457 19132 9820 -4763
343d763k494J3321J3035M404J386l848j5377j5034o51J1291J0340R139Q221l311
$$ -4763 -7257 6064 19099 23503 24889 21041 5664 -9370 -10021 1270 11610 20749 28970 25659
357B5659j7855j5571m155L547P098J3294J1472j320j1401j0078o143l295L842
$$ 25659 7804 -7767 -11922 -8375 -1277 12017 23489 22169 10768 690 -5453 -8748 -4906
370d906J1522P944k284p089o278n313k205P093J1875M990l766p356q363r058j602
$$ -4906 6616 14560 12276 5187 -1091 -6404 -8609 -1516 10359 15349 11583 4227 -4136 -13194 -14796
385a4796R962J3348O560k98n927j2162j2885m027P552J2603R969M852j931r942
$$ -14796 -4834 8514 15074 14776 8849 -3313 -16198 -20225 -12673 -70 9899 14751 12820 2878
399B878j3407p151K638P329P763N622J266n336p844m090K333N407M739K583j572
$$ 2878 -10529 -17680 -15042 -7713 50 5672 6938 1602 -6242 -10332 -7999 -2592 2147 4730 3158
414C158p314q144l428M186Q027P770M630j164p900j1304p480j6P042R651R388
$$ 3158 -4156 -12300 -15728 -11542 -3515 4255 8885 7721 -179 -11483 -18963 -18979 -11937 -2286 7102
429G102K694o048j0459q910l855J997Q045J0015N151j676n319o802n512K45N564
$$ 7102 9796 3748 -6711 -15621 -19476 -17479 -9434 581 5732 4056 -1263 -8065 -13577 -13332 -7768
444g768M914J075j788l923m833j857M015P313N025O37l719p827r611m582M262
$$ -7768 -2854 -1779 -3567 -7490 -12323 -14180 -10165 -2852 2173 2810 -909 -8736 -18347 -22929 -18667
459a8667Q902Q501N064K53o159j0203o970j168M274Q062Q317L108m476o563m870
$$ -18667 -9765 -1264 3800 4053 -2106 -12309 -19279 -20447 -16173 -8111 206 3314 -1162 -7725 -12595
474a2595l166r5N810N666J573k242k248l442k689K936O114K028k556k699l566
$$ -12595 -15761 -15856 -10046 -4380 -2807 -5049 -7297 -10739 -13428 -10492 -4378 -2350 -4906 -7605 -11171
489a1171o353j643O619Q818M256J616l4o669j0737n045L581O393N324P257L354
$$ -11171 -17524 -19167 -12548 -3730 526 2142 2108 -4561 -15298 -20343 -16762 -10369 -5045 2212 5566
504E566n150q009l515m85m54M500Q900K295n716l997P08k073j793N303O078j339
$$ 5566 416 -7593 -11108 -11593 -12047 -7547 1353 3648 -2068 -6065 -5357 -7430 -9223 -3920 2158 819
520H19n864n96l54k302L537R130L896m509l250k028o813n265O715J1002M144l40
$$ 819 -5045 -5641 -5995 -8297 -4760 4370 8266 3757 507 -1521 -8334 -13599 -6884 4118 8262 7922
536G922J810j748r312o691L069N308J605L791M596k597o852j007K156j308M90
$$ 7922 9732 7984 -1328 -8019 -4950 358 1963 5754 10350 7753 901 -106 2050 742 1232
551A232O608K813o239l877K791P09j967M053O400j996o340k343l66j936K991R518
$$ 1232 7840 10653 4414 537 3328 4037 2070 6123 12523 10527 4187 1844 1478 -458 2533 12051
567A2051M196l742k028j636p671p499M966J0134K041j024L857J2r139n244M355
$$ 12051 16247 12505 10477 8841 1170 -6329 -1363 8771 10812 9788 13645 13657 4518 -726 3629
582C629K483k180L149O107m618p501K195N694l344k158P558K180j0112m516P276
$$ 3629 6112 3932 7081 13188 8570 1069 3264 8958 5614 3456 11014 13194 3082 -1434 5842
597E842J758n277L217J0327k339j1892j705L338l879k321J0697Q029o031n124
$$ 5842 7600 2323 5540 15867 13528 1636 -69 3269 -610 -2931 7766 15795 9764 4640
611D640M008l253j1397o45J2205L141n421J920M839n897p455M846N761m854k479
$$ 4640 8648 5395 -6002 -6647 5558 8699 3278 5198 10037 4140 -3315 1531 7292 2438 -41
626d1O897J96q941j593P860J552l812L338K754p753o985O003M137n230J200J1135
$$ -41 6856 7052 -1889 -3482 4378 5930 2118 5456 8210 457 -6528 -525 3612 -1618 -418 10717
642A0717J040j1467m905L736j977l787P684Q288m272m719N257Q9j1496k516J0674
$$ 10717 11757 290 -4615 -879 -2856 -6643 1041 9329 5057 338 5595 5684 -5812 -8328 2346
657B346L335o488R19N526m840o235O553O667p229n346Q345K459j1717l326J0560
$$ 2346 5681 -807 112 5638 798 -5437 1116 7783 554 -4792 3553 6012 -5705 -9031 1529
672A529L746m783J671N027p766r008N812O979o792k570J3111N638j3037p163O537
$$ 1529 5275 492 2163 7190 -576 -9584 -3772 3207 -3585 -6155 6956 12594 -443 -7606 -1069
687a069Q74p764L208J0552k479p588M933N478r377p448R686O969q071m144O236
$$ -1069 -195 -7959 -4751 5801 3322 -4266 667 6145 -3232 -10680 -994 5975 -2096 -6240 -4
702dM2p273M070Q881m447q678N286O113r759p761Q787Q450m001j300N034m189
$$ -4 38 -7235 -3165 5716 1269 -7409 -2123 3990 -5769 -13530 -4743 3707 -294 -1594 3440 -749
718g49r434K550P546n879m928J1265Q557j0648r208P256L710r116m87J0090k42
$$ -749 -10183 -7633 -87 -5966 -10894 371 8928 -1720 -10928 -3672 38 -9078 -9565 525 283
733B83r426L351Q419n912q894Q118Q450q606p518O923L226q096P39J1900l58j1324
$$ 283 -9143 -5792 2627 -3285 -12179 -4061 4389 -4217 -11735 -4812 -1586 -9682 -8943 2957 2599 -8725
749h725K444Q744p580j1602P098J1758l077n172O308J248r402j869P808j552p577
$$ -8725 -6281 2463 -5117 -16719 -9621 2137 -940 -6112 196 1444 -7958 -9827 -2019 -3571 -11148
764a1148O247J1041n801j0308M964Q090p200n533Q368L693q875j128Q445J55p518
$$ -11148 -4901 6140 339 -9969 -5005 3085 -4115 -9648 -1280 2413 -6462 -7590 855 1010 -6508
779f508L547Q579m959q083L550M572o682j290J1103L372r427n28P873l657j1195
$$ -6508 -2961 5618 659 -7424 -3874 698 -5984 -7274 3829 7201 -2226 -2754 5119 1462 -9733
794i733K891J1153j048o126N592M433p373l576O543K93q341L033J0653m026j0611
$$ -9733 -6842 4311 3263 -2863 2729 7162 -211 -3787 2756 3049 -5292 -2259 8394 4368 -6243
809f243N324J0205n904p771P116O230q963o430Q791M370p611J059R327j638j0178
$$ -6243 -919 9286 3382 -4389 2727 8957 -6 -6436 2355 6725 -886 173 9500 7862 -2316
824b316J726O463o176n750R860P971q130n182Q188J924j1385k791J0412J607p389
$$ -2316 -590 5873 -303 -6053 3807 11778 3648 -1534 6654 8578 -2807 -5598 4814 6421 -968
839i68J563P438l528o273M699L923o150k749P112O37q944L83R728m56p463K444
$$ -968 595 8033 4505 -1768 2931 6854 704 -2045 5067 5704 -3240 -2857 6871 6415 -1048 1396
855A396O239m366p664L200N637l749j573P310Q49p137j334M752l291o264N690
$$ 1396 7635 3269 -4395 -1195 4442 693 -880 6430 7279 142 -1192 3560 269 -5995 -305
870c05P543m173n247N309L270p462l519O763J835o220M51N946k079n446L860N499
$$ -305 7238 3065 -2182 3127 6397 -1065 -4584 2179 4014 -2206 -1755 4191 2112 -3334 526 6025
886F025m117m729M947J746o976j669Q022K064o441J026N933k744p865K144N830
$$ 6025 1908 -2821 2126 3872 -3104 -4773 3249 5313 -1128 -102 5831 3087 -4778 -2634 3196
901C196l093k995O000L266n758l198N118m02o367J193P191j187m813L026M520
$$ 3196 103 -2892 3108 6374 616 -2582 2536 2134 -4233 -3040 4151 2964 -1849 1177 5697
916E697m298m713M504L107m856k274N036O72m918J265N759o78n309J606K753m633
$$ 5697 1399 -3314 1190 4297 -559 -2833 2203 2875 -2043 -778 4981 4303 -1006 600 3353 -1280
932a280l516N131L662l142p57M253k48o566o79M385o9l146K855L917l051l318
$$ -1280 -4796 335 3997 855 98 4351 4103 -2463 -3142 1243 1174 -1972 883 4800 1749 -1569
948a569K840J558m565j679M943O97m199Q12M478j062l838J827K519l677k618K454
$$ -1569 1271 2829 -1736 -3415 1528 2225 -1974 -1162 3316 2254 -1584 243 2762 -915 -3533 -1079
964a079J589k977k88M550Q05l263l78J890k661l469K044L552j116j166K965J061
$$ -1079 510 -2467 -2755 1795 2600 -663 -1041 849 -1812 -5281 -3237 315 -801 -1967 998 2059
980B059l711k660K473L26k313R54L637j146k543J419J952k949j690K258M64k762
$$ 2059 -1652 -4312 -1839 -1513 -3826 -2872 765 -381 -2924 -1505 447 -2502 -4192 -1934 -1470 -4232
996d232m51K734O95j545J423K037k090k863J89J164j782n4L449J838j735q50J612
$$ -4232 -4683 -1949 -1254 -2799 -1376 661 -1429 -4292 -4103 -2939 -4721 -4775 -1326 512 -1223 -2073 -461
1013d61j337l139N06K675o40j003K431K089k288j961J632J72k130o27K460L18
$$ -461 -1798 -4937 -4431 -1756 -2396 -3399 -968 1121 -1167 -3128 -1496 -1324 -3454 -4081 -1621 -1303
1029a303j395J255K072n59j516K55P81j845j773J634J980p07O79K443J41k167
$$ -1303 -2698 -1443 629 70 -1446 -1191 -410 -2255 -4028 -2394 -414 -1121 -442 2001 2142 -25
1045b5r73M18j442r35J614K672J5m70Q62l25k130n58J379R2r89Q67J682k52q16
$$ -25 -998 -580 -2022 -2957 -1343 1329 1344 874 1736 1411 -719 -1277 102 194 -795 72 1754 1502 686
1064F86N57Q77r36j452K61R5l43O99J637P44N2k66m57r30j492k60N46N43O49J203
$$ 686 1243 2120 1184 -268 -7 88 -255 444 2081 2825 2877 2611 2154 1224 -268 -528 18 561 1210 2413
1084B413R88m92o60j127n75r16K83P27M49J011Q38k16j191j74n38J51q54K27K44
$$ 2413 3401 2909 2249 1122 547 -369 -86 641 1090 2101 2939 2723 1532 1358 820 971 117 344 588
1103E88J35K55N44Q38j69q62m42j069q96L5R17J478P00l7r7o35j318q49k99O07
$$ 588 723 978 1522 2360 2191 1329 887 -182 -1078 -1043 -126 1352 2052 2015 1918 1283 -35 -884 -1183 -576
1123e76O1R35P17K88r2k01n50o83m23j89J3K99Q57L51N42n31kl52k49o47o44K00
$$ -576 -515 420 1137 1425 1333 1132 582 -101 -524 -713 -700 -401 456 807 1349 818 816 464 215 -432 -1076 -876
1145h76R07Q9P26R84k5o07r54n82r65k95Q69J384O30J81M01j87j459q80K54O67
$$ -876 31 120 846 1830 1805 1198 244 -338 -1303 -1598 -729 655 1285 1466 1867 1680 221 -659 -405 262
1165B62o69J4J381P20o77j2J77k12q24l56K38m7mQ88R92k01k15K46o16j265n55
$$ 262 -407 -393 988 1708 1031 1019 1196 984 160 -196 42 -5 -9 879 1871 1670 1455 1701 1085 -180 -735
1186g35N44O06M3O97R74J00j037n19k90n81j95R17K07J93M79L96o11n97m6K74
$$ -735 -191 415 458 1155 2129 2229 1192 673 383 -198 -393 524 731 924 1403 1799 1188 591 545 819
1206H19q39r84J046P71m21K78N88M2r57j18P0q84o15R69O73k37K47J022n55j504
$$ 819 -20 -1004 42 813 392 670 1258 1300 343 225 295 -589 -1204 -235 438 201 448 1470 915 -589
1226e89n42Q5O5k91K20J447M7j020M80k58q44m42M64N01o19J9J327o34q47L00
$$ -589 -1131 -1046 -981 -1272 -1052 395 442 -578 -98 -356 -1200 -1642 -1178 -677 -1296 -1277 50 -584 -1431 -1131
1246a131R64q54j265M91Q45p07k30J246K52o08k40J62q15q43J398K19q29M8J407
$$ -1131 -167 -1021 -2286 -1795 -950 -1657 -1887 -641 -389 -997 -1237 -1075 -1890 -2733 -1335 -1116 -1945 -1897 -490
1265d90L55j326n51N60l7r02P29J050k80o04J117J74j066r13J454J06j149p0K123
$$ -490 -135 -1461 -2012 -1452 -1489 -2391 -1662 -612 -892 -1496 -379 -205 -1271 -2184 -730 -624 -1773 -1843 280
1284B80r22j039P91J510j162j760R33J384o38j069J362J072n16p78R52p44j362
$$ 280 -642 -1681 -890 620 -542 -2302 -1369 15 -623 -1692 -330 742 226 -552 400 -344 -1706
1301a706J152J223j008l06J445J323j797j420J018N50o32P6Q14k02l54P06P32
$$ -1706 -554 669 -339 -645 800 2123 326 -1094 -76 474 -158 -82 732 530 176 882 1614
1318A614j196p47P49O96j092q54J748M09r78M44J219j387j373Q06J156q34l30
$$ 1614 418 -329 420 1116 24 -830 918 1327 349 793 2012 625 -748 58 1214 380 50
1335E0Q07P27p20M70M3j082j261J345J119j719n02K175J283j798j113R32L23j750
$$ 50 857 1584 864 1334 1377 295 -966 379 1498 -221 -723 1452 2735 937 -176 756 1079 -671
1353f71J37J160n59o90J667J200j588j788J470Q55j790j167K083O86j505N73J923
$$ -671 -534 626 67 -623 1044 2244 656 -1132 338 1193 -597 -1764 319 1005 -500 73 1996
1370A996r48k501P44J650j366j930J404K129o08l26Q43l07k047j40J653o23j879
$$ 1996 1048 -1453 -709 941 -425 -2355 -951 1178 570 244 1087 780 -1267 -1407 246 -377 -2256
1387b256J366K560p08j555O10J019j433q20O60K71j072P44J866k58j111N96P94
$$ -2256 -890 1670 962 -593 17 1036 -397 -1217 -557 -286 -1358 -614 1252 994 -117 479 1273
1404A273j818j247J133J008j105L16K105l63j701LJ621p68k489J075J713l35k92
$$ 1273 -545 -1792 -659 349 -756 -440 1665 1302 -399 -396 1225 457 -2032 -957 756 421 129
1421A29J598N7j539k94J400r62k223J276K464o25j420J062J612j738j255J488
$$ 129 1727 1784 245 -49 1351 389 -1834 -558 1906 1281 -139 923 2535 797 -458 1030
1437A030M7j847O6K291K08j318P97J787j458k251J000Q66j706k52K142J041j743
$$ 1030 1077 -770 -704 1587 1795 477 1274 3061 1603 -648 352 1218 -488 -740 1402 2443 700
1454G00j48J875p14k523K75J827p31j420J448J594r79q09J104J34k619k2J433
$$ 700 552 2427 1713 -810 -535 1292 561 -859 589 2183 1204 395 1499 1633 -986 -1008 425
1471D25M4j533J205K056r16j511Q82M87k028r66J757L95j094N88J831m35j934
$$ 425 469 -1064 141 2197 1281 -230 652 1139 -889 -1855 -98 297 -797 -209 1622 1187 -747
1488g47L13R20j504j472K183J120j736j38K217l08k370o2J578o15j973Q89K060
$$ -747 -434 486 -1018 -2490 -307 813 -923 -1061 1156 848 -1522 -1584 -6 -621 -2594 -1705 355
1505C55q80j199J789J049k051j268J273J78j952L34K837m07j595J030J384j337
$$ 355 -525 -1724 65 1114 -937 -2205 -932 -754 -2706 -2372 465 58 -1537 -507 877 -460
1521d60j840Q19J047j271l21J864Q65j613J75R99q71j600K90J621j140m49J939
$$ -460 -2300 -1481 -434 -1705 -2026 -162 703 -910 -735 264 -607 -2207 -1917 -296 -1436 -1885 54
1538E4Q82j602m24J492j80j984J32J320o2r24J233J401r73j329J219l4j950L33
$$ 54 936 -666 -1090 402 222 -1762 -1630 -310 -372 -1296 -63 1338 365 -964 255 221 -1729 -1396
1556a396J700J64j150Q99J821r91j767M25J265j460p73J668Q78j234n5J689m18
$$ -1396 304 468 -682 217 2038 1047 -720 -295 970 -490 -1263 405 1283 49 -6 1683 1265
1573A265j545K29J103q58j413J499J570j067r23J379O62k032p74J483K69j955
$$ 1265 -280 -51 1052 194 -1219 280 1850 783 -140 1239 1901 -131 -905 578 847 -1108
1589a108R00J882m54j225P13Q35j348j350J328Q55j493q5J920L36j675q3J080
$$ -1108 -208 1674 1220 -5 708 1543 195 -1155 173 1028 -465 -550 1370 1706 31 -52 1028
1606A028n31j850O42J125n64o84J320M91q22l76J047l35j239j84J057r9r29R22
$$ 1028 497 -1353 -711 414 -150 -834 486 977 155 -221 826 491 -748 -932 125 26 -903 19
1624A9R62j087q50O72N27j413q2J477j87n60N59N98q44r51R84L58j026n24J342
$$ 19 981 -106 -956 -284 243 -1170 -1252 225 38 -522 37 635 -209 -1160 -176 182 -844 -1368 -26
1643b6N18j020R7Q29j17j175J35O71m09n68R06Q11q37l93Q98K12j107o18J322
$$ -26 492 -528 -431 398 281 -894 -759 -88 -497 -1065 -159 652 -185 -578 320 532 -575 -1193 129
1662A29j57o22O67Q75l02q69N15L95j188q0J068J00m40l9R37j83r00J52P61p04
$$ 129 -28 -650 17 892 590 -279 236 631 -557 -637 431 531 91 52 989 806 -94 58 819 115
1682A15m34O91P90m20p57J012M71j113m23Q52k20q22R81N63k42o13O16K02p80
$$ 115 -319 372 1162 742 -15 997 1468 355 -68 784 564 -258 723 1286 1044 431 1047 1249 469
1701D69k95M40L03n51p1J079m09o15L67K44m94o76K79P81p9k81L15P5p41m6P36
$$ 469 174 614 917 366 295 1374 965 350 717 961 467 -209 70 851 772 491 806 881 140 94 830
1722H30k82q55M88M67j15m35N94Q7n28l46L20j65m44j47Q00J33o32M73K50n38
$$ 830 548 -307 181 648 533 98 692 779 251 -95 225 60 -384 -531 269 402 -230 243 493 -45
1742d5p50K36L34n18M4P24K30l70nK1l29k42n2j4K36J09J78K12l35k67M33n01
$$ -45 -795 -559 -225 -743 -699 25 255 -115 -120 -99 -428 -670 -722 -736 -500 -391 -213 -1 -336 -603 -170 -671
1764f71o32J64K24J43r5M59K35j69j59P6k46l25j13L55R5L46K02q4j68l58j7K96
$$ -671 -1303 -1139 -915 -772 -867 -408 -173 -342 -501 -425 -671 -996 -1109 -754 -659 -313 -111 -195 -363 -721 -738 -442
1786d42l17N0K09K65L82l47K13J96m34j94n6K4k5L14L61j47L9o2N8o02L86l03
$$ -442 -759 -709 -500 -235 147 -200 13 209 -225 -419 -475 -451 -476 -162 199 52 91 29 87 -515 -129 -432
1808d32K03q2M75M39J23j07l78J23l66l5k26J61K19L48Q9R4o7m39J38k62k03J32
$$ -432 -229 -311 164 603 726 619 241 364 -2 -37 -263 -102 117 465 554 648 581 142 280 18 -185 -53
1830e3K04L19pm9L41J30j56m87k39m3M2J21J93K74J66l70K3K4n59L0l9J59Q8K97
$$ -53 151 470 463 414 755 885 729 242 3 -40 2 123 316 590 756 386 409 433 -126 -96 -135 24 112 409
1854D09K25l57J09k58j5l62m69L14J72M73l92M96j75N5m65kj22k31K94k17M74
$$ 409 634 277 386 128 113 -249 -718 -404 -232 241 -151 345 170 225 -240 -242 -364 -595 -301 -518 -44
1875d4n0L34J8l54j80k51j43l20N12K55O8j8M47l53o05P9j5j07l11O44L46j10
$$ -44 -94 240 258 -96 -276 -527 -670 -990 -478 -223 -155 -173 274 -79 -684 -605 -620 -727 -1038 -394 -48 -158
1897a58K5J98j44l74o9j77J27Kj88O44L29k63L29j95n32o09Q16m0k20J38M75K63
$$ -158 -133 65 -79 -453 -522 -699 -572 -570 -758 -114 215 -48 281 86 -446 -1055 -239 -279 -499 -361 114 377
1919C77r6l02L25n25j33p5L74j4R3L80J36j02m87L00P4o36K9M01N55m21J63N35
$$ 377 281 -21 304 -221 -354 -429 -55 -69 24 404 540 438 -49 251 325 -311 -282 119 674 253 416 951
1941I51k59l93J28j72m2j78L52J05M1J72J33l68l38J88K63m21o5R0L37J77J4Q4
$$ 951 692 299 427 255 213 35 387 492 533 705 838 470 132 320 583 162 97 187 524 701 715 799
1963G99J97r13J73J16l19K4K89N95l18k79M18l43n61j3K29J75l52K82M28l20j03
$$ 799 996 83 256 372 53 77 366 961 643 364 782 439 -122 -135 94 269 -83 199 627 307 204
1984B04J7J2k60n18L17J9J24J49K91m23l17j15N74m19n99M42K27J80m35M59O0
$$ 204 221 233 -27 -545 -228 -209 -85 64 355 -68 -385 -500 74 -345 -944 -502 -275 -95 -530 -71 -11
2005a1n22j10L44m11m50O51K72L3m73O32J4m39j70K78j6q21P74J06R3m7J39J73
$$ -11 -533 -643 -299 -710 -1160 -509 -237 -204 -677 -45 -31 -470 -640 -362 -378 -1199 -425 -319 -226 -273 -134 39
2027C9m44p2K0J37l76J76O56k12k22K9O92o78m85M28nj41r9M78K33l75K62R2m35
$$ 39 -405 -477 -457 -320 -696 -520 136 -76 -298 -269 423 -255 -740 -312 -317 -458 -557 -79 154 -221 41 133 -302
2050c02k74J6P41l60QL21O04o96l61J32L85n34J73M42kj57N2P61n99j74Q5o3r1
$$ -302 -576 -560 181 -179 -171 150 754 58 -303 -171 214 -320 -147 295 293 136 188 949 350 176 261 198 107
2073A07l7M27J6k09k05Q56j74o15l04M44K73m28L45M4K8j29L00j97m46N7R8J35
$$ 107 70 497 513 304 99 955 781 166 -138 306 579 151 496 540 568 439 739 542 96 153 251 386
2095C86k51J56L88p5l35K90l22n01K61L62O8n94M60K68l64pM48l96p10k53Q42
$$ 386 135 291 679 604 269 559 237 -264 -3 359 427 -167 293 561 197 190 638 242 -468 -721 121
2116A21m4l18L40K88k69l30k02L50n6n94M46M02k82j99N44j46k69l83N50j27p40
$$ 121 77 -241 99 387 118 -212 -414 -64 -120 -714 -268 134 -148 -347 197 51 -218 -601 -51 -178 -918
2137i18M86N40j92l23L40L5j76n30M78j99j70M5N10J21m98L34l6k14k81L64K2
$$ -918 -432 108 -84 -407 -67 -32 -208 -738 -260 -459 -629 -584 -74 47 -451 -117 -153 -367 -648 -284 -262
2158b62j9m15P96m1k82k0L76k73m72M15j20K50k54K27K75k65LK20j86k60j26O67
$$ -262 -281 -696 100 59 -223 -243 133 -140 -612 -197 -317 -67 -321 -94 181 -84 -81 139 -47 -307 -433 234
2180B34J59n36M92K57k07m73j64J33k7j4M44K42k81J69J03k68q6l1K2k01k4O89
$$ 234 393 -143 349 606 399 -74 -238 -105 -132 -146 298 540 259 428 531 263 177 146 168 -33 -57 632
2202F32K01m53k59M21J96m79n11P29j7n75O93j27j2oJ50jm13l02L67J21m09K40
$$ 632 833 380 121 542 738 259 -252 477 460 -115 578 451 439 433 583 582 169 -133 234 355 -54 186
2224A86Q18k07q13J02L62o41O3J25K07l09M13n5l04J1P2J27m83l31L45N37j15
$$ 186 1004 797 -16 86 448 -193 -130 -5 202 -107 306 251 -53 -42 30 157 -326 -657 -312 225 110
2245A10m26L32M45q19m0J45K84m24k1N15m5l04J29L66k30r11L23L26m85J65N90
$$ 110 -316 16 461 -358 -398 -253 31 -393 -414 101 56 -248 -119 247 17 -894 -571 -245 -730 -565 25
2266B5l00k5k1K29l31l82L48J35m50L0P92r9m45J99J40l06l97O02O0k1m80N98
$$ 25 -275 -300 -321 -92 -423 -805 -457 -322 -772 -742 50 -49 -494 -295 -155 -461 -858 -256 -196 -217 -697 -99
2288i9j70Q2l66M19p7k31j55L55P3k36M32O2N0k55K32J8o58J36P02j84k8r9M11
$$ -99 -269 -187 -553 -134 -211 -442 -597 -242 -169 -405 27 89 139 -116 116 134 -524 -388 314 130 102 3 414
2311D14j5k45j19K97j76j87O54q4l85M2k7J05l43J5J46Q7k99P59J58k52l06J87
$$ 414 399 154 35 332 156 -31 623 539 154 196 169 274 -69 -54 92 179 -120 639 797 545 239 426
2333D26Q5n51k16N45J64j25l8K19Oj88k16K15k64j69M01N2k10K12M7p4j91J8j40
$$ 426 511 -40 -256 289 453 328 290 509 515 327 111 326 62 -107 294 346 136 348 395 321 130 148 8
2356Hj38K37l62P26l73q1n3L12l85K45k67L0R8l89K56M21k21l4j46j13p0J30R1
$$ 8 -130 107 -255 471 98 17 -36 276 -109 136 -131 -101 -3 -392 -136 285 64 30 -116 -229 -299 -169 -78
2379g8j73J81J58l60M9J93l00k6Q7O9P9l82K45JK07k21J2J71j49Lm15K40j5K47
$$ -78 -251 -70 88 -272 -223 -30 -330 -356 -269 -200 -121 -503 -258 -257 -50 -271 -259 -88 -237 -234 -649 -409 -424 -177
2403a77Q2L39k13j35M4l74K92m92P0N92k72O2J38n5k0j22K33j78j38L44J97k76
$$ -177 -95 244 31 -104 -60 -434 -142 -634 -564 28 -244 -182 -44 -99 -119 -241 -8 -186 -324 20 217 -59
2425e9J63K03j90m13M10j42k34M38p6J78K16m55M70m28j52L9k8K83j16L30o4K29
$$ -59 104 307 117 -296 114 -28 -262 176 100 278 494 39 509 81 -71 -32 -60 223 107 437 373 602
2447F02k35j17L26o16N0K49J80l36J34M41k00j26j62J34o6oj25J68J4nP8J02m39
$$ 602 367 250 576 -40 10 259 439 103 237 678 478 352 190 324 258 252 127 295 309 304 382 484 45
2470D5L01K4l50J30n1J00j07K99p0J3M2j71l36k09L90K16k16O9J7L51k87p0k93
$$ 45 346 370 20 150 99 199 92 391 321 334 376 205 -131 -340 50 266 50 119 136 487 200 130 -163
2493a63J21M3j87QM62j2MJ70n11K03m20M8j74K63j86R7K01k72R5j58Q4K22m61
$$ -163 -42 1 -186 -178 284 272 276 446 -65 138 -282 -234 -408 -145 -331 -234 -33 -305 -210 -368 -284 -62 -523
2516e23Q6J06k0K19L6j7k37nn2k3Pn7K39R4L87m92K15k27L17n87L77n0l12J24
$$ -523 -437 -331 -351 -132 -96 -113 -350 -355 -407 -430 -423 -480 -241 -147 240 -252 -37 -264 53 -534 -157 -207 -519 -395
2540c95O0Q0J42P5l26K09l99R9K70Q8K5P6J00J77m11J08l2k03M2J11K70K4J84
$$ -395 -335 -255 -113 -38 -364 -155 -554 -455 -185 -97 -72 4 104 281 -130 -22 -54 -257 -215 -104 166 190 374
2563C74Q2j73l56M5L11l46k12K44O9J96O9R1l44j7K94j74l61K9M29j57k9o2K11
$$ 374 456 283 -73 -28 283 -63 -275 -31 38 234 303 394 50 33 327 153 -208 -179 250 93 64 2 213
2586B13K69m93J80PQl61J78M91q5%P4k82k41j02J20J63k61K29J36j12r7J27K1
$$ 213 482 -11 169 176 184 -177 1 492 407 407 481 199 -42 -144 -24 139 -122 107 243 131 34 161 182
2609A82j37k76K5J09P1M14l28N8j54K1j87K58l25K43J96k99N0j45K13k37M29n63
$$ 182 45 -231 -206 -97 -26 388 60 118 -36 -15 -202 56 -269 -26 170 -129 -79 -224 -11 -248 181 -382
2631c82K13l3j08O4L0j13L62M0o89L35k12K02l02J58K48o4p9l3r9Q4M4k3J7k2
$$ -382 -169 -202 -310 -246 -216 -329 33 73 -616 -281 -493 -291 -593 -435 -187 -251 -330 -363 -462 -378 -334 -357 -340 -362
2655c62r4N11k75j03J72k7j65n7J67k16R7K49j10K19Nj72K65j11n73J30K59J80
$$ -362 -456 55 -220 -323 -151 -178 -343 -400 -233 -449 -352 -103 -213 6 11 -161 104 -7 -580 -450 -191 -11
2677a1l8J07j68l27N79N3k08j77K0L20J5r8J47J57Lk32j05J55m29L80L18k32k60
$$ -11 -49 58 -110 -437 142 195 -13 -190 -170 150 165 67 214 371 374 142 37 192 -237 143 461 229 -31
2700c1L05J64L3j16m29L32j82J05L60j91l24M48Q9j30j19k67P18l58K5mj05O7
$$ -31 274 438 471 355 -74 258 76 181 541 350 26 474 563 433 314 47 765 407 432 428 323 390
2722C90Q2k65L23p73N90J29j46j06J26J6p6L72n41K66k63l1k76K43j53M23o5j46
$$ 390 472 207 530 -243 347 476 330 224 350 366 290 662 121 387 124 93 -183 60 -93 330 265 119
2744A19j61J99N5m09M82k58K07l74J14J66k51M9Po4O9o2L1j41L49l25L15j10r2
$$ 119 -42 157 212 -197 285 27 234 -140 -26 140 -111 -62 -55 -119 -50 -112 -81 -222 127 -198 117 7 -85
2767h5j69J26k02J12k33M42j92N5L6m6j88J7K60o7J11r5J39k83k15M11o0n5n3
$$ -85 -254 -128 -330 -218 -451 -9 -201 -146 -110 -156 -344 -327 -67 -134 -23 -118 21 -262 -477 -66 -126 -181 -234
2790b34j41O22j98j46jkR8j41K11j06k27l6L61L8n36N05L83n24J2N1J72k09j54
$$ -234 -375 247 49 -97 -98 -100 -2 -143 68 -38 -265 -301 60 98 -438 67 450 -74 -62 -11 161 -48 -202
2813b02K76R3k4k60N65r0l98L53N4q0j41j11K62rk05J84j75j95L73k06j18K33
$$ -202 74 167 143 -117 448 358 -40 313 367 287 146 35 297 288 83 267 92 -103 270 64 -54 179
2835A79Mq2L02j89L88k72l41N3K91l64K74k52M88r8m55J36J32j57L2j41J60J47
$$ 179 183 101 403 214 602 330 -11 42 333 -31 243 -9 479 381 -74 62 194 37 69 -72 88 235
2857B35q4J18l56N6J53j79r1k5M04o0l90K24K58k79o1R1l42J66J95n95Q31r8k26
$$ 235 151 269 -87 -31 122 -57 -148 -173 231 171 -219 5 263 -16 -77 14 -328 -162 33 -562 269 171 -55
2880e5K6j65k38K38l3j14j52QK19J52n8k22K83k86j1L5R4P2m15O52j86j35r5j6
$$ -55 -29 -194 -432 -194 -227 -341 -493 -485 -266 -114 -172 -394 -111 -397 -408 -373 -279 -207 -622 30 -156 -291 -386 -402
2904d02j66K68j85j31M44k60K8N20k22k93l3J05K1q8j09L41j23J02K45p1k47J2
$$ -402 -568 -300 -485 -616 -172 -432 -404 116 -106 -399 -432 -327 -306 -394 -503 -162 -285 -183 62 -9 -256 -244
2926b44L2j36j0L26J23l22L68k05J16j06J92m45Q3L45k44J63L3j65O29n24k64
$$ -244 -212 -348 -358 -32 91 -231 137 -68 48 -58 134 -311 -228 117 -127 36 69 -96 533 9 -255
2947b55L98j45m1OO5J73K97k99oK21l06l14K54J88l51K87M16k60k04L54m06m6
$$ -255 143 -2 -43 -37 28 201 498 199 193 414 108 -206 48 236 -115 172 588 328 124 478 72 26
2969B6k7m4R5kJ73K36k67N05j67L1m99J53J3pP9l3m0K75l75J16o2k37K36j83K14
$$ 26 -1 -45 50 48 221 457 190 695 528 559 60 213 226 219 298 265 225 500 125 241 179 -58 178 -5 209
2994B09j00K1M52n00R6p0k39Q1l5J64p7j57K28L39k35p1j77j79J99l7O6P0oK02
$$ 209 109 130 582 82 178 108 -131 -50 -85 79 2 -155 73 412 177 106 -71 -250 -51 -88 -22 48 42 244
3018B44q8r1M9J52j10j73m9J21k82K29j56J44o1K4p5K15k70K92k56J79K31jm30
$$ 244 156 65 114 266 156 -17 -66 55 -227 2 -154 -10 -71 -47 -122 93 -177 115 -141 38 269 268 -162
3041a62K91j82nq4K42L3j55j10J84R1l14J87m4Qj09q0L20k48L06K34k64j6M3k68
$$ -162 129 -53 -58 -142 100 133 -22 -132 52 143 -171 16 -28 -20 -129 -209 111 -137 169 403 139 123 166 -102
3065a02M51m04N73l21J09Q8k51M4k25L62l01M5J29J6J9J21j97L2r1o0P4K13K2
$$ -102 349 -55 518 197 306 394 143 187 -38 324 23 68 197 213 232 353 156 188 97 37 111 324 346
3088C46k66K87k02J32p7k92M40m10K62j18rl1J03J42j41J69k91J68k52K26J81
$$ 346 80 367 165 297 220 -72 368 -42 220 102 93 62 165 307 166 335 44 212 -40 186 367
3109C67l97j13q5K08p8l8N1j63J68m0M0mQ9j73J9J10K8l18J92PPL60m92J45j36
$$ 367 -30 -143 -228 -20 -98 -136 -85 -248 -80 -120 -80 -84 5 -168 -149 -39 -11 -329 -137 -130 -123 237 -255 -110 -246
3134b46M3J50k9O5k42j22O3K24k2J3k71K86j84j46J65j63L30k42k36K62L36k69
$$ -246 -203 -53 -82 -17 -259 -381 -318 -94 -116 -103 -374 -88 -272 -418 -253 -416 -86 -328 -564 -302 34 -235
3156b35Q1J50n1m27J95j26J63K12j93K82m35K17k48J68J04m7K2K15n43N66l07
$$ -235 -154 -4 -55 -482 -287 -413 -250 -38 -231 51 -384 -167 -415 -247 -143 -190 -168 47 -496 70 -237
3177b37j37m9K48r8R6j41n4r3M27j68K64j16J01j25J68k18J7k27M06J31j48j77
$$ -237 -374 -423 -175 -273 -177 -318 -372 -465 -38 -206 58 -58 43 -82 86 -132 -115 -342 64 195 47 -130
3199a30p8Q1J40J25l52K16K28r5Q3J1j56L1n0J17o1M2j14j56J09nK95k39R2J95
$$ -130 -208 -127 13 138 -214 2 230 135 218 229 73 104 54 171 110 152 38 -118 -9 -14 281 42 134 329
3223C29l23l5K37L6n1j32k00J81k9K27k3r0Rj74K81m2Op7k69j7J03J63l03K81
$$ 329 6 -29 208 244 193 61 -139 42 13 240 217 127 136 -38 243 201 207 130 -139 -156 -53 110 -193 88
3247H8j86M9k9o0L7L65k71j96L49K7j99R6qJ04l63Q5j51L08OJ28k07J12J7k24
$$ 88 -98 -49 -78 -138 -101 264 -7 -203 146 173 -26 70 62 166 -197 -112 -263 45 51 179 -28 84 101 -123
3271a23K92l44n3PJ03M6K16k67J04J96r8q8L55n13k22J93M7J90j18M40j48k02
$$ -123 169 -175 -228 -221 -118 -72 144 -123 -19 177 79 -9 346 -167 -389 -196 -149 41 -77 363 215 13
3293A3K20m73K4J2P8M67n58K09j52j2O09n58J01k1L11n37M59l30J50j04J40J00
$$ 13 233 -240 -216 -204 -126 341 -217 -8 -160 -172 437 -121 -20 -41 270 -267 192 -138 12 -92 48 148
3315A48K2k8K9J18l35nPK12L63J61p54KL03r2j72J09K90k06k04K64j63J08qL35
$$ 148 170 142 171 289 -46 -51 -44 168 531 692 -62 -60 243 151 -21 88 378 172 -32 232 69 177 169 504
3339E04j74j21k15P87n75l20M64p5O2j24j11J26j32j88J61N6K42K6j82J01j77
$$ 504 330 209 -6 781 206 -114 350 275 337 213 102 228 96 -92 69 125 367 393 211 312 135
3360A35j27j11K40l8j6K81Q9j82J5j69p0l5j22M23l17J73R9j77K58l74j59J36
$$ 135 8 -103 137 99 83 364 453 271 286 117 47 12 -110 313 -4 169 268 91 349 -25 -184 -48
3382d8O1j2k00pj27L80O3p0J18m89N3R0l42L00J10n7j19K16k1n7p2L11l29Q8l9
$$ -48 13 1 -199 -206 -333 47 110 40 158 -331 -278 -188 -530 -230 -120 -177 -296 -80 -101 -158 -230 81 -248 -160 -199
3407a99K27l80K36O1k29j19J07k07J18N7j10J19P8R8j71q6J23K96p5J7k24K74
$$ -199 28 -352 -116 -55 -284 -403 -296 -503 -385 -328 -438 -319 -241 -143 -314 -400 -277 19 -56 -39 -263 11
3429A1k79K94l92J60M2k90L21n0j12kJ85N8k7j16J64q7k01L21j48j6j16K95J11
$$ 11 -268 26 -366 -206 -164 -454 -133 -183 -295 -297 -112 -54 -81 -197 -33 -120 -321 0 -148 -164 -280 15 126
3452A26m26K67J06p1Q8K4k9k16K67k12K03k58K22K38j54R0l74J14K57r6J50j15
$$ 126 -300 -33 73 2 90 114 85 -131 136 -76 127 -131 91 329 175 265 -109 5 262 166 316 201
3474B01r5P6k34J08K5o1j1K23J6l98J33K88k63O8M8k07J96j65k8Q2J17j13Qk14
$$ 201 106 182 -52 56 81 20 9 232 248 -150 -17 271 8 76 124 -83 113 -52 -80 2 119 6 14 -200
3498b00R5j61M45k49R1j71k5J83o5L23l5l21K12n7m37L11o8M07k62l81M84q1j23
$$ -200 -105 -266 179 -70 21 -150 -175 8 -57 266 231 -90 122 65 -372 -61 -129 278 16 -365 119 38 -85
3521h5nj2k62K41R6Kj06j44J27j9r2K06k81K77l83M60J35l20k16J30M8J51j86
$$ -85 -90 -102 -364 -123 -27 -25 -131 -275 -148 -167 -259 -53 -334 -57 -440 20 155 -165 -381 -251 -203 -52 -238
3544b38J67l6qJ98K75m03j00Q9k4o1J38K15m76M02l4n41K98J56P3K5N6j54N2l
$$ -238 -71 -107 -115 83 358 -45 -145 -56 -80 -141 -3 212 -264 138 104 -437 -139 17 90 115 171 17 69 66
3568F6Qn48N19k6q4P0n2J95K5J29j52J99l52j73K89J79o5j38J89l4K49j42k11
$$ 66 74 -474 45 19 -65 5 -47 148 173 302 150 349 -3 -176 113 292 227 89 278 244 493 351 140
3591A40K25k46L57m8m28K32J27q5J18m26J74j07M19m93J04l4L1rK44j70J70k8
$$ 140 365 119 476 428 0 232 359 274 392 -34 140 33 452 -41 63 29 60 51 295 125 295 267
3613B67l56L3J70K8o3J55j00L8N0k53J22K64n01L40j76K46Q9k81O8L6k60O2L00
$$ 267 -89 -56 114 142 79 234 134 172 222 -31 91 355 -146 194 18 264 353 72 140 176 -84 -22 278
3636B78n34q0L47n9K98k38J8k03J45J41j53m21K16K12L6q5J19O2l61L07k85M64
$$ 278 -256 -336 11 -48 250 12 30 -173 -28 113 -40 -461 -245 -33 3 -82 37 99 -262 45 -240 224
3658B24m00L6J91n36M60k01J15K59k43N7o29L38L00J15q8j13R8j88L15l91J24
$$ 224 -176 -140 51 -485 -25 -226 -111 148 -95 -38 -667 -329 -29 86 -2 -115 -17 -205 110 -281 -157
3679a57L4J47l24L32p6K7P8N0m54L48L09l06P5M7l39J45k86K05J99N5q8J16l51
$$ -157 -123 24 -300 32 -44 -17 61 111 -343 5 314 8 83 130 -209 -64 -350 -145 54 109 21 137 -214
3702b14J64K6k04J07j06N09m3m05J84O6Q7j19J54k59OM3K41k11K0K23k84k1p7
$$ -214 -50 -24 -228 -121 -227 282 239 -166 18 84 171 52 206 -53 -47 -4 237 26 46 269 -15 -36 -113
3725a13p0J79K12q8J75p2k3R2k89k31K33K36k48K21j52L7k00K48j5o6j99J03J88
$$ -113 -183 -4 208 120 295 223 200 292 3 -228 5 241 -7 214 62 99 -101 147 132 66 -133 -30 158
3748A58j17R6j97J08N4o2j72oo%P9M7J13j52j37Q3J13R8j91L3N5Rp6o4j09R8j05
$$ 158 41 137 -60 48 102 40 -132 -138 -144 -144 -65 -18 95 -57 -194 -111 2 100 -91 -58 -3 6 -70 -134 -243 -145 -250
3775b50J42jK6p7j55K16J5l6M0N3Oj30l54J89K6K19J99k46j6L6J12l01J10j24
$$ -250 -108 -109 -83 -160 -315 -99 -84 -120 -80 -27 -21 -151 -505 -316 -290 -71 128 -118 -134 -98 14 -287 -177 -301
3799c01J48J50k32m5J74R1j59j36L10j21K28j66K1K21n18K20L77j11j14R3k82
$$ -301 -153 -3 -235 -280 -106 -15 -174 -310 0 -121 107 -59 -38 183 -335 -115 262 151 37 130 -152
3820a52J51n3q7%M72k11J24p6l18L82k16K70j51mk73K63R7j07J49j5j32J48l3
$$ -152 -1 -54 -141 -141 331 120 244 168 -150 232 16 286 135 131 -142 121 218 111 260 245 113 261 228
3843B28k14j1J3K58q7M36k94m26J86K18j36q0L15l24K78k66p6J36P0J3q8mo5J96
$$ 228 14 3 16 274 187 623 329 -97 89 307 171 91 406 82 360 94 18 154 224 237 149 145 80 276
3867B76r5K64k68K04k09r4J11q0J46J80l36J16k73J74j42L27r2j53J7j10k19Q1
$$ 276 181 445 177 381 172 78 189 109 255 435 99 215 -58 116 -26 301 209 56 73 -37 -256 -175
3889a75L03J00k37j60J05P3N9Q8L0k91K33k98J13L11l70j24J84J40j93P2Jj34
$$ -175 128 228 -9 -169 -64 9 68 156 186 -105 128 -170 -57 254 -116 -240 -56 84 -109 -37 -36 -170
3911a70J13M4j76m3j6K01m9P7o2k39L71l8j15L3l8j51oK90l25K31j58J67J66j60
$$ -170 -57 -13 -189 -232 -248 -47 -96 -19 -81 -320 51 13 -102 -69 -107 -258 -264 26 -299 -68 -226 -59 107 -53
3935e3j32k06k3L13Q5k80K06p0o6L86M0q3l06j76M23j45j9k38M55m6j25l8J76
$$ -53 -185 -391 -414 -101 -16 -296 -90 -160 -226 160 200 117 -189 -365 58 -87 -106 -344 111 65 -60 -98 78
3958G8j30J0J5K5K72j71j40k15N11k87P5m3k3J20N8J01l22K13k13J38k1p3k1J15
$$ 78 -52 -42 -27 -2 270 99 -41 -256 255 -32 43 0 -23 97 155 256 -66 147 -66 72 51 -22 -43 72
3982G2j47J01K8j8J35o4l9p3O1l5P8m6J45N0k55j4j0J02K01l17j19P6q8j4K56
$$ 72 -75 26 54 36 171 107 68 -5 56 21 99 53 198 248 -7 -21 -31 71 272 -45 -164 -88 -176 -190 66
4007F6K09m09L02l87j21J97N3J6PJ93m28N25l57Q2k6k1k50J6J93k85M62p9j57
$$ 66 275 -134 168 -219 -340 -143 -90 -74 -67 126 -302 223 -134 -52 -78 -99 -349 -333 -140 -425 37 -42 -199
4030a99j21j14K79Q1j4j44K17k65L29j6m1j43k5J89j60L86l50L7j39J35l54L90
$$ -199 -320 -434 -155 -74 -88 -232 -15 -280 49 33 -8 -151 -176 13 -147 239 -111 -74 -213 -78 -432 -42
4052d2k50M73j95O3j68K98l3n58M56k92J12K22q2j38L68l87J14O1M5J83l00J54
$$ -42 -292 181 -14 49 -119 179 146 -412 44 -248 -136 86 4 -134 234 -153 -39 22 67 250 -50 104
4074A04k01N6o8qJ55J49k54L4N54n88J97k82L16l89P3M11J30l98r0K23L47m22
$$ 104 -97 -41 -109 -117 38 187 -67 -33 521 -67 130 -152 164 -225 -152 259 389 -9 -99 124 471 49
4096D9K14j43j4P7n6k1k14J63J26l5k72M0J95o8L25k55m9J26J7Mn6j44K29l36
$$ 49 263 120 106 183 127 106 -108 55 181 146 -126 -86 109 41 366 111 62 188 205 209 153 9 238 -98
4120i8K68j75n3K21k7M6k64M15j02k13q0P2J60j9l09J7K57j14J10q8Q4J78l09
$$ -98 170 -5 -58 163 136 182 -82 333 231 18 -62 10 170 151 -158 -141 116 2 112 24 108 286 -23
4143b3q2J64pj54J07j39J89k9Q2j78J50j04o6oO5o1j4N2M7l6o3n0J6L71k63J62
$$ -23 -105 59 52 -102 5 -134 55 26 108 -70 80 -24 -90 -96 -31 -92 -106 -54 -7 -43 -106 -156 -140 231 -32 130
4169A30k41j59K94l14M22r8j22k20M18j14Kj53J77j02j67L17J09l06j7j68K78
$$ 130 -111 -270 24 -290 132 34 -88 -308 110 -4 -2 -155 22 -80 -247 70 179 -127 -144 -312 -34
4190c4N7O7m99K38K0K66k25K79k69J69m91O54l89L00m0M4kp5J11r1l3n1R3j76
$$ -34 23 90 -409 -171 -151 115 -110 169 -100 69 -422 232 -157 143 103 147 145 70 181 90 57 6 99 -77
4214g7J52qO0k66K42k5j58J08p5R4M9K38m18J30J11k70K37L21l46K11l50J02j95
$$ -77 75 67 127 -139 103 78 -80 28 -47 47 96 334 -84 46 157 -113 124 445 99 310 -40 62 -133
4237a33K49m4J11k7l26K31J53k98l6M67j18l01R4O8M6K7j56ql72J39M14l46J91
$$ -133 116 72 183 156 -170 61 214 -84 -120 347 229 -72 22 90 136 163 7 -1 -373 -234 180 -166 25
4260B5L4m2K16j18P5k63J39l67L79K4L5k10m6J90p3nn2R4K48p76M30o2l17M60
$$ 25 59 17 233 115 190 -73 66 -301 78 102 137 -73 -119 71 -2 -7 -59 35 283 -493 -63 -125 -442 18
4284A8j18k14L43k53N51m71J61P2k07Q0j3p3j53L65n5j03pJ81l7l31L7R4K73m13
$$ 18 -100 -314 29 -224 327 -144 17 89 -118 -38 -51 -124 -277 88 33 -70 -77 104 67 -264 -227 -133 140 -273
4308b73J34j29k6k9l9M13l9q4M6L7l40J71K28J1l00pk0L0O8K56M4j72L5L9j50
$$ -273 -139 -268 -294 -323 -362 51 12 -72 -26 11 -329 -158 70 81 -219 -226 -246 -216 -148 108 152 -20 15 54 -96
4333i6J28J91j57k72j43J86J92M2r1K25J71l05J37O5k69mQ6j57J42j16l78N19
$$ -96 32 223 66 -206 -349 -163 29 71 -20 205 376 71 208 273 4 0 86 -71 71 -45 -423 96
4355I6K49j56lO1k18M00n79K50M1j50j41K87Q8j37l43M93k59O5J40p7O5J24k58
$$ 96 345 189 186 247 29 429 -150 100 141 -9 -150 137 225 88 -255 238 -21 44 184 107 172 296 38
4378C8N7m28L25K69k80j30N9P8j21J59J79N7m09L64k66mj52J3M65j72rj18J3j10
$$ 38 95 -333 -8 261 -19 -149 -90 -12 -133 26 205 262 -147 217 -49 -53 -205 -192 273 101 92 -26 -13 -123
4402a23m7L20k39rk4M9K54k22K0J3p0km1K69N6l16k71L68RJ53l33n3N9K21L5j13
$$ -123 -170 150 -89 -98 -122 -73 181 -41 -21 -8 -78 -80 -121 148 204 -112 -383 -15 -6 147 -186 -239 -180 41 76 -37
4428c7j33p2M08o4j62j68K58o2j4P7K4J79l11j07kK10K8j54J3J9J38J51n36J42
$$ -37 -170 -242 166 102 -60 -228 30 -32 -46 31 55 234 -77 -184 -186 24 52 -102 -89 -70 68 219 -317 -175
4452a75L65n70N52l34K41r8J85k16p2L16Q7l70K94l34J88J07J89q8j04j33K53
$$ -175 190 -380 172 -162 79 -19 166 -50 -122 194 281 -89 205 -129 59 166 355 267 163 30 283
4473B83l36n0K58mo7PJ0K36k67J05q7L6J06r3l3O3j79j05J28J02J20l00K59J15
$$ 283 -53 -103 155 151 84 91 101 337 70 175 88 124 230 137 104 167 -12 -117 11 113 233 -67 192 307
4497C07m02J97r6Q8m1J32j94K6j75M8K13r1j39m7Q7j06n0K08r1K05J5l4r3J86
$$ 307 -95 102 6 94 53 185 -9 17 -158 -110 103 12 -127 -174 -87 -193 -243 -35 -126 79 94 60 -33 153
4521A53n9Q1l6N5l28P4mL97o84M18j43K13j72K91k3j66o5j41rk3J30J2j59J85
$$ 153 94 175 139 194 -134 -60 -64 333 -351 67 -76 137 -35 256 233 67 2 -139 -148 -171 -41 -29 -188 -3
4545cj90M0j40J04K24K1J0j34J4m6r8o0L95l26L42j5l38K23J30j43O6J85n12K62
$$ -3 -193 -153 -293 -189 35 56 66 -68 -54 -100 -198 -258 137 -189 153 138 -200 23 153 10 76 261 -251 11
4569A1mJ15j44J58j27o7o4J57q1J95j40q2N8O4P4j48K5J02J62j56k90K32J25k14
$$ 11 7 122 -22 136 9 -58 -122 35 -46 149 9 -73 -15 49 123 -25 0 102 264 108 -182 50 175 -39
4593c9J32j32M02k49l08K70J69k76K95K7m48J55K75R3l87J20j07N3k09K86Q8J7
$$ -39 93 -39 363 114 -194 76 245 -31 264 291 -157 -2 273 366 -21 99 -8 45 -164 122 210 227
4615B27l02J1J91O2k05K0j45L38l25J61J83m82K35J24m2NJ55k54j00n4N00m30
$$ 227 -75 -64 127 189 -16 4 -141 197 -128 33 216 -266 -31 93 51 56 211 -43 -143 -197 303 -127
4637a27K88k03k49K02L91j32q3Q9l91L38m16K54j5j40L6J23J03k59j11K69QL8
$$ -127 161 -42 -291 -89 302 170 87 176 -215 123 -293 -39 -54 -194 -158 -35 68 -191 -302 -33 -25 13
4659A3l5J82n70L02K68j95J22J6j14p8J06j75k8J63J52k85j36J13j8K90p8k88
$$ 13 -22 160 -410 -108 160 -35 87 103 -11 -89 17 -158 -186 -23 129 -156 -292 -179 -197 93 15 -273
4681b73K38Q4M6l41M79m34o6K2M57j43j79J12j05L39l62J18qP1r6j23K38j4j17
$$ -273 -35 49 95 -246 233 -201 -267 -245 212 69 -110 2 -103 236 -126 -8 -16 55 -41 -164 74 60 -57
4704e7m6J47J86n03R3L67J5j28n4J77k55n1L15k88K8K46j70j07O8j7P4k9J60M6
$$ -57 -103 44 230 -273 -180 187 202 74 20 197 -58 -109 206 -82 -54 192 22 -85 -17 -34 40 11 171 217
4728B17l36J40J21j61J55j95J49K47l70J38p7o8L50j67j73J10j01J59q8k64L08
$$ 217 -119 21 142 -19 136 -59 90 337 -33 105 28 -40 310 143 -30 80 -21 138 50 -214 94
4749I4q5j1J79l50L15k59j87L08l7J82l67L01o5J93l15l81M91j62k40L14M42j54
$$ 94 9 -2 177 -173 142 -117 -304 4 -33 149 -218 83 18 211 -104 -485 6 -156 -396 -82 360 206
4771B06N8j14q8L1j86J53J03k65P9k37K86k83K16J57l17J53K32k55J39l7l47K86
$$ 206 264 150 62 93 -93 60 163 -102 -23 -260 26 -257 -41 116 -201 -48 184 -71 68 31 -316 -30
4793c0j32J79k28J28J74l19L57n2l18J05P2K15j85j96L19k52J78n8K73l97%J89
$$ -30 -162 17 -211 -83 91 -228 129 77 -241 -136 -64 151 -34 -230 89 -163 15 -43 230 -167 -167 22
4815B2l9Mj61K03j44R1j82J11J25k34J80J3j74J83J16l10L8K86j78K7P3J51j31
$$ 22 -17 -13 -174 29 -115 -24 -206 -95 30 -204 -24 -11 -185 -2 114 -196 -158 128 -50 -23 50 201 70
4838G0J38j43l30L09o1j54P9Q9K97k53j34K73j09j81J81k15J9K90l5o4m0p4l9
$$ 70 208 65 -265 44 -17 -171 -92 -3 294 41 -93 180 71 -110 71 -144 -125 165 130 66 26 -48 -87
4861h7M2Q4q0j7K14J12M2l02J6j8J2p7jJ03o2Q7R7k65K38M0j09p1j30k1K89Ol64
$$ -87 -45 39 -41 -58 156 268 310 8 24 6 18 -59 -60 43 -19 68 165 -100 138 178 69 -2 -132 -153 136 142 -222
4888b22J50P2K32o9k01J26r6k40j34M22Q4Rk60L72l73o1M60j35l73L37l09N5R8
$$ -222 -72 0 232 163 -38 88 -8 -248 -382 40 124 133 -127 245 -128 -189 271 136 -237 100 -209 -154 -56
4911e6j03M8j26J71N2k9j58J89j6o1J33n6J32k08j3j74J91k84L67j39l76N39k16
$$ -56 -159 -111 -237 -66 -14 -43 -201 -12 -28 -89 44 -12 120 -88 -101 -275 -84 -368 -1 -140 -516 23 -193
4934a93K02J7j96L8J26k50J46j33M6j4J43L7P4p1omJ51m8p6j28M7j5j24L65N4
$$ -193 9 26 -170 -132 -6 -256 -110 -243 -197 -211 -68 -31 43 -28 -34 -38 113 65 -11 -139 -92 -107 -231 134 188
4959A88j69L02j39Ol22J29j45L28k05R0J73j53k7N6R1q2k89J29l8L3R4M65n95
$$ 188 19 321 182 188 -134 -5 -150 178 -27 63 236 83 56 112 203 121 -168 -39 -77 -44 50 515 -80
4982h0N43n59K50k21l2J94j68J8J45J04j9j79N9n6j5J09q6O5k30J07P4q0j02K41
$$ -80 463 -96 154 -67 -99 95 -73 -55 90 194 175 -4 55 -1 -16 93 7 72 -158 -51 23 -57 -159 82
5006H2O5Kj24j19r7M74j77M5m9L8J07k84n7J51K03j0l93J10qK3K8m20P55l97j97
$$ 82 147 149 25 -94 -191 283 106 151 102 140 247 -37 -94 57 260 250 -143 -33 -41 -18 10 -410 345 -52 -249
5031b49M25k85J2L4J53J30o47L69R7k61R7K48j39j11O8l02K68J71k55k76L12K78
$$ -249 176 -109 -97 -63 90 220 -427 -58 39 -222 -125 123 -16 -127 -59 -361 -93 78 -177 -453 -141 137
5053A37m13L16j87L66n81L21M7k51R8J34o5l07M55m6J48P8m57L34n3l6m5J57m54
$$ 137 -276 40 -147 219 -362 -41 6 -245 -147 -13 -78 -385 70 24 172 250 -207 127 74 38 -7 150 -304
5076c04L09l54J74Q6j68L90R7j96J16n3m1L7q6l3j48qJ90l5l4M03n09J69P2K7
$$ -304 5 -349 -175 -89 -257 133 230 34 150 97 56 93 7 -26 -174 -182 8 -27 -61 342 -167 2 74 101
5100A01rr1j49J46K50q6J68k59k51M93m85N05l56J68l40L36k67J34l0J62k20K18
$$ 101 92 1 -148 -2 248 162 330 71 -180 313 -172 333 -23 145 -195 141 -126 8 -22 140 -80 138
5122A38J65k03p9J39p0l33L96k23J87r7J92k97J56O0o2J40R4j23k72J65Q5q6j31
$$ 138 303 100 21 160 90 -243 153 -70 117 20 212 -85 71 131 69 209 303 180 -92 73 158 72 -59
5145e9Q1k83M36k56o5l7J09K44k04Km8J98j98J34p3j7K8m8Q1l47M30k75j02N39
$$ -59 22 -261 175 -81 -146 -183 -74 170 -34 -32 -80 118 -80 54 -19 -36 -8 -56 25 -322 108 -167 -269 270
5169B70m83J9K15l5j81K55n5L49o85J75K49l24K9Q1J66l5j47rQ3k5q8K71K13m68
$$ 270 -213 -194 21 -14 -195 60 5 354 -331 -156 93 -231 -202 -121 45 10 -137 -146 -63 -88 -176 95 308 -160
5193a60K57n4l4J32j07j39p0Q7l4N18k14l89J45q2J70M7P7j73J44q5k2Q5l7J93
$$ -160 97 43 9 141 34 -105 -175 -88 -122 396 182 -207 -62 -144 26 73 150 -23 121 36 14 99 62 255
5217B55k10j26j28K82M5o0K4Q8j05k43O9K81M02m73l4L1k22j45J26M07l94J58
$$ 255 45 -81 -209 73 118 58 82 170 65 -178 -109 172 574 101 67 98 -124 -269 -143 264 -130 28
5239B8L2k0R5j38J1L6j04L9k6N7l8M32k04j2K14l03l6Q9k84O4K39k57J25J03j52
$$ 28 60 40 135 -3 8 44 -60 -21 -47 10 -28 404 200 188 402 99 63 152 -132 -68 171 -86 39 142 -10
5264a0o1o8J49J54rk24K29pl35K10j63R1QM3p1J89J05k45M7l9q2m3J96k18J48
$$ -10 -71 -139 10 164 155 -69 160 153 -182 28 -135 -44 -36 7 -64 125 230 -15 32 -7 -89 -132 64 -154 -6
5289fM8P6k3j28j79J26J84j08l86K35J46j75K53r1o4R1o7K31k52Q8J03j61P8J45
$$ -6 42 118 95 -33 -212 -86 98 -10 -396 -161 -15 -190 63 -28 -92 -1 -68 163 -89 -1 102 -59 19 164
5313A64j95j62K1M0p2K15j48J07J21k31K90l23R1KlJ94l92M82r9J38k4k72o4R2
$$ 164 -31 -193 -172 -132 -204 11 -137 -30 91 -140 150 -173 -82 -80 -83 111 -281 201 102 240 216 -56 -120 -28
5337b8J54K86p06M18l3p1k89K17K91j46N7L5rJ8j70L2K73k34R1j48J36j07j37
$$ -28 126 412 -294 124 91 20 -269 -52 239 93 150 185 176 194 24 56 329 95 186 38 174 67 -70
5360g0l7J25j2Q4j44J18l72L34K20k93K39l92K01J77k75M1K31k85M21l29l9m9
$$ -70 -107 18 6 90 -54 64 -308 26 246 -47 192 -200 1 178 -97 -56 175 -110 311 -18 -57 -106
5382a06K44P4n3j5q9J68M0K6J1k93N5J99m28M3j06L24L1Kpk30L3L28l77j6L3L8
$$ -106 138 212 159 144 55 223 263 289 300 7 62 261 -167 -124 -230 94 125 127 120 -110 -77 251 -126 -142 -109 -71
5408g1J59j22J90j04L2j76O3n2N8k00K11p2J48l03J95L7J33k39J8r0K09j64k08
$$ -71 88 -34 156 52 84 -92 -29 -81 -23 -223 -12 -84 64 -239 -44 -7 126 -113 -95 -185 24 -140 -348
5431c48M20j06L3l0k37L62j55J7L2k58L72j65L76j59k54O5j44L11k34J15j00R1
$$ -348 72 -34 -1 -31 -268 94 -61 -44 -12 -270 102 -63 313 154 -100 -35 -179 132 -102 13 -87 4
5453DJ68j70k9K3oj66o9J55k16O54O2k48R5l82K1k44J06k16O28j47m5n4k33O34
$$ 4 172 2 -27 -4 -10 -176 -245 -90 -306 348 410 162 257 -125 -104 -348 -242 -458 170 23 -22 -76 -309 325
5477C25m40k11n0L09K5o5NK0J00K37k30R4k2mk15J75J62k98M49m47J52Q1k78J67
$$ 325 -115 -326 -376 -67 -42 -107 -102 -82 18 255 25 119 97 93 -122 53 215 -83 366 -81 71 152 -126 41
5501D1j01K05M7l38jJ60Jo3l17K61K78j64K65m61K18j54J49j82J25L42k01q3l4
$$ 41 -60 145 192 -146 -147 13 14 -49 -366 -105 173 9 274 -187 31 -123 26 -156 -31 311 110 27 -7
5524gk22K5L47p7Lj57K85k65J22k17L39J17k31o0rJ89k61M0J07k84L76O4k43N5
$$ -7 -229 -204 143 66 69 -88 197 -68 54 -163 176 293 62 2 -7 182 -79 -39 68 -216 160 224 -19 36
5548C6J15l73K98K10o22P9K53J04R8k38k34L71l35N0n3K3J94k43K85j03q4kK9
$$ 36 151 -222 76 286 -336 -257 -4 100 198 -40 -274 97 -238 -188 -241 -218 -24 -267 18 -85 -169 -171 -142
5571a42M31l41J36O9k37k3j64L15k35K14j30j13N0K69j85L16k40M3l5K66l17j96
$$ -142 289 -52 84 153 -84 -107 -271 44 -191 23 -107 -220 -170 99 -86 230 -10 33 -2 264 -53 -249
5593b49M95r9q7j22j10N9K89J30p08M83n2l24N13P2n25L24P9k0j51N1J84pj09
$$ -249 246 147 60 -62 -172 -113 176 306 -402 81 29 -295 218 290 -235 89 168 148 -3 48 232 225 116
5616A16p7j13K69k01R6K34j97JJ05k0p6J76j85J91k28j68J13Q2j21J48p6J8k30
$$ 116 39 -74 195 -6 90 324 127 128 233 213 137 313 128 319 91 -77 36 118 -3 145 69 87 -143
5639a43R3L7p5K22j16q9j01J46P7p1L2NP3l0j32K96k39pj11K4K92m2l86K50O7
$$ -143 -50 -13 -88 134 18 -71 -172 -26 51 -20 12 17 90 60 -72 224 -15 -22 -133 -109 183 141 -245 5 72
5664G2Q3m2N1n6l69K98k76N4K61j67M94k59k72n6R5K82l14K0N0J00k43J36J96
$$ 72 155 113 164 108 -261 37 -239 -185 76 -91 403 144 -128 -184 -89 193 -121 -101 -51 49 -194 -58 138
5687A38J7j53qM4K2l15L61j23J16l63J8K46q0K1K53j95L8j31J24m60M70j29R3
$$ 138 155 2 -6 38 60 -255 106 -17 99 -264 -246 0 -80 -59 194 -1 37 -94 30 -430 40 -89 4
5710Dj37K33J94l44Kn1Q6NM7q7O8J43L3n6K3k27k39L39K07m19K72L2j39J08k95
$$ 4 -133 100 294 -50 -48 -99 -13 -8 39 -48 20 163 196 140 163 -64 -303 36 243 -176 96 128 -11 97 -198
5735a98n8J08j46N82j99m1l4J73j87J53j74NL07k08j43J86M0o1j79J1K26l89M39
$$ -198 -256 -148 -294 288 89 48 14 187 0 153 -21 -16 291 83 -60 126 166 105 -74 -63 163 -226 213
5758B13K4k33j19j23L36j57L45k65L1k15L15l11J24K15k76l5K28r7p0K36r9K3
$$ 213 237 4 -115 -238 98 -59 286 21 52 -163 152 -159 -35 180 -96 -131 97 0 -70 166 67 90
5780I0l2l8j32P2j99J98k5j9M11n03K19o5J07k97mJ73K26l50L32J01m45mJ73k92
$$ 90 58 20 -112 -40 -239 -41 -66 -85 326 -177 42 -23 84 -213 -217 -44 182 -168 164 265 -180 -184 -11 -303
5804c03J65L0j5R3j80L16l68L75j37J73o05M32J42j75K5j98J49k29K84N5j14J6
$$ -303 -138 -108 -123 -30 -210 106 -262 113 -24 149 -456 -24 118 -57 -32 -230 -81 -310 -26 29 -85 -69
5826f9J70j68K29N7j79k9K8l75M30l03L45J32j16k04K39k2k52l9L29l31j45M67
$$ -69 101 -67 162 219 40 11 39 -336 94 -209 136 268 152 -52 187 165 -87 -126 203 -128 -273 194
5848A94k07l23L98Qo4K2P6k39k02L46J2j58P9o5j90L21k15j6R1K08N5j56K2R0
$$ 194 -13 -336 62 70 6 28 104 -135 -337 9 21 -137 -58 -123 -313 8 -207 -223 -132 76 131 -25 -3 87
5872H7r5j80J35J58q2J41o7j47J57r1N9k9j66J78L9m8j41L6K58j79O0j44j42K93
$$ 87 -8 -188 -53 105 23 164 97 -50 107 16 75 46 -120 58 97 49 -92 -56 202 23 83 -61 -203 90
5896I0J25KL8m31M14k39m2O5k33K19J97j13n4J39m7j18J00j34L13k21K06l73p1
$$ 90 215 217 255 -176 238 -1 -43 22 -211 8 205 92 38 177 130 12 112 -22 291 70 276 -97 -168
5919a68q1L55j66j99L11k85M46l58j62L83O6k7k59K0j70J26P1L63m37J32Q6K24
$$ -168 -249 106 -60 -259 52 -233 213 -145 -307 76 142 115 -144 -124 -294 -168 -97 266 -171 -39 47 271
5941B71o99L65j34J79j63K3J49P8n9l46M12q8l01M45J6k0j56J25j35k52M20Np1
$$ 271 -428 -63 -197 -18 -181 -158 -9 69 10 -336 76 -12 -313 132 148 128 -28 97 -38 -290 130 135 64
5964F4k22J62Q2n8j06K84k86r6M7J43Q1q4j89M45l38l7L47J7m59J28L10k87R2
$$ 64 -158 4 86 28 -78 206 -80 -176 -129 14 95 11 -178 267 -71 -108 239 256 -203 -75 235 -52 40
5987D0QK8Nl1lP9j42J33J51l67J30j96J2J81m03M55O2k1P6k41M8JK71m25L17m22
$$ 40 48 76 81 50 47 126 -16 117 268 -99 31 -165 -153 28 -375 80 142 121 197 -44 4 5 276 -149 168 -254
6013b54K93K35o39J18J91J0o7j0J36K30k82K13k28O1M5J14K7l89Mk8K17k2J17
$$ -254 39 274 -365 -247 -56 -46 -113 -123 13 243 -39 174 -54 7 52 166 193 -196 -192 -220 -3 -25 92
6036I2j76J2J18k62K13L2P4p4L4j07k08K98L8r3K38m6%j86K85k2l95l04L65m8
$$ 92 -84 -72 46 -216 -3 29 103 29 63 -44 -252 46 84 -9 229 183 183 -3 282 260 -135 -439 -74 -122
6060a22N4K44p3j95P8q4l5N4j74K53q0R1j22j93L91j20k2o4K30j13j05K0K53j16
$$ -122 -68 176 103 -92 -14 -98 -133 -79 -253 0 -80 11 -111 -304 87 -33 -55 -119 111 -2 -107 -87 166 50
6084E0Q5J72k31l37O8N7J35k15J00L56l38n7j41J38J20j40n6R3J74k03k34M44
$$ 50 135 307 76 -261 -193 -136 -1 -216 -116 240 -98 -155 -296 -158 -38 -178 -234 -141 33 -170 -404 40
6106D0J73k49r1K11Q4j51K1P0o6j72J56P9k22P0R1J11m7K55o04M91k25R5jL8k71
$$ 40 213 -36 -127 84 168 17 38 108 42 -130 26 105 -117 -47 44 155 108 363 -241 250 25 120 119 157 -114
6131a14J10o8L40k55n9K19l46J08O8l4q1J56M5nj68j02J7K55j42k21L9N01Lm95
$$ -114 -4 -72 268 13 -46 173 -173 -65 3 -31 -112 44 89 84 -84 -186 -169 86 -56 -277 -238 263 266 -229
6155b29N57J1l95L77l99J12n0RO0j97j23J90J76j65m6J24J39l62R9O3j30J51k42
$$ -229 328 339 -56 321 -78 34 -16 -7 53 -144 -267 -77 99 -66 -112 12 151 -211 -112 -49 -179 -28 -270
6178b70N25l51J09n8o0r1J75J29p7L0L6k36O7k06L47j42l9J38l4J19l74J75J98
$$ -270 255 -96 13 -45 -105 -196 -21 108 31 61 97 -139 -72 -278 69 -73 -112 26 -8 111 -263 -88 110
6201A10k74J88J17l48n9J35J12o8K28j1r0j52J78J32k04K41k77j07L05o2k5k36
$$ 110 -164 24 141 -207 -266 -131 -19 -87 141 130 40 -112 66 198 -6 235 -42 -149 156 94 69 -167
6223a67Q6O7j59J11R7j16K00q9K3K3k08K23j79J7r3J99J31m6L8l6Lk8p7k54M77
$$ -167 -81 -14 -173 -62 35 -81 119 30 53 76 -132 91 -88 -71 -164 35 166 120 158 122 125 97 20 -234 243
6248B43j42j2k45J25K5K2K31l42l0L04k66J90Q5j42k6J23m4j3MK0l23m6L30M5
$$ 243 101 89 -156 -31 -6 16 247 -95 -125 179 -87 103 188 46 20 143 99 86 90 110 -213 -259 71 116
6272A16n0j80K68r8j94O4K8R0j75K79l19K11K3J21j70J67k59j87K05J77k00k1
$$ 116 66 -114 154 56 -138 -74 -46 44 -131 148 -171 40 63 184 14 181 -78 -265 -60 117 -83 -104
6294a04K13j72j13k5M50p6j97ONJ11n7j52K47nN8p0l4J47o10K54J28kk66J01R4
$$ -104 109 -63 -176 -201 249 173 -24 -18 -13 98 41 -111 136 131 189 119 85 232 -378 -124 4 2 -264 -163 -69
6319f9lJ25o1j04L4p6M6J40j73j60J2J53P1N7K6r8L00l85q7J67J67k70J31J95
$$ -69 -72 53 -8 -112 -78 -154 -108 32 -141 -301 -289 -136 -65 -8 18 -80 220 -165 -252 -85 82 -188 -57 138
6343A38l04J22k02L71n6j44J17O4R9k54k62J79K34M2l04J27k01N98k71J69j08
$$ 138 -166 -44 -246 125 69 -75 42 106 205 -49 -311 -132 102 144 -160 -33 -234 364 93 262 154
6364A54k21j05j1J43J98j9k28q8M36j17l92K28k22L63l53J94M22k08m3j93M33
$$ 154 -67 -172 -183 -40 158 139 -89 -177 259 142 -250 -22 -244 119 -234 -40 382 174 131 -62 371
6385C71n43L08k0j30Q9Rl08J29J15K6M9o9M6K03l88J3K67k77J53J79l27K97J87
$$ 371 -172 136 116 -14 75 84 -224 -95 20 46 95 26 72 275 -113 -100 167 -110 43 222 -105 192 379
6408C79k66l31k7L60j50L5K8j91L30J49k43K03k48r3L71m61l2R6J17M0J22j78
$$ 379 113 -218 -245 115 -35 0 28 -163 167 316 73 276 28 -65 306 -155 -187 -91 26 66 188 10
6430A0J14k62J09PJ18j59K49l93M04k53J17J20k44N3Qk54J51J67N4l7p5J71k56
$$ 10 124 -138 -29 -22 96 -63 186 -207 197 -56 61 181 -63 -10 -2 -256 -105 62 116 79 4 175 -81
6453h1L22Qk26J0n1J46k47n1J60M4J22j42J49j1l76K75j49J58j45o4K58k02L19
$$ -81 241 249 23 33 -18 128 -119 -170 -10 34 156 14 163 152 -224 51 -98 60 -85 -149 109 -93 226
6476B26k64K9n7k8p2o7K85j13J33l06K22J36L27k54k09J0K94n01o1O02j71J1k17
$$ 226 -38 -9 -66 -94 -166 -233 52 -61 72 -234 -12 124 451 197 -12 -2 292 -209 -270 332 161 172 -45
6499d5q1j55M81k66K07m14J04J31j26M03k98j51J48j53l2L75rl33K96j74l1m3
$$ -45 -126 -281 200 -66 141 -273 -169 -38 -164 239 -59 -210 -62 -215 -247 128 119 -214 82 -92 -123 -166
6521a66K15K28m31L27p0k8J86j98j22O1jo9J06k11J60J02j80L84l80k7M90k22
$$ -166 49 277 -154 173 103 75 261 63 -59 2 1 -68 38 -173 -13 89 -91 293 -87 -114 376 154
6543A54J44k76N7j15j86J82K62j0j23q6mM3q9k26M47L0l06j62K00J25m9N7k71
$$ 154 298 22 79 -36 -222 -40 222 212 89 3 -1 42 -47 -273 174 204 -102 -264 -64 61 12 69 -202
6566b02m0o7J38L9O0R4j62k01J61J95K9Q4k11K29J42k69O4l29N07n3l10j32L31
$$ -202 -242 -309 -171 -132 -72 22 -140 -341 -180 15 44 128 -83 146 288 19 83 -246 261 208 -102 -234 97
6589I7R3J96o72K06L04l19K10R8j91o5N4J65j77J35n64L41q3L27l15K03J98k85
$$ 97 190 386 -286 -80 224 -95 115 213 22 -43 11 176 -1 134 -430 -89 -172 155 -160 43 241 -44
6611d4P1j10O6k5j20M12j64j89n2L19Q8m90J89O9kp5J11p4N7K46qj44k28o0O5
$$ -44 27 -83 -17 -42 -162 250 86 -103 -155 164 252 -238 -49 20 18 -57 54 -20 37 283 275 131 -97 -157 -92
6636i2L35j19j08m2J89n5j71J06k06Q6r4Q0J75K4M0j31l1q3K8m2K7M9R7L10j10
$$ -92 243 124 16 -26 163 108 -63 43 -163 -77 -171 -91 84 108 148 17 -14 -97 -69 -111 -84 -35 62 372 262
6661B62k50j23J17J8J25l18J24K15j19Q1j84O6q1J58j92O0J75j27Q5j42P5l3Q5
$$ 262 12 -111 6 24 149 -169 -45 170 51 132 -52 14 -67 91 -101 -41 134 7 92 -50 25 -8 77
6684G7k3l7k47K78K30l99Q7L8j82J14P3j81L33r3o5M9r5J0j72J01J59J1j55J21
$$ 77 54 17 -230 48 278 -121 -34 4 -178 -64 9 -172 161 68 3 52 -43 -33 -205 -104 55 66 -89 32
6708C2M9k96L80l09L92k78RK6j39R9j26n4J10M6J79J3j35J1K07k82J51q5J22k54
$$ 32 81 -215 165 -144 248 -30 -21 5 -134 -35 -161 -215 -105 -59 120 133 -2 9 216 -66 85 0 122 -132
6732a32K23Q9j24J40j76r7O3j63J15O7j90M7J80j27q8O13l13J3k91J97L68l61
$$ -132 91 180 56 196 20 -77 -14 -177 -62 5 -185 -138 42 -85 -173 440 127 140 -151 46 414 53
6754E3k49j5m1M31j18m9k37L84j13j51N8M4O4J39N9k41J65O0j91j37R6j15L18
$$ 53 -196 -211 -252 179 61 12 -225 159 46 -105 -47 -3 61 200 259 18 183 243 52 -85 11 -104 214
6777B14m52L72k83J89M5k64K27L4J03j16R5k82Pk04J69k1M80k93R4m9Pj1L7l54
$$ 214 -238 134 -149 40 85 -179 48 82 185 69 164 -118 -111 -315 -146 -167 313 20 114 65 72 61 98 -256
6801b56j41L76k6n7j14L99l9l27J42p1j27L02k05J14J09j40J68n2M9k63R1N1j48
$$ -256 -397 -21 -47 -104 -218 181 142 -185 -43 -114 -241 61 -144 -30 79 -61 107 55 104 -159 -68 -17 -165
6824a65J43j23P2k2j28K68K0k25N0j13J57m1N5J2p3J46k93J85M1J14l5k16j70
$$ -165 -22 -145 -73 -95 -223 45 65 -160 -110 -223 -66 -107 -52 -40 -113 33 -260 -75 -34 80 45 -171 -341
6847c41R8J2L06R5l27K48r3J70j14j77J02K24j04q1k66K09L3R8k0j94K87l4o2
$$ -341 -243 -231 75 170 -157 91 -2 168 54 -123 -21 203 99 18 -248 -39 -6 92 72 -122 165 131 69
6870F9q4m6K3P3j9kk4p1Pj06K22j7k65J87L0R1j11J42o5J72k81O3p1J12K47m12
$$ 69 -15 -61 -38 35 16 14 -10 -81 -74 -180 42 25 -240 -53 -23 68 -43 99 34 206 -75 -12 -83 29 276 -136
6896a36K08j92m0L06qq6l44L01l3m6o6K29L7j77j04L28l22L24l96R0P0L35j45
$$ -136 72 -120 -160 146 138 52 -292 9 -24 -70 -136 93 130 -47 -151 177 -145 179 -217 -127 -57 278 133
6919A33o1j91o1Q8L33p3k20r5j05j16K69K1J91o5k44K59r1J78j56k1J13k39P6
$$ 133 72 -119 -180 -92 241 168 -52 -147 -252 -368 -99 -78 113 48 -196 63 -28 150 -6 -27 86 -153 -77
6942g7R3j76K32L14k25K27k62j40J40n4Q7j53j66Q1J12M4Qk21M54k96l42J05N
$$ -77 16 -160 72 386 161 388 126 -14 126 72 159 6 -160 -79 33 77 85 -136 318 22 -320 -215 -210
6965b10j3K07o2j68M62l24K50j83l85K84P2L23l25L6P4q6m02M08K1j98L67j55
$$ -210 -223 -16 -78 -246 216 -108 142 -41 -426 -142 -70 253 -72 -36 38 -48 -450 -42 -21 -219 148 -7
6987gR3L8M9l5o9j84K06k74j42J28N5J00r7r0L06J50j28p0l49L03J80k44J35j16
$$ -7 86 124 173 138 69 -115 91 -183 -325 -197 -142 -42 -139 -229 77 227 99 29 -320 -17 163 -81 54 -62
7011f2L4j2J26k2j42p3J19p9M05m47J07n6L5pK76k47M7j69J68J29q3l3m6J08k08
$$ -62 -28 -40 86 64 -78 -151 -32 -111 294 -153 -46 -102 -67 -74 202 -45 2 -167 1 130 47 14 -32 76 -132
7036a32K65J71k21Q2O2j47p8J32L17n64J9K87m45N01j17m2J05j85k28L01m8n9
$$ -132 133 304 83 165 227 80 2 134 451 -113 -94 193 -252 249 132 90 195 10 -218 83 35 -24
7058b4p8l1K42j1p2k11J91n9J94m8m38M19p3j07J70m08L03j23K63k27J52L07n02
$$ -24 -102 -133 109 98 26 -185 6 -53 141 93 -345 74 1 -106 64 -344 -41 -164 99 -128 24 331 -171
7081a71J53J09n0k36No4K79j3m0j29q7l2J24j37K89J31r7M0k76J03q4QJ08L06
$$ -171 -18 91 41 -195 -190 -254 25 12 -28 -157 -244 -276 -152 -289 0 131 34 74 -202 -99 -183 -175 -67 239
7105B39k70n9K79j57L5q8j60R4j08R5L14l95L13j68L4Q4j00o2k4J10J29k47J63
$$ 239 -31 -90 189 32 67 -21 -181 -87 -195 -100 214 -181 132 -36 -2 82 -18 -80 -104 6 135 -112 51
7128E1M2m4j34n7N0j10J31J3J00J51k95J21J49j88j88K49J53j67j36Q0K89k22
$$ 51 93 49 -85 -142 -92 -202 -71 -58 42 193 -102 19 168 -20 -208 41 194 27 -109 -29 260 38
7150C8O8k04J42j3P6J8m7k5o0oJ41l7r9j29J70o1m7N97n22O2q2K30j79N8l70L53
$$ 38 106 -98 44 31 107 125 78 53 -7 -13 128 91 -8 -137 33 -28 -75 522 0 62 -20 210 31 89 -281 72
7176G2k2L60k34q9k97J18J22K95k09k03P5M2J93k71L42j16j41m3J7N1j67K28n1
$$ 72 50 410 176 87 -210 -92 30 325 116 -87 -12 30 223 -48 294 178 37 -6 11 62 -105 123 72
7199G2n33N39k35M4L91m33M57m77J24k18K22m9pJ36J49j36k78MN9LJ42K66l27
$$ 72 -461 78 -157 -113 278 -155 302 -175 -51 -269 -47 -96 -103 33 182 46 -232 -228 -169 -166 -24 242 -85
7222h5k1J16J23P6l92N8K25k38K06Oj79J18m4k11J14R3J09j05L6R3k02j8j82J58
$$ -85 -106 10 133 209 -183 -125 100 -138 68 74 -105 13 -31 -242 -128 -35 74 -31 5 98 -104 -122 -304 -146
7246a46K97j61j30K40Pj70j75P4J53K80j17j39P3K20l68J36k30l2K59k33J88J07
$$ -146 151 -10 -140 100 107 -63 -238 -164 -11 269 152 13 86 306 -62 74 -156 -188 71 -162 26 133
7268A33j5P2r5j32J06j44J86k18K41M7j54J39k22rL09m20J55L3N6L2p8k0j03l7
$$ 133 118 190 95 -37 69 -75 111 -107 134 181 27 166 -56 -65 244 -176 -21 12 68 100 22 2 -101 -138
7292a38K00o5J0l8j03j98K33P5Q5j55J43q6k35K84j19M0k0O3j78J85o2mj56K27
$$ -138 62 -3 7 -31 -134 -332 -99 -24 61 -94 49 -37 -272 12 -107 -67 -87 -24 -202 -17 -79 -83 -239 -12
7316a2o7l7L53o58N08J7j15o1K59j71l50L20k09K55k29O9m3R7J26j3j7J31l11
$$ -12 -79 -116 237 -421 87 104 -11 -72 187 16 -334 -14 -223 32 -197 -128 -171 -74 52 39 22 153 -158
7339a58J57l7R1J39l44K09j75l5J37l19oM32k46J51l7q1K23k87J18J19K46l23
$$ -158 -1 -38 53 192 -152 57 -118 -153 -16 -335 -341 91 -155 -4 -41 -122 101 -186 -68 51 297 -26
7361b6p8J96j78k5L6j16M22l56OJ41j86R2K42k69L67m67Q9J29j9L0J2o2O0P0j41
$$ -26 -104 92 -86 -111 -75 -191 231 -125 -119 22 -164 -72 170 -99 268 -199 -110 19 0 30 42 -20 40 110 -31
7386c1R1J1k07K60m62N91j88o0Q0l86L39J94k62j09K61R2l11K96k54J82j71K06
$$ -31 60 71 -136 124 -338 253 65 5 85 -301 38 232 -30 -139 122 214 -97 199 -55 127 -44 162
7408A62p2p4j46K88l8l09L14l34J50J07L2l6j48K00p7K42j36j14K28k94J12M7
$$ 162 90 16 -130 158 120 -189 125 -209 -59 48 80 44 -104 96 19 261 125 11 239 -55 57 104
7430A04j87N8Mj25J18ol28K56n5J67K15k66o1R3j23l3p9J29nK79k22J31M1j03
$$ 104 -83 -25 -21 -146 -28 -34 -362 -106 -161 6 221 -45 -106 -13 -136 -169 -248 -119 -124 155 -67 64 105 2
7454Bk4n83M52J44j5N7n1ro5N3M9L5l01J00o8R7K24R7j39Q0J0j67l6QP1j10j6
$$ 2 -22 -605 -153 -9 -24 33 -18 -27 -92 -39 10 45 -256 -156 -224 -127 97 194 55 135 145 -22 -58 -50 21 -89 -105
7481a05R9k46K43k23P3J66j29K17j52j70M08k76%K40J06k95J9M4q8J40k77K90
$$ -105 -6 -252 -9 -232 -159 7 -122 95 -57 -227 181 -95 -95 145 251 -44 -25 19 -69 71 -206 84
7503H4M5J67k45n1j07L35r1o6j80L4l30M58J2L8Pk66N0N9Q8j81M4O3k4Q1R2l12
$$ 84 129 296 51 0 -107 228 137 71 -109 -75 -405 53 65 103 110 -156 -106 -47 41 -140 -96 -33 -57 24 116 -196
7529a96K33J13N1J21l98j13L46j70J40j45k44K7M5K03J49pm9j90J70q5K34j14
$$ -196 37 150 201 322 -76 -189 157 -13 127 -18 -262 -235 -190 13 162 155 106 -84 86 1 235 121
7551A21j14L61j69j43j17K95m03l0K31R1j08N5o5R3K50o34L72j45R3Q0k92J1R3
$$ 121 7 368 199 56 -61 234 -169 -199 32 123 15 70 5 98 348 -286 86 -59 34 114 -178 -167 -74
7574g4O4J40j5k72M5L59j85k12K18j13k2N6l3L8r2kJ26p8P8k5K65m83RJ85K46
$$ -74 -10 130 115 -157 -112 247 62 -150 68 -45 -67 -11 -44 -6 -98 -100 26 -52 26 1 266 -217 -208 -23 223
7599B23m64M10N0k17Q4k94K85n0J30q9j04k12N12m09P4k4j79K38k50L39J75j40
$$ 223 -241 169 219 2 86 -208 77 27 157 68 -36 -248 264 -145 -71 -95 -274 -36 -286 53 228 88
7621H8j40J12J4q0l08N26l8m7m55r3L10Q0j5k21L71O6l35P5J73k09N3J06p0nP6
$$ 88 -52 60 74 -6 -314 212 174 127 -328 -421 -111 -31 -46 -267 104 170 -165 -90 83 -126 -73 33 -37 -42 34
7646C4l3j83K11K6K4P5j27O5Q4l91P4K47K50l12K21j62j51L17l22K09j20K89J49
$$ 34 1 -182 29 55 79 154 27 92 176 -215 -141 106 356 44 265 103 -48 269 -53 156 36 325 474
7669D74l63j36j61J89O5M2K9j13k00L45k13J66l40M28Pj05r1j06n3l14K67J90
$$ 474 111 -25 -186 3 68 110 139 26 -174 171 -42 124 -216 212 219 114 23 -83 -136 -450 -183 7
7691Gq3n8J72jQ5j29K71p1k50K96k54N0k9L2j85J35K18k87K17m06L49j81N7M7
$$ 7 -76 -134 38 37 122 -7 264 193 -57 239 -15 35 6 38 -147 -12 206 -81 136 -270 79 -102 -45 2
7715Bj96M73K01n79J47K64r7k83r2J76J05j2j55K86Km84K80p0K54q7o04M01O2
$$ 2 -194 279 480 -99 48 312 215 -68 -160 16 121 109 -46 240 242 -242 38 -32 222 135 -469 -68 -6
7738fj73J17J42J9k24nR2J56l82K35J13k3l10J15j9L18k23J04k51J42K60l60K51
$$ -6 -179 -62 80 99 -125 -130 -38 118 -264 -29 84 61 -249 -134 -153 165 -58 46 -205 -63 197 -163 88
7761H8N7j72K3M01m26J72j44l44L60J9m8K00k02q0K23j49K31k9j67J8K0o2J71
$$ 88 145 -27 -4 397 -29 143 -1 -345 15 34 -14 186 -16 -96 127 -22 209 180 13 31 51 -11 160
7784A60q8jN6l9N7n3k06j08J32O1R3j27P6J57j02pN1j7j14Q8Q6k43N18m05Q2l06
$$ 160 72 71 127 88 145 92 -114 -222 -90 -29 64 -63 13 170 68 61 112 95 -19 69 155 -88 430 25 107 -199
7810a99L31k12N2K51l63J13k16K45l02L70k40J37n7k05L67l1Lq2j5O7j57j35J22
$$ -199 132 -80 -28 223 -140 -27 -243 2 -300 70 -170 -33 -90 -295 72 41 44 -38 -53 14 -143 -278 -156
7833a56M8L52j24k16k7J18m1L93k56j65n3N6J56l15nK17J23l14J60R0n3p3M0l16
$$ -156 -108 244 120 -96 -123 -5 -46 347 91 -74 -127 -71 85 -230 -235 -18 105 -209 -49 41 -12 -85 -45 -361
7857c61J57J4J88q1K6R1k42r3K77o5J98k10Q2J41l1m3J33k41J5J65q6J55k64L
$$ -361 -204 -190 -2 -83 -57 34 -208 -301 -24 -89 109 -101 -19 122 91 48 181 -60 -45 120 34 189 -75 -72
7881g2Q4p1k78R5K17j7o2J27J41j46M8J62k67J53J12j87J03k13Nl3J24q4R9j81
$$ -72 12 -59 -337 -242 -25 -42 -104 23 164 18 66 228 -39 114 226 39 142 -71 -66 -99 25 -59 40 -141
7905a41M20m91K49J24j0k21N2J3L7P1K9N8l44L07J6j89l86L08P5Q8n8r0J38j09
$$ -141 279 -212 37 161 151 -70 -18 -5 32 103 132 190 -154 153 169 -20 -406 -98 -23 65 7 -83 55 -54
7929e4P9j11O2J49k85L72o0l24K4K51J25l92J49Q1jq6J27q2r0k0k01K44j3J98
$$ -54 25 -86 -24 125 -160 212 152 -172 -148 103 228 -164 -15 66 65 -21 106 24 -66 -86 -287 -43 -56 142
7953A42J05k30j49J65j12J31j78o2J85j6Jp4K25%lo0J36l79j23M45o3l11K50j02
$$ 142 247 17 -132 33 -79 52 -126 -188 -3 -19 -18 -92 133 133 130 70 206 -173 -296 149 86 -225 25 -77
7977g7J44k10nJ87K75k99k0j42J27j03K85l33k2J05k73L27r5K2k6J19J20J98j89
$$ -77 67 -143 -148 39 314 15 -5 -147 -20 -123 162 -171 -193 -88 -361 -34 -129 -107 -133 -14 106 304 115
8000A15l4l23K22J88j85Mn1k00L18q6j05M5J03K97m18K31l44M15k04R4j18J6K5
$$ 115 81 -242 -20 168 -17 -13 -64 -264 54 -32 -137 -92 11 308 -110 121 -223 192 -12 82 -36 -20 5
8023EK4m2L19m01K47k1J21n05J30O8M2Jk52K73M5o5r4O4j27N1J2K91k87q8K66
$$ 5 29 -13 306 -95 152 131 252 -253 -123 -55 -13 -12 -264 9 54 -11 -105 -41 -168 -117 -105 186 -101 -189 77
8048G7N4k76M43k88L3M0k22J73J31k90Q9OLJ15p2J7k52K79J16K00r6n37K7K98
$$ 77 131 -145 298 10 43 83 -139 34 165 -125 -36 -30 -27 88 16 33 -219 60 176 376 280 -257 -230 68
8072F8r9K46k45K31l51J57J25j14k30K21L8Pn5l21K57lJ47k23K10l0k31J57q5
$$ 68 -31 215 -30 201 -150 7 132 18 -212 9 47 54 -1 -322 -65 -68 79 -144 66 36 -195 -38 -123
8095a23K71j63L2j1j09K90k63M2J57k12M8K30N8j74Q3l01K00rk52K95l76K91q6
$$ -123 148 -15 17 6 -103 187 -76 -34 123 -89 -41 189 247 73 156 -145 55 46 -206 89 -287 4 -82
8118h2j4j82L03k5j41Q0m0M30r0j35k16J57m2OJ42j96n5O4K06l0M5j33q1J03j24
$$ -82 -96 -278 25 0 -141 -61 -101 329 239 104 -112 45 3 9 151 -45 -100 -36 170 140 185 52 -29 74 -50
8143e0J93k00J61O4K36n04K74K21k72r9j93K9K08k60L60n2m3j14j3J18m64L25
$$ -50 143 -57 104 168 404 -100 174 395 123 24 -169 -140 68 -192 168 116 73 -41 -54 64 -400 -75
8165g5N1L4j03O7J10N0j70K28l61K50j32j16K68Kj33N5j33K28p2L6pk60J80J63
$$ -75 -24 10 -93 -26 84 134 -36 192 -169 81 -51 -167 101 103 -30 25 -108 120 48 84 77 -183 -3 160
8189A60l89L04
$$ 160 -229 75
8191G5
$$ Imaginary data points
##PAGE= N=2
##DATA TABLE= (X++(I..I)), XYDATA
0@%%%%%%%%%%%%qJ6j6J6j6K1k9L2l6M4m8N5o3P2q5R3j04J19j34J51j70J91k13
$$ 0 0 0 0 0 0 0 0 0 0 0 0 0 -8 8 -8 8 -8 13 -16 16 -20 24 -24 31 -32 40 -45 48 -56 63 -71 80 -90 101 -112
35a12K36k64K95l27L62l99M42m91N43o01O68p43Q25r21J035j168J329j526J769
$$ -112 124 -140 155 -172 190 -209 233 -258 285 -316 352 -391 434 -487 548 -620 709 -817 952
54I52k089K528l167M187o063J0622m0128m5599J29635O4889j00858j09957J3499
$$ 952 -1137 1391 -1776 2411 -3652 6970 -33158 -78757 50878 115767 14909 -95048 -81549
67h1549K7747N035N6416P5005k6208p3244j9255j7366o6832O197J27908Q6758
$$ -81549 -53802 -48767 7649 82654 56446 -16798 -36053 -53419 -120251 -114054 13854 100612
79A00612m8238n5211m053n0284q1155L0664J18275M7569k9609o940j1466p6644
$$ 100612 52374 -2837 -6890 -57174 -138329 -107665 10610 58179 28570 21630 10164 -66480
91f6480n7134M0324N9230J8984K8769K2687o2256q6785J4525O6689K78j7321N4398
$$ -66480 -123614 -83290 -24060 -5076 23693 46380 -15876 -102661 -88136 -21447 -21169 -38490 15908
104A5908M0390o9251q7287J107L6932J8324M4090N7151j6424o7675k2964L17l8670
$$ 15908 56298 -12953 -100240 -99133 -62201 -43877 213 57364 40940 -26735 -49699 -49382 -88052
117h8052j1642Q1617P6214k2913m8177o626k8148n6401J6211Q4848L3225k7221
$$ -88052 -99694 -18077 58137 35224 -12953 -19579 -47727 -104128 -87917 -3069 30156 2935
129B935L05O299n7201n3355L8040O3096O018k442K2262k6694p4604j2102O1415
$$ 2935 3240 9539 -47662 -101017 -62977 119 6137 3695 25957 -737 -75341 -87443 -26028
142b6028K9221q092L1594L0516n6583q1724j10M2331J0116J8327N5983J2073o1106
$$ -26028 3193 -4899 26695 57211 628 -81096 -81206 -38875 -28759 -10432 45551 57624 -3482
155c482m3717P359n269j3218M3211O2706p342m7015j2599l880l0967N15N9570
$$ -3482 -47199 -39840 -45109 -58327 -15116 47590 40248 -6767 -19366 -23246 -54213 -53698 5872
168E872L7110k3977j9016N632k4610l9042J8966N5420J5444j1693L489j3969n2075
$$ 5872 42982 19005 -11 5621 -18989 -58031 -39065 16355 31799 20106 23595 9626 -42449
181d2449k1257M0859L6817K532J4976K0819l3176o2351j0948L1252J2486J0406
$$ -42449 -63706 -22847 13970 16502 31478 52297 19121 -43230 -54178 -22926 -10440 -34
193c4L8779J7947m0460m0782J611M848o161K7616M6300l099m1423j5656M460j6260
$$ -34 38745 56692 16232 -24550 -22939 -18091 -24252 3364 49664 46565 5142 -10514 -6054 -22314
207b2314m569M2405L6480j6356k6741l028j3004k6105J3340M7033J8427j4483
$$ -22314 -26883 15522 52002 35646 8905 5877 -7127 -33232 -19892 27141 45568 31085
219C1085m908p738l6486k3185K7958L8045O915L113J2061j6529m3983j4868K2485
$$ 31085 26177 18439 -18047 -41232 -13274 24771 31686 34799 46860 30331 -13652 -28520 -6035
232f035J6296O639K2114J3785k6988l3957o28R935n42J5798L1641J021l2240j8378
$$ -6035 10261 16900 39014 52799 25811 -8146 -8774 1161 619 16417 48058 49079 16839 -1539
246a539L049n252j608K8220K8578r076k4141q002r375j6151R381L7427J8441j1841
$$ -1539 1510 -3742 -5350 22870 51448 42372 18231 10229 854 -15297 -5916 31511 49952 38111
260C8111r455o020k3941k1115J6750L2371R964j046N508j0679l3133j5532J9041
$$ 38111 28656 22636 -1305 -22420 -5670 26701 36665 35619 41127 30448 -2685 -18217 824
273H24J7267L518J1223J1154j8160k9568m410J2738M769P187K0017M065k4620
$$ 824 18091 21609 32832 43986 25826 -3742 -8152 4586 9355 16542 36559 40624 16004
286A6004k0743J287L597R22J6861K2245l591k3368j3403m618q043M110K5868K0225
$$ 16004 -4739 -3452 145 1067 17928 40173 36582 13214 -189 -4807 -12850 -8740 17128 37353
300C7353o611j4313q811j3231j4704O478K3591J3905o7j821r153k0195j3303R217
$$ 37353 30742 16429 7618 -5613 -20317 -13839 9752 23657 23590 21769 12616 -7579 -20882 -11665
314a1665J5610O853M331L467j0236j8992o656P529Q547Q024R217o30j6732j6249
$$ -11665 3945 10798 15129 18596 8360 -10632 -17288 -9759 -1212 6812 16029 15399 -1333 -17582
328a7582k460M270O410J4178J4096k474j6745j3767p178m720N921J9668J4910
$$ -17582 -20042 -15772 -9362 4816 18912 16438 -307 -14074 -21252 -25972 -20051 -383 14527
341A4527k007r703q739j1882j0657M956J6763J1086J050j701o332j4038r073O020
$$ 14527 12520 2817 -5922 -17804 -28461 -23505 -6742 4344 5394 3693 -2639 -16677 -25750 -19730
355a9730J1743N803J501O10q230j2876m090P929J0597P296N147j719j3938j5145
$$ -19730 -7987 -2184 -683 -73 -8303 -21179 -25269 -17340 -6743 553 5700 3981 -9957 -25102
369b5102l964N464Q938J2336J1588P39j2281j4041p264k201M155J2807J2773J706
$$ -25102 -29066 -23602 -14664 -2328 9260 9999 -2282 -16323 -23587 -25788 -21633 -8826 3947 5653
383E653p151q037p117o006K411J0128R068Q44l615n180o148l425L818R213O434
$$ 5653 -1498 -9535 -16652 -22658 -20247 -10119 -1051 -207 -3822 -9002 -15150 -18575 -14757 -5544 890
398H90k15m820p449p792l119N100J2464J0925L482l546j0159j1999q829J318R748
$$ 890 675 -4145 -11594 -19386 -22505 -17405 -4941 5984 9466 5920 -4239 -16238 -25067 -23749 -14001
413a4001J2055P630J441m897r881r276k469N127Q250O274J576l173o283o020j59
$$ -14001 -1946 5684 7125 2228 -7653 -16929 -19398 -14271 -6021 253 1829 -1344 -7627 -13647 -13806
428a3806N218N504M240P48m502p534m736J432O342P887O544Q57p281r923p441
$$ -13806 -8588 -3084 1156 1904 -2598 -10132 -14868 -13436 -7094 793 7337 8194 913 -9010 -16451
443a6451k564L211J0106J1394N554k739p107q714p680j387N699Q221N105J492
$$ -16451 -19015 -15804 -5698 5696 11250 8511 1404 -7310 -14990 -16377 -10678 -2457 2648 4140
457D140j624m636n388r43M570N375K712r84l348n199k923K314N685M753M016L87
$$ 4140 2516 -2120 -7508 -8451 -3881 1494 4206 3222 -126 -5325 -8248 -5934 -249 4504 8520 8907
473H907n967q668n350K072N159P982Q347K450o100q176o043m865L78Q130J0299
$$ 8907 2940 -5728 -11078 -9006 -3847 4135 12482 14932 8832 656 -5387 -10252 -9874 -1744 8555
488H555M542j585k204m551o552j463O133M975j37r78K22l089l892K432O906L352
$$ 8555 13097 11512 9308 4757 -1795 -3258 2875 7850 7713 6735 6957 3868 -24 2408 9314 12666
504A2666m82l39m103p916l304N231O468K326M001L619n320j1349l980L242J901
$$ 12666 12184 11845 7742 -174 -3478 1753 8221 10547 14548 18167 12847 1498 -2482 760 2661
519B661M036R145N311n013o966k595l246m127M197R077K538l975k96P90m604l736
$$ 2661 6697 15842 21153 16140 9174 6579 3333 -794 3403 12480 15018 11043 10747 11537 6933 3197
535C197N786O359k815n106r07j534m514J692Q387M453j207p71k515q635n940M434
$$ 3197 8983 15342 12527 7421 6514 4980 466 2158 10545 14998 13791 13020 10505 1870 -4070 364
551C64P155J838K690M306k980j0646n057K795J604R05N887N297l592n107j303
$$ 364 7519 9357 12047 16353 13373 2727 -2330 465 2069 2974 8861 14158 10566 5459 4156
566D156j681m036K554O576j201n677L62L233l640k786O520O103m159n496L29k815
$$ 4156 2475 -1561 993 7569 6368 691 1053 4286 646 -2140 4380 10483 6324 828 1157 -1658
582a658o423K225J0244K896l128J830Q51r862q509N885P016k405J332Q669j232
$$ -1658 -8081 -5856 4388 7284 4156 5986 6837 -3025 -11534 -5649 1367 -1038 294 8963 7731
597G731j2765m522O856Q32n561N048Q219l990p787K599L681n538j346Q899J609
$$ 7731 -5034 -9556 -2700 -1868 -7429 -2381 5838 1848 -5939 -3340 341 -5197 -6543 2356 3965
612C965j0832l656P681M66n667M659J0373k576q346l17R57p628k258J1149P313
$$ 3965 -6867 -10523 -2842 -2376 -8043 -3384 6989 4413 -3933 -4250 -3293 -10921 -13179 -2030 5283
627E283n395j831M152m286r658J668P105m34r16O793K359j0568m980P721K688
$$ 5283 -112 -1943 2209 -2077 -11735 -10067 -2962 -3396 -4312 2481 4840 -5728 -10708 -2987 -299
642b99o612k8Q198j485p417J752N429l579j697Q351K794j1257o278P191K647n977
$$ -299 -6911 -6939 1259 -226 -7643 -5891 -462 -4041 -5738 2613 5407 -5850 -12128 -4937 -2290 -8267
658h267L181J0263r51q260J204K055r372m880J2371Q235p412l903P319j16j0703
$$ -8267 -5086 5177 4226 -4034 -2830 -775 -10147 -15027 -2656 5579 -1833 -5736 1583 1467 -9236
673i236r48Q407o64m616O589N533j0433o912J0163O937r840m570R982J269j1014
$$ -9236 -10184 -1777 -2441 -7057 -468 5065 -5368 -12280 -2117 4820 -5020 -9590 392 1661 -9353
688i353j254R755n26n051O889O790j0447j0546O414O128o418j090J0905L274q633
$$ -9353 -10607 -852 -1378 -6429 460 7250 -3197 -13743 -7329 -1201 -7619 -8709 2196 5470 -3163
703c163j140L703n892p627Q274J0701n526p638O565N575q185m615P075J343n695
$$ -3163 -4303 -600 -6492 -14119 -5845 4856 -670 -8308 -1743 3832 -4353 -8968 -1893 -550 -6245
718f245L477N793p237p300R206R338p760p189Q133L992j1154m159J0091K722n965
$$ -6245 -2768 3025 -4212 -11512 -2306 7032 -728 -7917 216 4208 -6946 -11105 -1014 1708 -4257
733d257M532R143o833j2270M324P790o063m847J0994O737q804l791P402k169j0323
$$ -4257 275 9418 2585 -9685 -5361 2429 -3634 -8481 2513 9250 446 -3345 4057 1888 -8435
748h435L773J2476l534j0463M985R852n769p619O733N327o457k440O365k338q779
$$ -8435 -4662 7814 4280 -6183 -1198 8654 2885 -4734 1999 7326 869 -1571 4794 2456 -6323
763f323N250J2256l255r438M908O691q971q533P841O924n480k52R322q62j0971
$$ -6323 -1073 11183 7928 -1510 3398 10089 1118 -7415 426 7350 1870 1618 10940 10078 -893
778h93m38P367k700o409O771P217n896m876O937J600r384j33J0023r64j0457J360
$$ -893 -1331 6036 3336 -3073 3698 10915 5019 143 7080 8680 -704 -837 9186 8222 -2235 -875
794h75R705k214p583N123P054n662n082M485k87q926K777J1053q81r152M053Q519
$$ -875 8830 6616 -967 4156 11210 5548 466 4951 4664 -4262 -1485 9568 8687 -465 3588 12107
810A2107q449j0708O435Q426n630m329R202L489r769l582P766n25q113L578Q028
$$ 12107 3658 -7050 -615 7811 2181 -2148 7054 10543 774 -2808 4958 4433 -3680 -102 7926
825G926m677p523O412O293p832n356R639L279j0646m537R480J477p563K168R102
$$ 7926 3249 -4274 2138 8431 599 -4757 4882 8161 -2485 -7022 2458 3935 -3628 -1460 7642
840G642j852q423K146L170o424l096Q272L924o866k25P576j996r987J040Q032
$$ 7642 5790 -2633 -487 2683 -3741 -6837 1435 5359 -1507 -1732 5844 3848 -6139 -5099 2933
855B933j991n663M234N254m850m369N120J644n380m12O154k081o344K903P102
$$ 2933 942 -4721 -487 4767 -83 -4452 668 2312 -3068 -3480 2674 593 -5751 -2848 4254
870D254l777m949N635M261p281n242N586K441n118R86P816q73n958J276L692n258
$$ 4254 477 -4472 1163 5424 -1857 -7099 -1513 928 -4190 -3204 4612 3739 -2219 -943 2749 -2509
886b509m505N645M658m806j509O545K98p797r91P143p62o176K820N628l549m680
$$ -2509 -7014 -1369 3289 -1517 -3026 3519 3817 -3980 -4971 2172 1410 -4766 -1946 3682 133 -4547
902d547M269L844m572k545N367J15o967K30O927k28m476L073M667m555o589L341
$$ -4547 -278 3566 -1006 -3551 1816 1931 -5036 -4806 2121 1893 -2583 490 5157 602 -5987 -2646
918b646L404l911j370O765J739n456q87M005j538n440K041M541j847l452M135
$$ -2646 758 -3153 -4523 2242 3981 -1475 -2362 1643 105 -5335 -3294 1247 -600 -4052 83
933H3K769m897k403M799J212n139k96M472k60m475J913M194k350l033K360J886
$$ 83 2852 -2045 -4448 351 1563 -3576 -3872 600 340 -4135 -2222 1972 -378 -3411 -1051 835
949H35n012k426M797J994k671J017M149j695n826O57K603k380j966M762L080l385
$$ 835 -4177 -6603 -1806 188 -2483 -1466 2683 988 -4838 -4181 -1578 -3958 -5924 -1162 1918 -1467
965a467j784L133Q7m296L25L571j113l042J631L705k285j797K757J718l453k240
$$ -1467 -3251 -118 -31 -4327 -4002 -431 -1544 -4586 -2955 750 -1535 -3332 -575 1143 -2310 -4550
981d550K778O84k538O59L956R5k954J459J175l345k396K132K134j073O35L341
$$ -4550 -1772 -1088 -3626 -2967 989 1084 -1870 -411 764 -2581 -4977 -2845 -711 -1784 -1149 2192
997B192L64l487N3Q04j672k048K656K689j063j028K412N54k351r30K074K62l069
$$ 2192 2556 -931 -878 -74 -1746 -3794 -1138 1551 488 -540 1872 2426 75 -855 1219 1481 -1588
1014a588M13K923n91j472K512K078j905k530Q15M42k219l5L698J207q85L05R36
$$ -1588 -1175 1748 1157 -315 2197 4275 2370 -160 655 1097 -1122 -1157 2541 3748 2863 3168 4104
1031D104j871l107P30J522m26j46K167J848j646j232J024o11j564k03J375L2j197
$$ 4104 2233 -874 -144 1378 952 806 2973 4821 3175 1943 2967 2356 792 589 1964 1996 799
1048G99J211K030o57p84M21j9j954j052J320J87p48J351J941k66j411l33J3j892
$$ 799 2010 4040 3383 2599 3020 3001 1047 -5 1315 1502 754 2105 4046 3780 2369 2036 2049 157
1066A57j284J268J757N11L66O33o48j978n75j73M12p49Q02P83Q9k00K66K59m17
$$ 157 -1127 141 1898 2409 2775 3408 2760 782 207 34 446 -303 499 1282 1371 1171 1437 1696 1279
1085A279p65q34l88m03P8R08J407N17N99j162j218q82k88k94j70R56J718J78k17
$$ 1279 514 -320 -708 -1111 -1033 -125 1282 1799 2398 1236 18 -864 -1152 -1446 -1616 -660 1058 1236 1019
1104A019j99q12r46l79l10K86K26R49P43M04o45j68q89k42l93j51M00M18J38N78
$$ 1019 820 8 -938 -1317 -1627 -1341 -1115 -166 577 981 336 168 -721 -963 -1356 -1507 -1107 -689 -551 27
1124B7M41M12k39m49j070n58q72L34J255R75O48L27j51q13j097p88M1N53O01P43
$$ 27 468 880 641 192 -878 -1436 -2308 -1974 -719 256 904 1231 1080 267 -830 -1618 -1577 -1024 -423 320
1144C20Q46k9n42k34nj057l53J58J22M56M01Q65Q6n37L85m45j126p44O68O47n9
$$ 320 1166 1137 595 361 356 -701 -1054 -896 -774 -318 83 948 1034 497 882 437 -689 -1433 -765 -118 -177
1165a77K78J308L51p12r70k80n67o84KJ330L65K81P00M8j001j126j0M97r13J51
$$ -177 101 1409 1760 1048 78 -202 -769 -1453 -1451 -121 244 525 1225 1273 272 -854 -864 -367 -1280 -1129
1185a129J100K92j3m6L87o37o72m65j38k17J6R02L21J17O11Qp61j479l06R14n41
$$ -1129 -29 263 250 204 591 -46 -718 -1183 -1321 -1538 -1522 -620 -299 -182 429 437 -324 -1803 -2109 -1195 -1736
1206a736n59J200J728r42n14L5j7j331l46R01m6K08Q88J47p01m91P49j22j480
$$ -1736 -2295 -1095 633 -309 -823 -788 -805 -2136 -2482 -1581 -1627 -1419 -531 -384 -1085 -1576 -827 -949 -2429
1225b429o5J052M88q86L30J317lr78p6mq39m48J038N06k36L96J252p64j106M6
$$ -2429 -2494 -1442 -954 -1840 -1510 -193 -196 -1174 -1250 -1254 -2093 -2541 -1503 -997 -1233 -837 415 -349 -1455 -1409
1245a409Q75j036m51J124J402q86n96R84J6q41R8j30Qj35R87P78j202q0J342L2
$$ -1409 -534 -1570 -2021 -897 505 -381 -977 7 23 -818 -720 -850 -842 -977 10 788 -414 -494 848 880
1265H80j195l98J271J28j094K91J540j46j101J225K38j454j096J500M13p72L96
$$ 880 -315 -713 558 686 -408 -117 1423 1277 176 1401 1639 185 -911 589 1002 230 626
1282F26J523m80j820O25R13p08j309J451J173l40j035R83N67j667j30P80k5q16
$$ 626 2149 1669 -151 474 1387 679 -630 821 1994 1654 619 1602 2169 502 372 1152 1127 311
1300C11R04J301j607n41J180R95j731j180R97R68r83l13J257N8o08J06O72j050
$$ 311 1215 2516 909 368 1548 2543 812 -368 629 1597 614 301 1558 1616 1008 1114 1786 736
1318G36j478Q16J384o45m09J111J51j232J7M90o42j256O42K068n56j202N77L90
$$ 736 -742 74 1458 813 404 1515 1666 434 451 941 299 -957 -315 1753 1197 -5 572 962
1336I62o26n03M48n14q36Q05J445j151j127J954J090j892j574J119K40j136K3
$$ 962 336 -167 281 -233 -1069 -264 1181 30 -1097 857 1947 55 -1519 -400 -160 -1296 -1273
1353a273J715J39j020Q77J347j993k089J478J296j356j178K759Q56j847n40K134
$$ -1273 442 581 -439 438 1785 -208 -2297 -819 477 -879 -2057 702 1558 -289 -829 1305
1369A305j173k543J057K123n24j828J041K211r33j316P29L65j741L2J314p9r95
$$ 1305 132 -2411 -1354 769 245 -1583 -542 1669 736 -580 149 514 -1227 -1195 119 40 -955
1386i55J442J841p48k173N33O54j114j089J408R64j157P75J787n82j787k68J293
$$ -955 487 2328 1580 -593 -60 594 -520 -1609 -201 763 -394 381 2168 1586 -201 -469 824
1403H24j163j135J558J571j160k25J433l58j831j32J822p94j692P10K624q01q23
$$ 824 -339 -1474 84 1655 495 270 1703 1345 -486 -618 1204 410 -1282 -572 2052 1251 428
1420D28P68M88j587r88J371m63j698J705K564j300j560O73J384j814j322J163
$$ 428 1196 1684 97 -891 480 17 -1681 24 2588 1288 -272 401 1785 -29 -1351 -188
1436a88N83j245K39K242%k142O84J127j310k135J205J551j081o43K041O23k243
$$ -188 395 -850 -611 1631 1631 -511 173 1300 -10 -2145 -940 611 -470 -1113 928 1551 -692
1453f92p34J737m64k351M96J905m0j314J544J084r62j872Q83J34k117M8K740n8
$$ -692 -1426 311 -153 -2504 -2008 -103 -143 -1457 87 1171 209 -1663 -780 -646 -2763 -2715 25 -33
1471c3j494Q12J884j294j901N74Q95j304q46K151R80j535l8J904j079k017M87
$$ -33 -1527 -715 1169 -125 -2026 -1452 -557 -1861 -2707 -556 424 -1111 -1149 755 -324 -2341 -1854
1488a854J132j071r79K118J451j321q06J779n9k307l64J886n1j905J252K280q68
$$ -1854 -722 -1793 -2772 -654 797 -524 -1330 449 390 -1917 -2281 -395 -446 -2351 -1099 1181 313
1505C13j166O95M51j596j023J609J052j429M15K421o36j709K6J845j776j814J813
$$ 313 -853 -158 293 -1303 -2326 -717 335 -1094 -679 1742 1106 -603 -577 1268 -508 -2322 -509
1522e09J440j344k67J827N74j752l68J204l08j964Q52J851o88o36J311J010j893
$$ -509 931 -413 -680 1147 1721 -31 -399 805 497 -1467 -615 1236 548 -88 1223 2233 340
1539C40j047J549j49j644M16K116o8j249Q74J211j233j780J129K93r33j68K096
$$ 340 -707 842 693 -951 -535 1581 1513 264 1138 2349 1116 -664 465 758 -175 -343 1753
1556A753L99j648n7J608o59k361M93J583q93q54J705R15j412k94J090r1k367M31
$$ 1753 2152 504 447 2055 1396 -965 -472 1111 218 -636 1069 1984 572 278 1368 1277 -1090 -659
1574f59J672q48j004J374J538r44j707J037P14j869p93J758P09j676M38J739n91
$$ -659 1013 165 -839 535 2073 1129 -578 459 1173 -696 -1489 269 978 -698 -260 1479 888
1591H88j531L55R98j329r43J405O49r73k63J777%j873j81J221l60j070K34J600
$$ 888 -643 -288 710 -619 -1562 -157 492 -481 -744 1033 1033 -840 -1021 200 -160 -1230 -996 604
1609F04p13q28J256M97j351q33J149R0j172N62J201J09j463J287K38j038p32P19
$$ 604 -109 -937 319 816 -535 -1368 -219 -129 -1301 -739 462 571 -892 395 633 -405 -1137 -418
1627d18O64q84o9J210L12q81j44P95n74r23Q08P21q74n08J296M50q60n16J348
$$ -418 246 -638 -707 503 815 -66 -210 585 11 -912 -104 617 -257 -765 531 981 121 -395 953
1646I53k87j395J7J445k95n31P27N30p51n79P21J28j210J90J442l33q52N01R09
$$ 953 666 -729 -712 733 438 -93 634 1164 413 -166 555 683 -527 -337 1105 772 -80 421 1330
1665A330o56o69J51P24o80j72O74R6m24M31L78k24j321M57Q43l15j098R71J052
$$ 1330 674 5 156 880 200 28 702 798 374 805 1183 959 -362 95 938 623 -475 496 1548
1684A548j087n84N12N26r99o02J030O3m37J28N48N0j003K94K77k51p10O49L90
$$ 1548 461 -123 389 915 -84 -686 344 407 -30 98 646 696 -307 -13 264 13 -697 -48 342
1703C42m81j09M20Q4q70j24M36j29p50N61Q02m10n17O94J2q21n6K79j05k34K33
$$ 342 -139 -248 172 256 -614 -738 -302 -431 -1181 -620 182 -228 -745 -51 -39 -860 -916 -637 -742 -976 -743
1724g43P06j72o87L85k8k90l63K01N14n25K70L01M6o09K22J36m93j93L04M46j79
$$ -743 -37 -209 -896 -511 -539 -829 -1192 -991 -477 -1002 -732 -431 -385 -994 -772 -636 -1129 -1322 -1018 -572 -751
1745g51k01P69k8k23k53L21m53l28M63K89j68M28j3j97R6k83J79J55o73M90K66
$$ -751 -952 -183 -211 -434 -687 -366 -819 -1147 -684 -395 -563 -135 -148 -345 -249 -532 -353 -198 -871 -381 -115
1766a15J45j86J69L19m06n79M25j4N8Q4M91pk6L85j53l82n03K17l3m6K35P41K43
$$ -115 30 -156 13 332 -74 -653 -228 -242 -184 -100 391 384 358 743 590 208 -295 -78 -111 -157 78 819 1062
1789A062o07M5p3O3p59K36p0M23R4K02N9K00k86P5l47l57j98N19j3N8M05K88k23
$$ 1062 455 500 427 490 -269 -33 -103 320 414 616 675 875 589 664 317 -40 -238 281 268 326 731 1019 796
1812G96k14l15m84N32n87L48L64K67j50l98N99n12k75K0j24R7n01Q24K82J21n45
$$ 796 582 267 -217 315 -272 76 440 707 557 159 758 246 -29 -9 -133 -36 -537 287 569 690 145
1833A45p4J60m50l46K26m1K56J9L47L07o30j83P6k43k34K0K49M04Q0j06M0j21
$$ 145 71 231 -219 -565 -339 -380 -124 -105 242 549 -81 -264 -188 -431 -665 -645 -396 8 88 -18 22 -99
1855i9n89p3K79l60Q0N23K73J41l13K74k98k57k72j74K24j6L37K54j36M88k57
$$ -99 -688 -761 -482 -842 -762 -239 34 175 -138 136 -162 -419 -691 -865 -641 -657 -320 -66 -202 286 29
1876B9j93j33m85N2K84J10Q0O02M1j04J78p47j26J38J11P4K05KK83J58k60l7m0
$$ 29 -164 -297 -782 -730 -446 -336 -256 346 387 283 461 -286 -412 -274 -163 -89 116 118 401 559 299 262 222
1899B22m40l32M59L71R4r1O04n00K32l38m9n65L77Q3M85L35o66N02M94r84j81
$$ 222 -218 -550 -91 280 374 283 887 387 619 281 232 -333 44 127 612 947 281 783 1277 293 112
1920A12K59j07r6J58K46J16k80M68K13n70n69R4J3k31K54L39O06l91PJ52k76m17
$$ 112 371 264 168 326 572 688 408 876 1089 519 -50 44 57 -174 80 419 1025 634 641 793 517 100
1942A00J86m97J74M5L93j02K1%J12n70l39L74J70k62k45N04J26Q7k15J15q9l00
$$ 100 286 -211 -37 8 401 299 320 320 432 -138 -477 -103 67 -195 -440 64 190 277 62 177 88 -212
1964b12k61K93j47p8L92M19p65m55M32J43l07l06M75K15j58J51M63m52j48n48
$$ -212 -473 -180 -327 -405 -13 406 -359 -814 -382 -239 -546 -852 -377 -162 -320 -169 294 -158 -306 -854
1984h54N48n74M9M13j62L47l0J58j19m55j00L50j9o33O14L43j3j08J34k4l83j18
$$ -854 -306 -880 -831 -418 -580 -233 -263 -105 -224 -679 -779 -429 -448 -1081 -467 -124 -137 -245 -111 -135 -518 -636
2006f36O3K58m37O31M81j67n77M80Q8k95m12K24L61l58L30K21q7k55L63N9p82
$$ -636 -573 -315 -752 -121 360 193 -384 96 184 -111 -523 -299 62 -296 34 255 168 -87 276 335 -447
2027d47L36J92K33k70J86M15l36o7N2N74l85r51P51J27K09m96N26lk87qJ28L5
$$ -447 -111 81 314 44 230 645 309 242 294 868 483 -468 283 410 619 123 649 646 359 351 479 514
2049E14o43K79P01r6o01M32J93l96o09L83K14j61k77O75K03n47J09K11j48l74
$$ 514 -129 150 851 755 154 586 779 383 -226 157 371 210 -67 608 811 264 373 584 436 62
2069F2N2K75n15r6O37M4l40p1N19m90k16K6K07n7k8K7L21j82l09M27p65rK9M13
$$ 62 114 389 -126 -222 415 459 119 48 567 77 -139 -113 94 37 9 36 357 175 -134 293 -472 -481 -452 -39
2093c9P7k86K56L42l90n27P9M73p21K12L88L9k06L19K00k48o36L13L36n12k23
$$ -39 38 -248 8 350 -40 -567 -488 -15 -736 -524 -136 -97 -303 16 216 -32 -668 -355 -19 -531 -754
2114g54M02L14k4j31K34l68m44J02K09K29k37P2L89K0m94L33N5m87r4N52J8l04
$$ -754 -352 -38 -62 -193 41 -327 -771 -669 -460 -231 -468 -396 -7 13 -481 -148 -93 -580 -674 -122 -104 -408
2136d08J92P62j74p97K30L05o62m3K90N72l36j55O94l28M6j96L13k25m51L39M66
$$ -408 -216 546 372 -425 -195 110 -552 -595 -305 267 -69 -224 470 142 188 -8 305 80 -371 -32 434
2157D34j02j43J60L97o65m15P60l71L9j15N19Rm53N24J40m80l7J2l0m8J48M23
$$ 434 332 189 349 746 81 -334 426 55 94 -21 498 507 54 578 718 238 201 213 183 135 283 706
2179G06q9l25q0M63o23k36K63N28n25j73P05l08k4J17N20n48j037O74K54l27j70
$$ 706 617 292 212 675 52 -184 79 607 82 -91 614 306 282 399 919 371 -666 8 262 -65 -235
2200b35O24O1l01k37L61j2p67j7M84K35k98L29j9p7l21oj34l76L66P8L59l24k3
$$ -235 389 450 149 -88 273 261 -506 -523 -39 196 -102 227 208 131 -190 -196 -330 -706 -340 -262 97 -227 -250
2223b50N40m29q80M54M11m11J09J48K58l59K86K60j18m20J37j12j00j33MP10l04
$$ -250 290 -139 -1019 -565 -154 -565 -456 -308 -50 -409 -123 137 19 -401 -264 -376 -476 -609 -605 105 -199
2244a99l43O8M62p40Q7J71K30j69j8N78o4m34K07J05l41k52P12J02m46J56K99
$$ -199 -542 -474 -12 -752 -665 -494 -264 -433 -451 127 63 -371 -164 -59 -400 -652 60 162 -284 -128 171
2265A71J16n24J02L33l05j27J79Q0l4k84M41O40o84k15M96m05j89P5M96k84J42
$$ 171 287 -237 -135 198 -107 -234 -55 25 -9 -293 148 788 104 -111 385 -20 -209 -134 362 78 220
2286B20lJ36j99m56K63J58P5k63O18j2k43J56j05J00k76j88L12l26R2N34k1j06
$$ 220 217 353 154 -302 -39 119 194 -69 549 537 294 450 345 445 169 -19 293 -33 59 593 572 466
2308D66l26M02l02j35R5J88%j55N26r4m75m7J72k6k23k42L94P5l63K23L70L0o19
$$ 466 140 542 240 105 200 388 388 233 759 665 190 143 315 289 66 -176 218 293 -70 153 523 553 -66
2331f6P9L22p11J97K91N3Mj16K25k07n3j00O1m58m1J98K56j08P3J80l2k32k76
$$ -66 13 335 -376 -179 112 165 169 53 278 71 18 -82 -21 -479 -520 -322 -66 -174 -101 79 47 -185 -461
2354d61L42j80q8L64j02O1k07M75k01l48j93l4K28m8m0K47K66o49K21J60N0k72
$$ -461 -119 -299 -387 -23 -125 -64 -271 204 3 -345 -538 -572 -344 -392 -432 -185 81 -568 -347 -187 -137 -409
2376d09K23PPJ99P0J59o18R7J05l52K43j3O6K32j61l1L18l60KJ12J82j58j51L69
$$ -409 -186 -179 -172 27 97 256 -362 -265 -160 -512 -269 -282 -216 16 -145 -176 142 -218 -216 -104 78 -80 -231 138
2400A38l1Q8k7j7k21l4L08m5j12n3K37J61r3O6J31n7m90K92M7j55Q7K17R9Jl5
$$ 138 107 195 168 151 -70 -104 204 159 47 -6 231 392 299 365 496 439 -51 241 288 133 220 437 536 537 502
2425E02k76j26J68J98J46l29Q4J37J41l95L26n21J85k66K02J57O9mk57L25j18
$$ 502 226 100 268 466 612 283 367 504 645 250 576 55 240 -26 176 333 402 398 141 466 348
2446C48m54K83o9j09k47J2N38M2j85R0k79J09j04P6J59m87J47K22O6J59n10K41
$$ 348 -106 177 108 -1 -248 -236 302 344 159 249 -30 79 -25 51 210 -277 -130 92 158 317 -193 48
2468D8l61J20N3j08J49k71K02K13l4%m15P5J28l84J05J19L60l38J12NK89k57j72
$$ 48 -313 -193 -140 -248 -99 -370 -168 45 11 11 -404 -329 -201 -585 -480 -361 -1 -339 -227 -222 67 -190 -362
2491c62l70J46K10m0K49J13j40J57l87k3P0J72q8m5L7O0P9R9q4m23M09r7k01K48
$$ -362 -732 -586 -376 -416 -167 -54 -194 -37 -424 -447 -377 -205 -293 -338 -301 -241 -162 -63 -147 -570 -161 -258 -459 -211
2515b11J12J08r5R1j73K58k17j47j51pM99j53K35M4p5k48J81k77k6J22N9J61P5
$$ -211 -99 9 -86 5 -168 90 -127 -274 -425 -432 67 -86 149 193 118 -130 51 -226 -252 -130 -71 90 165
2538A65L14r6k9j55m9j26R2j88K54m5K5K03k06J4j9k54p1K9J51J3L91N8k03l5
$$ 165 479 383 354 199 150 24 116 -72 182 137 162 365 159 173 154 -100 -171 -142 9 22 413 471 268 233
2562B33j86J5q3Q4Q7J25j15m1Q5N5J0j33J52j15j78j43J41KK82m5k6l0j6k75k21
$$ 233 47 62 -21 63 150 275 160 119 204 259 269 136 288 173 -5 -148 -7 -5 277 232 206 176 160 -115 -336
2587c36J8J06L96l43j96M45k43J09K78l52k94Q0N5K7J10K26j2ql35K17k63J65
$$ -336 -318 -212 184 -159 -355 90 -153 -44 234 -118 -412 -332 -277 -250 -140 86 74 66 -269 -52 -315 -150
2609a50l1P5r2L7o9K53j79j07M7k51K46l54J69J73M87n92J15k07L56n82M31n9
$$ -150 -181 -106 -198 -161 -230 23 -156 -263 -216 -467 -221 -575 -406 -233 254 -338 -223 -430 -74 -656 -225 -284
2631b84k13M80j45K45m73J28L2J28l29J01L84k93J97l3l1n6L31n92J80J20J88
$$ -284 -497 -17 -162 83 -390 -262 -230 -102 -431 -330 54 -239 -42 -75 -106 -162 169 -423 -243 -123 65
2652F5j41J63m0M39m05q9L03mk94l3J59j00N27l63M03om45K88r1J22l26p1J50
$$ 65 -76 87 47 486 81 -8 295 291 -3 -36 123 23 550 187 590 584 139 427 336 458 132 61 211
2675B11M3k74N74j62l02L22j83j43O7K35m8J60k13J26J9%k07R8P5j30j38K05k49
$$ 211 254 -20 554 392 90 412 229 86 153 388 340 500 287 413 432 432 225 323 398 268 130 335 86
2698H6J07J30K53l05k76J6L24l62Q4L6J30Q7l54L93l35j05J52J76m52L03o6K65
$$ 86 193 323 576 271 -5 11 335 -27 57 93 223 310 -44 349 14 -91 61 237 -215 88 22 287
2720B87l60k30M49j65j04k0J00K73l36k1J05J44m31L14j61Oj22o0L95m23L42j3
$$ 287 -73 -303 146 -19 -123 -143 -43 230 -106 -127 -22 122 -309 5 -156 -150 -272 -332 63 -360 -18 -31
2742c1j51k51R9N01n96J04L2J46p8J28l47L86k52L7O1K01l59M29o8k06L46j63
$$ -31 -182 -433 -334 167 -429 -325 -293 -147 -225 -97 -444 -58 -310 -273 -212 -11 -370 59 -9 -215 131 -32
2764c2j52m4Km1qK46J02q3R2k91J03K26k21k93M09m7n6L91j90k66j43J52P4k68
$$ -32 -184 -228 -226 -267 -275 -29 73 -10 82 -209 -106 120 -101 -394 15 -32 -88 303 113 -153 -296 -144 -70 -338
2788c38M73j04L29j62j30jK8J80j43j82j22K24J52L4K06m84J39R3o7j25M47k30
$$ -338 135 31 360 198 68 67 95 275 132 -50 -172 52 204 238 444 -40 99 192 125 0 447 217
2810B17l25L09j04K4j15K09p2R2j86k03N01k77o8L97j79k84K3j1o5o2L76Mm80
$$ 217 -108 201 97 121 6 215 143 235 49 -154 347 70 2 399 220 -64 -41 -52 -117 -179 197 201 -279
2833b79J41L36j91O7m31K77J8k49N32k58J44k76M7J28r5m30J82j36K81J78J38
$$ -279 -138 198 7 74 -357 -80 -62 -311 221 -37 107 -169 -122 6 -89 -519 -337 -473 -192 -14 124
2854A24k59k34J95jj24m0p1J96l1J11j44l01K30j14J10Q1k38L40J22m33j48L28
$$ 124 -135 -369 -174 -175 -299 -339 -410 -214 -245 -134 -278 -579 -349 -463 -353 -272 -510 -170 -48 -481 -629 -301
2876c01J87m2J0k6J97m30j9K30l0K54m72M95k15p0j08K73l2m05N07j53k2L83j12
$$ -301 -114 -156 -146 -172 25 -405 -424 -194 -224 30 -442 53 -162 -232 -340 -67 -99 -504 3 -150 -172 211 99
2899I9M9k75l9M09l41O6K16k38n4N1K14L29k93k96L23j12R0l64L07K18l53K62
$$ 99 148 -127 -166 243 -98 -32 184 -54 -108 -57 157 486 193 -103 220 108 198 -166 141 359 6 268
2921B68jk80K99k07J87k63J3L78l0q0K44L3k25m07J06J56K68L7j28K30k91J76
$$ 268 267 -13 286 79 266 3 16 394 364 284 528 561 336 -71 35 191 459 496 368 598 307 483
2943D83j36J01k63J8jL6J98r5J15l52O9k31L19m2k21L01k87J87k7J24L01m55k22
$$ 483 347 448 185 203 202 238 436 341 456 104 173 -58 261 219 -2 299 12 199 172 296 597 142 -80
2966h0K60k26k22K51J69j21L7J88l15n2K13j40N6j38p2L14k6r7R6k20Lo0J6o9
$$ -80 180 -46 -268 -17 152 31 68 256 -59 -111 102 -38 18 -120 -192 122 96 -1 95 -125 -122 -182 -166 -235
2990b35K92k81J21J30Kk92L57m13K1J21P5k71K79J48n61J90K4J88Lj84J31j8J0
$$ -235 57 -224 -103 27 29 -263 94 -319 -298 -177 -102 -373 -94 54 -507 -317 -293 -105 -102 -286 -155 -173 -163
3013a63LK39j19k2p6K14J65l64m7J57j76j17J29J2M9K98j66M1j61J07J44r0j2
$$ -163 -160 79 -40 -62 -138 76 241 -123 -170 -13 -189 -306 -177 -165 -116 182 16 57 -104 3 147 57 45
3036D5j22n7L84k56J1m2J26l16L69l21L33L0j77L59m43J72j04J59K0P3o5oj53
$$ 45 -77 -134 250 -6 5 -37 89 -227 142 -179 154 184 7 366 -77 95 -9 150 170 243 178 172 19
3059A9K26l0k99k9j28N27k76L66n18M48k79o0K10p4j32J75j81j61R2M17l31N3
$$ 19 245 215 -84 -113 -241 286 10 376 -142 306 27 -33 177 103 -29 146 -35 -196 -104 313 -18 35
3081C5j29o3K48j14K1j8j72J74J78k52k13J71K10k51J57l20N36l39q1J8j31L13
$$ 35 -94 -157 91 -23 -2 -20 -192 -18 160 -92 -305 -134 76 -175 -18 -338 198 -141 -222 -204 -335 -22
3103b2J26k23L4p5k4o9J83m11K78K73m46M12l68j17J86j36J78k25L62j42n6Q5
$$ -22 104 -119 -85 -160 -184 -253 -70 -481 -203 70 -376 36 -332 -449 -263 -399 -221 -446 -84 -226 -282 -197
3125a97J9k15J69k05J76J19J72j61l85L69r4j71J97K61k76L6J15m30O24j46k88
$$ -197 -178 -393 -224 -429 -253 -134 38 -123 -508 -139 -233 -404 -207 54 -222 -186 -71 -501 123 -23 -311
3146c11J85o4j90J16L39m82L33J59k20Qm2O7l6L08K4l5j59j15K06k21K67l33K04
$$ -311 -126 -190 -380 -264 75 -407 -74 85 -135 -127 -169 -102 -138 170 194 159 0 -115 91 -130 137 -196 8
$$ [...]
8191d3
##END NTUPLES=NMR FID
##END=
