##TITLE=1H_LR-688B-C4-CHL
 CDCl3, 8 sc, 
 20.9.2019
##JCAMPDX= 6.0         $$ Bruker NMR JCAMP-DX V2.0
##DATA TYPE= NMR FID
##DATA CLASS= NTUPLES
##ORIGIN= UXNMR, Bruker Analytische Messtechnik GmbH
##OWNER= root
$$ XWIN-NMR		Version 3.5
$$ Fri Sep 20 14:51:48 2019 Russian Standard Time (UT+4h)  she@DPX200
##.OBSERVE FREQUENCY= 200.1315
##.OBSERVE NUCLEUS= ^1H
##.DELAY= (6, 6)
##.ACQUISITION MODE= SIMULTANEOUS
##.ACQUISITION SCHEME= undefined
##.AVERAGES= 8
##.DIGITISER RES= 18
##SPECTROMETER/DATA SYSTEM= spect
##.PULSE SEQUENCE= zg30
##.SOLVENT NAME= CDCl3
##.SHIFT REFERENCE= (INTERNAL, CDCl3, 0, 15.7039)
##AUDIT TRAIL= $$ (NUMBER, WHEN, WHO, WHERE, WHAT)
$$ ##TITLE= Audit trail, XWIN-NMR		Version 3.5
$$ ##JCAMPDX= 5.01
$$ ##ORIGIN= Bruker BioSpin GmbH
$$ ##OWNER= she
$$ F:/spectra/data/she/nmr/H-F/1/audita.txt
$$ ##AUDIT TRAIL=  $$ (NUMBER, WHEN, WHO, WHERE, WHAT)
(   1,<2019-09-20 14:46:55.21 +0400>,<she>,<DPX200>,
      <created by zg, POWCHK disabled, PULCHK disabled
       configuration hash MD5:
       00 E9 B6 7A A2 85 ED C7 34 08 36 98 17 FE 4E 26
       data hash MD5: 16K
       DB 2C C1 95 02 05 D8 DC B9 A8 F2 51 D7 8C CD 3B>)
$$ ##END=
$$ 
$$ hash MD5
$$ 9A 42 EC 0F 36 69 B8 90 2C 33 8D 33 58 3D 6D 16
##$RELAX= 
##$RELAX= 
##$RELAX= 
##$RELAX= 
##$RELAX= 
##$RELAX= 
$$ Bruker specific parameters
$$ --------------------------
##$DU= <F:/spectra>
##$EXPNO= 1
##$NAME= <H-F>
##$PROCNO= 1
##$TYPE= <nmr>
##$USER= <she>
##$AMP= (0..31)
100 100 100 100 100 100 100 100 100 100 100 100 100 100 100 100 100 100 
100 100 100 100 100 100 100 100 100 100 100 100 100 100 
##$AQSEQ= 0
##$AQ_mod= 1
##$AUNM= <au_zg>
##$AUTOPOS= <>
##$BF1= 200.13
##$BF2= 200.13
##$BF3= 200.13
##$BF4= 200.13
##$BF5= 200.13
##$BF6= 200.13
##$BF7= 200.13
##$BF8= 200.13
##$BYTORDA= 1
##$CFDGTYP= 0
##$CFRGTYP= 5
##$CHEMSTR= <none>
##$CNST= (0..31)
1 1 145 1 1 1 1 1 1 1 1 1 1 1 1 1 1 1 1 1 1 1 1 1 1 1 1 1 1 1 1 1 
##$CPDPRG= <>
##$CPDPRG1= <>
##$CPDPRG2= <>
##$CPDPRG3= <>
##$CPDPRG4= <mlev>
##$CPDPRG5= <mlev>
##$CPDPRG6= <mlev>
##$CPDPRG7= <mlev>
##$CPDPRG8= <mlev>
##$CPDPRGB= <>
##$CPDPRGT= <>
##$D= (0..31)
0 1.2 0 0 0 0 0 0 0 0.06 0 0.03 0 0 0 0 0.0002 0 0 0 0 0 0 0 0 0 0 0 0 
0 0 0 
##$DATE= 1568976414
##$DBL= (0..7)
120 120 120 120 120 120 120 120 
##$DBP= (0..7)
150 150 150 150 150 150 150 150 
##$DBP07= 0
##$DBPNAM0= <>
##$DBPNAM1= <>
##$DBPNAM2= <>
##$DBPNAM3= <>
##$DBPNAM4= <>
##$DBPNAM5= <>
##$DBPNAM6= <>
##$DBPNAM7= <>
##$DBPOAL= (0..7)
0.5 0.5 0.5 0.5 0.5 0.5 0.5 0.5 
##$DBPOFFS= (0..7)
0 0 0 0 0 0 0 0 
##$DE= 6
##$DECBNUC= <off>
##$DECIM= 24
##$DECNUC= <off>
##$DECSTAT= 4
##$DIGMOD= 1
##$DIGTYP= 9
##$DL= (0..7)
0 120 120 120 120 120 120 120 
##$DP= (0..7)
150 150 150 150 150 150 150 150 
##$DP07= 0
##$DPNAME0= <>
##$DPNAME1= <>
##$DPNAME2= <>
##$DPNAME3= <>
##$DPNAME4= <>
##$DPNAME5= <>
##$DPNAME6= <>
##$DPNAME7= <>
##$DPOAL= (0..7)
0.5 0.5 0.5 0.5 0.5 0.5 0.5 0.5 
##$DPOFFS= (0..7)
0 0 0 0 0 0 0 0 
##$DQDMODE= 0
##$DR= 18
##$DS= 0
##$DSLIST= <SSSSSSSSSSSSSSS>
$$ [...]
##$SUBNAM2= <"">
##$SUBNAM3= <"">
##$SUBNAM4= <"">
##$SUBNAM5= <"">
##$SUBNAM6= <"">
##$SUBNAM7= <"">
##$SUBNAM8= <"">
##$SUBNAM9= <"">
##$SW= 24.0689530833862
##$SWIBOX= (0..15)
0 0 2 0 0 0 0 0 0 0 0 0 0 0 0 0 
##$SW_h= 4816.95568400771
##$TD= 16384
##$TD0= 1
##$TE= 0
##$TE2= 300
##$TE3= 300
##$TEG= 300
##$TL= (0..7)
0 120 120 120 120 120 120 120 
##$TP= (0..7)
150 150 150 150 150 150 150 150 
##$TP07= 0
##$TPNAME0= <>
##$TPNAME1= <>
##$TPNAME2= <>
##$TPNAME3= <>
##$TPNAME4= <>
##$TPNAME5= <>
##$TPNAME6= <>
##$TPNAME7= <>
##$TPOAL= (0..7)
0.5 0.5 0.5 0.5 0.5 0.5 0.5 0.5 
##$TPOFFS= (0..7)
0 0 0 0 0 0 0 0 
##$TUNHIN= 0
##$TUNHOUT= 0
##$TUNXOUT= 0
##$USERA1= <user>
##$USERA2= <user>
##$USERA3= <user>
##$USERA4= <user>
##$USERA5= <user>
##$V9= 5
##$VALIST= <valist>
##$VCLIST= <CCCCCCCCCCCCCCC>
##$VD= 0
##$VDLIST= <DDDDDDDDDDDDDDD>
##$VPLIST= <PPPPPPPPPPPPPPP>
##$VTLIST= <TTTTTTTTTTTTTTT>
##$WBST= 1024
##$WBSW= 4
##$XGAIN= (0..3)
0 0 0 0 
##$XL= 0
##$YL= 0
##$YMAX_a= 204262
##$YMIN_a= -291193
##$ZGOPTNS= <>
##$ZL1= 120
##$ZL2= 120
##$ZL3= 120
##$ZL4= 120
##$ABSF1= 10
##$ABSF2= 0
##$ABSG= 5
##$ABSL= 3
##$ALPHA= 0
##$AQORDER= 0
##$ASSFAC= 0
##$ASSFACI= 0
##$ASSFACX= 0
##$ASSWID= 0
##$AUNMP= <proc_1d>
##$AZFE= 0.1
##$AZFW= 0.1
##$BCFW= 1
##$BC_mod= 2
##$BYTORDP= 1
##$COROFFS= 0
##$CY= 11.3945322036743
##$DATMOD= 1
##$DC= 2
##$DFILT= <>
##$DTYPP= 0
##$F1P= 20.1720416913024
##$F2P= 0.152960286110954
##$FCOR= 0.5
##$FTSIZE= 0
##$FT_mod= 4
##$GAMMA= 1
##$GB= 0.15
##$INTBC= 1
##$INTSCL= 1
##$ISEN= 128
##$LB= 0.24
##$LEV0= 0
##$LPBIN= 0
##$MAXI= 10000
##$MC2= 0
##$MEAN= 0
##$ME_mod= 0
##$MI= 1.114404
##$NCOEF= 0
##$NC_proc= 0
##$NLEV= 6
##$NOISF1= 3.799351
##$NOISF2= 2.8
##$NSP= 1
##$NTH_PI= 0
##$NZP= 0
##$OFFSET= 15.70392
##$PC= 1
##$PHC0= -9569.109
##$PHC1= 9.00096
##$PH_mod= 1
##$PKNL= yes
##$PPARMOD= 0
##$PSCAL= 0
##$PSIGN= 0
##$REVERSE= no
##$SF= 200.130013532006
##$SI= 16384
##$SIGF1= 3
##$SIGF2= 2
##$SINO= 400
##$SIOLD= 16384
##$SREGLST= <1H.CDCl3>
##$SSB= 0
##$STSI= 0
##$STSR= 0
##$SW_p= 3612.71676300578
##$SYMM= 0
##$S_DEV= 0
##$TDeff= 0
##$TDoff= 0
##$TI= <>
##$TILT= no
##$TM1= 0
##$TM2= 0
##$TOPLEV= 0
##$USERP1= <user>
##$USERP2= <user>
##$USERP3= <user>
##$USERP4= <user>
##$USERP5= <user>
##$WDW= 1
##$XDIM= 8192
##$YMAX_p= 0
##$YMIN_p= 0
$$ End of Bruker specific parameters
$$ ---------------------------------
##NTUPLES= NMR FID
##VAR_NAME=  TIME,          FID/REAL,        FID/IMAG
##SYMBOL=    X,             R,               I
##VAR_TYPE=  INDEPENDENT,   DEPENDENT,       DEPENDENT
##VAR_FORM=  AFFN,          ASDF,            ASDF
##VAR_DIM=   8192,          8192,            8192
##UNITS=     SECONDS,       ARBITRARY UNITS, ARBITRARY UNITS
##FACTOR=    0.0002076,     1,               1
##FIRST=     0,             0,               0
##LAST=      1.7004516,     0,               0
##MIN=       0,             -291193,         0
##MAX=       1.7004516,     204262,          0
$$ Real data points
##PAGE= N=1
##DATA TABLE= (X++(R..R)), XYDATA
$$ [...]
2134I49n23N4J13m41j9K75K74K07j17j53l8J94k52l19j56M01K19k96K04M11m76
2155E11j74J14l27j32K44N11L8l05j13J66N6l51J30J96m08k58R4J052k64p79K72
2176B73K93n50m63L13L71l59j35P01K94r23P3L19j61m98q7M00M15o11rP08l49
2197A5n07p3k8j94k34L32J07J24J1k56K42l31j79k91j89M04O2m3K10J01j28n15
2219a360j61L8k83J46K93Q0j44r3N12N1o86k80L17k99K2L3N89j18k67j34L60l57
2241a741n17L35K97k5j52N30K77k99k27j33O0m54J00O68P3r0J14J62j15l57O0
2262a434K78n1l36M84N44o9N8J89l1k08m7l71L58M54K23k45J91M9LJ2n64L99K23
2285A09j67J02N42KJ50o00N17j48j12k0M51m0j34P12jk55O1K63l54j02J2P2Q4
$$ plain form
2134 949 426 480 593 152 133 408 682 889 772 619 581 775 523 204 48 449 668 372 576 987 511
2155 511 337 451 124 -8 236 747 785 480 367 533 589 238 368 564 156 -102 -8 1044 780 1 273
2176 273 566 16 -447 -134 237 -122 -257 444 738 -185 -112 207 46 -452 -539 -139 276 -335 -344 364 15
2197 15 -492 -565 -593 -787 -1021 -689 -582 -458 -447 -703 -461 -792 -971 -1262 -1451 -1047 -985 -1028 -818 -717 -845 -1360
2219 -1360 -1521 -1483 -1766 -1620 -1327 -1247 -1391 -1484 -972 -921 -1607 -1887 -1570 -1869 -1847 -1814 -1225 -1343 -1610 -1744 -1384 -1741
2241 -1741 -2258 -1923 -1626 -1651 -1803 -1273 -996 -1295 -1522 -1655 -1595 -2049 -1949 -1281 -1208 -1298 -1184 -1022 -1137 -1494 -1434
2262 -1434 -1156 -1207 -1543 -1059 -515 -584 -526 -337 -368 -576 -623 -994 -636 -182 41 -204 -13 36 39 51 -513 -114 109
2285 109 -58 44 586 588 738 138 655 507 395 375 826 786 652 1364 1363 1108 1169 1432 1078 976 988 1060 1144
2308A144K32O9o7K51j37k17P3j85j88M26O8J63k17N30l07l62j04K25Q1m70Q0L07
2330A395j63K73K84l43k88Ml09l8K13J67L0j60K12q5j56J01o22K38j88J60k0J58
2352H63%j0j66L69o38k36k7K48P1J40L12o94L07m33K22l96q9L93J89o7j22r8M31
2375E69l27j79m3l88l23L23M00j08R4J94k1m48K6p3L02j87k8k4J57k26M90r4J1
2398I7l87p7p4P2O4K43K41l77J72j38j46J63j02r6l7K43L24j23m92K55L71n18
2420c22j47L2K15J76l6J29K5Om09K87k11k50M27m36N57l7m77j63P05j94k09k78
2442f10K35j97J25L83j21J7k07l7j72r9j90M7K1M54j59m03L90j56q8m8k60K57
2464h18j75P5R5k13K87J17l30K0J41l13l8L44j76n0N9K7l1j3J18k87l6K15J68
$$ plain form
2308 1144 1376 1445 1378 1629 1492 1275 1348 1163 975 1401 1469 1632 1415 1945 1638 1276 1172 1397 1478 1008 1088 1395
2330 1395 1232 1505 1789 1446 1158 1162 853 815 1028 1195 1225 1065 1277 1192 1036 1137 515 753 565 725 705 863
2352 863 863 853 687 1056 418 182 155 403 474 614 926 232 539 106 328 -68 -157 236 425 358 236 138 569
2375 569 242 63 20 -368 -691 -368 32 -76 18 212 191 -257 -231 -304 -2 -189 -217 -241 -84 -310 180 86 97
2398 97 -290 -367 -441 -369 -305 -62 179 -198 -26 -164 -310 -147 -249 -345 -382 -139 185 62 -430 -175 196 -322
2420 -322 -469 -437 -222 -46 -82 47 72 78 -331 -44 -255 -505 -78 -514 43 6 -471 -634 71 -123 -332 -610
2442 -610 -375 -572 -447 -64 -185 -168 -375 -412 -584 -683 -873 -826 -805 -351 -510 -913 -523 -679 -767 -815 -1075 -818
2464 -818 -993 -918 -823 -1036 -749 -632 -962 -942 -801 -1114 -1152 -808 -984 -1034 -975 -948 -979 -992 -874 -1161 -1197 -982 -814
2487h14j72P8j3j54M43j83j06o1k69L84J26N1m1K33l99n5J31J22m5O4N8K99J49
2510a74r0j03lQ6k45J96J82J39l48L12K68j95QJ00k55M63j85o6K09q9M03N1j71
2533D93N4j95K18O2K65q6J54L8QP4jK3l91K58Q7jL05k61K32j05m3P7L26l25n6
2558A210r4J70M20m78M8j16J59l59K81J26J03m8j60K0J9j00L10o11K09n3J14J22
2580A292l24J29j89J38j17n9k36mm4J12l2J41O7o0k06j08Q3J18l61o4p3J84j98
2603A89J30j60r1P0q6J1J46k58Q4p9p3M3j81Nj32pk3J93m60J34M32k07r3Lr4j49
2629f53j41L07l51K37P6R2J4j00L91l94j73JJ76p4J04J62j72q5o1L8k75K38J24
2652e19O4j66K03O8j41J12k18L56l76m5L32k55L06j47L15q7k12p5O9M5J15k89
$$ plain form
2487 -814 -986 -908 -921 -1075 -632 -815 -921 -982 -1251 -867 -741 -690 -731 -498 -897 -952 -821 -699 -744 -680 -622 -323 -174
2510 -174 -264 -367 -370 -284 -529 -333 -151 -12 -360 -48 220 25 33 133 -122 341 156 90 299 210 613 664 493
2533 493 547 352 570 632 897 811 965 1003 1011 1085 1084 1107 716 974 1061 1060 1365 1104 1336 1231 1188 1265 1591 1266 1210
2558 1210 1116 1286 1706 1228 1276 1160 1319 960 1241 1367 1470 1422 1262 1282 1301 1201 1511 900 1109 1056 1170 1292
2580 1292 968 1097 908 1046 929 870 634 630 586 698 666 807 874 814 608 500 583 701 340 276 203 387 189
2603 189 319 159 68 138 52 63 209 -49 35 -44 -117 -74 -255 -250 -382 -389 -412 -219 -679 -545 -113 -320 -413 -410 -504 -653
2629 -653 -794 -487 -838 -601 -525 -433 -419 -519 -128 -522 -695 -694 -518 -592 -488 -326 -498 -583 -644 -606 -881 -643 -519
2652 -519 -455 -621 -418 -350 -491 -379 -597 -241 -617 -662 -330 -585 -279 -426 -111 -198 -410 -485 -416 -371 -256 -545
2674e45M51j65J7J51M9j05l51N94n56J01L28j36Q2l83K49k9K09l27K52k25L86
2695D7n32M28L10k96p1l90K07L3l7J41j44J10o8n3J85j82l4O2K6j62n4j58K18
2718d14L89k85J4L2l58L6j60J57OO2K10q2q0k02J43J4N0j86K53j09j4J68r4J05
2742c45J4Q4m53L19j58j51L98J05K72l49J81j16k47J39o5L25Q1k14K47R1j08p1
2764b1k30M4J65j60l5O90r6k9J55N2j97j02K98k40k1n9M67n2L1J28j25j63o0K23
2788F63l11L19M55m43L66P1q2m21M49j16m11M33K58J67l52k8j51K30r7j04n3J68
2810A010k7K97j62P1j72j53M76k63m62j69N05J88l82Q9l4o1l58L00k33M31l29
2831E62J85m0K1J3k54L83mo57N8J93k23k79J91M35m87n8J12k3l1k12M62m95j26
$$ plain form
2674 -545 -94 -259 -242 -91 -42 -147 -498 96 -460 -359 -31 -167 -85 -468 -219 -248 -39 -366 -114 -339 47
2695 47 -485 -57 253 -43 -114 -504 -297 -264 -301 -160 -304 -194 -262 -315 -130 -312 -346 -284 -258 -420 -474 -632 -414
2718 -414 -25 -310 -296 -264 -622 -586 -746 -589 -583 -521 -311 -393 -473 -675 -532 -518 -468 -654 -401 -510 -524 -356 -450 -345
2742 -345 -331 -247 -700 -381 -539 -690 -292 -187 85 -264 -83 -199 -446 -307 -372 -47 34 -180 67 158 50 -21
2764 -21 -251 -207 -42 -202 -237 453 357 328 483 535 338 236 534 294 273 214 681 629 660 788 663 500 440 663
2788 663 352 671 1126 683 1049 1120 1038 617 1066 950 539 972 1230 1397 1045 1017 866 1096 999 895 842 1010
2810 1010 983 1280 1118 1189 1017 864 1340 1077 615 446 951 1139 757 846 812 751 393 693 460 891 562
2831 562 747 707 728 741 487 870 866 209 267 460 237 -42 149 584 97 39 151 128 97 -115 347 -148 -274
2854b74j2M24k58j34j01n9Rjm67J24L74o0j61J71j40m6O6m53R0K59J87q8N1n9
2878e58n44L34R7J16n94O48j77k5Qr3J38J71l18J41j68j01K92K85q7k08L48l61
2900f56N48m17j78M19m64KM55q9n0rl41M02J13j31J36j22J21J93j06Q1k18j49
2922d60K5J39L73k61k7N5r4O25m95r6K52l4M8J20k7J80m55K57j63K08j42k06K77
2945I9l06L5J63J0J10j01K74j12l36k02M89L5j29l62O31k8k35j9k1k22K5J19j2
2968i5J81R1O0k12j30r2J33J61k09M8LJ57j79j82l3j46K84J54j51k87K92M96m85
2991a41L1j36K91q0j66J28j65K57n8N2k95K35J92j78j4k42M51j8m6J20k48kl0
3014f2J46N4R4Qk78M56j5Lk95L06l22q3M69j21r0J32j17L88qj61O0K9m46M17J48
$$ plain form
2854 -274 -286 138 -120 -254 -355 -414 -405 -406 -873 -749 -375 -435 -596 -425 -565 -611 -545 -998 -908 -649 -462 -550 -499 -558
2878 -558 -1102 -768 -671 -555 -1149 -501 -678 -703 -695 -788 -650 -479 -797 -656 -824 -925 -633 -348 -435 -643 -295 -656
2900 -656 -108 -525 -703 -284 -748 -746 -291 -380 -430 -439 -780 -378 -265 -396 -260 -382 -261 -68 -174 -93 -311 -460
2922 -460 -435 -296 77 -184 -211 -156 -250 375 -120 -216 36 2 50 170 143 323 -132 125 -38 170 28 -178 99
2945 99 -207 -172 -9 1 111 10 284 172 -164 -366 123 158 29 -333 298 270 35 16 -5 -227 -202 -83 -95
2968 -95 86 177 237 25 -105 -197 -64 97 -112 -64 -61 96 -83 -265 -298 -444 -160 -6 -157 -444 -152 344 -141
2991 -141 -110 -246 45 -35 -201 -73 -238 19 -39 13 -282 -47 145 -33 -47 -289 162 144 98 218 -30 -32 -62
3014 -62 84 138 232 240 -38 418 403 406 111 417 95 12 481 360 270 402 285 673 665 504 564 593 147 564 712
3039G12j49K32L2k87L62l7k56PN6k13L87Rm19L33o2P3R5j05j23l90M53J67j02
3062G75m4M1l13L25P2j37j4l51M22j55k62K8K27j67L70l77Jj55J93l21K73j97
3084B34O4m9M0p9j41k30M18k02j65q2j43J04j4Q0o3j05o6j35K55k44K84N7q32
3107a014P15k50R2l60K59m7k18M0J94k09J91j75K07l19L4L08l07n0L98k90k16
3128a017M20j87j07q5N13j42L5J5K12n45M21K14o28p6N65r6l30J11J6P9J40K58
3150b14l50N0J58k00m7R9N01n11K60J6n2k44M33o7J06j01K39Ln8m8j03j03J82
3173e1J04Kl07O78l16n8K29J12k34q5J44j71J66l2p0L1M5J13Q0j86l0k7kM7l6
3198A46J99k07R8K36j17j77J3R1j92j67L76j77K88l41K49r7m14K45R1k23J51O1
$$ plain form
3039 712 563 795 827 540 902 865 609 616 672 459 846 855 436 769 707 780 875 770 647 257 710 877 775
3062 775 731 772 459 784 856 719 705 354 776 621 359 387 614 447 817 440 441 286 479 158 431 234
3084 234 298 249 289 210 69 -161 257 55 -110 -192 -335 -231 -245 -165 -228 -333 -399 -534 -279 -523 -239 -182 -1014
3107 -1014 -299 -549 -457 -817 -558 -605 -823 -783 -589 -798 -607 -782 -575 -894 -860 -552 -859 -909 -511 -801 -1017
3128 -1017 -597 -784 -891 -976 -463 -605 -570 -555 -343 -888 -467 -253 -881 -957 -392 -488 -818 -707 -691 -612 -472 -214
3150 -214 -564 -514 -356 -556 -603 -504 -3 -514 -254 -238 -290 -534 -101 -168 -62 -163 76 79 21 -27 -130 -233 -51
3173 -51 53 55 -252 426 110 52 281 393 159 74 218 47 213 181 111 142 187 300 380 194 164 137 135 182 146
3198 146 345 138 236 472 355 178 191 282 90 -77 299 122 410 69 318 221 -193 52 143 -80 71 132
3220A32K46j66k59J41M3j80K11k48j42L10j89lL11k25j65p0L44j86j91JJ75N5
3242e5M7K85j24j33l4l53J48J56L04k56J00j28N5O1r7l9O3n4j52K13O2k8M39l43
3266A37K6J66l84J08J4k43M69k75K43j82N1j3J83j85o6L12q1j5K79j00j52J42
3288D34k75N7k4L83k60J47K76k28n4n1N2o1M3J58j1Lj50K8j06J2n1J58L5n4m7
3313D14k20M03l4J45m75J33k02J70k10K17j83j17K68J5j13l8q7K1K6j94K2k4J09
3336D6K28k65k38lk56K49k08M0L92j64O2j04j87J57j48j06K6Q5J56j91o0J47j29
3359d71P8k10O0k52l2Q1L31o3k13l2K45n37L92J22l52J79j88J15K0k43M23j22
3381f69O3r0K23o9J32P8m29K18j67J26K05P8j23K26j56j62J00K53j17J80l82J45
$$ plain form
3220 132 378 212 -47 94 137 -43 168 -80 -222 88 -101 -104 207 -18 -183 -253 91 -95 -286 -285 -110 -55
3242 -55 -8 277 153 20 -14 -367 -219 -63 241 -15 85 -43 12 73 -24 -63 0 -54 -206 7 69 41 480 137
3266 137 163 329 -55 53 67 -176 293 18 261 79 130 117 300 115 49 361 280 265 544 444 292 434
3288 434 159 216 192 575 315 462 738 510 456 405 457 396 439 597 586 589 439 467 361 373 322 480 515 461 414
3313 414 194 597 563 708 233 366 164 334 124 341 158 41 309 324 211 173 86 107 133 -61 -39 -63 46
3336 46 274 9 -229 -232 -488 -239 -447 -407 -15 -179 -117 -221 -408 -251 -399 -505 -479 -394 -238 -429 -489 -342 -471
3359 -471 -393 -603 -543 -795 -827 -746 -415 -478 -691 -723 -478 -1015 -623 -501 -853 -674 -862 -747 -727 -970 -547 -669
3381 -669 -606 -696 -473 -542 -410 -332 -761 -543 -710 -584 -379 -301 -424 -198 -354 -516 -416 -163 -280 -100 -482 -337
3403c37J34j64JM79K37l29P5j30m21M32J70j34j74J15K62L9k67l3P1J45j32J90
3425B29k34K43J61k78L32j68LJ94j42J42j50L00k51J1j17Q1Pj20K15J33k97n3
3447B41J40J45j50J49m06L82j03O4k34Q0J1J77m43K76L11n3j40l24J69q4J98k16
3469A90k44K15n2N3L6J21l51J15J46j20k04n6K24ok69M72K6n82L39M1k16m4j56
3492c22K53j48K04k05K95l44J33j17L74k21o7llJ92K9l12J66K5jm1P1l7J01j28
3516a06J77J00j41k50L50J86k56j49J98J35j37P7L8j52n8QK2j51L43q9K1m4m1
3539H1J70j3Oj39K52j55J38j8m75Q30l09m6Q8L3l84J07K47k36K37q6p5km2j40
3563F9J85n9J19k9o9j30J49N4l80M0L03j17m3P7J38j12k98J18j29N2J91n0j22
$$ plain form
3403 -337 -203 -367 -366 113 350 21 96 -34 -455 -23 147 13 -161 -46 216 255 -12 -45 26 171 39 229
3425 229 -5 238 399 121 453 285 288 482 340 482 332 632 381 392 275 356 363 243 458 591 294 241
3447 241 381 526 376 525 119 501 398 462 228 308 319 496 53 329 640 587 447 123 292 208 406 190
3469 190 -54 161 109 162 198 319 -32 83 229 109 -95 -151 73 67 -202 270 296 -286 53 94 -122 -166 -322
3492 -322 -69 -217 -13 -218 77 -267 -134 -251 123 -98 -165 -168 -171 21 50 -262 -96 -71 -72 -113 -42 -79 22 -106
3516 -106 71 171 30 -220 130 316 60 -89 109 244 107 184 222 70 12 20 42 -109 234 145 166 122 81
3539 81 251 238 244 105 357 202 340 322 -153 677 368 322 410 443 59 166 413 177 414 328 253 251 209 69
3563 69 254 195 314 285 216 86 235 289 -91 -51 252 135 92 169 307 195 -103 15 -114 -62 129 79 -43
3586d3j79J4N53k66j98o8R1l5j22o2K37m36L92k04p6N2M0o4Mj19jJ36j87K24k61
3611e78J70J90j51j10J02J4k59J85K27k31j21K3J75k51J03R8O2N7l06P8J92r3
3633d24M1nj65Q5L1J47k46P4R8OO4o4J85p1P6N1j30K29j03J84j61r7N4M15k31
3658D3k16j0K4K48j99K45j29%L33L43k88j93R1J26m87M80l30M37O6l15P2L36m13
3681B64M19j44k6j08q7p0L07j75Q0m1R1j13N3K86m71M3Q2J67j04n8J16k45K62
3704E28K22m30Jl5J82j10k48R9K7L15k25r9p2M9J14k99J19j38j82L95l7L0l03
3727i7L3J25L2P5j34J16l47M52k24R3q5j38k47J8K06K09j43J7k77R2L3J14l53
3750d30L21q8j85L16N6j80QJ70l95L49j95j47K47o2J7J29j15Q1p1j68K25J55n4
$$ plain form
3586 -43 -222 -208 345 79 -119 -187 -96 -131 -253 -315 -78 -514 -122 -326 -402 -350 -310 -374 -370 -489 -490 -354 -541 -317 -578
3611 -578 -408 -218 -369 -479 -377 -363 -622 -437 -210 -441 -562 -539 -364 -615 -512 -414 -352 -295 -601 -523 -331 -424
3633 -424 -383 -388 -553 -468 -437 -290 -536 -462 -364 -358 -294 -358 -173 -244 -168 -117 -247 -18 -121 63 -98 -195 -141 274 43
3658 43 -173 -183 -159 89 -110 135 6 6 339 682 394 201 292 418 -69 411 81 518 584 269 341 677 264
3681 264 683 539 513 405 318 248 555 380 460 419 510 397 450 736 265 308 390 557 453 395 511 266 528
3704 528 750 320 321 286 468 358 110 209 236 551 326 227 155 204 318 19 138 0 -182 213 176 206 -97
3727 -97 -64 61 93 168 34 150 -197 255 31 124 39 -99 -346 -328 -122 87 -56 -39 -316 -224 -191 -77 -430
3750 -430 -109 -197 -382 -66 -10 -190 -182 -12 -407 -58 -253 -400 -153 -215 -198 -69 -184 -103 -174 -342 -117 38 -16
3773a6j51r4K25LJ27J44l74K25j27Q3n9J55j71l2J18L11j64j29J28k4l80L50m
3796A44o3P4K42j54n25M07j47M36n04L61L0J9qj34k2J60k9KJ53m62j5K37M4P1
3820C17k83P0L80k97K9k36P8k6J98j37j28oj15L55l35J35m0m3k20l4L49l70Q6
3843b73K73l88M27O9m84Q1L39j72j87q9M32j82j17J74j20n7q9K8J84j09m36Q7
3865f09M62k66J47n9N3n8n8J14K00k16M5j11o3J92P7m8Q9j52j3R2j77J45K9n19
3889g04M26J05j07Or1N69k54j9k96M18m1l27J34J52j46K42q7p6O8KK57q2J17r2
3913A74K0k05P5K44l8L22k71Q3l00J01j20J10L22m9n1j36O5J4P6Nj57O1J04n5
3937C94J45k85R9J18oPk4L0j37J43m2k00O1J53j23K2J22l57M40k15j30J69L55
$$ plain form
3773 -16 -167 -261 -36 -33 94 238 -136 89 -38 45 -14 141 -30 -62 56 367 203 74 202 178 -202 148 144
3796 144 81 155 397 243 -282 125 -22 414 -90 271 301 320 312 178 156 316 287 289 442 -20 -35 202 246 317
3820 317 34 104 484 187 216 -20 58 32 230 93 -35 -41 -156 199 -136 -1 -41 -84 -304 -338 11 -359 -273
3843 -273 0 -388 39 108 -376 -295 44 -128 -315 -404 28 -154 -271 -97 -217 -274 -363 -335 -151 -260 -696 -609
3865 -609 -147 -413 -266 -325 -272 -330 -388 -274 -74 -290 -245 -356 -419 -227 -150 -198 -109 -261 -274 -182 -359 -214 -185 -704
3889 -704 -278 -173 -280 -274 -365 204 -50 -69 -365 53 12 -315 -181 -29 -175 67 -20 -96 -28 -26 231 149 266 174
3913 174 194 -11 64 308 270 592 321 404 104 205 85 195 517 468 417 281 346 360 436 441 284 345 449 394
3937 394 539 254 353 471 465 472 448 478 341 484 442 242 303 456 333 355 477 120 560 345 215 384 739
3960G39l83k40J39k09k8K15K2J55k64J26j66j47K27m7K5j22K6r1P1q2k9J14q7
3983c6k9k53K16J05Pm45L5O0J3L24l86m8L34r1k03J3L32k76L04k45pl03L63j4
4007b30J59l03Q0j03L04k16m2J98rj97L41O3l53Q8nO3p2N7j83K61L7o7J42j4k34
4032b35J92J20j71L08o2j97r8J34J10M0P2j99J91o4j17k29K53J24r9k75L49j09
4054C8Q1l18K26K63j80j71M0L15p8k35K94j32L8p5j18O3L07j90j67O3M8O7J01
4077B80l85K33k53K21m5q7J74r6j85n7K6J34J00p3j96n1L60J26m08Q7J56l73R7
4100b15Qr5J61q2j34M6M6l5N8J19q5N2L8L3Q8n09L81k04N7j23L35j66J22j44q0
4125c28K21j99J45p4o7R8N5j55J17j4M1j06RN72l69j03l2J41j5j76N3O7Q5L8l04
$$ plain form
3960 739 356 116 255 46 18 233 255 410 146 272 106 -41 186 139 164 42 68 -23 48 -34 -63 51 -36
3983 -36 -65 -318 -102 3 10 -435 -400 -340 -327 -3 -389 -437 -103 -194 -397 -384 -52 -328 -24 -269 -276 -579 -216 -230
4007 -230 -71 -374 -294 -397 -93 -309 -351 -153 -162 -359 -18 45 -308 -220 -225 -162 -234 -177 -360 -99 -62 -129 13 -1 -235
4032 -235 -43 77 -94 214 152 -45 -143 -9 101 141 213 14 205 141 24 -205 48 172 73 -202 147 38
4054 38 119 -199 27 290 110 -61 -21 294 216 -19 275 143 181 106 -12 51 358 168 1 64 112 179 280
4077 280 -105 128 -125 96 51 -36 138 42 -143 -200 -174 -40 60 -13 -209 -260 100 226 -182 -95 61 -312 -215
4100 -215 -207 -302 -141 -223 -357 -311 -265 -300 -242 -123 -208 -156 -118 -85 3 -506 -125 -329 -272 -395 -60 -226 -104 -248 -328
4125 -328 -107 -306 -161 -235 -302 -204 -149 -304 -187 -201 -160 -266 -257 315 -54 -157 -189 -48 -63 -239 -186 -119 -34 4 -300
4150c00O1O9L23l58J86qK0n1J74o4K05j69p8L02j89M63n07M2K78O7n9j23nPJ71
4175D57l0qm1R4j73o5J31k09k3M23l11J61j63Q8K72m53k9M77j57j16j91P6L88
4198E98p8j11j21J62kJ61l40J32j59O9N1J75k77k0j60K12o9k64L31j92J24O5n9
4221B28k44j5k35K67J09j71K90m05p8j21K9K86j54k3K01j9j98J68j53r1J20qK2
4244a95KJ78K1k37j46J76k21J40j45M26m32Q9J99k40K67k46J40j50M10k94J4M7
4266a97L4j63J02mk93l1L50K25j31j4j05k8J00M36j57l2j49k23K19o2K59k57J08
4289a3p0K29l0n4rl40K20K02N6l42M97p0k52j57M32N9m02J40J23O3k0k56L41l66
4313a9J4K2m6K44K7p1j82K01k6n4m5L08j76K2l09QK07m1j23J91k47J10J07j68
$$ plain form
4150 -300 -239 -170 153 -205 -19 -27 -7 -58 116 52 257 88 10 312 123 586 79 121 399 466 407 284 279 286 457
4175 457 427 419 378 472 299 234 365 156 133 556 245 406 243 331 603 150 121 598 441 325 134 210 598
4198 598 520 409 288 450 448 609 269 401 242 311 362 537 260 240 80 292 223 -41 290 98 222 287 228
4221 228 -16 -31 -266 1 110 -61 229 -176 -254 -375 -346 -60 -214 -237 -36 -55 -253 -85 -238 -329 -209 -217 -195
4244 -195 -193 -15 6 -231 -377 -201 -422 -282 -427 -1 -433 -344 -145 -385 -118 -364 -224 -374 36 -258 -244 -197
4266 -197 -163 -326 -224 -228 -521 -552 -202 23 -108 -122 -227 -255 -155 281 124 92 -57 -280 -61 -123 136 -121 -13
4289 -13 -83 146 116 62 53 -287 -67 135 191 -151 346 276 24 -133 299 358 -44 96 219 282 262 6 347 -19
4313 -19 -5 17 -29 215 242 171 -11 190 164 110 65 373 197 219 -90 -82 125 84 -39 152 -95 15 122 -46
4337d6L8j03J57J71j25M1n9P7O3m70J47J88j56R2j10n8nK13k76Rj95O2K42j00
4361b03J31K30l27J94l85rJ44J49m86M98J38l98L27j47J60j51k90K78j09L01k18
4382a73K11l48J51J36l0O7J4n6M44m07l2J29j40m6J08J35r8J73m03L36k56m6J22
4405iK48l60K47n1JK7m7K08j18O6k67J81j92K5L72j65J35k8k12K72k25J69J07
4428C84j70m1K69L7j10N6k8p8l6O2j21J29k93L20r5n2J36k57K96k99p8L02l93
4451f0K22K30k52m4j13k60K02N4J74j42K32O1l07p0K83n8j36P8k49J91j04m0M0
4474f8L75k58m38M10o2J22q6j93J87J7K9j16P6k0P2l2l60J4J72j53K4M0K73l62
4498c37l1L05p9j67J20j51j06J51O3o4K56N5l60J59k93O36m10m5J00k4p6j14K6
$$ plain form
4337 -46 -8 -111 46 217 92 133 74 151 214 -256 -109 79 -77 15 -95 -153 -158 55 -221 -212 -407 -345 -103 -203
4361 -203 -72 158 -169 25 -360 -369 -225 -76 -562 -64 74 -324 3 -144 16 -135 -425 -147 -256 45 -173
4382 -173 38 -310 -159 -23 -53 14 28 -28 416 9 -23 106 -34 -80 28 163 65 238 -165 171 -85 -131 -9
4405 -9 239 -121 126 75 76 103 56 264 146 212 -55 126 -66 -41 331 166 301 273 61 333 108 277 384
4428 384 214 173 442 479 369 425 397 319 283 345 224 353 60 380 285 233 369 112 408 109 31 333 -60
4451 -60 162 392 140 96 -17 -277 -75 -21 153 11 243 304 -3 -73 210 152 16 94 -155 36 -68 -108 -68
4474 -68 307 49 -389 21 -41 81 -5 -198 -11 6 35 -81 -5 -25 47 15 -345 -331 -159 -312 -288 -248 25 -337
4498 -337 -368 -63 -142 -309 -189 -340 -446 -295 -232 -296 -40 15 -345 -186 -479 157 -253 -298 -198 -222 -298 -412 -386
4521c86K82j9j70K58j59n1J26O6k3J38j02J20p3k42L20j46P5K6o3L09n17J21K52
4544A42R8L4k16K87r7l11M48k63L5K68j53k93R2L00k43M2K83m89K66j54K63l94
4566e5K20Q3j12jK24j04k08J56J12j37K7J83j50J88l03j24M3K41l10K27j93K2
4588B9J20k91L1QJ62k26K20k88L53j30k20L06m19M45q1k55L16k19l62K54L46j77
4610g8k40K74k69J43J1J00m5L9k79L31k63L32M2j85m44J93J75j33L8j5L0j68J05
4633c06J89J70l73J49J63l21J27J40jJ34k07R9n7j96n0Q9Jj23J66J50q4j73K99
4656a5P0l4l4P8J08q7K0r5J91M9K00j98k20o7J00j26K89q6p5J82R9J7%l14K80
4681C32k57K77k46J08j13Q7J55nQ7J82l55r4J02J11l78J59J69l71J02J03p7k22
$$ plain form
4521 -386 -104 -123 -293 -35 -194 -245 -119 -53 -76 62 -40 80 7 -235 85 -61 14 40 -23 286 -231 -110 142
4544 142 240 274 58 345 248 -63 385 122 157 425 272 -21 71 371 128 170 453 -36 230 76 339 -55
4566 -55 165 248 136 135 359 255 47 203 315 178 205 388 238 426 123 -1 42 283 -27 200 7 29
4588 29 149 -142 -111 -103 59 -167 53 -235 118 -12 -232 74 -345 100 19 -236 80 -139 -501 -247 99 -78
4610 -78 -318 -44 -313 -170 -159 -59 -104 -65 -344 -13 -276 56 98 -87 -531 -338 -163 -296 -258 -273 -243 -411 -306
4633 -306 -117 53 -320 -171 -8 -329 -202 -62 -63 71 -136 -37 -94 -290 -340 -251 -250 -373 -207 -57 -141 -314 -15
4656 -15 55 21 -13 65 173 86 106 11 202 251 451 253 33 -34 66 -60 229 143 68 250 349 366 366 52 332
4681 332 75 352 106 214 101 188 343 338 425 607 252 158 260 371 -7 152 321 -50 52 155 78 -144
4703a44L03o4j37o9K68p3M6j08k4R0j58R1j69M19k43J76j91q4lj83L11k64J2j06
4727c04N74j45j34k08Q9J60l14m2J38J10l40J66J66JM3k52K68j79K21r3j18K31
4749C8k60J41j8k27P5J46j81p1K44j83P4J22j21L3J18J07N4k39q3J03j11J34k9
4772a34j66L56l12L19k05L94m82L87l32K22k88K28K20j05J5k05M28l43PK82k43
4793D3jJ01k64K20K7j32K16k08O4J50j17J57k36M86m35M6K7J59k37O0j30K67j88
4816G5K62M4k27R4j58M3O1J94k03L94n01LL45l76l00M61O1k33K60j00j36J06j2
4839A57R4l08k91L18K66r6j58k21P7J77J73rm18K29P1n3j09J88n39L50J32K01
4861B31j95m07J98l2J59q0m1m6R1j37K76j47Q8Mk21J27J48K12l53j69o2O9J58
$$ plain form
4703 -144 159 95 -42 -111 157 84 130 22 -2 88 -70 21 -148 271 28 204 13 -71 -74 -257 54 -210 -198 -304
4727 -304 270 125 -9 -217 -128 32 -282 -324 -186 -76 -416 -250 -84 -83 -40 -292 -24 -203 18 -75 -193 38
4749 38 -222 -81 -99 -326 -251 -105 -286 -357 -113 -296 -222 -100 -221 -188 -70 37 91 -148 -231 -128 -239 -105 -134
4772 -134 -300 56 -256 63 -142 252 -230 157 -175 47 -241 -13 207 102 117 -88 340 -3 4 286 43
4793 43 42 143 -121 99 126 -6 210 2 66 216 99 256 20 506 71 117 144 303 66 126 -4 263 75
4816 75 337 381 154 248 90 133 194 388 185 579 78 81 426 50 -250 211 272 39 299 199 63 169 157
4839 157 251 -57 -348 -30 236 140 -18 -239 -162 15 188 179 -239 -10 61 8 -101 87 -452 -102 30 231
4861 231 36 -371 -173 -205 -46 -126 -167 -213 -122 -259 17 -130 -42 -38 -259 -132 16 228 -125 -294 -356 -287 -129
4884a29j3J76k28P5l62K75R1l96L15L0J9q9K33n8K13p7k60L35l83R7L41k23K58
4907B40k97k58M32J91m00j61L72kJ94J1j57l2L1q4KP2p8J70K9k77L4K77j66j30
4931A3M3J92J09l46L10j80j01m8L48m53m5M61q0K0l4p5j21J69J5m48K62Q7Pl7
4955F8q9Q7j74q1K82l01L22k60R0M43n2j91l16L05j60J95k35N9j10j08M16m13
4977b23K5q0K95k40J68J14j32p2K28m66k7K81j81Q7Q8k44K65L5l5J32J4q4j56
5000b08M6k84K41oj91K18L4R1K3l24Q0j67L24K47j06j69L2N3j55K37o4J62j05
5023IP4M2l57K2K26j87J93l22M64j90j62m7L06k08J09K53l64j7K24L09l08J49
5045B18j18K34k71Q2J20k25Q7k3J80j85Qj22J17J21J84k09J24P1Ro2l77q1K75
$$ plain form
4884 -129 -142 34 -194 -119 -481 -206 -115 -511 -196 -166 -147 -236 -3 -61 152 75 -185 150 -233 -136 205 -18 240
4907 240 -57 -315 117 308 -92 -253 119 117 311 322 165 133 164 80 82 154 76 246 275 -2 32 309 143 13
4931 13 56 248 357 11 321 141 40 -8 340 -113 -158 303 223 243 209 134 13 182 197 -251 11 98 105 68
4955 68 -21 66 -108 -189 93 -208 114 -146 -56 387 335 144 -172 133 -27 168 -67 -8 -118 -226 190 -223
4977 -223 -198 -278 17 -223 -55 59 -73 -145 83 -383 -410 -129 -310 -223 -135 -379 -114 -79 -114 18 32 -52 -208
5000 -208 -162 -446 -205 -211 -402 -184 -150 -59 -36 -360 -280 -447 -123 124 18 -151 -119 -66 -221 16 -48 114 9
5023 9 83 125 -232 -210 16 -171 22 -300 164 -26 -188 -235 71 -137 -28 225 -139 -156 68 377 69 218
5045 218 100 334 63 145 265 40 127 104 284 99 107 -15 102 223 407 198 322 393 402 340 -37 -118 157
5068A57M6m5p2K75j83j97L22K0Q6j26m60J67M43n04L31j51j52L3L40l72J89k29
5090h2J64k1RJ15j70R8k11J9J39k7Q8k83K57j94j14J21J05m4n9j50N37l51N8j75
5114a71M9J25n5j05qp2l6K49k68K91k05J37M3O9O6l32O7j5J5M7N7J54m45K6nK9
5140b93r2L33j55J24j4o3k65L28J60k95K19L15n23J68KJ03l7m6l9J96j49K38R7
5163C12l33J79L3P5l20k08K21R8J59j76J50o8r6j3J0K44o4j06k47O45m37K99k03
5186A54K98k77J9k6J54J70p6l01L7J77j92K34k00Kk76J73j13J56j34l6L89l24
5208HJ41j56K03K8k85J61j88N7K7l4J33j63nJ9J46l84L92L0J78m49k04L21k02
5231b26J57K8P7k82qL11k32K75K6k51L29j97r9j39L72m51O3N2r1J01L02l03J81
$$ plain form
5068 157 203 158 86 361 178 -19 303 323 409 283 -177 -10 433 -71 260 109 -43 -10 330 -42 147 -82
5090 -82 82 61 70 185 15 113 -98 -79 60 33 121 -162 95 -99 -213 -92 13 -31 -90 -240 297 -54 4 -171
5114 -171 -122 3 -52 -157 -165 -237 -273 -24 -292 -1 -206 -69 -26 43 109 -223 -156 -171 -156 -109 -52 102 -343 -317 -322 -293
5140 -293 -385 -52 -207 -83 -97 -160 -425 -97 63 -232 -13 302 -221 -53 -51 52 15 -31 -70 126 -23 215 312
5163 312 -21 158 191 266 -54 -262 -41 57 216 40 190 122 26 13 23 267 203 97 -150 495 58 357 154
5186 154 452 175 194 168 322 492 416 115 152 329 137 371 171 173 -103 70 -43 113 -21 -57 332 8
5208 8 149 -7 196 224 -61 100 -88 -31 -4 -38 95 -68 -73 -54 92 -292 100 130 308 -141 -345 -24 -226
5231 -226 -69 -41 36 -246 -254 57 -175 100 126 -125 204 7 -92 -231 141 -310 -247 -195 -286 -185 117 -186 -5
5254ep1J05l33P4p0K9J68k58L06k37M28k29L8K01k97J59l29k50M68J66l76J03
5276b10K44j77K39n11L58k1r5rK93r2nj43%nJ81K68m87M3K10j10J5J95m67N59
5300B73j7k63O2L1k59K97R0r5J53k01K6R7p7L5L3j84L24k2k77L8o4J90L72m49
5324A13J82J2n22L40j6j96K74p7o2J27j10Oj3j91J64nJ99j45l5j44J33j2j6n1
5348d5J3j91k2k7K81kJ18j63j12K39j58j19j61O6J58L45m34J76l15J99P5j3K12
5371A20m90L02O3k14J16J0J13m12K88J67l42J74k01J47L02k31K13QJ03k40j62
5392a66K47k03j30L8K51Q7m62O7O9K48j32j78K49r8m2M3M02m23L85l29J10Q7j46
5415b6L0J8%R6j12J71J81k52K9r9N8QK14k76Q5k06O3R2k35K23q0R9L1l6K43m01
$$ plain form
5254 -5 -76 29 -304 -230 -300 -271 -103 -361 -55 -292 136 -93 -55 146 -151 8 -321 -571 -103 63 -313 -210
5276 -210 34 -143 96 -415 -57 -78 -173 -182 111 19 14 -129 -129 -134 47 315 -172 -129 81 -29 -14 181 -286 273
5300 273 256 -7 55 86 -173 124 214 119 272 71 97 194 117 152 185 1 325 303 26 64 0 190 562 113
5324 113 295 307 -215 125 109 -87 187 110 48 175 65 71 58 -133 31 26 225 80 45 -99 34 22 6 -45
5348 -45 -32 -223 -245 -272 9 7 125 -38 -150 89 -69 -188 -349 -283 -125 220 -214 -38 -353 -154 -79 -92 120
5371 120 -370 -68 -5 -219 -103 -93 20 -392 -104 63 -279 -105 -306 -159 143 -88 125 133 236 -4 -166
5392 -166 81 -122 -252 -214 37 124 -338 -271 -202 46 -86 -264 -15 -113 -155 -112 290 -133 252 -77 33 120 -26
5415 -26 4 22 22 118 6 177 358 106 135 36 94 102 316 40 125 -81 -18 74 -161 62 -18 81 112 76 319 -82
5441h2K28J12O5k7j6q6j34L36j75J89q9k43J6J94k13j21M4J59J20j35k45K97k31
5464c7R4J30p8R5j21q3k97L75m4lN0k80J55K26j76K5j08J21J74n45K76j90L43
5487A02k46j72K57J21k27J20l46L03qj99J53L7R1k15L3K6L2j06J86j97J47j84
5509b92J79j90J73j07l1L95k03j10P7p6P6J24p1q8J14J25j29K14k87J06j72O1
5531a12L6j7k3M9K34j2j89k3l05K91r3J36m6L17m70J18K19k5J93l74O6j25L60
5554B05j19j47k60M07j18L8Q4K07O9k67m3K50j41J54k3j07n7Qj63Q9L66j18n76
5577b62L39j02K00M1K07o1m12N8k6L2J17K30Q7l33J6q9N0R7k65j2J93o3j72j55
5601b85M84p3j99J31q0j65l9J08P8m24K00K83K9k25lj16p3J62p7P3n8K74r0MO4
$$ plain form
5441 -82 146 258 323 296 280 194 60 396 221 410 321 78 94 288 75 -46 -2 157 277 142 -103 194 -37
5464 -37 57 187 109 204 83 0 -297 78 34 31 81 -199 -44 182 6 31 -77 44 218 -327 -51 -241 102
5487 102 -144 -316 -59 62 -165 -45 -391 -88 -96 -295 -142 -105 -14 -229 -196 -170 -138 -244 -58 -255 -108 -292
5509 -292 -113 -303 -130 -237 -268 127 -76 -186 -109 -185 -109 15 -56 -144 -30 95 -34 180 -107 -1 -173 -112
5531 -112 -76 -93 -116 -67 167 155 -34 -57 -362 -71 -164 -28 -74 243 -227 -109 110 85 278 -96 -30 -155 205
5554 205 86 -61 -321 86 -32 6 90 297 366 99 56 306 165 319 296 189 132 140 -23 66 432 314 -262
5577 -262 77 -25 175 216 423 362 -50 8 -18 14 131 361 448 115 131 42 92 189 -76 -88 105 42 -130 -285
5601 -285 199 126 -73 58 -22 -187 -226 -118 -40 -464 -264 19 48 -177 -180 -296 -369 -207 -284 -211 -269 5 -85 -81 -17
5626a7r5r2k42M95k38j69K12l0qM6n4J3qK48j99P2lj27k2J60L1J19j00k05L32
5651A19l35J78Q3o1N7l04J78J08j88L83k55l2P3Q1o5J23m11K04K40j56K95J3k69
5674E9l6L1j12J92K79j89j09l4j73q0L38l8M27k61j82K22k61J04k89L44r8J21
5696B55l82N2M73l30L5J8j36J69j54m3Q6J66l76M15j25r0q6J15p3lK53l90J85
5719C4J20j78J1J1j32K75J54l96K23k98o8j22N1K84o7R5l21M06j45J21j10j09
5741a61O2k63L43Kp1j3k0N0j21L23j64l05M28j16o0j72M29J03m14j75J89M3J65
5764H2q6j26L34n25K12j22J63j24O2L32k95L5l34O09j52k53J58n3J85m5q2k38
5786b63J28o1L79L4j11j96Q5K76m34L68j18J4K13P0l83k36J88L51l84K08N9j51
$$ plain form
5626 -17 -112 -204 -446 49 -189 -358 -146 -176 -184 -138 -192 -179 -187 61 -138 -66 -69 -196 -218 -58 -27 92 -8 -213 119
5651 119 -216 -38 45 -16 41 -263 -85 23 -165 218 -37 -69 4 85 20 143 -268 -64 176 20 315 328 59
5674 59 23 54 -58 134 413 224 115 81 -92 -172 166 128 555 294 112 334 73 177 -112 232 134 255
5696 255 -127 -75 398 68 103 121 -15 154 0 -43 43 209 -167 248 123 33 -53 62 -11 -14 239 -151 34
5719 34 154 -24 -13 -2 -134 141 295 -101 122 -176 -244 -366 -315 -31 -98 -3 -324 82 -63 58 -52 -161
5741 -161 -99 -362 -19 -17 -88 -101 -121 -71 -192 131 -33 -338 90 -26 -86 -258 171 274 -140 -315 -126 -83 82
5764 82 -4 -130 204 -321 -109 -231 -68 -192 -130 202 -93 -58 -392 217 65 -188 -30 -83 102 57 -25 -263
5786 -263 -135 -196 183 217 106 -90 -5 271 -163 205 87 101 314 384 1 -235 -47 304 -80 128 187 36
5808C6K0J05N3Q5j30q3J32m3j67J70k7oK06j87O0j64%q0L09l4O6j70j83o5J81
5833H4q1K10k72J41oJ53l20q2K19J16l64K83l8J80j50j91j1jK47m22L94j3j28
5856e2qMPQ8j24j11pN5K58k8k83L50j08K0l23L55Oj72O9R2k04K45q2j26Rl9O3
5883d6qQ6j57J50k69J22l8K2L40m31nJ05L8j04J80l12M59k31O6M06m44J40k3j52
5907a06L06j79OJ82k49K14M1J9l35K88k2k09O9j30J63J54k14j04N45p6m53r2K20
5930C8k66L44n4J15J35k11j40J06K43k01N1J29O6q7k08N4k18P2L07j01k18J59
5952A15r5l1K80j42r6K12j19K7o1k46M80l44L61m36J77J14k07j25RL80j70P6M1
5975B00j86o0R1j91K34n8j02J58j3k32j42J24J91j38l15O6M33k5k99L00o8l38
$$ plain form
5808 36 56 161 214 299 169 86 218 175 8 178 151 145 351 164 224 60 60 -20 289 255 321 151 -32 -97 84
5833 84 3 213 -59 82 76 229 -91 -173 46 162 -202 81 43 223 73 -118 -129 -130 117 -305 89 76 -52
5856 -52 -60 -56 -49 39 -85 -196 -203 -148 110 82 -201 149 41 61 -262 93 99 -73 -4 88 -116 129 47 -79 -70 -109 -46
5883 -46 -54 32 -125 25 -244 -122 -160 -138 202 -229 -234 -129 -91 -195 -15 -327 132 -99 -33 373 -71 69 46 -106
5907 -106 200 21 27 209 -40 174 215 234 -101 187 165 -44 25 -105 58 212 -2 -106 439 363 -90 -182 38
5930 38 -228 116 62 177 312 101 -39 67 310 109 160 289 355 268 60 114 -104 -32 275 174 -44 115
5952 115 20 -11 269 127 31 243 124 151 90 -156 324 -20 341 -95 82 196 -11 -136 -127 253 83 159 200
5975 200 14 -46 45 -146 88 30 -72 86 73 -159 -301 -177 14 -124 -439 -373 60 35 -264 36 -32 -370
5997c70Q1K78k7k29J0L8J7L92m37O8O8J75r0k26N63l17j97j45M62k84j7J75j25
6020a37j01k19L59L6j86L22L5j58M89p00K36j63j0J68J22o1p5K85n06J58J20k65
6042b51L77J71l63n8N57m62J10K10j35n0k55K50l9L1J12k57k15J73J74k26N18
6063C72q4N1j08k31J24po5L4J18l04L39j82M0L1j82L50j89J34j86K08l47Q5J53
6086A54j10l8k0J93j20J02k19k52L51K5Q5p04N80J9k19j52L99q0j76J79k3j13
6108a39j22J60M5o8J0J66O0j04k33M97l87%J25j10j64K84j18J2J92l73J06J25
6130c6j42j30M32k96K59k77m1Q3J92o0k93J17K52l13m9K11K07j40R7Q0r2N4j80
6153f5on3n1J01O3j36K69k37K46l57K08j13J59j01J61r2K75m37K23N1K01m60K26
$$ plain form
5997 -370 -289 -11 -38 -267 -257 -219 -202 190 -247 -179 -111 64 -26 -252 311 -6 -203 -348 114 -170 -187 -12 -137
6020 -137 -238 -457 -98 -62 -248 74 109 -49 440 -260 -24 -187 -197 -29 93 32 -43 242 -264 -106 14 -251
6042 -251 126 297 -66 -124 433 -29 81 291 156 106 -149 101 62 93 205 -52 -267 -94 80 -146 372
6063 372 288 339 231 0 124 117 52 86 204 -100 239 57 97 128 -54 296 107 241 55 263 -84 1 154
6086 154 44 6 -14 179 59 161 -58 -310 41 66 151 -553 27 46 -173 -325 74 -6 -182 -3 -26 -139
6108 -139 -261 -101 -56 -124 -114 52 112 8 -225 272 -115 -115 10 -100 -264 20 -98 -86 106 -267 -161 -36
6130 -36 -178 -308 124 -172 87 -190 -231 -148 44 -16 -309 -192 60 -253 -302 -91 116 -24 73 153 61 115 -65
6153 -65 -71 -124 -175 -74 -11 -147 122 -115 131 -226 -18 -131 28 -73 88 -4 271 -166 57 108 309 -151 75
6176G5Q5j79L3J80j79P7Q2k65M04l62J64n8j46L28j77P9nn6o9j6J55n2r8L07k96
6201A1L37l04J0Q5k8M9l5j19R8j91K1K9K69k72K94k25J01l22P9j7N1J25M1j83
6225i6K00K0J6j99j48N63n76q4L18q2J36l25L1L22J87j99j96k29L17n3Pp7J12
6248c5j19J60j39mJ5J67j50k03L51j7j84M9r2P1K21j71K70k12J6k65j54L33j90
6271b82K73O8p5k6J85K39k66o6j65L2L5j04k00M63p0P5N9mk04j02L07j49K28k33
6295A8P1O5p8p7K18m15O01j78j02j25l0M17l13j77K27j19P9Q8l5o1l10M94j47
6318A11o1o4R7L2j20J96j70K97j06k05M09k25j18r3O0J39j95J77j78J97j97j87
6340b04M32n33L80n8k09P0L18l35L5J18j87L13r3r2k23M8L88q6J11k66j74L0J3
$$ plain form
6176 75 160 -19 14 194 15 92 174 -91 313 -49 115 57 -89 239 62 141 136 80 11 -5 150 98 0 307 11
6201 11 348 44 54 139 111 160 125 6 104 -87 -66 -37 232 -40 254 29 130 -192 -113 -130 -79 46 87 -96
6225 -96 104 124 140 -59 -207 356 -220 -304 14 -68 68 -257 -226 96 283 84 -112 -341 -24 -77 -70 -147 -35
6248 -35 -154 6 -133 -137 -122 45 -105 -308 43 26 -158 -109 -201 -130 91 -80 190 -22 -6 -271 -425 -92 -282
6271 -282 -9 59 -16 -42 143 382 116 50 -115 -83 -48 -152 -352 111 41 116 175 171 -33 -135 172 23 251 18
6295 18 89 154 76 -1 217 -198 403 225 123 -2 -32 385 72 -105 122 3 82 170 135 74 -236 258 111
6318 111 50 -14 83 115 -5 191 21 318 212 7 416 191 73 -20 40 179 -16 161 -17 180 -17 -204
6340 -204 228 -305 75 17 -192 -122 196 -139 -104 14 -173 140 47 -45 -268 -220 168 82 193 -73 -247 -217 -204
6363b04l1J75L8j34J17l21J90PJ77n5J62k85L03k43K4N9j10K22l39K75N3j97J02
6386a5K24j65r5M1K28j86l30N2JJ17L31k34j50j0J2j01J2J47J20n2L5J01j47O1
6410cL14k38k10M04j32p4R4Qj38p1J44NJ19j35k30j31M68l76M02J2k07r1J09K08
6434B51k49J80n23N57l82M17j71J89j1k09jk38M17p2j43K37p4K20n24j2N82l27
6456A14l71K50J61k88l7N3j12J70J88k75J12L13l53M2m6P4Q8k1n3k65L22j86L29
6479B09l74l9P9Q4J13R6l32J60J90l23J60L5O2k53J51j44K2J94J02l75r3K63O5
6502E2k31P1J83l78M46j94p2J35N6K44l52J87j19L09q28M43K1L1J2n0J41Q8j81
6525A4j2P5j67J50J54j71j72J30j22K57r7O3j91rJ0O6J4Q9J2j1p0k53M29m32M81
$$ plain form
6363 -204 -235 -60 -22 -156 -39 -360 -170 -163 14 -41 121 -164 139 -104 -80 -21 -131 91 -248 27 80 -117 -15
6386 -15 209 44 -51 -10 218 32 -298 -246 -245 -128 203 -31 -181 -191 -179 -280 -268 -121 -1 -53 -18 83 -64 -3
6410 -3 311 73 -137 267 135 61 155 163 25 -46 98 103 222 87 -143 -274 194 -182 220 232 25 -66 43 251
6434 251 2 182 -341 216 -166 251 80 269 258 49 48 -190 227 155 12 249 175 395 -129 -141 441 114
6456 114 -257 -7 154 -134 -171 -118 -230 -60 128 -147 -35 278 -75 -33 -79 -5 83 62 9 -256 66 -120 209
6479 209 -165 -204 -125 -41 72 168 -164 -4 186 -137 23 58 120 -133 18 -126 -104 90 192 -183 -276 -13 52
6502 52 -179 -108 75 -303 143 -51 -123 12 68 312 -40 147 28 337 -491 -48 -27 4 16 -34 107 195 14
6525 14 2 77 -90 60 214 43 -129 1 -121 136 39 102 -89 -98 -88 -22 -8 81 93 82 12 -241 188 -244 237
6550B37j99M6k6q4J88J7O8j71o1J42L69m17K3k95j37O56q5j15m1o6o9J52k31K07
6574A08N7m24K80R0k47J61K63k37J18J88j82j9j65k20L66j25jL8l4j39K63j09
6596C0o5L4oj71K11l1l23L47j92K04j59j75L89Oj76J28k00j82N09j34j22n8N7
6619g9l18N79k55j08K1J35j62r3N9J88j91L74j89N1j05k14K76L4n0K46l24l9L9
6642a25O7J21j25L3mOJ22j31Jn2o5M22n9k38k26L18j55Q9J49O6j26l2J43l68K68
6667I9j09p6K31j88J33k12J97j51m8j84M34Q6j76k2j91J24L00j92L06l21o1j25
6689a46J88j09J44pJ47n06L34J67n5L6j85K06j26O4l28L30K6q5Mj43K11k69L12
6712B10k25J13j06L13k35k12O0J94J62l16Qj16J63m9J43j39J37j04Q5J4r1P8L8
$$ plain form
6550 237 38 84 58 -26 162 179 247 76 15 157 526 109 132 -163 -300 356 271 156 115 49 -20 132 -99 108
6574 108 165 -259 21 111 -136 25 288 51 169 357 175 156 -9 -229 137 12 11 49 15 -124 139 30
6596 30 -35 -1 -7 -178 33 2 -321 26 -166 38 -121 -296 93 99 -77 51 -149 -331 178 44 -78 -136 -79
6619 -79 -397 182 -73 -181 -160 -25 -187 -280 -221 -33 -224 150 -39 12 -93 -307 -31 3 -47 199 -125 -164 -125
6642 -125 -58 63 -62 -29 -33 -27 95 -36 -35 -87 -152 270 211 -27 -253 65 -90 -1 148 214 88 56 199 -169 99
6667 99 -10 -86 145 -43 90 -122 75 -76 -124 -308 126 212 36 14 -177 -53 247 55 361 40 -21 -146
6689 -146 42 -67 77 70 217 -289 45 212 157 193 8 214 88 152 -176 154 180 95 99 -44 167 -102 210
6712 210 -15 98 -8 305 70 -142 -82 112 274 -42 -34 -150 13 -36 107 -32 105 1 86 100 9 87 125
6735A25J28p6k38L16k22q1m8pj93LJ97j41J02N3k44J19K74o5Qj9l22M89r9j29
6759g0l6qq8J3K70j77Qj41J56k27J73K6m2k0L85k68j34N8K54k79Q3L87l16K17
6783B24j81l89J82L87k22J41j62L8N1Mj82K33j46J52K17l52M2j21M5K88j48J26
6805B27j93Q4j03k58M53p9j05l6J6J27P7n4P8j65j48q9K26J29j08M4m0l8J2L3
6829I0l6j52Q3K60l11Q2J15n4l6N3k73K12n4P5J76k12j42K22L40n79Q1MN0Q3r0
6854a3J08K36m17J60k09M8M6q3l9j33R0L84l13j07J40q2j05J99M1l1n1j94r9L35
6878h9J23o0J19j28K66k99O7l3q2nrK24j23L9K78l24J6J33k20P6o0l19M69k80
6902b21L05n8p6o1K6mK46l47J48K1J96l19J57o7m1K65k35P0M5j8j05K60j37q3
$$ plain form
6735 125 253 177 -61 255 33 -48 -96 -103 -296 -293 -96 -237 -135 -82 -326 -207 67 2 10 -9 -331 158 59 -70
6759 -70 -106 -114 -202 -189 81 -96 -88 -229 -73 -300 -127 -101 -143 -163 222 -46 -180 -122 132 -147 -64 323 7 224
6783 224 43 -346 -164 223 1 142 -20 18 69 73 -109 124 -22 130 347 -5 37 -84 -39 249 101 227
6805 227 34 118 15 -243 210 131 26 -10 6 133 210 156 234 69 -79 -168 58 187 79 123 83 45 57 90
6829 90 54 -98 -15 245 -66 16 131 77 41 94 -179 33 -21 54 230 18 -124 98 438 -141 -60 -56 -6 77 -13
6854 -13 95 331 -86 74 -135 -87 -41 -124 -163 -296 -206 178 -135 -242 -102 -184 -289 -90 -49 -80 -131 -325 -424 -89
6878 -89 34 -26 93 -35 231 -68 -1 -34 -116 -121 -130 94 -29 10 288 -36 -20 113 -107 -31 -91 -410 59 -221
6902 -221 84 26 -50 -111 -85 -89 157 -190 -42 -21 175 -144 13 -54 -95 170 -65 5 50 32 -73 187 50 -33
6926c3j30K34L28No11K13K63r2J0j67J78q1j23R2K26l85K1K23l26n3K94k15J73
6949D4o7K13j35r5J35J10j14P6k33j2j5L02r6%O8p3l51P8L72K7l43Q7J71k77K15
6974H7J18l29L57n30L01J1k90K32P8L4m21J23J51J0J55lJ25q5m33L9l4L68k44
6997a80M06m70K6q0M8K26m6J85k59J47r2j70l4N37k12M0j16M8j54K64J46l79R1
7020b8l18M37j44K6M7O1k00RM6p0J70j30M16l25J65l2N7Q9M5k50K9l6O9j5j87
7045f9J42j28M6k13J02J40J5J4l80K68J48j12J10k33K50j88j00K17J27k22K63
7066A97l9j34J1J17Q1j28l10M83k49j5p6l7L83l33P1j42J49K13k38j30L25l0l90
7089b21K5K49r6K7l09M51J82m39k59L46j67K25l13M62q1k12K00O4l4Lk08k06K13
$$ plain form
6926 -33 -163 71 399 404 -207 6 269 177 187 20 198 117 -6 86 312 -73 -52 171 -155 -208 86 -129 44
6949 44 -23 190 55 -40 95 205 91 167 -66 -78 -93 209 113 113 181 108 -243 -165 207 234 -109 -22 149 -128 87
6974 87 205 -124 233 -297 4 15 -275 -43 35 69 -352 -229 -78 -68 87 84 209 124 -309 -270 -304 64 -180
6997 -180 226 -244 -218 -298 -250 -24 -70 115 -144 3 -89 -259 -293 244 32 72 -44 4 -150 114 260 -119 -28
7020 -28 -346 91 -53 -27 20 81 -119 -110 -64 -134 36 -94 322 -3 162 130 187 276 321 71 100 64 133 118 -69
7045 -69 73 -55 -9 -222 -120 20 35 49 -331 -63 85 -27 83 -150 100 -88 -188 29 156 -66 197
7066 197 158 24 35 152 233 105 -205 278 29 14 -62 -99 284 -49 22 -120 29 242 4 -126 199 169 -221
7089 -221 -196 53 -43 -16 -325 126 308 -131 -390 -44 -211 14 -299 163 82 -130 70 134 100 103 -105 -311 -98
7112i8j8J06j63K19k48K91k7o1o6l3j91Q5M1J61j61J99K1l80J70k7K19J69m41
7135b33J12k9P4K34j72q3J71j89p6Lj70M44l0k72K2K06j95N04m34K43k52R6r0
7158a16j16Q9J82Q1j36J99n24L75l12K20J0K12l45M50k54j38M4K14K9m3m09K31
7180e7N8L0K03l54M57j92m8j52J30K33m25K72j18j09K80k58J69J63l24L04l44
7201h2J32N0j30J86j07k07l8M97n01L42J8j66J86r4j74K97l55L92k70M9k0j74
7223a69K77n1J41j93q8K52l19K99q9j39J55q4M4l40J19J43J03O5m05L72l33K32
7245hOk21J33j11J5J76k44K53J30l05MK08Lm3J30k25L5Q5K0o0O7l26K19j59M4
7270a74L43j51Lj04lJ52j76K48j75J76k6j12L0L9J02j80j6K4Q7j48J9P9J19O5
$$ plain form
7112 -98 -116 -10 -173 46 -202 89 62 1 -65 -98 -289 -204 -163 -2 -163 36 57 -323 -153 -180 39 208 -233
7135 -233 -121 -150 -76 158 -14 -97 74 -115 -191 -188 -358 86 56 -216 -194 12 -183 321 -113 130 -122 -26 -116
7158 -116 -232 -143 39 120 -16 183 -341 34 -278 -58 -48 164 -181 269 15 -123 -79 135 164 121 -288 -57
7180 -57 1 31 234 -120 337 145 97 -55 75 308 -117 155 37 -72 208 -50 119 282 -42 262 -82
7201 -82 50 100 -30 156 49 -158 -196 301 -200 142 160 -6 180 86 -88 209 -146 246 -24 25 5 -169
7223 -169 108 57 198 5 -83 169 -150 149 60 -79 76 -8 36 -304 -185 -42 61 126 -279 93 -240 -8
7245 -8 -2 -223 -90 -201 -186 -10 -254 -1 129 -176 -172 36 39 -4 126 -99 -64 21 41 -19 48 -278 -59 -218 -174
7270 -174 169 18 21 -83 -86 66 -110 138 -37 139 113 1 31 70 172 -8 -24 0 87 -61 -42 37 156 221
7294B21J5l05k3j70J51J72j25J20j32L21k44M7k82M08p8q4L04k69j07J61l3Q0
7316A48p1j52N1M8k1k0j8j99K61m9j25M98o9m95K51L9jj40R5J10J1p2L5k89K93
7341A19m03K61R5L7K36l66M02l41LJ26j40j55j0L47l96k3K09kk81P9L22k51N4
7364g8J27K8J97l12j04L05j03q4K62j8j76kl75K92m08K08J74J41j25j18O0PK11
7387A09k82J49m1L15l14J68j40N8N2J43n4k89o5J8K61k07L01k03J83o2j04j97
7409b01L6K3o7J25l0J01K1Q9j04k8K7K38r3J12Nj16J67j82r9J01lq1J01k50J29
7434B1m5L3K25l17J32q6k2j00L57j28n2O3K45l71j02J65k08l5L78l2Mk85l5M57
7458B62k76j61L14j94K89l36K78j12n0J62n0L4l75K13r3J9J73j1J7Q7k44K26j10
$$ plain form
7294 221 236 -69 -92 -262 -111 61 -64 56 -76 245 1 48 -234 174 96 12 316 47 -60 101 68 148
7316 148 77 -75 -24 24 3 -17 -35 -234 27 -22 -147 351 282 -213 38 77 76 -64 31 141 152 80 115 -174 119
7341 119 -284 -23 72 109 345 -21 381 40 43 169 29 -126 -136 211 -185 -208 1 -1 -282 -203 119 -132 -78
7364 -78 49 77 274 -38 -142 163 60 -24 238 220 44 42 -333 -41 -449 -241 -67 74 -51 -169 -109 -102 109
7387 109 -173 -24 -65 250 -64 104 -36 22 74 217 163 -126 -191 -173 88 -119 182 -21 162 100 -4 -201
7409 -201 -165 -142 -209 -84 -114 -13 8 97 -7 -35 -8 230 137 249 254 138 305 123 24 125 122 41 142 -108 21
7434 21 -24 9 234 -83 49 -37 -59 -159 198 70 18 81 326 -45 -147 18 -190 -225 153 121 125 -160 -195 262
7458 262 -14 -175 139 -55 234 -102 176 64 14 176 126 160 -215 -2 -95 -76 97 86 103 190 -54 172 62
7481F2J06j70k25J79K72k62P5l42K93o6K36l09j52O30m68J0L6q7K63O5k44K46
7503A48l12K9k5J44j16P0j13J23k01K71N6o8K7j01Q3j35J45k08K32k6R3j63J08
7526F1j93Q6K84l04J01j82O1p7M66m86N11k34j68L08k87J39j65K60k86J33L65
7547C93m28l4k0l9K02j82%K70j39r9j9L19k29N1m9k53L5K44j10J95j53J44oM1
7571A34q2j19J71l58M10j13L28l46J46j79l2P7r5rL1L02k04J44L5k32j49P9p4
7594a35K90J20k24J60k58J1R3L55k58j75j03L32j89k07K92k11JJ66k57K52o2m8
7616e5n6R4Np2K26m53K04l3L0m1K83l72k01J83J05J96j15Q7j52O3K11j51l07M91
7640A70o7k65M36j87n7j18K71k66R7k8l11MK40L0j87J56o1K22j37K2J27j33K14
$$ plain form
7481 62 168 -2 -227 -48 224 -38 37 -305 -12 -78 158 -151 -303 327 -141 -131 -95 -182 81 146 -98 148
7503 148 -164 -135 -160 -16 -132 -62 -175 -52 -253 18 74 6 33 -68 15 -120 25 -183 49 23 116 -47 61
7526 61 -132 -46 238 -66 35 -147 -86 -163 303 -183 328 94 -74 234 -53 86 -79 181 -105 28 393
7547 393 -35 -69 -89 -128 74 -108 -108 162 23 -76 -95 224 -5 46 -3 -256 -221 23 -87 108 -45 99 93 134
7571 134 52 -67 104 -254 156 43 371 25 171 -8 -40 37 -58 -67 -36 266 62 206 241 9 -140 -61 -135
7594 -135 155 275 51 211 -47 -36 57 412 154 -21 -124 208 19 -188 104 -107 -106 60 -197 55 -7 -55
7616 -55 -111 -17 -12 -84 142 -311 -107 -140 -110 -151 132 -240 -441 -258 -153 43 -72 15 -137 -74 137 -14 -321 170
7640 170 103 -162 274 87 30 -88 183 -83 14 -14 -325 -321 -81 -51 -238 -82 -143 79 -58 -36 91 -42 172
7663A72nl26j26M32l17J63J1n8jo1K89l03K28j63N73m46l26J69L39j40j28P1k7
7686B0J32j68l28m3O52j33o4J56n47K82j78J37J48K31k13o2M8L5L0l03L82J10
7708C24k65M4q4L49l79K5j20J37k29J39k8J18n9Q1q9K98k72l6J6j35L11l36M39
7731B49l23j14J06K3J77k16L14m94k7L46m5j29m2M46m52K25j14m8O8J55k05J32
7753C2l74J74J93J19j97J88k80p2L05j61Q0M3J30j86Q8K1J5k72L0j5n4K6M28j95
7777F6m8N8j0R0j55k23j05M07J15j19j37J22J65q3o2j96R1J23O2p8oo2k07J69
7801b3P1K9K7j94J51m3P4M3m18N26l10k4k2J13J00l9j9p5RJ2J2j03N3N6N0K68
7827C24n46K14n4KK64k82L53k41j07r6J98Jj17N8J19Q3k07m03N27M6l20J37J82
$$ plain form
7663 172 167 -159 -285 147 -170 -7 4 -54 -55 -116 173 -130 98 -65 508 62 -264 -95 244 104 -24 47 20
7686 20 152 -16 -344 -387 265 132 68 224 -323 -41 -219 -82 66 297 84 22 70 105 135 -168 214 324
7708 324 59 103 19 368 -11 14 -106 31 -198 -59 -87 31 -28 53 -36 262 -10 -46 -30 -165 146 -190 249
7731 249 -74 -188 -82 -59 118 -98 216 -278 -305 41 -4 -133 -175 271 -181 44 -70 -118 -50 105 -100 32
7753 32 -342 -168 25 144 -53 135 -145 -217 88 -73 7 50 180 -6 82 103 118 -154 -124 -139 -193 -167 261 66
7777 66 18 76 66 156 1 -222 -327 80 195 76 -61 61 226 143 81 -115 -24 99 161 83 77 15 -192 -23
7801 -23 48 77 104 -90 61 18 92 135 -283 243 -67 -91 -113 0 100 61 42 -33 -24 -12 0 -103 -50 6 56 324
7827 324 -222 -8 -62 -60 204 -78 275 34 -73 -169 29 30 -87 -29 90 173 -34 -437 90 136 -184 -47 135
7850A35k81J39q0L17Lo27M97nn04J68L02j74J70m27N19m33M89m64J02j24J96O9
7872a3L1k5k96L12m32M5Q8J66J6L9r2J32J87q6o0K28k94K57k29J9j42k4K70k04
7896a07M40k77j63o8K59M7j24J67ok33j51K96m6k64K88p2p8R9l6J1k0J41k81K71
7920I3Q6k62J97O3m34K99O9L00m70M6R4k00lJ70r8r0J13J4J12k4R8m4Qj89L18
7945B66k27p7pQ6p2k41K14L07nk32q5J23K9R8j00J1p2K9p2K20j22K8j83J3l7K38
7971A30j74M2m2L54k79q6n7L58l02J67k63M62m41L17l03m4q5M15m99L47k49L00
7993F8j45P0K7p0K4rJ14l03J22J92k34k5l1m9L85o31L12J84j95J91l6J54j83j16
8017a84q0j58L08K21P2j38j69R5j82J80j20K99n4j20L6K75k52k87N46m52M90l27
$$ plain form
7850 135 -146 -7 -87 230 233 -394 103 98 -406 -238 64 -110 60 -367 152 -281 208 -256 -154 -278 -82 -13
7872 -13 18 -7 -303 9 -423 -378 -290 -124 -108 -69 -161 -29 158 72 12 240 -54 203 -26 -7 -149 -173 97 -107
7896 -107 333 56 -107 -175 84 131 7 174 168 -65 -216 80 34 -230 58 -14 -92 7 -29 -18 -38 103 -178 93
7920 93 179 -83 114 177 -257 42 111 411 -59 -13 81 -119 -122 48 -50 -140 -27 -13 99 75 173 129 137 -52 266
7945 266 39 -38 -45 41 -31 -272 -58 249 244 12 -73 50 79 177 77 88 16 45 -27 193 71 99 -84 -71 -108 130
7971 130 -44 -2 -44 310 31 -55 -112 246 -56 111 -152 310 -131 186 -117 -161 -246 169 -330 17 -232 68
7993 68 -77 -7 20 -50 -26 -35 79 -224 -102 90 -144 -169 -200 -249 136 -495 -183 1 -194 -3 -39 115 -68 -184
8017 -184 -264 -422 -114 107 179 41 -128 -33 -215 -35 -155 144 90 -30 6 281 29 -258 288 -164 326 -1
8039aN5k20K49o0j14jQ2j32j06K50J7L64k84j1k96J98K1n2K58j78lN7R1j98J71
8064A57l47K26l8J54j59Q4J04k58J33k53J53j50J59J88l01J0J06J46j20K1J67
8085A82n3O5n7%j32J8%k15L12j45J60k68K17J54j74j33p1R2k72M50qk18K54j86
8109b8N0j0j60j1J64J15l52j73K78L2O8R8R4j16m41L14j56J50J6J28k15L1k8j57
8133c09L4J11L99l27O8j27r3K25o9n0J93p5O4q8O0L1k59N5K89j73J93k22J39L6
8157A05k1j9k57K90Nk98K89L3l01J04M6J11k24J13J70k23p8J61p1P5j77L10q8
8180E5K45l24K2J37m09P0L2J45k38O22j63
$$ plain form
8039 -1 54 -166 83 23 -91 -92 -10 -142 -248 2 19 383 99 88 -208 -10 11 -41 217 39 36 93 184 -14 157
8064 157 -190 36 -2 152 -7 77 181 -77 56 -197 -44 -194 -35 153 -148 -138 -32 114 -6 15 182
8085 182 129 194 137 137 5 23 23 -192 120 -25 135 -133 84 238 64 -69 -140 -48 -320 130 122 -96 158 -28
8109 -28 22 12 -148 -159 5 120 -232 -405 -127 -95 -27 71 165 49 -392 -78 -234 -84 -68 60 -155 -124 -152 -309
8133 -309 -275 -164 235 -92 -24 -151 -244 -19 -88 -138 55 -20 44 -44 16 47 -212 -157 132 -41 152 -70 69 105
8157 105 84 65 -192 98 103 -195 94 127 -174 -70 -24 87 -137 -24 146 -77 -155 6 -65 10 -167 143 55
8180 55 300 -24 -2 135 -274 -204 -172 -27 -265 357 194
8191A94
$$ Imaginary data points
##PAGE= N=2
##DATA TABLE= (X++(I..I)), XYDATA
0@%%%%%%%Qj6J6j6J6k4L2l6M4n6O4p2Q8j04J20j39J62j89K15k42K76l14L57m03
31b13M50n03N64o31P02p79Q64r59J065j180J305j445J600j773J967k184K434k719
49a435L050l445L918m498N229o184P498r416J2479j8165L2132j24328j88028L16707
63B5514J39527k45886j66505J78427J14351n5081J1749L9564j47353j03462J39133
74g0022J02137j28242l2288J70803J4033k08250k3389J85578P483j63813J4453
85a31517J19358n9005q8956J23548J10505j20896j17934N2587K1455n9044N9134
96i0765J02544p5381r5330J10332R6725j32150r6639J29651O4774j58268p4468
107b18975J44526Q9433o1414q749M2102p1905p6010Q4772P3713r2424m7815J15707
$$ plain form
0 0 0 0 0 0 0 0 0 8 -8 8 -8 8 -16 16 -20 24 -32 32 -40 48 -56 64 -75 87 -102 113 -129 147 -167 190 -213
31 -213 237 -266 298 -333 369 -410 454 -505 560 -620 685 -760 840 -933 1034 -1150 1284 -1435
49 -1435 1615 -1830 2088 -2410 2819 -3365 4133 -5283 7196 -10969 21163 -103165 -291193 25514
63 25514 165041 -80845 -247350 -68923 45428 -9653 2096 41660 -105693 -209155 -70022
74 -70022 32115 -96127 -128415 42388 56421 -151829 -175218 10360 17843 -145970 -131517
85 -131517 -12159 -71164 -160120 -36572 73933 -46963 -164897 -112310 -90855 -149899 -90765
96 -90765 11779 -63602 -158932 -48600 48125 -84025 -180664 -51013 13761 -144507 -218975
107 -218975 -74449 14984 -46430 -55179 -13077 -84982 -160992 -76220 -2507 -94931 -142746 -27039
119b7039L7437j18566j5859J21127m753j20453J0718Q6344m3131m9189J12916
130a0448P9734j09740p7384Q4997K8408r7529k535J01392j2180p9806N5421R0112
142E0442o1067p1089P3167L8717j12231m6249J15833N1801q2557o817Q7878j6395
154B1433q7787K9465P4679m6840o1432O1949N4777n4118j8860P3045J332q7143
166c9500m244O6125j8209m7859N8853O6965n3218n2998N3821L0960o4649k2640
178b6593N5835j193n2635K9046O8050k1491m3510L9017K5205o7470l2614O8476
190D0123K9630n4501k585O2949p260o1716J5406N1234l1432m6867L7863L6858
202F9702l8212j1828N6824O863o1542n918M5670j8609m4653L4986N2251k8138
$$ plain form
119 -27039 10398 -108168 -124027 -2900 -7653 -128106 -117388 -31044 -74175 -123364 -10448
130 -10448 69286 -40454 -117838 -32841 -4433 -101962 -104497 -3105 -15285 -95091 -39670 50442
142 50442 -10625 -81714 -8547 30170 -82061 -128310 -12477 39324 -43233 -50050 37828 21433
154 21433 -66354 -36889 37790 -9050 -70482 -8533 46244 -7874 -26734 46311 47643 -39500
166 -39500 -43744 22381 4172 -43687 15166 82131 28913 -24085 29736 60696 -3953 -26593
178 -26593 29242 28049 -24586 4460 72510 51019 7509 46526 71731 4261 -28353 40123
190 40123 69753 15252 12667 75616 68356 6640 22046 73280 41848 -5019 32844 69702
202 69702 31490 19662 76486 83349 21807 15889 61559 42950 -1703 33283 85534 57396
214E7396l1656L8766K0029m7644j6740L9700k532m3894J4228M7654j3441l3540
226B8326K7292K5914m1143k8863L6947J6249l8278r92M6898l069m3315J0486L3590
239G0042k6666l5948K9046K6931l0522j1451M1255P203m2765m027L3086j3888
251D2296l8411J6532L4360j8353k2720K8543J8472l4192j8470K7805J778l6088
263A552K640L7941l592l1153J1772K5215k3052k6883J9956J3817k5548o909K9721
276B5477L283k7356K548K1507j4897k7155J0933J7783j4906r403K1178P739k2844
289f113o042J6458o373k3942N962J9743q275j3716J5360J1601k0105j2077J5366
302a2153j432k3058K730K3948k795j8516Q659J5565j4159j8478Q800P384j4304
$$ plain form
214 57396 25740 64506 84535 36891 20151 59851 57319 13425 27653 75307 61866 28326
226 28326 55618 81532 40389 11526 48473 64722 26444 25452 72350 69281 25966 36452 70042
239 70042 43376 7428 36474 63405 32883 21432 62687 69890 27125 23098 56184 42296
251 42296 3885 20417 54777 36424 13704 42247 60719 26527 8057 35862 37640 1552
263 1552 4192 42133 38541 7388 19160 44375 21323 -5560 14396 28213 2665 -4244 25477
276 25477 28760 1404 3952 25459 10562 -16593 -5660 12123 -2783 -12186 8992 16731 -6113
289 -6113 -12155 4303 -2070 -26012 -20050 -307 -8582 -22298 -6938 4663 -15442 -27519 -12153
302 -12153 -13585 -36643 -33913 -9965 -12760 -31276 -22617 -7052 -21211 -39689 -30889 -23505 -37809
315c7809l853J8013M195j3508J190J1450q639j6989M397J0625o962n456J3432
328b9914O931j1803l895Q404n500j4467L227J1696k883l896J1974P905j0891o849
342c9961O441k528j3098Q23J5162K018q045O394J1901n898j3059K474N209p185
356c9352m347J0667Q764l958O89O569k976j0114j032N449J75M1P362N972L56p05
372a6440J76l920n617j378J439J385M102Q889O402m35j984M98m399q673n87O762
388a3780K318l39P852Q335j978n064P03J99n698k609N541O117L230L492L235k23
404A1331n346n446k459J116J865K603N556P078K593k128k118k346m885m902o87
419A825L524N992O195M615L768P21m879o888k650l18j220J041O942N335Q96k37
$$ plain form
315 -37809 -41662 -23649 -19454 -32962 -31772 -20322 -28961 -45950 -41553 -30928 -37890 -43346 -29914
328 -29914 -22983 -34786 -38681 -30277 -35777 -50244 -47017 -35321 -38204 -42100 -30126 -22221 -33112 -39961
342 -39961 -33520 -36048 -49146 -48323 -33161 -31143 -39188 -32794 -20893 -26791 -39850 -37376 -32167 -39352
356 -39352 -43699 -33032 -24268 -28226 -27537 -20968 -23944 -34058 -35090 -29641 -29466 -29425 -22063 -16091 -15735 -16440
372 -16440 -16264 -20184 -25801 -27179 -25740 -24355 -20253 -11364 -4962 -5397 -7381 -6883 -11282 -19955 -20542 -13780
388 -13780 -11462 -11801 -3949 4386 2408 -2656 -1953 -1754 -7452 -10061 -4520 1597 4827 8319 11554 11331
404 11331 5985 539 -1920 -804 1061 3664 9220 16298 18891 16763 14645 12299 7414 2512 1825
419 1825 5349 11341 17536 22151 25919 26640 21761 14873 12223 11905 10685 11726 18668 24003 24899 24662
435B4662j09k691m787m299o54L448M675L488L610L935j643p671n702r46j996k362
451A0958N531R399L963k34J810k45o469p700l177l29o86K808P040O333J143k097
467B8048j883m135p205l687J457L261K490L923L306k77k702k256m552m750K7K804
483A3869K029K648P335K420n200n310k497n647p531R38O812M213J292M245L602
498B3218l697o358l450l407n435m05M794M390K282K901K705m029p320m739j655
513b05p10N52M540M206R88m19j378m844o277j191m1l881K125R151M133l222L51
530C878J423q006j1234q11M254j817P92R175M858l372k295J213m812r145j570
545a7469L409n55j517O798P213l520p661J5K62p893m064P436N549k578J921O520
$$ plain form
435 24662 24553 21862 17075 12776 12122 15570 20245 23733 27343 31278 29635 21964 16262 15316 13320 10958
451 10958 16489 25888 29851 29617 31427 31182 24713 17013 13836 13507 12821 15629 22669 29002 30145 28048
467 28048 26165 22030 14825 11138 12595 15856 18346 22269 25575 25298 22596 20340 15788 11038 11065 13869
483 13869 15898 18546 25881 28301 23101 17791 15294 9647 2116 3054 9866 14079 15371 19616 23218
498 23218 19521 13163 9713 6306 871 466 5260 9650 11932 14833 17538 13509 6189 1450 -205
513 -205 -915 -363 4177 8383 9371 8952 7574 2730 -3547 -4738 -4779 -8660 -6535 2616 6749 3527 3878
530 3878 5301 -2705 -13939 -14750 -10496 -12313 -11521 -2346 2512 -860 -3155 -1942 -6754 -15899 -17469
545 -17469 -14060 -14615 -16132 -9334 -2121 -5641 -13302 -13287 -13025 -20918 -24982 -17546 -11997 -14575 -12654 -6134
561f134l088q625p93J034p070k980Q721N889k075K392O058l580r772l045J125
576b1943l148j868N711O556N35j17L435j301p239k776K119k421k201P162P154
591a0342k760k547N626j034j0436k723Q322L98m850O988R245k885n866M498j18
606h484j0844l562Q850K975m860N369J1396p70r705N01M671o317o510P025P363
621b902l437p00R983K305r315k007O089l926p422N969R127l164j375Q656J152
636I033j1405k952P879r06p176N360J1148j960n409N900L190q773n392O971J363
651F871p747K723J2542R93q346K753O493p956q866O449O133o459q02J2132J554
666A8467j1530L87Q904m769j0465N267Q955n280l632J0044L941j1085l305R323
$$ plain form
561 -6134 -9222 -17847 -18640 -17606 -24676 -27656 -18935 -13046 -15121 -12729 -6671 -10251 -20023 -23068 -21943
576 -21943 -25091 -26959 -21248 -14692 -14157 -14274 -10839 -12140 -19379 -22155 -20036 -22457 -24658 -17496 -10342
591 -10342 -13102 -15649 -10023 -11057 -21493 -24216 -15894 -15496 -20346 -13358 -4113 -6998 -12864 -8366 -8484
606 -8484 -19328 -22890 -14040 -11065 -15925 -10556 840 70 -9635 -9134 -4463 -10780 -17290 -10265 -2902
621 -2902 -6339 -7039 2944 5249 -4066 -6073 16 -3910 -11332 -5363 3764 600 -775 7881 9033
636 9033 -2372 -5324 2555 1649 -5527 -167 10981 9021 3612 9512 12702 3929 -1463 5508 6871
651 6871 -876 1847 14389 15382 7036 9789 16282 8326 -540 5909 12042 5583 4781 16913 18467
666 18467 6937 7324 16228 11459 994 6261 15216 9936 6304 16348 20289 9204 5899 15222
680A5222k459j1993L505J3232k280q714N963P661q521q417P086L682r553k231
694B183J1917K565r341M15Q679l901r256K707M878n400k284R547K101q697k89
709E824P643m298r401L511P081m224l053P642J679r173J30Q171m352j0913N157
724A424J0233n642q663R293P793j0019p533Q809L023j2621j442J4719J101j3033
738b558J894J2037n710j2738N722R444q236o205J1153M866j1770k455J1757r82
752F219j3287M98J1049k079q235N124P423n681n845N517P78q953L8R692k32q143
768f117L286Q148n198q795M771M961p818l305R601K508q651O13Q867l543r850
783a0522L009N953n663l838Q738L464q099j261Q224k253j0458J427R506l046p364
$$ plain form
680 15222 12763 770 4275 17507 15227 6513 12476 20137 11616 3199 10285 13967 4414 2183
694 2183 14100 16665 7324 7739 16418 12517 3261 5968 10846 5446 3162 12709 14810 6113 5824
709 5824 13467 9169 -232 3279 10360 6136 3083 10725 12404 3231 3361 11532 7180 -3733 1424
724 1424 11657 6015 -2648 6645 14438 4419 -3114 5695 8718 -3903 -5345 9374 10475 -2558
738 -2558 -664 11373 5663 -7075 -1353 8091 -145 -6350 4803 9669 -2101 -4556 7201 6219
752 6219 -7068 -6570 4479 2400 -5835 -711 6712 1031 -4814 703 1481 -7472 -7434 2258 2026 -6117
768 -6117 -2831 5317 119 -8676 -3905 1056 -6762 -10067 -466 2042 -6609 -5996 2871 -672 -10522
783 -10522 -7513 -1560 -7223 -11061 -2323 1141 -6958 -8219 5 -2248 -12706 -11279 -1773 -4819 -12183
798a2183N947O916n739n488N519J713r241j102R599k55p784M629R593n751r754
813a3381M802N798q387n234R885N031p984n85Q617q77r363P68O644l911n792O117
829g852O391m293k423O110N41r147j157O269m22m881M378P019k720m665L380J473
845a999o389j443N426P42m268L811P273k812n374L913L260p749m242P353L642
860A144n503J068Q875o46q104R76N429m712m856N656O133m221j817O876J453p228
876E23k046M895q29n669K555Q057k09l873L193L178n734n219L921K602m204R63
892B104P176O18m510K120K854m464n206L360K008l327M23O744J004l985l91K058
908H586l147l818K523L044j583l92M646J287m356j500K637k401n343J502N154
$$ plain form
798 -12183 -6236 680 -5059 -10547 -5028 -3315 -12556 -13658 -4059 -4314 -12098 -7469 2124 -3627 -13381
813 -13381 -8579 -2781 -11168 -16402 -6517 -1486 -9470 -10055 -1438 -2315 -11678 -10910 -4266 -8177 -13969 -7852
829 -7852 -1461 -5754 -8177 -2067 -1526 -10673 -11830 -5561 -5983 -10864 -6486 533 -2187 -6852 -3472 -1999
845 -1999 -8388 -9831 -4405 -3663 -7931 -4120 3153 341 -5033 -1120 2140 -5609 -9851 -2498 1144
860 1144 -4359 -3291 5584 4938 -3166 -2190 3239 -1473 -6329 -673 5460 1239 -578 6298 7751 523
876 523 -1523 3372 2543 -3126 -571 7486 7277 3404 6597 9775 4041 -1178 2743 5345 1141 2104
892 2104 9280 9898 5388 7508 10362 5898 692 4052 6060 2733 3156 9900 10904 6919 6528 8586
908 8586 5439 1621 4144 7188 5605 5213 9859 11146 6790 5290 7927 5526 183 1685 6839
923F839n64j772L937L865n743m000K319M15n349L05N765O20l143K239L479l553
939E659m599J235J264l675q07M857K580k550r62K423j294m805r94K931q32j326
955h95K875L116j647j858J150p90m522j460K920k80q02L374K970k093j926P68
971I00p74l719p67K348O13j164J826K629j032k316J43o4k702j599K550K186j014
988a956O83K696j050l013j001J023j620r45K297K021m69j83J922l05k865j509
1004d274R91j410r71K454K894k76p44J325l55l145j326J157J74q81J016K821l09
1021h59j159M27J44j766j899O48J471J94L90J793J289j897j688N5n73j464L72
1038d522J708K31M18J064L79q30j010l38j113q64O59Q94O27J128R04l7j673o52
$$ plain form
923 6839 6275 4503 8440 12305 6562 2562 4881 5296 -53 252 6017 6637 3494 5733 9212 5659
939 5659 1060 2295 3559 -116 -923 3934 6514 3964 3002 5425 4131 -674 -1668 1263 431 -895
955 -895 1980 5096 3449 1591 2741 1951 -2571 -4031 -1111 -1391 -2193 1181 4151 2058 132 900
971 900 126 -3593 -4360 -2012 -1399 -2563 -737 1892 860 -1456 -1313 -1377 -4079 -5678 -3128 -942 -1956
988 -1956 -1273 1423 373 -2640 -3641 -2618 -4238 -5183 -2886 -865 -1334 -1517 405 100 -2765 -4274
1004 -4274 -3283 -4693 -5664 -3210 -316 -592 -1336 -11 -366 -3511 -4837 -3680 -3506 -4387 -3371 -550 -859
1021 -859 -2018 -1591 -1447 -3213 -5112 -4464 -2993 -2799 -2409 -616 673 -1224 -2912 -2857 -3430 -4894 -4522
1038 -4522 -2814 -2583 -2165 -1101 -722 -1552 -2562 -2900 -4013 -4877 -4218 -3324 -2697 -1569 -665 -702 -2375 -3027
1056c027j81p75k54O45J255O11k42K3N46k42j848k45M43j70l8J234J439j6m36
1075a278jr65j232N9O08R6P40P58O10K88O3o79p18R7l91q32Q78J538M78L51Q8
1096E56k24p11m25k60mR06N09K10R23N05n86q31N95j45r97K02J341O87m4Q00L53
1117C360p82n54J41n44n8P72M31N35Q39Rj181P17J87j143l31J006K31K38N71N99
1137E043n47m49K42n81l22N54J01R3M36O18m49l90K45m76l11m4K95n6N46K10j10
1158D648k03P3p80p74K43J57k06L04P81m52o51N55k28q52o29N14o5K12l14j38
1178B195M16k17p50q83K07M31n98j72O22P35o01q15o7l63q80l1L78N2j89l8M32
1199a36n04l94m61o7r5n16oJ128J68j045R8O19r25j494O31O76o58o64J615N30
$$ plain form
1056 -3027 -3208 -3983 -4237 -3592 -2337 -1726 -1968 -1945 -1399 -1641 -3489 -3734 -3291 -3461 -3499 -2265 -826 -842 -1278
1075 -1278 -1279 -2244 -3476 -3417 -2809 -2713 -1973 -1215 -605 -317 -254 -933 -1651 -1554 -1945 -2777 -1899 -361 117 468 556
1096 556 332 -379 -804 -1064 -1068 -162 347 557 1480 1985 1399 568 1163 1018 21 223 1564 2251 2207 3007 3360
1117 3360 2578 2024 2165 1621 1563 2335 2766 3301 4140 4149 2968 3685 3872 2729 2398 3404 3635 3873 4444 5043
1137 5043 4496 4047 4289 3708 3386 3940 4041 4134 4570 5188 4739 4349 4594 4118 3807 3763 4058 4002 4548 4758 4648
1158 4648 4445 4518 3738 2964 3207 3364 3158 3462 4243 3791 3140 3695 3467 2615 1986 2500 2435 2647 2333 2195
1178 2195 2611 2394 1644 761 968 1399 801 629 1251 1986 1385 570 503 140 -740 -771 -393 -341 -530 -568 -136
1199 -136 -640 -1034 -1495 -1562 -1657 -2173 -2179 -1051 -883 -1928 -1830 -1211 -2136 -3630 -2999 -2323 -2981 -3645 -2030 -1500
1219a500j051n21M93m99r59K70N14mJ2M79M97m61m61l48J18n34l68J050R95p4
1239b352m19M95Q9p28j023N03k94L7M32J155p1Q8M15l91j149L55l7m09Q98Q97
1259a509K06o51Q76N4j122l15O15l67o02J111J223K99q30j23P84n87j647k1J348
1278a258O12r21J259J383p39j524N69K60j935L9J796N99j255Q39J788o01k068
1295a157J79P14r80o66J464J519j89o51O98J24j263j396Q78J26m19P87J508R9
1313A375o11K93K17j712p79P51K28k87J188J344m65p16L38n29j481J4P92K78o18
1332c80J182J429k89j048N38jk012q80K396O16j330Q76K328l99k680K01J372j220
1350F99j727J879K173j056n97K037O58k365j479J332J85j632K75K907N53j659
$$ plain form
1219 -1500 -2551 -3072 -2579 -3078 -4037 -3767 -3253 -3257 -3245 -2766 -2269 -2730 -3191 -3539 -3421 -3955 -4323 -3273 -2278 -2352
1239 -2352 -2771 -2276 -2187 -2915 -3938 -3435 -3729 -3692 -3260 -2105 -2176 -2088 -1673 -2064 -3213 -2858 -2895 -3304 -2406 -1509
1259 -1509 -1303 -1954 -1078 -1024 -2146 -2461 -1846 -2213 -2815 -1704 -481 -182 -1012 -1135 -351 -938 -2585 -2606 -1258
1278 -1258 -646 -1567 -308 1075 336 -1188 -619 -359 -2294 -2255 -459 140 -1115 -276 1512 911 -1157
1295 -1157 -978 -264 -1244 -1910 -446 1073 884 233 931 1055 -208 -1604 -726 -600 -1019 -232 1276 1375
1313 1375 764 1057 1274 -438 -1217 -466 -238 -525 663 2007 1542 826 1164 635 -846 -832 -40 238 -380
1332 -380 802 2231 1942 894 1432 1431 -581 -1461 935 1551 221 1097 3425 3026 346 547 1919 699
1350 699 -1028 851 3024 1968 1371 3408 4066 1701 222 1554 1739 107 382 3289 3842 2183
1366B183L34J550j384k186Q46J208j208mK249P42j200j9M58j238j174K42Q60J02
1384B361N4J413N60j008n76M62j033j545N32J315m99M97J436P43k024p32P80l00
1402B436k589O15K042L7j273J972J159k088k026J304j5j975k53K709O51j692N43
1419A557J156j279k164O4J186j127j092J928J871j330j181J316l22k583j83J409
1435g74n54j159J755J541j354m91L33n57j755l78J387m25l46J174J257q73j413
1452b632M94l7j833m25J869L53j194Q48J832j088k271O96Q96k050j040K580J222
1469a780j569j08K545r96k810L97J650j396j533K115K339j219j222J699K48k231
1485c871r93K286K80j964O87K612J0j621J9J675j229j819R04J635q02n27K422
$$ plain form
1366 2183 2517 4067 2683 497 1343 2551 1343 1339 3588 4330 3130 3111 3569 2331 1157 1399 2259 2361
1384 2361 2415 3828 4388 3380 2804 3266 2233 688 1220 2535 2036 2533 3969 4712 2688 1956 2736 2436
1402 2436 -153 462 2504 2541 1268 3240 4399 2311 285 1589 1574 -401 -654 2055 2706 1014 1557
1419 1557 2713 1434 -730 -666 520 -607 -1699 229 2100 770 -411 905 583 -2000 -2183 -774
1435 -774 -1328 -2487 -732 809 -545 -1036 -703 -1260 -3015 -3393 -2006 -2431 -2777 -1603 -346 -1219 -2632
1452 -2632 -2138 -2175 -4008 -4433 -2564 -2211 -3405 -2557 -725 -1813 -4084 -3388 -2492 -4542 -5582 -3002 -1780
1469 -1780 -3349 -3457 -912 -1908 -4718 -4321 -2671 -4067 -5600 -3485 -1146 -2365 -3587 -1888 -1640 -3871
1485 -3871 -4864 -2578 -2298 -4262 -3575 -963 -953 -2574 -2555 -880 -2109 -3928 -3024 -1389 -2191 -2718 -296
1502b96K40j965N2J196n76j772J232J379m71P3P22R39j233k61N98q85o88J082
1520f34J165o76p5J718l36j484j88J040M7j558R20K011p44j162J566J066j979
1537F97j220J308O11j607K88K502l6k016O41J517r98k691J488J886j046j052K037
1554B309P40j892q01J709k54j943N32J308k6r60Q26J524j393j366R31P00j390
1571E54n33J270J029j342J13J502q18j430M32Q98j131j22J537K15j201K40R75
1588B188n97j394P27P50p20m19J386K97r64K20L64m48r90K50P12k6o67N19J433
1607B621q06j538J132N88j153o79J568O95j662J64J431k70j701O17P66j039j64
1624E70J159O27j032Q0M61J90j085k19N38J76k14L96L84J0p36J65L47j068k72
$$ plain form
1502 -296 -56 -2021 -1969 -773 -1349 -3121 -1889 -510 -981 -908 -186 753 -480 -741 -143 -1028 -1716 -634
1520 -634 531 -145 -220 1498 1162 -322 -510 530 577 -981 -61 1950 1206 44 1610 2676 697
1537 697 -523 785 1396 -211 77 2579 2543 527 1168 2685 1687 -1004 484 2370 1324 272 2309
1554 2309 3049 1157 356 2065 1811 -132 400 1708 1682 722 1548 3072 1679 313 1244 1944 554
1571 554 21 1291 2320 978 1091 2593 1775 345 777 1675 544 422 1959 2174 973 1213 2188
1588 2188 1591 197 924 1674 954 535 1921 2218 1254 1474 1838 1390 400 650 1362 1336 669 1188 2621
1607 2621 1815 277 1409 1997 844 165 1733 2428 766 930 2361 2091 390 1007 1773 734 570
1624 570 1729 2356 1324 1404 1865 2055 970 751 1289 1465 1251 1647 2031 2041 1305 1470 1817 749 477
1643D77P21J29n21K73Q80n91p43J41J52r32q1J226k78p30N23P30p65p77L91J74
1663C99r41p1O86M42q97K80L39j82j088OK51l0o31O45O32n63o12P68r4j451j07
1684b219O16J87p20M38Q19o03o80J62N84j241m01Q89O4l32P3R98m57q65K32J21
1704b335o38m40L18M85J38J88j91M98o63l22J70l86j42J12P92J62k02J45O12q58
1724b557n85l0N57m28K83Q86K4j16j9J93l16n28J35K95j84L77P15M33n19M47o8
1745a005l97n06J78K82L84M73M37L19k98k10K57n27p5J62N02N9J14J71P21l08
1765G33k24o4m21k34M50P74K54k2N92J07n57Rk29m21j31P30L2M08J04M29j91j9
1787B109r13j02L43m2K6N44M07j53j27L56o41m55l8j6J31J37M21L73j13k7j58
$$ plain form
1643 477 1198 1327 806 1079 1959 1368 625 766 918 -14 -95 1131 853 123 646 1376 611 -166 225 399
1663 399 -542 -613 73 515 -382 -102 237 55 -1033 -1027 -776 -806 -1437 -792 -160 -723 -1335 -567 -661 -2112 -2219
1684 -2219 -1603 -1416 -2136 -1698 -879 -1482 -2162 -2000 -1416 -2657 -3058 -2169 -2105 -2437 -2364 -1366 -1823 -2688 -2456 -2335
1704 -2335 -2973 -3413 -3095 -2610 -2472 -2284 -2475 -1977 -2640 -2962 -2792 -3178 -3320 -3208 -2416 -2254 -2456 -2311 -1699 -2557
1724 -2557 -3142 -3172 -2615 -3043 -2760 -1874 -1850 -1966 -1985 -1792 -2108 -2636 -2501 -2206 -2390 -2013 -1298 -865 -1384 -937 -1005
1745 -1005 -1402 -1908 -1730 -1448 -1064 -591 -154 165 -133 -343 -86 -613 -688 -526 -24 35 149 320 1041 733
1765 733 509 445 24 -210 240 1014 1268 1246 1838 1945 1388 1397 1168 747 616 1346 1378 1786 1890 2319 2128 2109
1787 2109 1196 1094 1437 1395 1421 1965 2372 2219 2092 2448 1807 1352 1314 1298 1429 1566 1987 2360 2247 2220 2062
1808B062l73m06k53K64K51K36j74L29J55j96m59k67n19K68m17O94L00K42j18J16
1828A735l43l64om79j42M88J57L18J8k6k74M0j82q06K13K35Q8o2L77M06l5n45
1850H11J32o35l16K01J37L87j20P34m7o55j28rn50J06M4L43K82J85l07J69j4l29
1872D21l27l15J88j2L09j1M05J89k98j48j70m58J26j92J1P60K93q4j36k44m01
1893i4j38k43J47m0L16K82L72k96l56J04m55m75J30R0L22q2K04R3l05m9j9n08
1915a000J4k14n2N57K39j70L05k86k42n24k3P2n66N70J99J87m4P9l32n09k21N5
1937a906j41k4N59m07M22J25l29k33k48Oj38k13L12M64P1L48l40j62j82l6j63
1958b215m1K38k6K09P90q64j31M62m40n87L53L08K83m39M13P84m6n27Q9p3j72
$$ plain form
1808 2062 1689 1283 1030 1294 1545 1781 1607 1936 2091 1895 1436 1169 650 918 501 1195 1495 1737 1619 1735
1828 1735 1392 1028 1022 543 401 889 1046 1364 1382 1356 1082 1122 940 134 347 582 670 608 985 1391 1356 811
1850 811 943 308 -8 193 330 717 597 1331 1284 629 501 492 -58 48 92 435 717 902 595 764 750 421
1872 421 94 -221 -33 -45 264 253 658 847 549 401 231 -227 -101 -293 -282 478 771 687 551 307 -94
1893 -94 -232 -475 -328 -368 -52 230 602 306 -50 54 -401 -876 -746 -656 -334 -416 -212 -119 -424 -473 -492 -1000
1915 -1000 -986 -1200 -1252 -695 -456 -626 -321 -607 -849 -1373 -1396 -1324 -1890 -1320 -1121 -934 -978 -899 -1231 -1740 -1961 -1906
1937 -1906 -2047 -2071 -1512 -1919 -1497 -1372 -1701 -1934 -2182 -2176 -2314 -2527 -2215 -1751 -1680 -1332 -1672 -1834 -2016 -2052 -2215
1958 -2215 -2256 -2018 -2044 -1835 -1045 -1909 -2040 -1578 -2018 -2605 -2252 -1944 -1661 -2100 -1687 -903 -949 -1476 -1387 -1460 -1632
1979a632l14N36M79o5n5L86K37k60k03k51L62k12j97Q82L61l41K18O31n02n80
1999e20J37K83K76K00M64m9J48l2j58j37jL42j20K19J88L22N9j83M02l30k17j71
2021A122J96K47nL71K87m8m57P7J60n38j57P04L04l56j76M42J42m79j2k8O5n90
2043A271N17L84j1m9L0J42j49j024L81P99m72j80K82K46n32l78K40j20N2k96J19
2064A252L53n21k27Q99r7o88K47j59m53m48L40N32R9n59J71j77R5j90l64lK81
2085C83j07K42p2K7J57n97k41J71k07j53L33R4N4j26j74K10k29k07k02Q3K21l58
2107f98J84O97l60n25M13p3j86m27K53L66m24J60O38l99k16j71K88m3k06J17K98
2128c14J90m16K10N3l77P0k06K48k84K32M27J7k48l6J78l18K8j06K28j24m6Q8
$$ plain form
1979 -1632 -1946 -1410 -931 -996 -1051 -665 -428 -688 -891 -1142 -780 -992 -1189 -307 54 -287 -69 562 60 -520
1999 -520 -383 -100 176 376 840 791 939 907 749 612 611 953 833 1052 1240 1562 1621 1438 1840 1510 1293 1122
2021 1122 1318 1565 1560 1931 2218 2170 1713 1790 1950 1412 1255 1959 2263 1907 1731 2173 2315 1836 1824 1796 1861 1271
2043 1271 1788 2172 2161 2112 2142 2284 2135 1111 1492 2291 1819 1639 1921 2167 1635 1257 1497 1377 1429 1133 1252
2064 1252 1605 1084 857 1756 1659 971 1218 1059 606 158 498 1030 1129 570 741 564 659 469 105 102 383
2085 383 276 518 446 473 630 33 -208 -37 -244 -397 -64 30 84 -42 -216 -6 -235 -442 -644 -561 -340 -698
2107 -698 -514 183 -177 -702 -289 -362 -548 -975 -722 -356 -780 -620 18 -381 -597 -768 -480 -523 -729 -612 -314
2128 -314 -124 -540 -330 -277 -654 -584 -790 -542 -826 -594 -167 -150 -398 -434 -256 -574 -546 -652 -424 -548 -594 -506
2150e06%M51k9n91l49J02N42o29m8O73n6l31JJ03l04m76J76P11j91k36J46M75
2172c66k8p22p5N71o81m09R59J24o84J91P96k71p71j60M63m4k52r4N51Q7m04o5
2194a284N60m51n52j39P25k8k16O5P82k61j50l40J02Oj67J4J56q0J43M58k59L86
2216e30m22m53L91Mj54K7N92K85m84r8M46p9l94OO79J72j49p5N28j38l17K84o8
2239E3j6j93K19M70J09l74L76K42l28k54K13K22k23P2L52O08l37j10L54k40l28
2260H87jK62j1L23l1M13J44p02O6K29q0l68K80N35j10j73M34j64m2k05j11k05
2282A370J02K94J61j51M39p2k54k51J00l68j94L76k3L47l12J35J90m42m80K24
2302A191n2k96K01K89k31J29J09m16J25o17j30K97l04J20M19j85J23m67J01j66
$$ plain form
2150 -506 -506 -55 -84 -675 -1024 -922 -380 -1009 -1057 -384 -440 -771 -770 -667 -971 -1447 -1271 -560 -751 -987 -841 -366
2172 -366 -394 -1116 -1191 -620 -1301 -1710 -751 -627 -1311 -1120 -324 -595 -1366 -1526 -1063 -1107 -1359 -1453 -902 -815 -1219 -1284
2194 -1284 -724 -1175 -1727 -1866 -1141 -1169 -1385 -1320 -538 -799 -949 -1289 -1187 -1181 -1348 -1334 -1178 -1258 -1115 -657 -916 -530
2216 -530 -952 -1405 -1014 -1010 -1164 -1137 -545 -260 -744 -842 -396 -475 -869 -863 -184 -12 -161 -236 292 154 -163 121 53
2239 53 37 -156 63 533 642 268 644 886 558 304 517 739 516 588 940 1548 1211 1101 1455 1215 887
2260 887 886 1148 1137 1460 1429 1842 1986 1284 1350 1579 1499 1131 1411 1946 1836 1663 2097 1933 1891 1686 1575 1370
2282 1370 1472 1766 1927 1776 2215 2143 1889 1638 1738 1370 1176 1552 1529 1876 1564 1699 1889 1447 967 1191
2302 1191 1139 843 1044 1333 1102 1231 1340 924 1049 432 302 599 295 415 834 649 772 305 406 240
2322B40k33r2j22J46J75j62K02J28l39K85m93n68K93j50K92o7L21l03J0j87Q8
2343e36J13o87J95J29J62q9L67m79L90l26j18k45L59j17k05M75k08L59q2j20n31
2364a194J15L47l70L6K39J31k44L20K3l9j42l05K69j62J0M37J52n2k69Q5j36j21
2386h70j77K80k78M74p3N6M72j08Q5r6m68j77J96K04L18k38J24J3J07l66M5j2
2408d89kL4m3J07l8K39r4k27J35K11q24M61j88M94j86R5j29J3o8M6k12L37l08
2431f36q2K88L29j01j93l5k74K17n64M51K23m35O86k14j98p2J69j63j92P4K18
2452e04O4J89k3o0l33L21nM0k67M13j25j34j60L28j09J08rN1K47j54n8q3K47k4
2476d0K87K3l21J25J80L7o9j62K93k25J69J87j85J83N5k5J5N5J42j04L66p1J12
$$ plain form
2322 240 7 -85 -207 -61 114 -48 154 282 -57 228 -265 -833 -540 -690 -398 -465 -144 -447 -437 -624 -536
2343 -536 -423 -1110 -915 -786 -624 -713 -346 -825 -435 -761 -879 -1124 -765 -882 -1087 -612 -820 -461 -543 -663 -1194
2364 -1194 -1079 -732 -1102 -1066 -827 -696 -940 -620 -597 -636 -778 -1083 -814 -976 -966 -529 -377 -429 -698 -613 -749 -870
2386 -870 -1047 -767 -1045 -571 -644 -588 -116 -224 -139 -235 -703 -880 -684 -480 -162 -400 -276 -263 -156 -522 -477 -489
2408 -489 -491 -457 -500 -393 -431 -192 -286 -513 -378 -167 -991 -530 -718 -224 -410 -315 -444 -431 -499 -453 -665 -328 -636
2431 -636 -718 -430 -101 -202 -395 -430 -704 -487 -1051 -600 -377 -812 -126 -340 -538 -610 -441 -604 -796 -722 -504
2452 -504 -440 -251 -274 -334 -667 -346 -351 -311 -578 -165 -290 -424 -584 -256 -365 -257 -266 -215 32 -122 -180 -263 -16 -40
2476 -40 247 270 -51 74 254 291 222 60 353 128 297 484 299 482 537 512 527 582 724 620 986 915 1027
2499A027J25k02N3O2J89o3J34l01K89k82J50M5K08l93j41J05K90n9J18J72m07
2520A119M3J35J74J18j09k5k33J50K42l75J01k38K64k60Q2L12n86N3O3J65n4m77
2542F64L42P8j95K0o0J41l61K69j75j80j93L09p9O1j51j40J77J74q2m39l36J32
2564b4J3o0j80j43K10K57J08n16r4k01J4K04R7o8j72J83j44R2m78k33K68mj11
2587i82J1J38J62k85M1q7J92k98o0K88k96K29P6j93R9q7j94L6J06L35p54M58K16
2610h49k29J81r7R5j21J4j54p7J10J89K68q1M08k42j40k8p0L0j95L47K16l19L73
2633c71o6nl5k3K48l50j01L29k7M8J86j93K29k05K07m53L50QJ73k1K83k89j16
2656a94j75L83K8j52r3L36KM1p2p3J33m19L36l03J68K05j34J19J84n44K42j94
$$ plain form
2499 1027 1152 950 1003 1065 1254 1191 1325 1024 1313 1031 1181 1226 1434 1041 900 1005 1295 1236 1354 1526 1119
2520 1119 1162 1297 1471 1589 1480 1455 1222 1372 1614 1239 1340 1102 1366 1106 1188 1500 914 967 1030 1195 1141 664
2542 664 1006 1084 889 909 849 990 629 898 723 543 350 659 580 641 490 350 527 701 619 180 -156 -24
2564 -24 -11 -71 -251 -394 -184 73 181 -335 -429 -630 -616 -412 -315 -383 -555 -372 -516 -424 -902 -1135 -867 -871 -982
2587 -982 -971 -833 -671 -956 -915 -1002 -810 -1108 -1168 -880 -1176 -947 -871 -1064 -965 -1052 -1246 -1210 -1104 -769 -1523 -1065 -849
2610 -849 -1078 -897 -994 -899 -1020 -1006 -1160 -1237 -1127 -938 -670 -751 -343 -585 -725 -753 -823 -793 -988 -641 -425 -744 -371
2633 -371 -437 -442 -477 -500 -252 -602 -703 -374 -401 -353 -167 -360 -131 -336 -129 -582 -232 -224 -51 -72 211 -78 -194
2656 -194 -369 14 42 -110 -203 133 135 176 104 31 164 -255 81 -222 -54 151 17 136 320 -224 18 -176
2678a76L55n63M09M9j64K31p8J55Nj49J17k58k29K82K3JN0k7QK70l36l51N72l49
2702a53j73N85J10m35M3J59n8J50j46R2j33k06L40q6J2N8k04j49P4q3K94j36N88
2725E43n08j17M30j88K10l61J7K09j71J66L76l04N44n15K34q8j69J59k01M5L66
2746F77j72O5M08k41m5j97N57k69m17M62O0J58r7j73J75k34O5l21L40J04j19L3
2768H19K33q8k9Q6j88P2k77l3L99l47P6L17l56p9K33l05L16l02J45n1MK64n65
2791C44rL81j61m77l4N45j5l10J12L10l37l48J06m58J66K64m14LM25j94o1jL1
2814a32k38L4K62o48Q6J19J28m49K21M60p80o6K03P3N7k13j27M55p7m26K68Q0
2836g10o3j37J23k90J25k9J16J86j79n12M51K29m34m7L42j32J27j07JL3L12m28
$$ plain form
2678 -176 179 -384 25 74 -90 141 63 218 223 74 191 -67 -296 -14 9 10 60 33 41 311 -25 -376 196 -153
2702 -153 -326 259 369 -66 -23 136 78 228 82 174 41 -165 175 89 101 159 -45 -194 -120 -203 91 -45 543
2725 543 35 -82 348 160 370 9 26 235 64 230 606 302 846 331 565 477 308 467 266 311 677
2746 677 505 570 978 737 692 495 1052 783 366 828 888 1046 949 776 951 717 782 461 801 905 786 819
2768 819 1052 964 935 1021 833 905 628 595 994 647 723 1040 684 605 838 533 849 547 692 641 645 909 344
2791 344 335 716 555 78 44 589 574 264 376 686 349 1 107 -351 -185 79 -335 -332 93 -101 -162 -163 -132
2814 -132 -370 -336 -74 -722 -636 -517 -389 -838 -617 -157 -937 -1003 -800 -727 -670 -883 -1010 -555 -632 -1058 -790 -710
2836 -710 -773 -910 -787 -1077 -952 -981 -865 -679 -858 -1370 -919 -690 -1124 -1171 -829 -961 -834 -941 -940 -907 -595 -1023
2858a023Q8J23L9k41L25L11k37P0l8q5k20L1K68j1Jj15L30j33j1K04j40oo9J84
2882c55J51q9m7M09k1K2j19j18K92j7j31K53J43l17J22k06K59j00p1J56K76k55
2904B37J68l8J97R5n92J51L80j01k33J88K71O7l97Mk2k2j56R0J28N8k38L09q5
2927D59j73J59l2P5k86K04l00J71P3J24l08K80k63r3J18K40l39J37K70m35R2p4
2949I9J03o3J02k31K91M7k39m46K63J1J30j54K43J02J2k97j08K29J40l92J31J02
2971G5J42k26p6K78j52o6P0K71k11K5O7J04j96k55M16L6Pjk34P8l95L98K27k8
2995C54P5l00L49k45K22j06k52L89j97j73K31K04J98k11j8j21j35K58l2J20p4
3016E36RO8k4j96K0K78l0k51L6nJ12Jl2J17k94M0N2J62l95j09M42m05%K83m68
$$ plain form
2858 -1023 -935 -812 -773 -1014 -689 -378 -615 -545 -583 -668 -888 -857 -589 -600 -599 -714 -384 -517 -528 -324 -464 -470 -539 -355
2882 -355 -204 -293 -340 69 48 70 -49 -167 125 108 -23 230 373 56 178 -28 231 131 60 216 492 237
2904 237 405 367 564 659 67 218 598 497 264 452 723 790 393 397 375 353 197 287 415 473 235 544 459
2927 459 286 445 413 488 202 406 106 277 350 474 166 446 183 90 208 448 109 246 516 81 173 99
2949 99 202 139 241 10 301 348 109 -337 -74 -63 67 -87 156 258 270 -27 -135 94 234 -158 -27 75
2971 75 217 -9 -85 193 41 -25 45 316 105 130 197 301 105 -150 266 302 309 308 74 152 -243 155 382 354
2995 354 429 129 478 233 455 349 97 486 289 116 347 551 749 538 520 399 264 522 490 610 536
3016 536 545 613 589 393 413 691 661 410 446 441 553 554 522 639 345 385 437 599 204 95 537 132 132 415 -53
3041e3L60j63q1m1K58m14mL0K49m92L93j78J64l08j45J06LO8n4L16n29K91p9j72
3065d75J79J12l19n4o2M54k77J06l92K51j93j8p4J70r5p3J14K73l29k30j1p7J36
3088h84K23n1l03K93%k56J34j70K83j02J93j95R9O5k1J08j63J12j03o3J7j3J10
3111f87K45J55k37J14j22n1K88O9P9j92K40r1k35J47O6J82J07j83k03L20L05m41
3133a25J25J86j08q1K21q1l0L76j95k6K68l11L37k36k48J71K04J34k06J94k53
3154C16L08k78J43j02J97m3k81K01R0K5J43l0j49ljM1q8L24n2o8k38L89l44K5
3178E25L65m11j69r2L39k37K21j1j82Q7Rj26K1j34K56m53J90K80j74N2k1l09M9
3201G5j64M13j90l10M06l65O5L49k78J14o8J02k4k45q3J83l09M10J09m98K01j26
$$ plain form
3041 -53 307 144 63 22 280 -134 -138 -108 141 -351 42 -136 28 -280 -425 -319 -316 -248 -302 14 -515 -224 -303 -475
3065 -475 -296 -184 -503 -557 -619 -165 -442 -336 -728 -477 -670 -688 -762 -592 -687 -760 -646 -373 -702 -932 -943 -1020 -884
3088 -884 -661 -712 -1015 -722 -722 -978 -844 -1014 -731 -833 -640 -835 -736 -671 -692 -584 -747 -635 -738 -801 -784 -797 -687
3111 -687 -442 -287 -524 -410 -532 -583 -295 -226 -147 -339 -99 -190 -425 -278 -212 -30 77 -106 -309 11 316 -125
3133 -125 0 186 78 -3 218 137 107 483 288 262 530 219 556 320 72 243 447 581 375 569 316
3154 316 624 346 489 387 584 541 260 461 551 576 719 689 540 537 536 577 489 813 761 693 455 844 500 525
3178 525 890 479 310 218 557 320 541 530 348 435 444 318 339 205 461 8 198 478 304 356 335 26 75
3201 75 -89 324 134 -176 230 -135 -70 279 1 115 47 149 125 -120 -203 -20 -329 81 190 -308 -107 -233
3223b33nn7K89m71N62q0j3j70J94k2k04J58o4k9M2j5J94K40k64R8k85Q7O6k68
3247b50N6K12j27J00J06J84k90K23N4K5n7J21m63N41l02L0J43r6N5j27J83k96
3269B5Q2K69l09K88j31Jk48K90r7K72o3R3j57M5m40O0K73j63J50k01Kk9j4j9K37
3294B16N2k81r0N0P9j90O9O0l5mJ30l80k42K99P5p0M9r6j81N7J65P4k72K3Q4r9
3320d58P3k40M29p9k32J10J02k62J40l00R3n6p3L90q6k24P3L34l86J01j00m2K0
3343f73J21j24K19o2p4K9k24M10P1k65l2M00L9l21L26k23J68m8o0J18r3K94o2
3366f6K12k78q9K29r9jm2K81k14L28q3l07J72K9L36l76M73l29J30m0J17j97P3
3389B59J17k69k5K32j8K24l87K24J98l20K76J10j40Kn8R1k8J57J16l71K55k7k0
$$ plain form
3223 -233 -238 -295 -6 -477 85 5 -8 -178 16 -6 -210 -52 -116 -145 -103 -118 76 316 52 150 -135 -48 18 -250
3247 -250 -194 18 -109 -9 97 281 -9 214 268 293 236 357 -106 435 133 163 306 210 265 138 321 25
3269 25 107 376 67 355 224 225 -23 267 170 442 379 472 315 360 -80 -20 253 90 240 39 41 12 -2 -21 216
3294 216 268 -13 -103 -53 26 -164 -95 -35 -70 -74 56 -324 -566 -267 -192 -262 -213 -309 -490 -433 -268 -194 -466 -443 -359 -458
3320 -458 -385 -625 -196 -275 -507 -397 -295 -557 -417 -717 -624 -680 -753 -363 -449 -673 -600 -266 -652 -551 -651 -693 -673
3343 -673 -552 -676 -457 -519 -593 -564 -788 -378 -307 -572 -604 -204 -165 -486 -160 -383 -215 -263 -323 -205 -298 -4 -66
3366 -66 146 -132 -221 8 -91 -92 -134 147 -67 261 178 -129 43 72 408 32 505 176 306 266 383 186 259
3389 259 376 107 82 314 296 520 133 357 555 235 511 621 481 483 425 516 488 645 761 390 645 618 598
3412E98M7qo0O9k72L70j41j49K0K54n3Pm9j06j89j6L71n22K30k80J18r3K21n5
3436C12k53K96j75M9J1j96L60n14L06r0O5l74L43j10j3j18mK5q1J5K26k04ol4
3460a64O5r1R0Kq9k87L41k05K61j42j28L73k13j48n8L21K5j52k02K13j07K76j63
3483a82M72o25K39m36L91j90J70j39J84J11j88K2J05j15M1o0L47Q0m06N9J26k2
3505a6j47L52m18J21L63n9j36l3l8K75k17K63l65J72j01l2J54l46J81N60m31K41
3527C43l05Q4j92L26m2j80R3J17J79j19o8j01j20K42m62J02K04k04R8j53j34J49
3549a43j2l0L46j59k88m1M27m87L32k41J32kL2j07R5j20J37o1l08J81J53j00J84
3572h0k08J71mk21l4n6L91m54J58k12l26M25K38l30J78J44r6M0j19m13L30K00
$$ plain form
3412 598 645 637 577 646 374 744 603 454 474 728 675 682 633 527 338 322 693 171 401 121 239 146 367 312
3436 312 59 355 180 229 240 44 404 -110 196 106 171 -203 140 30 17 -101 -105 -80 -161 -146 80 -124 -130 -164
3460 -164 -99 -190 -100 -98 -187 -474 -133 -338 -77 -219 -347 26 -187 -335 -393 -72 -47 -199 -401 -188 -295 -19 -182
3483 -182 290 -335 -96 -532 -141 -331 -161 -300 -116 -5 -193 -171 -66 -181 -140 -200 147 227 -179 -120 6 -16
3505 -16 -163 189 -229 -108 255 196 60 27 -11 264 47 310 -55 117 16 -16 138 -208 -27 533 102 343
3527 343 38 122 -70 256 214 34 127 244 423 304 236 135 15 257 -205 -103 101 -103 -5 -158 -292 -143
3549 -143 -155 -185 161 2 -286 -327 100 -387 -55 -296 -164 -166 -134 -241 -146 -266 -129 -190 -498 -317 -164 -264 -80
3572 -80 -288 -117 -121 -342 -376 -432 -41 -495 -337 -549 -875 -450 -212 -542 -364 -220 -316 -276 -395 -808 -478 -278
3594b78j31J22l03Q1Q0L65m90Q6L7K97q7j3m7J69l07L73j9PM8j71L12k53P6J2
3618c4o9M05l27k73L81j26L5Q0K48k4l42K23%NJ67j31O7K5K98j82Q4K15n32rK17
3643D01J81k78m8N19j38l45k83M08q0J24k80K15M2J33J16l48L52l61K81k50K49
3664F10j35l57O16l10J1j83N05m20K44k0q9l72K91p3l3%p3R2j04qk67K89l90L36
3688A60j50K94j25k94L41k4l07O8Q2J96n02j1K28k36J87j65j1J04J38j38l66K43
3710b88l1M8K99j19m13Q3M02j39k66K44m63L68o6K6J25n0J42k53m5J56l1Q8Q1
3733a02k42J14p8L9J57k21K03J65k84L52n3j36q7j45K99k08K63k25L85k86j12
3754b02p6M13m14L46J79m42K86M3j03L35m10n1K19R5r8j47K24J7j34J73o1k48
$$ plain form
3594 -278 -409 -287 -590 -509 -429 -64 -554 -468 -431 -134 -221 -234 -281 -112 -419 -46 -65 -58 -10 -181 131 -122 -46 -34
3618 -34 -103 302 -25 -298 83 -43 -8 72 320 296 -46 177 177 182 349 218 285 310 608 426 510 725 193 184 401
3643 401 582 304 256 775 637 292 9 417 337 461 181 396 438 571 687 339 691 330 611 361 610
3664 610 475 118 734 424 435 252 757 337 581 561 472 100 391 318 285 285 212 304 200 192 -75 214 -176 160
3688 160 10 304 179 -115 226 202 -105 -37 45 241 -261 -272 -44 -280 -93 -258 -269 -165 -27 -165 -531 -288
3710 -288 -319 -271 28 -91 -504 -421 -19 -158 -424 -180 -643 -275 -341 -315 -190 -240 -98 -351 -396 -240 -271 -183 -102
3733 -102 -344 -230 -308 -269 -112 -333 -130 35 -249 103 50 -86 -173 -318 -19 -227 36 -189 196 -90 -202
3754 -202 -278 135 -279 67 246 -196 90 133 30 365 -45 -96 123 218 120 -27 197 214 80 253 192 -56
3776e6J28K05J41k14R3l15J02L3m6L56l76K15n5j17K6m5J88m60L52l44L09P5K46
3799D41m35J39o7r3o4l5K98l05j0M71k13m01J12K90k49J69j25J86r8m0j36k14
3821c79J0J3P4K19kl6k97l9L49k23k5j16L85k5k74p2J22m2K56L2j67P1j14j0n7
3846c47J39r3k2L35l65K10J78l16L7k8L13J96l00J9j71L97o4k92J78J5K38l96
3868a39M94l02k21K51J31k21l2k01K2K72L07r1o4J43o6k74K63r5K01j73J90o4
3890C31p3q6L46Jj49J07k93L29k20L43O0j46j15j1l75M44P5l35l5K34j16l1K36
3913E21K3n6k67J90q9j93K48Nk69J91K2j87q2J57O0m4r4j0L60k84r9J28l7p5j88
3938f9J35j31o5j9o3Q3J36m9Ok57L27j66R5j49j63%J44M9n7j38j57K57L06k84
$$ plain form
3776 -56 72 277 418 204 297 -18 84 117 71 427 51 266 211 94 120 75 263 -197 155 -189 120 195 441
3799 441 6 145 78 -15 -79 -114 184 -121 -131 340 127 -274 -162 128 -121 48 -77 109 11 -29 -165 -379
3821 -379 -369 -356 -282 -63 -65 -101 -398 -437 -88 -311 -336 -452 -67 -92 -366 -438 -316 -358 -102 -70 -237 -166 -280 -290 -347
3846 -347 -208 -301 -323 12 -353 -143 35 -281 -244 -272 41 237 -63 -44 -215 182 118 -174 4 19 257 -139
3868 -139 355 53 -168 83 214 -7 -39 -240 -218 54 361 270 206 349 283 9 272 177 378 205 395 331
3890 331 258 172 518 519 370 477 184 513 293 636 696 550 435 424 49 493 568 233 198 432 316 285 521
3913 521 544 488 221 411 322 129 377 382 113 304 326 139 57 214 274 230 136 126 486 202 103 231 194 119 -69
3938 -69 66 -65 -130 -149 -212 -129 7 -42 -36 -293 34 -132 -37 -186 -349 -349 -205 -156 -213 -351 -508 -251 55 -229
3962b29j97jJ25j32K77J22l55J51o0K1k90K19q6ko1J36J69P4K6R0k88N3R2m9J41
3987e4k76J73J3O6j53L69m46K45l44n8N00l43K68L14k14r9n0J41O4n0J44j49j2
4010D9j38R0k46K36jJ44j00K24j70O6M0o8J25j72k99M80m2k36J99k47L40k77L22
4033C19r0k55L77k79J35K46k9m85L84l98L68k19J0O3J31j63J2R8M4r4j57q2k7
4056i1M11m48J89J2Rm3j1j24RM3p6P3J33Q1r1k40J61k02J42l01K82j10k1l1M5
4081a99k11J56J64J21j20k25M44n13J79J28j35j9J5j90M3k7L61L1o3L6q1K74k20
4104e1J55m1l93L88K1J10j41J37k27l5J18j86J88P6r9n2k4J50k52Q7R8J46J5j1
4128A77J50k46J4N13o3k08j64K3K8R9Q3k46J8p2L25j91J54l27R2O5M3J06po8L27
$$ plain form
3962 -229 -426 -427 -302 -434 -157 -35 -390 -239 -299 -278 -568 -349 -435 -437 -498 -362 -193 -119 -93 -3 -291 -238 -146 -195 -54
3987 -54 -330 -157 -144 -78 -231 138 -308 -63 -407 -465 35 -308 -40 274 60 -39 -89 52 116 66 210 61 49
4010 49 -89 1 -245 -9 -10 134 34 258 88 154 194 126 251 79 -220 260 218 -18 181 -66 274 -3 319
4033 319 229 -26 351 72 207 453 424 -61 323 -75 293 74 84 147 278 115 127 225 269 175 18 -64 -91
4056 -91 320 -128 61 73 82 39 28 -96 -87 -44 -120 -47 86 167 76 -164 -3 -205 -63 -364 -82 -192 -213 -244 -199
4081 -199 -410 -254 -90 31 -89 -314 130 -383 -204 -76 -211 -230 -215 -405 -362 -389 -28 3 -60 -24 -105 169 -51
4104 -51 104 63 -330 58 79 189 48 185 -42 -77 41 -145 43 119 20 -32 -56 94 -158 -71 27 173 188 177
4128 177 327 81 95 608 545 337 173 196 224 323 406 160 178 106 431 240 394 67 159 224 267 373 366 298 625
4153F25l45Ml15M01j77J72M6P9m8k00r9K79LO7k80J04Q8l99M12k08L5k01L20p5
4177B88M4l22j47L28k84M4J76j25j2L9J94l49p8K46k31J10k2p2p6M2K9r8L70n6
4201C8l43L24k48K76m15J27L2j43j95L09n3R9p9J72k83k21L53l02L81k7q7K4r5
4224c56j16J75K64l25M8q2m9r5L49m20K16J69j01K61j16N4l23K43J51Mj75J60
4246f4j61J20Qm2J37j54l0J61j63M60k67K15k08k23J08J19K16Lj65L31k48k24
4268g1K97r2m1J99p6J9r6P1K03l01J22j40m9K15K33j85n5j20oJ91m3l51L29j05
4292A48J70o0M8j15ok29L11n3q7J11n4J70k62l75L93p8q6J92M9r0l41J80L13l24
4316g5N7O1J70k34N9j1o4rj15L26l63J86k1j47j96N42j47j13j80P0K2L14m28L33
$$ plain form
4153 625 280 284 -31 370 193 365 411 490 442 242 143 422 425 492 212 316 404 5 417 209 244 43 363 288
4177 288 332 10 -137 191 -93 -49 127 2 -10 29 223 -126 -204 42 -189 -79 -101 -173 -249 -207 -178 -276 94 38
4201 38 -305 19 -229 47 -368 -241 -209 -352 -547 -238 -291 -192 -271 -99 -382 -603 -250 -552 -171 -198 -285 -261 -356
4224 -356 -472 -297 -33 -358 -310 -392 -441 -536 -187 -607 -391 -222 -323 -62 -178 -124 -447 -204 -53 -49 -224 -64
4246 -64 -225 -105 -97 -139 -2 -156 -186 -25 -188 272 5 220 12 -211 -103 16 232 235 70 401 153 -71
4268 -71 226 134 93 292 216 235 139 210 413 112 234 94 45 260 493 308 253 133 127 318 275 -76 253 148
4292 148 318 258 306 191 185 -44 267 214 127 238 184 354 92 -283 110 32 -54 138 187 97 -244 -64 249 -75
4316 -75 -18 43 213 -21 38 27 -37 -46 -161 165 -198 -12 -33 -180 -376 166 19 -94 -274 -204 -182 132 -296 37
4340C7m70K07K88k8q9j07l1K10j42N8q5J5J65N9q0K5k38M65m64K46O5j20M8k29
4364a95J48j23P2K22l48K1K03Q2k10M16j66k20J50K79m37L92l83J13M2L1N6j09
4386C6J24j42K73j94L85j39j70J03J89l73L55l0r1l6p6J32l99q5N94j66j81r6
4408A3M79l11R8J61m2j03J15l24j8J61o3q5K47j27l50J23J32j56K09l1j0j1P9
4431A86m92N13j44Pj55J70O3k58R5k01L76k62J84m43M52k86P3jJ23j84Q2j74M89
4454B13l17J07l1k97J93m19M55k32LK68j43l20J78K91j48j57J43m56K39K45k35
4475d20L96l40k3k46O08j65K06P7k90m7p7K67J09j3l72K11K4P2R6Q8l35l2J59
4498d7Q0j51L20k2j19P3k6j39J11j49R6K28J53l61j14K53j60N8J49k0k3J6j71
$$ plain form
4340 37 -433 -226 62 34 -55 -162 -193 17 -125 -67 -152 -137 28 87 7 32 -206 259 -205 41 106 -14 34 -195
4364 -195 -47 -170 -98 124 -224 -203 0 82 -128 288 122 -98 52 331 -106 286 -97 16 58 89 145 36
4386 36 160 18 291 97 482 343 173 276 465 92 447 417 326 290 214 346 -53 -138 456 290 109 13
4408 13 492 181 279 440 398 295 410 86 68 229 166 81 328 201 -149 -26 106 -50 159 128 118 107 186
4431 186 -306 207 63 70 -85 85 148 -110 -15 -216 160 -102 82 -361 91 -195 -122 -123 0 -184 -102 -276 213
4454 213 -104 3 -28 -325 -132 -551 -96 -328 -325 -57 -200 -520 -342 -51 -199 -356 -213 -669 -430 -185 -420
4475 -420 -24 -364 -387 -633 -25 -190 16 93 -197 -244 -321 -54 55 42 -330 -119 -95 -23 73 161 -174 -206 -47
4498 -47 33 -118 202 180 61 134 108 -31 80 -69 27 255 408 47 -67 186 26 84 233 213 190 206 35
4521C5O6J5l7M6J90j01R7nn9r7j05R2J04k31J24Q5K0J49j39m8L5J09j9k69K70
4546C27q0j17P4j76K69l53K88p2K3J01Q5l14Q0rq2J54L7p8J20k99j89K97j10L89
4570C65m29K53k88J78K6j71O1k70L76l39L2L04l51RO5J3J88k30L26k57j48J48
4592a39M4r9J01J54k21J50P0ol8l6l06K61j61j50K86J25j50J01O1q0j31J49o7
4615h2Rj82J66J29j64J90P0k84PQ2J02j61J33J70l04K62L0M8k61J35J46k76l1
4638f6P00l85p6N9k4j88mJ09k00R4J84j91rL52k21J48j12o9K86l40M02k72j06
4661G1N1J30l87J08K90J2P3j80l4j52K97l31J59j40L31l07L42j13r4pK9K7j31
4684D4J01m7q8L8N3j27K6j52p0L8Q2N8j83j18L96k89L8K78n74K96J52k05K98l70
$$ plain form
4521 35 101 116 79 125 315 214 311 306 247 150 45 137 241 10 134 219 239 388 249 201 236 345 326 57 327
4546 327 247 130 204 28 297 -56 232 160 183 284 369 55 135 126 44 198 235 157 277 -22 -211 86 -24 365
4570 365 -64 189 -99 79 105 -66 -5 -275 101 -238 -206 98 -253 -244 -179 -166 22 -208 118 -139 -287 -139
4592 -139 -95 -194 -93 61 -160 -10 60 54 16 -20 -326 -65 -226 -376 -90 35 -115 -14 47 -33 -164 -15 -82
4615 -82 -73 -255 -89 40 -124 66 136 -148 -141 -59 43 -118 15 185 -119 143 173 221 -40 95 241 -35 -66
4638 -66 634 249 173 232 208 20 16 125 -75 19 203 12 3 355 134 282 170 101 387 47 449 177 71
4661 71 122 252 -135 -27 263 275 348 168 134 -18 279 -52 107 -33 298 -9 333 220 126 119 148 175 44
4684 44 145 98 10 48 101 -26 0 -152 -222 -184 -102 -44 -227 -345 51 -238 -200 78 -496 -200 -48 -253 45 -325
4708c25j5L03l85N20l22q8K22j39K6n7l2J58J51p6l82N07j71rl26L87l15J10r
4731b67k4K87j58k3k1J62l35M3K7K91k76J08j40K94K70o4m98J25J31k68L21Q4
4753F9k15J97j87J31rn1K33pO2k92j06K40J99j67L35p6q0J1j78J67k81j80M92
4776C07k1R4l19K51r6K15k32M6J4K08l43L84k26L18j94j30k72J58p2RK62l24K62
4799B99k95L04L3Rq2l74L34m6l35O0J71L0r9n0N8k84J27K3k03J32M4NJ88j82J11
4824b2p0k2j89j03L81Lm09J83K51k24J39K09j01l68k0M18j62O8j34j3J94l86J25
4847b52lJ55j16r4L47j19j64j4l6L45j99L4J12j18l27K65K79r3k94J21K46j40
4869f5j11R5l6k58J80J50J56j20N6o0l09L15j07j10N57l3m0n4k40J11j89J89j09
$$ plain form
4708 -325 -340 -37 -422 98 -224 -312 -90 -229 -203 -260 -292 -134 17 -59 -441 66 -105 -114 -440 -53 -368 -258 -267
4731 -267 -291 -4 -162 -185 -206 -44 -379 -336 -309 -18 -294 -186 -326 -32 238 174 -324 -199 -68 -336 -15 69
4753 69 -146 51 -136 -5 -14 -65 168 161 223 -69 -175 65 264 97 432 356 276 287 109 276 -5 -185 307
4776 307 286 380 61 312 216 431 199 245 259 467 124 508 282 600 406 276 4 162 90 99 361 37 299
4799 299 4 308 341 350 268 -106 228 182 -153 -93 78 108 9 -41 17 -267 -140 -117 -320 -188 -144 -139 49 -133 -22
4824 -22 -92 -114 -303 -406 -25 -22 -431 -248 3 -221 -82 127 26 -342 -362 56 -106 -38 -172 -185 9 -377 -252
4847 -252 -255 -100 -216 -310 37 -82 -246 -260 -296 49 -150 -116 -4 -122 -449 -184 95 2 -292 -171 75 -65
4869 -65 -176 -81 -117 -375 -195 -45 111 -9 47 -13 -322 -7 -114 -224 333 300 260 206 -34 77 -112 77 -32
4892c2M9K54j18p7J11M5K8k52J03j38J38o1K44m21K41N8k93L95J44l28J83k37
4914C6Q8j02J87k8l5N1k42M5J15K14k00o8j22L04k84M42k70j51K%l0J49k3j66
4938h8J62j47K4K40j44J73l25K45l70L89j81J7N3j23K55m35L03k84j8O0L9N6K
4961i7j28J49L17k31k01k7L9n9PK42k53J21k05j0J59J9k47K4K55J55n50N15m97
4984e03N84j10l68R0K67j17K14n35M87j55L2nM25k06j40p2K37j39J43M6m0Q5l9
5007A81M6p7r1K70o73K92K78j19Q0Q4O3p9kj86J66J7J4k48J99J48j48j07K68m48
5031g2K06l5N6K03l34J55P5r4O7J08j99m5M84n39M74l90J84l19K49pj08R3r2k
5055A18j93J56o9O5j10n6L1J84p5l21j8K56nJ67k33j09j73n1K71K76k21J83j67
$$ plain form
4892 -32 17 271 153 76 187 232 260 8 111 -27 111 50 294 -127 114 172 -121 274 418 90 273 36
4914 36 124 22 209 181 146 197 -45 0 115 329 129 61 -61 243 -41 401 131 -20 -18 -18 -48 101 78 -88
4938 -88 74 -73 -49 191 47 220 -105 140 -230 159 -22 -5 48 -75 180 -255 48 -236 -254 -194 -155 -99 -97
4961 -97 -225 -76 241 10 -191 -218 -179 -238 -231 11 -242 -121 -326 -336 -177 -158 -405 -381 -126 29 -521 -6 -503
4984 -503 81 -29 -397 -307 -40 -157 57 -478 9 -146 -114 -119 306 100 -40 -112 125 -14 129 175 135 220 181
5007 181 227 150 59 329 -344 -52 226 107 187 271 334 255 253 67 233 250 264 16 215 363 215 108 376 -72
5031 -72 134 99 155 358 24 179 254 160 227 335 136 91 575 36 510 120 304 -15 234 227 119 212 120 118
5055 118 -75 81 12 77 -33 -89 -58 126 51 -270 -288 -32 -37 130 -103 -212 -385 -436 -165 111 -110 73 -94
5078i4K47l78N1K47j76j88L56k9m54K07j6p0M2L04k35N3M3j11j26J25J01r3J01
5101i3j65J28K13m80J57K33Q7j27K04j55j83P4j00K32J91n46k02N36K07j36p4
5122Aj22j19O7M89l96N4j45L60J03l72on4L44O4j45j30J5Q4j66J88k25L0n5L01
5146A65j08J5M61l77o8K96n83J20K56J83M9j50P9n62K31L34n2j72J05P1j36J6
5168A73P8k70L5O3J06j80K68l7k40K30R2j87r4J80lm6J19k10j47J58q1J38K90
5191D35n96J16j17L56k69%M9rp0j00J90m%k52N8J65P0j13L5j79Q9J9J74k13q3
5216b49qJ89J05M5j75J96K47p43O8R5Q1L7m2j18n8J68J32k98L46N0k0j32J93j38
5240b9R3q8J40j36k58R1j05M65m4j52K04k25r3J97M8l70K23k3J68j85J52L21l39
$$ plain form
5078 -94 153 -225 -174 73 -103 -291 65 36 -418 -211 -227 -297 -255 49 -186 -133 -90 -201 -327 -202 -101 -194 -93
5101 -93 -258 -130 83 -397 -240 -7 80 -47 157 2 -181 -107 -207 25 216 -330 -532 4 211 75 1
5122 1 -121 -240 -173 316 -80 -26 -171 189 292 -80 -86 -140 204 268 123 -7 8 92 -74 114 -111 -81 -136 165
5146 165 57 72 533 156 88 384 -199 -79 177 360 409 259 338 -224 7 341 289 117 222 293 157 173
5168 173 251 -19 16 79 185 5 273 236 -4 226 318 131 37 217 214 168 287 77 -70 88 7 145 435
5191 435 -161 -45 -162 194 -75 -75 -26 -35 -105 -205 -15 -19 -19 -271 -213 -48 22 -91 -56 -235 -146 -127 47 -166 -249
5216 -249 -257 -68 37 82 -93 103 350 -393 -325 -230 -149 -112 -154 -272 -330 -162 -30 -328 18 68 48 -84 109 -29
5240 -29 64 -24 116 -20 -278 -187 -292 173 129 -23 181 -44 -137 60 108 -262 -39 -62 106 -79 73 394 55
5263E5j6L75n20K14p3k79L59N7j54J38LJ33j81l5j57K31L7O5p8M1j71L00j92j34
5287A8L65j19m2o7K99l27O2l5m3j19J98r0k82R1L70l31L18q2OJ42j7k45P1j78
5311c7J54j12J10j53J94k76N0K62k0N8k42o1M4K25mj75J62O2m74J50n9j26k28
5334d96L03j98L24Q4j23n7j85J24M01m09pK43j05l1j36K13j65L1J11J45k50L5
5356a48J16j05p3L64j22j39orJj03J49J9r9kq9J73K3k4N7j54J05n2M1P0K93l35
5382d9J13l5j67K50k57J91J21k27K86k63l2l5J73j21O8K31j39j93K18l38N89k60
5404A24k87K06N9K72l54l5j11K79K10k91K71k02M2K17j17q8j95K02l33N06n39
5425a64J09M3J49j50N7j01K79n9o3K16l48P9j53O7J15k08P8j35J30NmJ28K3Q0
$$ plain form
5263 55 39 414 -106 108 35 -244 115 172 18 156 159 292 111 76 -81 150 187 252 174 215 44 344 152 18
5287 18 383 264 222 155 454 127 189 154 111 -8 190 100 -182 -91 279 -52 266 184 190 332 315 70 141 -37
5311 -37 117 5 115 -38 156 -120 -70 192 172 230 -12 -73 -29 196 192 17 179 241 -233 -83 -142 -268 -496
5334 -496 -193 -391 -67 17 -106 -163 -348 -224 177 -232 -239 4 -101 -132 -268 -55 -220 -189 -78 67 -183 -148
5356 -148 -32 -137 -210 154 32 -107 -113 -122 -121 -224 -75 -56 -155 -157 -246 -73 -50 -74 -17 -171 -66 -118 -77 -7 286 -49
5382 -49 64 29 -138 112 -145 46 167 -60 226 -37 -69 -104 69 -52 16 247 108 -85 133 -205 384 124
5404 124 -163 43 102 374 20 -15 -126 153 363 72 343 141 183 400 283 195 0 202 -131 375 -164
5425 -164 -55 -12 137 -13 44 -57 222 163 100 316 -32 47 -106 -39 76 -132 -54 -189 -59 -54 -58 70 93 173
5449A73l56L93k63k23M34l60K4j05k1M7J15M08l17J36l33l9j7K22P4m54K36J13
5471a13j65J84p5j56M17k03J57l05J52K12k72M1K00j30k78J35L4K17j11L2J0j00
5493a17J86m61K67O0k46j55O79k56P3j63J01j5j47J06K37j78L44k24j83K68j17
5514E9J7J5j85J94o6L29l12k0K09J10l00K25j34K28n9J22k41l2j13K32n0o4j29
5537C5M7Q4j75M22k23o8j97JK48j58r2L12j56p7j6L31k93K57r1o1O5L42l28J53
5561C62m38J35K68n84L36j51K23OR7m36j35L24q0k14L97k33K87k65K41l6k95j1
5583b02K23K0J08m71K76l55L28l3K79n28K59j17j42M98n07J65J00J11k10N3N2
5604i3J4J65k90J49P5k77R0j57J43K74qj96J25J40j51Q4Q7q3m35O01l16J15K4
$$ plain form
5449 173 -183 210 -53 -276 158 -202 -178 -283 -304 -257 -142 266 -51 85 -248 -287 -304 -82 -8 -462 -226 -113
5471 -113 -278 -94 -169 -325 92 -111 46 -259 -107 105 -167 -126 74 -56 -334 -199 -165 52 -59 -27 -17 -117
5493 -117 69 -392 -125 -65 -311 -466 213 -43 30 -133 -32 -47 -194 -88 149 -29 315 91 -92 176 59
5514 59 76 91 -94 100 34 363 51 31 240 350 50 275 141 369 310 432 191 159 46 278 228 164 35
5537 35 82 166 -9 413 190 122 -75 -74 174 16 -76 236 80 3 -13 318 25 282 191 130 195 537 209 362
5561 362 -76 59 327 -257 79 -72 151 157 254 -182 -317 7 -73 -287 110 -123 164 -101 140 104 -191 -202
5583 -202 21 41 149 -322 -46 -401 -73 -106 173 -355 -96 -213 -355 143 -364 -199 -99 12 -198 -145 -93
5604 -93 -79 86 -204 -55 20 -257 -167 -324 -181 93 85 -111 14 154 3 87 174 91 -344 257 -59 56 80
5627H0N4j91NJ07jm3nL65j69m08K63j3m1J5j33J70N6Q6p5j52Q9j91k9L83Q8p3
5653B37k04Rqk01K41k47J85K4J52k46L36L4j48P3j21m0j57K37k8M3Q0j04K05n39
$$ plain form
5627 80 134 -57 -52 55 54 11 6 371 202 -206 57 44 3 18 -115 55 111 197 122 -30 59 -132 -161 222 310 237
5653 237 33 42 34 -167 74 -173 12 36 188 -58 278 312 164 237 116 76 -81 156 128 171 251 147 352 -187
$$ [...]
8191a93
##END NTUPLES=NMR FID
##END=
