##TITLE=1H_LR-688A-CKB
 CDCl3, 8 sc, 
 24.9.2019
##JCAMPDX= 6.0         $$ Bruker NMR JCAMP-DX V2.0
##DATA TYPE= NMR FID
##DATA CLASS= NTUPLES
##ORIGIN= UXNMR, Bruker Analytische Messtechnik GmbH
##OWNER= root
$$ XWIN-NMR		Version 3.5
$$ Tue Sep 24 13:55:28 2019 Russian Standard Time (UT+4h)  she@DPX200
##.OBSERVE FREQUENCY= 200.1315
##.OBSERVE NUCLEUS= ^1H
##.DELAY= (6, 6)
##.ACQUISITION MODE= SIMULTANEOUS
##.ACQUISITION SCHEME= undefined
##.AVERAGES= 8
##.DIGITISER RES= 18
##SPECTROMETER/DATA SYSTEM= spect
##.PULSE SEQUENCE= zg30
##.SOLVENT NAME= CDCl3
##.SHIFT REFERENCE= (INTERNAL, CDCl3, 0, 15.7039)
##AUDIT TRAIL= $$ (NUMBER, WHEN, WHO, WHERE, WHAT)
$$ ##TITLE= Audit trail, XWIN-NMR		Version 3.5
$$ ##JCAMPDX= 5.01
$$ ##ORIGIN= Bruker BioSpin GmbH
$$ ##OWNER= she
$$ F:/spectra/data/she/nmr/H-F/1/audita.txt
$$ ##AUDIT TRAIL=  $$ (NUMBER, WHEN, WHO, WHERE, WHAT)
(   1,<2019-09-24 13:54:32.75 +0400>,<she>,<DPX200>,
      <created by zg, POWCHK disabled, PULCHK disabled
       configuration hash MD5:
       00 E9 B6 7A A2 85 ED C7 34 08 36 98 17 FE 4E 26
       data hash MD5: 16K
       DA 6C D5 A3 E0 30 E5 23 BF E6 06 B0 AF D4 64 C2>)
$$ ##END=
$$ 
$$ hash MD5
$$ 38 75 73 9F 95 2B 94 8E 8D 7A B0 9E EF 3F 86 BD
##$RELAX= 
##$RELAX= 
##$RELAX= 
##$RELAX= 
##$RELAX= 
##$RELAX= 
$$ Bruker specific parameters
$$ --------------------------
##$DU= <F:/spectra>
##$EXPNO= 1
##$NAME= <H-F>
##$PROCNO= 1
##$TYPE= <nmr>
##$USER= <she>
##$AMP= (0..31)
100 100 100 100 100 100 100 100 100 100 100 100 100 100 100 100 100 100 
100 100 100 100 100 100 100 100 100 100 100 100 100 100 
##$AQSEQ= 0
##$AQ_mod= 1
##$AUNM= <au_zg>
##$AUTOPOS= <>
##$BF1= 200.13
##$BF2= 200.13
##$BF3= 200.13
##$BF4= 200.13
##$BF5= 200.13
##$BF6= 200.13
##$BF7= 200.13
##$BF8= 200.13
##$BYTORDA= 1
##$CFDGTYP= 0
##$CFRGTYP= 5
##$CHEMSTR= <none>
##$CNST= (0..31)
1 1 145 1 1 1 1 1 1 1 1 1 1 1 1 1 1 1 1 1 1 1 1 1 1 1 1 1 1 1 1 1 
##$CPDPRG= <>
##$CPDPRG1= <>
##$CPDPRG2= <>
##$CPDPRG3= <>
##$CPDPRG4= <mlev>
##$CPDPRG5= <mlev>
##$CPDPRG6= <mlev>
##$CPDPRG7= <mlev>
##$CPDPRG8= <mlev>
##$CPDPRGB= <>
##$CPDPRGT= <>
##$D= (0..31)
0 1.2 0 0 0 0 0 0 0 0.06 0 0.03 0 0 0 0 0.0002 0 0 0 0 0 0 0 0 0 0 0 0 
0 0 0 
##$DATE= 1569318872
##$DBL= (0..7)
120 120 120 120 120 120 120 120 
##$DBP= (0..7)
150 150 150 150 150 150 150 150 
##$DBP07= 0
##$DBPNAM0= <>
##$DBPNAM1= <>
##$DBPNAM2= <>
##$DBPNAM3= <>
##$DBPNAM4= <>
##$DBPNAM5= <>
##$DBPNAM6= <>
##$DBPNAM7= <>
##$DBPOAL= (0..7)
0.5 0.5 0.5 0.5 0.5 0.5 0.5 0.5 
##$DBPOFFS= (0..7)
0 0 0 0 0 0 0 0 
##$DE= 6
##$DECBNUC= <off>
##$DECIM= 24
##$DECNUC= <off>
##$DECSTAT= 4
##$DIGMOD= 1
##$DIGTYP= 9
##$DL= (0..7)
0 120 120 120 120 120 120 120 
##$DP= (0..7)
150 150 150 150 150 150 150 150 
##$DP07= 0
##$DPNAME0= <>
##$DPNAME1= <>
##$DPNAME2= <>
##$DPNAME3= <>
##$DPNAME4= <>
##$DPNAME5= <>
##$DPNAME6= <>
##$DPNAME7= <>
##$DPOAL= (0..7)
0.5 0.5 0.5 0.5 0.5 0.5 0.5 0.5 
##$DPOFFS= (0..7)
0 0 0 0 0 0 0 0 
##$DQDMODE= 0
##$DR= 18
##$DS= 0
##$DSLIST= <SSSSSSSSSSSSSSS>
$$ [...]
##$SUBNAM2= <"">
##$SUBNAM3= <"">
##$SUBNAM4= <"">
##$SUBNAM5= <"">
##$SUBNAM6= <"">
##$SUBNAM7= <"">
##$SUBNAM8= <"">
##$SUBNAM9= <"">
##$SW= 24.0689530833862
##$SWIBOX= (0..15)
0 0 2 0 0 0 0 0 0 0 0 0 0 0 0 0 
##$SW_h= 4816.95568400771
##$TD= 16384
##$TD0= 1
##$TE= 0
##$TE2= 300
##$TE3= 300
##$TEG= 300
##$TL= (0..7)
0 120 120 120 120 120 120 120 
##$TP= (0..7)
150 150 150 150 150 150 150 150 
##$TP07= 0
##$TPNAME0= <>
##$TPNAME1= <>
##$TPNAME2= <>
##$TPNAME3= <>
##$TPNAME4= <>
##$TPNAME5= <>
##$TPNAME6= <>
##$TPNAME7= <>
##$TPOAL= (0..7)
0.5 0.5 0.5 0.5 0.5 0.5 0.5 0.5 
##$TPOFFS= (0..7)
0 0 0 0 0 0 0 0 
##$TUNHIN= 0
##$TUNHOUT= 0
##$TUNXOUT= 0
##$USERA1= <user>
##$USERA2= <user>
##$USERA3= <user>
##$USERA4= <user>
##$USERA5= <user>
##$V9= 5
##$VALIST= <valist>
##$VCLIST= <CCCCCCCCCCCCCCC>
##$VD= 0
##$VDLIST= <DDDDDDDDDDDDDDD>
##$VPLIST= <PPPPPPPPPPPPPPP>
##$VTLIST= <TTTTTTTTTTTTTTT>
##$WBST= 1024
##$WBSW= 4
##$XGAIN= (0..3)
0 0 0 0 
##$XL= 0
##$YL= 0
##$YMAX_a= 192334
##$YMIN_a= -163786
##$ZGOPTNS= <>
##$ZL1= 120
##$ZL2= 120
##$ZL3= 120
##$ZL4= 120
##$ABSF1= 10
##$ABSF2= 0
##$ABSG= 5
##$ABSL= 3
##$ALPHA= 0
##$AQORDER= 0
##$ASSFAC= 0
##$ASSFACI= 0
##$ASSFACX= 0
##$ASSWID= 0
##$AUNMP= <proc_1d>
##$AZFE= 0.1
##$AZFW= 0.1
##$BCFW= 1
##$BC_mod= 2
##$BYTORDP= 1
##$COROFFS= 0
##$CY= 11.3945322036743
##$DATMOD= 1
##$DC= 2
##$DFILT= <>
##$DTYPP= 0
##$F1P= 20.1720416913024
##$F2P= 0.152960286110954
##$FCOR= 0.5
##$FTSIZE= 0
##$FT_mod= 4
##$GAMMA= 1
##$GB= 0.15
##$INTBC= 1
##$INTSCL= 1
##$ISEN= 128
##$LB= 0.24
##$LEV0= 0
##$LPBIN= 0
##$MAXI= 10000
##$MC2= 0
##$MEAN= 0
##$ME_mod= 0
##$MI= 1.114404
##$NCOEF= 0
##$NC_proc= 0
##$NLEV= 6
##$NOISF1= 3.799351
##$NOISF2= 2.8
##$NSP= 1
##$NTH_PI= 0
##$NZP= 0
##$OFFSET= 15.70392
##$PC= 1
##$PHC0= -9565.726
##$PHC1= 11.60095
##$PH_mod= 1
##$PKNL= yes
##$PPARMOD= 0
##$PSCAL= 0
##$PSIGN= 0
##$REVERSE= no
##$SF= 200.130013532006
##$SI= 16384
##$SIGF1= 3
##$SIGF2= 2
##$SINO= 400
##$SIOLD= 16384
##$SREGLST= <1H.CDCl3>
##$SSB= 0
##$STSI= 0
##$STSR= 0
##$SW_p= 3612.71676300578
##$SYMM= 0
##$S_DEV= 0
##$TDeff= 0
##$TDoff= 0
##$TI= <>
##$TILT= no
##$TM1= 0
##$TM2= 0
##$TOPLEV= 0
##$USERP1= <user>
##$USERP2= <user>
##$USERP3= <user>
##$USERP4= <user>
##$USERP5= <user>
##$WDW= 1
##$XDIM= 8192
##$YMAX_p= 0
##$YMIN_p= 0
$$ End of Bruker specific parameters
$$ ---------------------------------
##NTUPLES= NMR FID
##VAR_NAME=  TIME,          FID/REAL,        FID/IMAG
##SYMBOL=    X,             R,               I
##VAR_TYPE=  INDEPENDENT,   DEPENDENT,       DEPENDENT
##VAR_FORM=  AFFN,          ASDF,            ASDF
##VAR_DIM=   8192,          8192,            8192
##UNITS=     SECONDS,       ARBITRARY UNITS, ARBITRARY UNITS
##FACTOR=    0.0002076,     1,               1
##FIRST=     0,             0,               0
##LAST=      1.7004516,     0,               0
##MIN=       0,             -163786,         0
##MAX=       1.7004516,     192334,          0
$$ Real data points
##PAGE= N=1
##DATA TABLE= (X++(R..R)), XYDATA
0@%%%%%%Qj6J6k4L2l6M4n6P2q8J04j20J44j69J96k33K71l12L58m11M71n35O06
29C22o86P76q75R79j096J229j370J523j695J881k085K311k557K830l135L474l852
46b026M278m759N307n941O687p573Q648r989J1709j4014J7284k2324L1197n1406
60c2922J76212M9044k56344P1673K2581p0211n318J71195M8175p1688m1171r417
72E1809j03328j0107J58559R2174j27656q0741O6854L31j09071M2131J63406R427
84A53788j31350j8176M3570o9885o4350J14238J24208l4223o7035R37n2491q8397
96h9166M2213J10731j7626o0830O6155N7418j15816r9708R5725J08148n1656o4010
108a8422K6136j3529p2043K4998R5542L446l8255M4002J3334j20509p8679R0385
$$ y = [0, 0, 0, 0, 0, 0, 0, 8, -8, 8, -16, 16, -20, 24, -32, 40, -48, 56, -64, 80, -89, 107, -126, 145, -167, 191, -220, 251, -284, 322, -364, 412, -463, 516, -580, 649, -721, 802, -893, 988, -1097, 1214, -1343, 1487, -1648, 1826, -2026, 2252, -2507, 2800, -3141, 3546, -4027, 4621, -5368, 6341, -7673, 9611, -12713, 18484, -32922, 143290, 192334, -64010, 7663, 30244, -39967, -45285, 125910, 174085, 102397, 61226, 51809, -51519, -61626, 96933, 189107, 61451, -19290, 47564, 47895, -61176, -19045, 144361, 153788, 22438, 4262, 47832, -22053, -86403, 27835, 152043, 117820, 50785, 51722, -769, -89166, -46953, 63778, 46152, -14678, 51477, 108895, -6921, -106629, -10904, 97244, 45588, -18422, 7714, -5815, -77858, -52860, 42682, 46128, 7873, 51875, 65209, -55300, -133979, -43594]
120d3594Q6971k9787m601N5011m3342j15608N269Q9263o027m3470N7602M7336
132E5023q7370p4005O5543O1199l4923n074M2995m8227r8454K6533R5651k885
144c994l3195O2870L7577j02570q5188N4713N3876l3494R205P0455j8823r2618
156h1186J39O5953j2275l8572M7443L7789o9597n1988N4402L5712l8437J0423
168d0194O3691k6981r4041o47O5867k460k5304N2287M4783n6752n6825K4713J2270
181c9593l5635J8488O5863j1056o4119Q786M6060k2676l2231M5074L6121n2578
193c7496m3693L2857J8865k7929J8018N6937j1161n9171p18K6482k5249j5482
205f7740N6926L8039m3493l0400K7525j585m2972J2851N5926l974m2390R739K6325
$$ y = [-43594, 43377, 13590, 8989, 64000, 20658, -94950, -89681, -418, -6445, -49915, 7687, 55023, -32347, -106352, -40809, 20390, -14533, -19607, 23388, -24839, -123293, -96760, -1109, -3994, -37189, 25681, 63258, -39312, -124500, -69787, -15911, -49405, -40200, 30255, 11432, -81186, -81047, -15094, -27369, -65941, -18498, 19291, -50306, -102294, -47892, -12180, -50617, -40194, 23497, -3484, -97525, -98172, -32305, -34765, -60069, -7782, 37001, -19751, -76576, -51863, -39593, -75228, -56740, 9123, -1933, -66052, -57266, -11206, -33882, -66113, -21039, 15082, -37496, -81189, -48332, -29467, -57396, -39378, 17559, 6398, -52773, -53491, -27009, -52258, -67740, -10814, 27225, -16268, -46668, -19143, -20728, -63700, -50849, 5077, 1103, -41287, -31548, -5223]
218e223k5521j7170M4275K4113m1921k3573K6214k744l3234K2050N5945m572m0431
231b1792O482J5884l2529j9720M3933L1100k6432j2900K4540q257l6852J2478
243b4065M2481o039k9918J3702J9184k6893j5569L6675K3533k6661j4433J8228
255A0225q077k9582J4647M2299L7k2385J0259J0029k9348j9379K8598K2430j5768
268A3985l252K0668o868k8516P018K9308n298j8721J1171J2091k0499j1442K5028
281B4673J6460j5212m159J3445j0941k5308P557K7806O67r274J2043O580k2903
294B1434j4751J5764R010j0074M661J7852o443k0766M698J7177n653j1305Q639
307C0243N732j5615p009J6833Q764p535K471R880j2206k1017K093J4408q30j888
$$ y = [-5223, -30744, -47914, -3639, 20474, -21447, -45020, -18806, -21550, -54784, -32734, 23211, 18639, -21792, -15310, 574, -31955, -51675, -7742, 23358, -3074, -15974, 8566, 309, -36543, -24065, 18416, 12377, -17541, -3839, 15345, -11548, -27117, 9558, 33091, 6430, -8003, 10225, 2148, -27434, -12787, 29512, 29549, 7164, 17423, 27452, -1896, -21275, 7323, 29753, 13985, 10733, 31401, 24533, -3983, 3035, 32343, 27045, 8324, 19495, 31586, 11087, -355, 24673, 41133, 25921, 21762, 35207, 24266, -1042, 6515, 34321, 34988, 25714, 37757, 44337, 21434, 6683, 22447, 31457, 21383, 26044, 43896, 37453, 16687, 21385, 38562, 32909, 21604, 30243, 35975, 20360, 13351, 30184, 38948, 31413, 33884, 43764, 31558, 10541, 12634, 27042, 26212, 24324]
321B4324J3846N686j6017j0388O531J85r239M706J3154l869j1789L641R401n644
335B4528n563O381j67j4004m935J0964M100l303O991R281q973j7134l168L436
349H434l871J099J2216O674p373m495K903m461r385R97O591m131o441M205P140
364A0102j293q17M558j732j1612o800J753J425O24P692Q875j948q115m598l581
379e467o790j705O584N407l61J330L491j521n895k510o24m797m661J132M072L345
395h970M310N385Q34n684o652n456l759j738L983O902N397K097j414l327n436
410a3528m425j875L97J547K764L069K104Q02r7j829l853m308m119k058J325O110
426a7974P087N479J904k765o289p566n430j796K263N473N935L400J591k82k955
$$ y = [24324, 38170, 43856, 27839, 17451, 23982, 24167, 14928, 19634, 32788, 28919, 17130, 20771, 30172, 24528, 18965, 25346, 25179, 11175, 6240, 17204, 21304, 18001, 24992, 34273, 25300, 8166, 4998, 8434, 4563, 5662, 17878, 24552, 17179, 12684, 15587, 11126, 1741, 2738, 9329, 5198, -1243, 2962, 10102, 8809, 7992, 12550, 10818, -794, -7594, -5841, -4416, -3792, 3900, 12775, 10827, 2712, -1886, -5467, -12257, -13962, -7378, -1971, -2332, -1002, 2489, 968, -4927, -7437, -8061, -12858, -17519, -16387, -12315, -8970, -4660, 725, 1559, -4125, -10777, -16233, -19992, -21730, -17747, -10845, -5448, -3351, -4765, -8092, -13528, -17953, -19828, -19431, -17884, -15120, -12051, -9947, -9145, -9242, -11071, -14924, -19232, -23351, -25409, -24084, -17974, -10887, -5408, -3504, -6269, -12558, -20124, -25554, -27350, -25087, -19614, -13679, -10279, -8688, -8970, -11925]
441a1925l388l086k497k615k38L127M019L506L701J160l328o160m814k425m27
456b5390L818P584O456J329j453k243m480o414l358J421K163L162N430M780O54
471f541k27J74l803p348m411P96J760J709O269P511J507k637j942l424o286k554
487a9447L889M172J802M728N202j522m794j588r78m083k674N025N732Q61L058
502f17N007N98n994m925j226l290k437M993P797K989K216N370o39q294m884J278
518b058q71l401M788Q956K232k016L080J485o801m187K161K35k822L369Q717J820
534A4687l437K266J495p007p500L037M615j426K317R442L172n480k509J309m834
549A0147o505L323N554j339M00Q241L993o233k919L503l801r334P84Q433M67j488
$$ y = [-11925, -15313, -18399, -20896, -23511, -23749, -20622, -16603, -13097, -9396, -8236, -11564, -17724, -22538, -24963, -25390, -21572, -13988, -7532, -6203, -7656, -9899, -14379, -20793, -24151, -22730, -20567, -17405, -11975, -7195, -6541, -6768, -6594, -10397, -17745, -22156, -21360, -19600, -17891, -11622, -4111, -2604, -5241, -7183, -10607, -16893, -19447, -15558, -11386, -9584, -4856, 346, -1176, -5970, -7558, -8536, -12619, -15293, -10268, -4536, -3675, -617, 4390, 4988, -1006, -5931, -7157, -10447, -12884, -7891, -94, 2895, 5111, 10481, 9842, 1548, -3336, -2058, -2929, -6330, -1542, 7414, 9646, 7630, 10710, 12195, 5394, 1207, 3368, 3603, 781, 4150, 12867, 14687, 11250, 13516, 15011, 8004, 504, 3541, 8156, 6730, 9047, 18489, 21661, 16181, 13672, 14981, 10147, 3642, 6965, 12519, 11180, 11580, 19821, 23814, 17581, 14662, 18165, 14364, 5030, 5814, 14247, 14714, 13226]
565A3226N981M993o209n837J843q11o781J760R190Q18m789L628O013p098q550
580G377L521L143o773k015J0310M209o075J328O215n436j0700J079M860n722k747
595B574J0169N976p386k462Q286k937j3196p31R591j672p629O234R105n868o733
610C321N784J607j0670l274J0253Q19q689L593J1241m120j1292K726N175r034
624b560o679J0585O309p759r08J0505o37j3230j089P614m071q247P192Q258o628
639a345l874J0014J947j2607l496R518n56j0809L537J1939l433p400N623L980
653C038j1073n338J0271K767j0187J434J2982j400j1548K449P832q593p912R089
667f189N821r689j626J4039J241j3470q52J0903m971j2143O350J0304o578n539
$$ y = [13226, 19207, 24200, 17991, 12154, 13997, 13186, 6405, 8165, 17355, 18173, 13384, 17012, 23025, 15927, 7377, 10898, 14041, 7268, 5253, 15563, 19772, 13697, 15025, 21240, 15804, 5104, 6183, 11043, 5321, 2574, 12743, 18719, 11333, 8871, 17157, 14220, 1024, 293, 9884, 8212, 583, 6817, 15922, 10054, 3321, 9105, 10712, 42, -3232, 7021, 7840, -849, 2744, 13985, 9865, -1427, 1299, 6474, -2560, -9239, 1346, 7655, -104, -1012, 9493, 8856, -4374, -5463, 2151, -1920, -10167, -2975, 5283, -1345, -5219, 4795, 6742, -5865, -9361, 157, -399, -11208, -7671, 4268, 835, -6565, -942, 3038, -8035, -13373, -3102, -335, -10522, -9088, 3894, 2494, -9054, -6605, 1227, -7366, -15278, -6189, -368, -10057, -11683, 2356, 3597, -9873, -10725, 178, -4793, -16936, -10586, -282, -6860, -12399]
681a2399J1647M314j4559m502J2687P86j4063K149J4737k512j1323O629R357j0965
695h017r715J1065N933j3692k498J6412L195j3812K81J1692o007j2622O378R789
709a618q296o024J3996O339j4365m924J2752Q13j4761O30J3598k725r552Q272
723e865R624j0447q164J0419L932j4156k258J5112K021j1245L494J1314o774j2095
737a5088P598P766j0652n339J3556O305j1433k060J1838j695j2855K984R463o615
751f227o974J1862Q505j0956m994J2307J408j5484j459J3519m86r997O887J1967
765I878p575r509R259N102j3573m632J3888L714j1912L019J4125l626j3553N358
779c7R575j0013r751J2217J0344j0507l978J3290K315j4734j311J1179l796j1320
$$ y = [-12399, -752, 3562, -10997, -15499, -2812, -2026, -16089, -13940, 797, -1715, -13038, -6409, 2948, -8017, -17732, -6667, -734, -14426, -16924, -512, 2683, -11129, -10848, 844, -5163, -17785, -11407, -1618, -9914, -15938, -1942, 4397, -9968, -14892, -2140, -1327, -16088, -15458, -1860, -4585, -14137, -5865, 3759, -6688, -14852, -4433, -501, -14657, -16915, -1803, 218, -11027, -7533, 3781, -2993, -15088, -7490, 276, -10376, -15715, -2159, 4146, -7287, -9347, 2491, 796, -12059, -9075, 388, -6227, -13201, -1339, 7166, -3790, -8784, 3523, 4931, -10553, -12012, 1507, 1021, -8976, -2089, 9878, 2303, -7206, 2053, 7155, -6418, -11050, 2838, 6552, -5360, -2341, 11784, 8158, -5395, -37, 9538, -475, -10226, 1991, 12335, 1828, -2150, 11140, 13455, -1279, -2590, 8589, 4793, -6527]
793f527Q645J2252p430p922J1637O207j4645p084J2209K777j2409K131J4596o22
807A3815j1012N084Q080j0211r486R261O818j0488j979J4002K302j2027L11J0054
821A4524n620j2705N862J0105o351n661J0777O247j0634m791Q449j961j1274K986
835d7J0982l333o907Q518P762j0214q271P674K690j1268j218J1855J617q962L596
850D474R330o826j0115N074N245r425l326J1816L983r382l98R812l435j2404K260
865c317Q987n445p039Q995Q366q089n170Q102R15j1914k148R808r96p844N791
880i98J0337n436q395N846M096j0686n298R675L574p608O46J0541j338j0000K043
895c001N851o353o965P077O180n519k091Q654J453r758k006O632k501p681M453
$$ y = [-6527, 2118, 14370, 6940, -982, 10655, 16862, 2217, -4867, 7342, 10119, -2290, -159, 14437, 13815, 2803, 7887, 15967, 5756, -3730, 5531, 12349, 1861, -118, 13884, 16186, 4159, 4470, 14524, 8904, -3801, 2061, 12166, 5815, 154, 10931, 17178, 6544, 1753, 10202, 8241, -3033, -47, 10935, 7602, 695, 9213, 16975, 6761, -1510, 6164, 8854, -2414, -3632, 8223, 9840, 878, 4474, 13804, 6978, -3137, 1937, 7182, -2243, -5569, 6247, 10230, 848, 450, 10262, 6827, -5577, -3317, 5670, 225, -6814, 2181, 10547, 2458, -2712, 5390, 6305, -5609, -7757, 2051, 1055, -6789, -998, 9339, 3903, -4492, 1354, 5450, -5236, -10534, -859, 2715, -4893, -4247, 6294, 4956, -5044, -3001, 2850, -3503, -10468, -3391, 2789, -2730, -4821, 3833, 5286, -4472, -6478, 154, -2347, -10028, -5575]
910e575Q889k826n395N619M168q139m809N855N66o966J618R178o49n726L465M866
926D139o434o710M567L859n860o56Q212J534n929K62M855l815o590K516N358l385
942d077k247O180M193o640k398M673j418p080J239O660j054l688M368M925n311
957a675m396L772O55o448q56P051J032m082K645N283l425o054J957K676m439k297
973h601N795L045l655k42M667j230o190l0M006k246l152M520M881k746k668L274
989e72M87n580j659M284L61k868K398N340j676l731K046R61l931k716L602J869
1005a385j942J061M410m47l590L29J554k313k624K237L048q75j72L144O94l715
1021e86j061K010q01k585J616L858k29j255K418O84k612k493J541Oj613J397L290
$$ y = [-5575, 3314, 488, -4907, 712, 4880, -3259, -8068, -2213, -1647, -8613, -6995, 2183, 1534, -4192, -727, 4139, -2295, -9005, -4438, -579, -6439, -7095, 1117, 2651, -3278, -3016, 1839, -1976, -8566, -6050, -692, -4077, -6324, -144, 4049, -2591, -4989, -316, -1734, -8814, -7575, -915, -1969, -5657, -1289, 3636, -1675, -6071, -2299, -1644, -8092, -8948, -1897, -865, -4947, -2302, 2981, -444, -6498, -4541, -1865, -6304, -8601, -2806, 239, -3416, -3658, 1009, -221, -6411, -6441, -2435, -4681, -7833, -3313, 1568, -1178, -3846, -572, -85, -5665, -7324, -3040, -2679, -5547, -3149, 2191, 515, -3216, -1170, -209, -4140, -6856, -3254, -1385, -3327, -2266, 2144, 1697, -1893, -1564, -10, -2323, -4947, -2710, 338, -537, -709, 2435, 3129, -586, -1647, 363, -438, -3023, -1407, 2451, 2222, 967, 3385, 4069, 1457, -1036, 505, 511, -1102, 295, 3585]
1038C585R14j578J061R68k279k651J134J381j100L17L071P04j138k29R55j381
1054C734k684Q62J730p42L85K202J035j379r48M53j006j819N08K197Rk82J557
1071E812J183j380j606k31m61j821K16J750J101K22K20J202j375j849n18K57n91
1088B131o64J903R85o2j00K25p34k000l81k1K12J92P28J492K5p43m93p95j132
1107G68j192M31N18J97J043P34J42o63j066o05j076o43R0Q77R14N27J84J98o41
1126G37j097q88m18l46L40Q96R01J14K38k85p10q59j126l51N51M77Q76P84L57
1145A91l19q09k00j330r43L66P14O37N91J091j01k19j098n96n71n76K3R76Q90
1164a283M96R38P0r03j284m71n79m51Q86P96J503j49j4K74r87j046p36J57J26
$$ y = [3585, 4499, 2921, 3982, 4950, 2671, 20, 1154, 2535, 1435, 1752, 4823, 5527, 4389, 4160, 5115, 3734, 1050, 1912, 3642, 2900, 3285, 5487, 6522, 5143, 4195, 4648, 3642, 1823, 2331, 4528, 4537, 4255, 5812, 6995, 5615, 4009, 3778, 3317, 1496, 1712, 3462, 4563, 4785, 5005, 6207, 4832, 2983, 2465, 2722, 2131, 1467, 3370, 4355, 4293, 4193, 4418, 3684, 1684, 1303, 1282, 1494, 1686, 2414, 3906, 3931, 3188, 2695, 1900, 768, -424, 7, 525, 722, 1765, 2499, 2641, 1978, 912, 307, -769, -1412, -1322, -445, 469, 996, 1180, 1378, 737, -360, -1248, -1666, -2012, -1672, -776, 125, 239, 477, 192, -518, -1377, -2503, -2854, -2303, -1826, -950, -166, 191, -128, -937, -1137, -2467, -3410, -3044, -2330, -1693, -1102, -11, -112, -331, -1429, -2025, -2596, -3172, -3149, -2173, -1283, -787, 151, 221, -682, -1966, -2437, -3016, -3467, -2581, -1785, -282, -431, -445, -171, -1158, -2204, -2940, -2783, -2657]
1183b657J3J584J059j78j19Q5j066j212m04M11N3K69J175J145j14o56n05m87j092
1202b696n73Q31M92N98J035P19m84r37m23n39q27n14Q70Q73L1J034O32j03j645
1221a626o30Kq72k62J008J493j31N43O93j144j130l36j25o19m0J443O81M54jM70
1241a29l58j429r40M04p9O2J051J526j92k26n4l20j298p65O65M64j41O39J849
1260G29K64j063k35K8j077q70N62J018J35P48J438J01j588n1j52o37q82R25J621
1279A014J78K19O46M91j265o59L77q82k71Q05J025L17K72R16q1j337o22K23n51
1298H15k48O94J808L50n68L68o2j375n33P66r9n64Q80J330J99r43O49M89j817
1317B139j195R05M71o79P40J820L61j558l53L39j169j246R79J322l60m38J200
$$ y = [-2657, -2644, -1060, -1, -179, -298, -213, -1279, -2491, -2895, -2484, -2431, -2162, -987, 158, 44, -612, -1117, -1604, -2696, -3269, -2438, -1946, -1348, -313, 406, -78, -1015, -1438, -1977, -2804, -3318, -2448, -1575, -1544, -510, 122, 19, -1626, -2256, -2254, -3126, -3388, -2380, -887, -1018, -475, 218, -926, -2056, -2392, -2517, -3136, -3176, -1733, -1052, -598, -599, -129, -487, -1916, -2856, -2452, -2531, -2469, -1418, 108, -84, -310, -364, -684, -1982, -2747, -2082, -1618, -1759, -1120, 729, 993, -70, -305, -277, -1354, -2224, -1662, -644, -509, 239, 1677, 1778, 190, 139, -13, -650, -1532, -607, 1014, 1192, 1411, 2057, 2548, 1283, 624, 1001, 119, -152, 653, 1678, 1995, 2267, 3183, 3102, 1765, 1143, 1366, 815, 567, 1261, 3069, 3419, 2851, 3219, 3157, 1782, 1249, 2015, 1916, 1352, 2232, 3562, 3761, 2818, 3467, 3956, 2139, 944, 1849, 2320, 1641, 2381, 4201, 4562, 3004, 2651, 2990, 1821, 575, 1554, 2876, 2516, 2078, 3278]
1334C278N99j619p18J041n83j990J78K239j21q82J206J135j982j327K14J26j557
1351g63O12K072P9q66M80O19j588j425M78N08j022J44J465Q70q37m85M18o33j669
1370a543r3Q56m39J10J788L45r57l66L28o54k235Q59J437j52j103J672J134j137
1388a50j087R02n59k252K93J740K41q22J498J505j630j884O04O54j758l72K189
1405h88J275j565J70K104j288k305J03J843j305j307K115J988j327n71K174m66
1421G50k795p92K137k84j320J682K379r21j930R70P37k163j231J840O75j330N46
1438a050K233N1j765K26P08j561j566Q20J893q46K22K310m62j961l82Q81r69j457
1456b675J275J818p47p33J733M00j933p49J141o30k055J034K505k78r21J264O68
$$ y = [3278, 3877, 2258, 1540, 2581, 1998, 8, 186, 2425, 2304, 1422, 2628, 3763, 1781, 454, 668, 794, -763, -151, 1921, 2000, 1134, 1614, 2233, 645, -780, -302, 206, -816, -672, 793, 1663, 826, 341, 759, 126, -1543, -1636, -780, -1219, -1109, 679, 1024, 67, -299, 29, -625, -2860, -2001, -564, -716, -1819, -147, 987, -150, -1237, -335, -894, -3146, -2853, -1113, -872, -1694, -196, 1309, -321, -2205, -1601, -947, -2705, -3077, -888, 387, -1178, -1008, 1096, -192, -2497, -2394, -551, -1856, -3163, -1048, 940, -387, -958, 1216, 750, -2045, -2837, -700, -984, -2304, -622, 1757, 836, -1094, -124, 613, -1550, -2781, -941, -266, -1596, -1050, 1183, 1234, -531, -305, 403, -1158, -2724, -1904, -11, -857, -635, 1675, 1213, -748, -1130, -249, -1218, -2675, -1400, 418, -329, -1062, 671, 1071, -862, -1611, -470, -1100, -3155, -2121, 384, 106, -815, 449, 1117]
1473A117k353j476J372N11j688N29K535J09j855N03J547j637k390J157J341j577
1489b255k16K736J383k927n8J665j052l013Q60K107l18j114K039J788k238r99
1505a612J229N0k344l39L017J35j748J398J900j243k090Q62R56k117p10K835Q74
1522A053j213J05K193j036k387M83J007r11j228K225J646j178n00J618l1j950
1538a04o26J155j18j453J911J989n58j139R50R0j669j077J851M94j242J114J659
1555C227l57j580Q69M79j770r50J377Q72j226N50K271k60j938J09R01j498j640
1572e64J804J738j429l36K197J57k271q54J630m34j837P14K395q00r46J078J098
1589C340k057j491J518Q3j576n6K580J07j585K64J194j295j910Q10J159j078n93
$$ y = [1117, -1236, -2712, -1340, -829, -2517, -1988, 547, 656, -1199, -696, 851, -786, -3176, -2019, -678, -2255, -2471, 265, 1648, -1279, -1337, 328, -724, -3737, -2877, -770, -1088, -2202, -163, 1625, -613, -1612, -383, -333, -2677, -3016, 1, 136, -1612, -214, 1686, 443, -1647, -785, 171, -1946, -2656, 179, 1053, -160, -55, 2138, 1102, -1285, -802, 205, -706, -1934, 291, 1937, 759, 259, 1877, 1846, -104, -730, 425, 307, -1146, 765, 2754, 2196, 1057, 2007, 2097, 428, -649, 1202, 1696, 454, 1568, 3227, 2870, 1290, 2159, 2638, 868, -82, 1295, 2167, 941, 1491, 3762, 3502, 1564, 1673, 2574, 1076, -564, 1240, 2978, 1549, 1213, 3410, 3567, 1296, 442, 2072, 1638, -199, 515, 2910, 2110, 1164, 2242, 3340, 1283, -208, 1310, 1393, -183, -239, 2341, 2448, 863, 1127, 2321, 1026, -884, -74, 1085, 7, -586]
1606e86J739J040j668n41J160n74j788J63J311m22q88J428J254j446q12Q10J1
1623A91k122l8J783N0p88P96J179r26j275M61J82j127p03K024J74p77K89J116
1641D89l81j637K82P42q95n94J494P28r55k8J110j1j788j64J077l77n09P51J089
1660D23l03p13O60L50j632o56J104M39j042Q28Q66L25j416Q13M34j210n76P50
1678e56M90o90K31J102j78q37k66P87o72p88Q25R25l46l84P81L03j117k51M83
1697a58k41q02L05J556k79r63R56N29j517k81M27L0n48L8J065L22q63J04P45r35
1717e10m82L2O33l99k1P47N19j134j38J66j57o77K25Q85k23m45N80K76n49l13
1737i85L86j31r33L02P30J54r7NK70m37o58M40j41m66J58O86K26N1J41J13m41
$$ y = [-586, 1153, 2193, 525, -16, 1144, 570, -1218, -1055, 256, -166, -1054, 374, 1628, 182, -630, 180, 191, -1931, -1969, -186, -136, -924, -128, 1051, 125, -1150, -689, -507, -1634, -2337, -313, -139, -916, -627, 489, 108, -1529, -1247, -505, -1400, -1994, -500, 228, -727, -755, 355, 344, -1444, -1608, -531, -908, -1417, -666, 423, 120, -593, 67, 417, -1215, -1871, -767, -328, -1370, -542, 324, 649, -767, 46, 480, -730, -1306, -556, -66, -756, -525, 577, 399, -438, -704, 83, -589, -1377, -552, 373, 27, -357, 424, 727, -390, -641, -158, -399, -1201, -896, 660, 381, -582, 374, 903, -614, -895, -468, -438, -986, -948, 117, 439, -424, -320, 425, -510, -992, -960, -327, -726, -747, 0, 519, -615, -753, -587, -744, -1421, -1196, -311, -534, -979, -399, -123, -672, -985, -599, -730, -1663, -1361, -631, -477, -574, -569, -299, -736, -1394, -954, -1095, -1561, -1403, -717, -491, -440, -299, -186, -627]
1758f27r77M70J94j36L57M40K31l22J61j33j16r26O80J89O4m8J049%j71o59K63
1779a7j81m23L7O00K76k05M95K76J19l76m87J22j29j89P85J25J26M68j08m09j93
1800G12j12k53J01q2N37O68R7R3k1k63l15n57j83L14J28L88M37L54J7n28J04p07
1822I29n9o9P9J04P06J66j80K36m77n29l81n2M0L45J86L79J51l2qn92n35J16m21
1845A02n9L77L93J32L53k00j39n38o04M3l86L15M86J5M74j71l84j05l70l81j50
1866g97j19P37MM38J07j14j48l75n80m84K03J88J88K10L64K54m60k66q5k49n21
1887a505m2M20O12L24k11M33l17o32k62R8k97K5L79N09K88k41K61Ln42n54M6L95
1909h10p1J04N96N12j64m09l7o54j02L9l3N34J50L16L80j75k85r4j38n84m1L60
$$ y = [-627, -1604, -1134, -940, -1076, -719, -279, -48, -370, -209, -342, -458, -1384, -704, -515, -451, -499, 550, 550, 379, -280, -17, -198, -621, -584, 16, 292, 87, 582, 858, 977, 601, 114, 236, 107, -82, 703, 828, 954, 1422, 1314, 905, 712, 600, 347, 448, 366, 903, 1571, 1668, 1761, 1740, 1477, 1162, 605, 422, 736, 864, 1252, 1689, 2043, 2060, 1532, 1636, 929, 870, 801, 880, 984, 1690, 1856, 1676, 1912, 1435, 906, 525, 473, 513, 858, 1044, 1423, 1574, 1542, 1534, 942, 407, 523, 102, 43, 420, 813, 945, 1298, 1098, 959, 421, -183, -140, -526, -211, 275, 290, 764, 593, 209, 104, -266, -647, -797, -916, -179, -175, 263, 370, 256, 108, -267, -847, -1331, -1128, -940, -752, -542, -178, 76, -384, -650, -735, -984, -1505, -1547, -1127, -515, -191, -402, 31, -286, -918, -1180, -1082, -1379, -1354, -975, -466, -178, -419, -158, -155, -697, -1251, -1205, -810, -881, -777, -181, 331, 167, -242, -279, -933, -1035, -996, -1029, -495, -345, -29, 351, 176, -109, -203, -341, -925, -966, -606]
1931f06J66O08L55P0j64k49m94j5n21L82j13P86K49L31m6o21m1l90j84r8rM34
1953a70M26K04q9L88p52j89l14k24k17L75Q73Lp6J95K07q33m24J63k47K5K18K87
1975a71O73m61o2M02o94q19L3O67l99J4O27M29m7n23q4j07o85j74K68N05j26M60
1997b74J94K13m91j88r2k34l92K64L35K13K90O4L02n73j19l53N0j06J44M03K91
2018e9K50J31m22k02lk21l94Q9P80K12k92N73K64p76N3K98k33m05J97N34O33k22
2040G85k8M70m56n83j25Q30m41l55P84L08k21l28N33o5m86m74O94K09p12N13O86
2061A538K89p40K54k11k39o16N52K28p8j81O50Q4k47m06N66n93m12K28O28j91
2081A103k44J31N52n06k67J00p9m40p8Q15L07m46P5j63L2n58J46q8K3p7K61j85
$$ y = [-606, -440, 168, 523, 593, 429, 180, -314, -329, -850, -468, -581, 205, 454, 785, 739, 118, 77, -313, -497, -595, -604, -170, 256, 460, 371, 759, 7, -182, -496, -720, -937, -562, 311, 314, 238, 433, 640, -193, -617, -454, -701, -676, -458, -171, 502, 41, -21, 381, -313, -1132, -1099, -432, -831, -817, -190, 239, 192, -331, -415, -522, -1207, -1381, -1113, -608, -734, -274, -80, 133, -358, -546, -638, -872, -1264, -1000, -665, -452, -162, -98, 204, -369, -488, -841, -791, -897, -753, -350, -59, 191, 322, -100, -302, -305, -526, -920, -831, -51, 161, -131, 442, 706, -70, -17, 281, 48, -357, -160, 374, 1007, 785, 757, 1227, 771, 188, 63, 893, 452, 97, 881, 1189, 968, 640, 1173, 1108, 622, 148, 842, 1051, 339, 852, 1538, 1827, 1087, 1341, 1130, 891, 275, 827, 1055, 977, 796, 1446, 1530, 1283, 877, 1443, 850, 438, 666, 1294, 1103, 859, 990, 1542, 1036, 769, 869, 790, 350, 272, 1087, 1394, 948, 1023, 860, 892, 334, 480, 392, 415, 338, 599, 414]
2103D14M5K58j04n47j51O6K14l74K63K07j93J60k50J30o87M2J80K82m86K98M10
2124A77j6p34q3O69l49m35j4N62m91n3L38M11n71l64M26l84j71K00M96L69n88
2145f05j97O24l57o51L24M43j75l61N83K73o97j20N89J79o63k90O97r1l84M18
2165d61M73m31l82J38J96j0r8L81J38k69N5N65k55l78QK17l12J32L44J03k01j42
2187a89M92m13j65K8L68j32l36L79L95l14N5J45l27m92J57M95j81j42M53K58n16
2208A8k70L78j19m07k43P76j03m04O43R1l59l37K71k20l46k14M79L84k36l42P44
2229A84l3q41J11J61J7p21N32M76j66l09N11J37o06n16M19k91K4O1Q62J61n64
2250c91q4K93m82m89M26K3m06M77M84K7j39j27K55o21m57L63L67k02K37N41o5
$$ y = [414, 459, 717, 613, 66, -85, -19, 195, -179, 84, 291, 98, 258, 8, 138, -549, -507, -327, -45, -531, -233, 177, 161, -573, -656, 13, -336, -771, -785, -223, -714, -767, -429, -18, -589, -953, -527, -911, -1082, -882, -386, -17, -605, -802, -178, -535, -1186, -862, -419, -594, -955, -372, -99, -796, -916, -327, -148, -811, -1101, -404, -495, -879, -461, 12, -419, -801, -663, -467, -477, -575, -194, -56, -325, -270, 295, 40, -338, -330, -113, -425, -293, 51, 154, -47, -189, 303, -110, -275, -247, 121, -11, -347, 32, 427, 113, 168, 313, -14, -506, -349, 146, -35, -177, 276, 534, 18, -252, 126, 7, -400, -643, 133, 30, -374, 269, 360, 1, -336, -65, -285, -631, -845, -366, 18, -218, -560, 184, 151, -690, -579, -418, -401, -1122, -590, -114, -280, -589, -78, 59, -547, -1063, -644, -935, -911, -850, 12, 173, -391, -475, -182, -664, -1153, -727, -704, -1110, -633, -149, -122, -261, -388, -133, -754, -1211, -848, -481, -683, -446, 95, 30]
2271C0j59l91K03K6m05K18N20j39k26P56k1m05m11N57j49m21R1M41LJ29K89K16
2293G52j86k61K01k38n09N18O21k24m6K54R5k59j20j15K40l07l67Q39L81k07k51
2314H11N27l88n74J73K72k29j21O91L58l1m83K81J00q62J26j81L69j01j81R44
2334A501m20j02j30K51q83j62L38K60j8K87J25L1n25j36J18k72m61P22K13r2k
2355F43J23M1m64j64k55J66l59l5L97K2J50J64q9m11l01J20j57L9j36Q26n3l39
2377g2J03k45L0k95o5o4l00N22K60Q5m48K59L60p92k10L9j2L77k28M18K47m26
2399d57r9M6K15n15J11M17j52P1J65J24n4l52m8L2k35m03O77J71o2J37L55o1m08
2422c25J90n8k67J36N8L81R4n3mLJ11l16j45J21l46P49M7l66J83K15k08j46m99
$$ y = [30, -129, -520, -317, -291, -696, -478, 42, -97, -323, 433, 412, 7, -404, 153, 4, -417, -326, 115, 118, 247, 536, 752, 566, 305, 506, 268, -241, 277, 898, 674, 628, 882, 977, 718, 598, 483, 723, 416, 49, 888, 1269, 1062, 811, 1338, 950, 376, 549, 821, 592, 471, 1162, 1520, 1489, 1006, 1287, 1387, 525, 651, 470, 839, 738, 557, 1501, 1081, 979, 849, 1100, 217, 55, 393, 653, 635, 922, 1047, 1078, 553, 417, 535, 263, -198, 524, 737, 645, 643, 766, 807, 343, 179, -76, 90, -269, -304, 93, 115, 265, 429, 340, -71, -372, -252, -409, -370, -506, 320, 267, -72, 31, -214, -184, -479, -544, -608, -908, -386, -126, -41, -489, -230, 130, -662, -872, -833, -845, -468, -696, -278, -31, -457, -556, -510, -295, -810, -699, -282, -434, -363, -198, -74, -128, -480, -528, -496, -731, -1134, -457, -286, -348, -211, 144, 83, -325, -135, -193, -460, -324, -266, 115, 209, 156, 152, 155, 266, -50, -195, -74, -420, 329, 376, 10, 193, 408, 200, 54, -445]
2445d45L05J90r9J60M73l71q8J37j86l28M0M5j84J10N1L31J77k67J8k24J47k22
2467b30K1j2K63k21j15M76l79j17PL8k43R6J59r9J38k05J47Q1o1n21K23o8O2k0
2491e80M3J08Q8nl8l79m7J50k15QK38oJ93O2j21J32p28J53R7m2J1N27k82J01M6
2516d86j43m8M0k3J20p5L27O7J63j79J4k40j45J89J04J53j00K35l48K48J00J96
2538A69m27j2R2MJ51K11k6o8MJ44j04K72j26j82M59J00m12L67L0m3j6r4k62J62
2562C93L13j37J73lJ31m11K35n5M3M1j8R3J12k19J09M4j29k61J4J76lK32M8jq7
2587H33k89K06m5k21J14J92j80k66N87q1r0r3r4Oj61j83j05K87j52J69K55P2l65
2610C96k03J04j29pm5K94k53J82n0k59K31k10l09K86j89j85M79j81j15N7L7Rk72
$$ y = [-445, -140, 50, -49, 111, 584, 213, 125, 262, 76, -252, -212, -167, -351, -241, -190, 141, 318, 51, 69, -155, -8, -230, -209, -221, 42, -179, -294, 182, -197, -314, -307, -269, -512, -416, -257, -356, -218, -423, -276, -195, -256, -777, -554, -622, -560, -580, -537, -429, -341, -346, -384, -763, -810, -660, -875, -867, -629, -635, -442, -380, -501, -369, -1097, -944, -847, -889, -878, -351, -633, -532, -486, -629, -677, -637, -660, -540, -615, -288, -221, -58, -237, -223, -463, -608, -419, -315, -162, -262, -27, -375, -127, -27, 169, -258, -270, -178, -174, -23, 188, 162, 94, 98, 242, 138, 410, 284, 102, 561, 661, 249, 616, 646, 603, 587, 493, 231, 393, 706, 569, 742, 739, 870, 459, 694, 639, 682, 723, 705, 798, 910, 691, 800, 844, 715, 454, 468, 644, 641, 873, 921, 920, 833, 544, 750, 705, 484, 598, 790, 610, 344, 931, 850, 760, 667, 573, 579, 418, 235, 130, 417, 265, 434, 689, 761, 396, 193, 297, 168, 161, 116, 410, 157, 339, 289, 30, 261, 51, -258, 28, -161, -346, 133, -48, -163, -106, -69, -60, -332]
2633c32o7K54L02n39L94J47k40l51j5L31j66j48Q9L14k9l02J4J42J66k15j3k67
2655e31j39J55M73p2N3K78n5l0l09l8k48L41j53M25j46k4L73k45J4n8l5j13j43
2678b27M62R4r5J47L9j28n27K47k64N0qN28K79m45O4J87P0k41l61L80l64K17m7
2701E7K96l7j10o6J22j72k15J78J01n7J27k02M12n50J14K8m0L8j22K41r5J77k97
2724g2J95l78P3j61k8k18J89L96j64O0J19j88j75r9n9M9p2k4J87j96L08K1j24
2747c61p0l37k2J34QJ30J12P6j95M18m86k29J17J3k60L07J33J8K13k13N6l67m0
2770h45j85L43q8N4L8j4N61j65j16L02n87j26K85J08J32o4J96K99J7p29M80k11
2792c15Q1m41N01J84N8l2J81J14l85j16K06k7j75K73J29mJ12k7Ll4k76L69K1j51
$$ y = [-332, -399, -145, 157, -382, 12, 159, -81, -432, -447, -116, -282, -430, -341, -27, -56, -358, -344, -202, -36, -251, -264, -531, -670, -515, -42, -114, -61, 217, 162, 132, -177, -215, -463, -122, -275, 150, 4, -20, 353, 108, 122, 64, 29, -84, -227, 235, 329, 234, 381, 420, 292, -235, 12, -252, -202, -210, 318, 597, 152, 216, 403, 473, 232, -129, 251, -113, 104, 57, 353, 316, 206, 140, 262, 90, -125, 53, 154, 97, 224, 22, 434, -116, -2, 26, -14, 24, -98, 143, 48, 225, -72, 123, -255, -182, -343, -371, -589, -400, -4, -168, -108, 11, -177, -352, -451, -510, -461, -533, -557, -370, -566, -258, -237, -361, -431, -768, -790, -656, -648, -518, -406, -330, -525, -107, -593, -822, -705, -692, -952, -645, -512, -494, -281, -494, -438, -805, -845, -1030, -687, -775, -721, -683, -697, -136, -301, -417, -115, -702, -828, -543, -435, -303, -367, -171, 128, 145, -584, -104, -315, -234, -675, -174, 10, 68, 36, 217, 331, -54, -170, 36, 9, -166, 107, 236, 232, 344, 317, 320, 286, 10, 379, 400, 249]
2816B49K14M0L57m32l5M5L19m63k1k52K89J51J58J24k05R1j82J41k07j71R6j96
2838A10M86O2J61m37J31o8m6j91K29k82L20P0N0j28j15J37k22n8k39M63j93J01
2860C41K40k33o4k12J49J15k00k52M39m95K71j61J95J03j32j65l2J36j83l31M90
2881A9L69l21k39L2P8o81P02r0J32o2l2J7j23j7K1pn1j70J02l34L41L17K51m39
2905a85k43K46J17j20j2J99j19n4K80n0n1J42J04m1m98L58j85L29k01L25j18k5
2927A98q2l50N20m70N65j78L00m44M49k79K44j91m21K70K03l33J22M60k34o7J35
2948D17Lj05m8L06k77l43M20J14J01k40J72l01j69M7n8K55j64n9K94j8k40l9L21
2971C89j74n4l6J65j18k85L83o6j31l26m3j1mJ42j46L02l8k15L81k15k68k44K61
$$ y = [249, 463, 503, 860, 428, 393, 438, 757, 294, 273, 21, 310, 461, 619, 743, 538, 629, 447, 588, 381, 210, 306, 110, 596, 658, 819, 382, 513, 445, 399, 208, 437, 155, 475, 545, 595, 467, 352, 489, 267, 209, -30, 433, 240, 341, 581, 348, 284, 72, 221, 336, 136, -116, 323, -172, 99, -62, 133, 236, 104, -61, -93, 43, -140, -471, 19, 388, 67, -172, -140, -62, -743, -41, -131, 1, -61, -93, -76, -199, -216, -195, -202, -253, -423, -321, -655, -314, 3, 254, -185, -428, -182, -65, -185, -197, 2, -117, -171, 109, 59, 8, 150, 254, 213, -285, 73, -112, 217, 16, 341, 223, 198, 116, -234, 286, -184, 381, 203, 503, 59, 508, 229, 473, 282, -139, 131, 334, 1, 123, 583, 349, 282, 417, 420, 315, 267, 573, 296, -47, 373, 487, 588, 348, 520, 219, 50, 97, 39, 294, 130, 71, 365, 347, 107, 68, 389, 215, 161, 125, 290, 172, -113, 270, 204, 73, -253, -296, -307, -311, -169, -315, -13, -51, -266, 115, -100, -368, -612, -351]
2994c51o7j46K28J79k57J41k31j1k26K07J27l52J38j1ok56M12l3J49k20m13M15
3016e84J22j73J09J99k18m6J55K17m74r6M99k36n8K16J37k58k56N34l39P1K3L14
3038a42j56n3k3J12J13k59n2K08n2K44q9J12k01J89J2j10J04n4K09m7M46n95M75
3061C91m22L28l33%M89l26J15N9j24K48J0m29K69qJ0J11J7L53q9n02K44J36J18
3084F65m22qo3K12J04j39J42j85M17m91J63j41j61OK23n0K5M0j71K59J1j93n22
3107b79J89M3Q4k8rL26n1j67j13R6r8j53J61o9MJ08J96j94j13J01j30j21j46M81
3131A18j64o1J00m70N40k9j64q0m12L26j16K29k0l1J50R1j71J96Q6k31l23L36
3153a00q8O6P0J08o4j61M7k08O4K82K3N3j26P0L1K92m93J75j95J88j85L10J54
$$ y = [-351, -418, -564, -336, -157, -414, -273, -504, -515, -741, -534, -407, -759, -621, -632, -638, -894, -482, -515, -366, -586, -999, -584, -462, -635, -526, -327, -545, -591, -436, -219, -693, -789, -290, -526, -584, -368, -231, -489, -745, -211, -550, -479, -456, -142, -298, -351, -374, -262, -149, -408, -460, -252, -304, -60, -149, -37, -238, -49, -37, -147, -43, -97, 112, 65, 511, -84, 391, -31, 297, -36, -36, 453, 127, 242, 301, 177, 425, 435, 6, 275, 267, 277, 388, 405, 758, 669, 167, 411, 547, 665, 243, 235, 172, 384, 488, 349, 491, 306, 723, 232, 395, 254, 93, 99, 322, 272, 297, 337, 166, 425, 436, 243, -279, -90, -47, 37, 9, 0, 326, 275, 108, -5, 91, -7, -160, 1, -68, -64, 44, 240, 46, -67, 34, -96, -217, -363, 118, -46, -107, -7, -477, 63, 34, -130, -210, -622, -296, -412, -183, -203, -234, -84, 7, -164, 32, 118, -113, -436, -100, -188, -122, -52, 56, -8, -169, -122, -330, -266, 16, 39, 92, -34, 36, 67, 359, -134, 41, -154, 34, -151, 159, 313]
3176C13j35J1J70l30J55k8j23M41q7L9j62K08J37n4j20k85kK78P0J94k31m3k5
3199C91j47O4k4L8p6pK53n2j94K17L6l02J53J00j68J69m4J10k21j49l6k9L9J23
3223B44mk73K11M3m06J34K79m51N42m11K72l6k23j4Q7m03K39k0J61L3m18J58l93
3246f49M97n24L00L95j2l01K47o51J53J33k38J82J8J89k64J76j40o8J28k34J49
3267e14K0J48j08L5K57j07p4J65k14l78O1K25J92j63j02J97mJ2k43l7L61L94l16
3290a93Om60N58j71K71j25q8N4j76J51o7K60j84K14j10r4J03K71j78o4K21j26
3312G3OM26m52J25k98L65j37K62j30l40M03J06l1l39RR7N7j51R2J34J86l29K76
3335D10j06p3o2r2j86K37J28K7J28l03J29O94n20m79J84N8k36L8K84k72J27k27
$$ y = [313, 178, 189, 359, 29, 184, 156, 33, 474, 387, 426, 264, 472, 609, 555, 435, 150, 148, 426, 496, 690, 459, 416, 391, 244, 308, 284, 322, 246, 239, 492, 440, 246, 463, 499, 197, 350, 450, 282, 451, 407, 517, 296, 147, 111, 82, 121, 244, 240, -33, 178, 221, -185, -51, 228, -223, 319, -92, 180, 144, -79, -93, -6, -409, -170, -190, -29, 4, -414, -256, -649, -152, -676, -376, 19, 7, -294, -47, -698, -545, -412, -650, -468, -450, -261, -525, -349, -489, -557, -429, -663, -514, -494, -346, -454, -419, -162, -269, -343, -178, -392, -770, -709, -484, -292, -455, -557, -360, -364, -352, -595, -632, -271, 123, -193, -187, -647, -89, -260, 11, -114, -202, -148, -324, -173, -240, 20, -164, 50, -60, -154, -51, 220, 42, -22, 199, 73, 79, 505, 53, 178, -120, 245, 108, 370, 240, -100, 303, 409, 378, 39, 48, 145, 202, 51, 143, 277, 463, 134, 410, 304, 231, 169, 77, -109, 128, 256, 283, 411, 108, 237, 931, 411, -68, 116, 174, -62, -24, 260, -12, 115, -112]
3357a12L10n9M5P9j79j34J58j6j83m3J82j29r2P6J77L4j95rP2n4j79K44n9n6l0
3382a52j28Q4K49m66r9J22L94j26j17K08l89J08J35j36J40j12J39o8j39j1L27
3403c7k16r7M57j2n18K44O1o1lO5K18j45o0J62nn4R1k7j49k3l23M78K05k69K86
3428B68J87j68J49j87j89M60o12N4L08J57J91k85P6k14k1l0o4K44K15j43N9L4
3450D89K13k61r0O5j37r7M22k11O5P7Q0k86r4K17l91J76l8J12k92rM02p4j06L10
3474E42l82J36j59L0nl9P3J48M7m08OJ79r9m78M32r1J79J30k7K5n77L27k16L5
3498a92P5p1J99j61N4l0l54M10l84J11j34P9P5Mk86L81J15k63J95k63L26l29r2
3521e35J86L9m3M17n52L36k27l96N23k28J39K21k92K36j50j61L32o2K24k50O0
$$ y = [-112, 198, 139, 184, 263, 84, -50, 108, 92, -91, -134, 48, -81, -173, -97, 80, 114, -81, -90, -18, -72, -251, -7, -66, -122, -152, -280, -196, 53, -413, -512, -390, 4, -122, -239, -31, -420, -312, -177, -313, -173, -285, -146, -214, -353, -364, -37, -253, -350, 107, 95, -423, -179, -118, -179, -182, -117, 101, -44, -104, 58, 53, -1, 90, 63, -86, -109, -432, 46, 251, -18, 268, 455, 287, 436, 249, 60, 520, -92, -38, 270, 427, 618, 333, 409, 195, 174, 144, 80, 324, 539, 396, 455, 489, 702, 441, 351, 416, 279, 182, 604, 393, 458, 535, 615, 329, 235, 452, 61, 237, 199, 311, 19, 10, 412, 338, 232, 542, 160, 296, 137, 167, 162, 123, 196, 344, 391, -17, -11, 168, 69, -409, 23, -68, 111, 241, 214, 239, -338, -11, -227, -192, -117, -188, 11, -150, -96, -126, -480, -70, -454, -343, -477, -398, -323, -319, -605, -224, -109, -372, -177, -440, -114, -443, -535, -349, -310, -353, 64, -488, -152, -379, -775, -252, -480, -341, -120, -412, -176, -326, -487, -155, -217, 7, -243, -183]
3542a83k22N5L03m37M00J7J2j2j59J27n8O2n0r0N4J3K51j17M1qL2P1j99L12j98
3567A7rJ78o1K37k40n4J9L38j74K0j32J20j52K80l30K16J02l5pk72L27k31J14
3590B71Ml82K23J42l80Q6K74j94J28Q1k7k26K72j88Q3k44j28J7L30j15N3j41M1
3613b0j05K96j74n5j89P2P8L05k34j85m9KK45m17J0O8J79K62l07o9m9O7N7k79
3637d91P4J04K72l70J65M6j04L1mJ35r4K6m7O2O7l37L01j30P9j70N5K18j46J42
3661a16r0M20m08N9k7k08J35K28j46J0J08J07j35J12q5J16pk2N3j07R3K09m18
3684a19L85j08M3j20J9lK76j23OM81m56m4L07k08m0J19p4l7J49j0J1J44k9o8j48
3709C53K8k3J4o8J46K50m27J20o9L86l22j77j14K80J32k05l7j10j41J06oJ62j48
$$ y = [-183, -405, -350, -47, -484, -84, -67, -55, -67, -226, -99, -157, -95, -145, -235, -181, -168, 83, -34, 7, -1, 31, 102, -97, 215, 17, 8, 186, 125, 362, 122, 68, 87, 425, 251, 271, 139, 259, 107, 387, 57, 273, 375, 340, 333, 61, 388, 157, 271, 275, -107, 116, 258, -122, -36, 238, 44, 172, 253, 226, 0, 272, 84, 167, -77, -205, -188, 142, 27, 80, -61, -20, -125, 171, -3, -58, -247, -175, -97, 208, -26, -211, -260, -258, -13, -430, -420, -352, -173, 89, -218, -287, -336, -269, -212, -491, -417, -313, -41, -411, -246, -200, -304, -273, -277, -142, -236, -210, -257, -195, -128, -465, -164, -294, -215, -385, -330, -112, -258, -116, -206, 214, -194, -135, -162, -370, -235, -7, -153, -143, -35, 72, -63, 49, -36, 80, 73, 51, 104, -3, 90, 299, -119, 266, 158, 201, 81, 100, 97, 373, 250, 256, 737, 281, 237, 544, 336, 296, 415, 341, 304, 453, 443, 454, 598, 569, 501, 353, 381, 358, 372, 304, 450, 700, 273, 393, 324, 710, 388, 211, 97, 377, 509, 304, 267, 157, 16, 122, 116, 278, 130]
3732A30O7m9J48j3k16j14R3j60K73q9J1P4n0j25KP5j87Q1J06L0j51j0l16J60L25
3757I5k59oo8J98kk73J93Qj05j40K12k66K56m09L24k90M03L10l64J96p1Q3j99
3780a74j82J54j91K69P7j55P9k4N4J53o19L02M6J33O6l20L5K25p8J52m7rL22n10
3804b42J82J9J9K65j33j05k24K87k47P4L27l10O9J75q6J3K45k16j28J44L0q1L61
3827D38r7l22K76j00J07Q4l71K24M7l70L97j57k85L00q8J07k7K12k68j25j4N0
3849A8K25j14q5L7K30k98O5j30R8J21k23K62l11J54k8K2k92L04j21j42K33j92
3871a67j3K17n1k25KL42j91k33N6M0m79L23K55O8m81O5J29q1N3LJ59j97K11m53
3895f48N12R3j62m7qj7J63k07m2J43J38K04l74j58K45K4n44M16J81j07p0K53L8
$$ y = [130, 197, 148, 296, 283, 67, -47, 46, -114, 159, 70, 81, 155, 105, -20, -18, 57, -130, -49, 57, 87, -64, -74, -390, -230, 95, -164, -170, -238, -40, -42, -315, -122, -114, -219, -359, -147, -413, -157, -566, -242, -532, -129, 181, -183, 13, -58, 25, -174, -356, -202, -393, -124, -47, -202, -123, -147, -93, 60, -559, -257, -211, -78, -12, -332, -297, -72, -150, 2, -45, -54, 268, -242, -60, -41, -22, 243, 110, 5, -219, 68, -179, -105, 222, -88, -19, 156, 70, 83, 328, 112, -16, 128, 158, 77, 438, 341, 19, 295, 195, 302, 386, 15, 239, 286, -84, 313, 156, -129, 171, 83, 190, 163, 375, 107, -18, -32, 18, 243, 129, 44, 81, 311, 13, 78, -52, 46, 167, -56, 206, -105, 49, 21, 43, -249, 55, -66, -208, 25, -167, -180, 37, -14, -239, -237, 105, -86, -319, -263, -223, -702, -379, -124, -56, -537, -472, -343, -424, -371, -368, -209, -406, -195, -648, -136, -43, -205, -252, -260, -277, -114, -321, -363, -220, -82, 122, -252, -410, -165, -141, -685, -269, -88, -195, -265, -12, 26]
3918B6k40J28j80m9R8K95o7Oo4J22oj54L31l04K83l73M6K26N8j34J65k01K73j61
3942A24J01j37l2L12k8K48k26j23k13K23R5q8K3L10j78K3j50J40j00k02O0L22
3964E04M3k97K9J28j48R0j29J05L5l9M5j61K86k26o2j89M49k25K0l21M65Q7k28
3987B61k94j8J58J3L9k64K09M3N6l65qL03o8Ml53N49o6m85J80J43j51l29K82j09
4011b70J51q2N5P7o3j13R9J02j54J66l45M5J69M7L2L9j05Oj51J03j22L1K01j50
4035b32J8J62k19P8n5k67K51J95l7p0J81l45M20k54p2K21j03K74O9l08j5N5J60
4058A07l3j3p0oK30k54N06k70l04J27N5J40J43o66M63r6J05j81J19PJ45q3L6J12
4082C19k56J06L0J00j29R5J43k23QN5j77j83J77L29l47q2k3J5J43M7k0j78Q4J60
$$ y = [26, -214, -86, -266, -315, -217, 78, 11, 17, -47, 75, 69, -85, 246, -58, 225, -148, -102, 124, 182, 48, 213, 12, 285, 124, 225, 88, 56, 368, 340, 588, 362, 239, 26, 249, 344, 256, 279, 589, 411, 434, 284, 424, 324, 122, 182, 504, 547, 250, 279, 407, 259, 349, 220, 325, 360, 321, 366, 205, 491, 265, 203, 14, 463, 238, 258, -63, 402, 489, 261, -33, -51, 107, 120, 159, -105, 104, 147, 203, -162, -170, 133, 65, 69, -284, 265, 199, -286, -106, 37, -114, -443, -161, -270, -119, -201, -146, -69, -132, -245, -146, -44, -198, -32, -377, -332, -163, -116, -84, -45, -150, -144, -295, -192, -314, -283, -82, -232, -214, -52, -271, -193, -248, -515, -264, -69, -106, -176, 5, -340, 80, -174, -246, -25, -128, 146, 215, -93, -108, -53, 107, 74, 61, -9, -15, 215, -39, 467, 197, -107, 20, 75, 215, 358, -308, 155, 59, 164, -17, 102, 109, 254, 171, 207, 319, 63, 169, 199, 299, 170, 265, 408, 185, 193, 248, 71, -112, 65, 394, 47, -35, -58, -43, 100, 147, 127, -51, 33, 193]
4106A93J74m31m0K39l02Q5K84k68K22j89j36N2j77N14k11j63k80K10K84j08k37
4127b85k26O15L9l11r1K17k59J10N07n74K37j42l50J20Q8K22l6J21k58J13p9m7
4149b69o6N48l48j02K25R1ql92L50m65L33J43l31J51m5J01k6j59J17r9j36J53
4171b34l6J00K09k16R4N0J2O2M4k37M5J63m0k83N01r4PL4j33n3J43p0l2J94j73
4196E7M08m55J67r1K65k52M11l40J29j86L7L99k35Q9r4k49n8M07k26m7O4J37M9
4219C86J19j80o9J83j14k46M6J35o86O71J47k01Q1k90J82j79J52j65J05K27n7
4240B47K15r6k62j87L03P0l20j05L59l37M5J5K45l21p6J54K13l84M8R3J07p0j65
4263b09R5M5k4M4j22J24l54J20M22n51K75j74M5k40K42J52Lk14J45k79M07j85
$$ y = [193, 367, -64, -104, 135, -167, -82, 202, -66, 156, -33, -169, -117, -294, 220, 9, -154, -434, -224, 60, -48, -285, -511, 104, 143, -168, -259, -42, -301, -191, 316, -258, -21, -163, -513, -393, -305, -83, -119, 2, -256, -143, -222, -269, -335, 213, -135, -237, -12, 79, 71, -321, 29, -436, -103, 40, -291, -140, -185, -84, -110, -269, -152, -251, -387, -234, -270, -170, 39, -177, -83, -33, -21, 41, 85, -152, -107, 56, 16, -267, 234, 140, 147, 181, 48, -5, 138, 68, 36, 230, 57, 465, 10, 177, 86, 351, 99, 510, 170, 299, 113, 150, 549, 314, 403, 309, 60, 2, 409, 183, 136, 200, 337, 386, 505, 325, 256, 439, 325, 79, 125, 260, -426, 245, 392, 191, 272, -18, 164, -15, 137, -28, 77, 304, 247, 462, 366, 104, -83, 220, 290, -30, -135, 224, -113, -68, -53, 192, -129, -205, -51, 162, -222, -174, -81, 26, -44, -209, -114, -69, -93, -49, -171, -47, -401, -281, 141, -410, -135, -309, -264, -504, -262, -110, -107, -321, -176, -455, -48, -233]
4285b33j08m2L49p7L0l15M24j30k23L14k09q7L15j00j37M5j3n1K84M7j6n0K72
4308B89k47l09L44Q0l93M9J68L3k33J43l6K14P1o3l4K9m2L27k62R1O8j42P3n12
4332b94N76N6j60m00N99j31j03m9Q3j70K77q3K2Q4K77o83P0K67j45R5l01M63k61
4355H9k01L73k23R2l07J32Q9n5K0L03j0j53k47j3K64K90m46j4m13M57n6k25m9
4378c03M09n6j61qj48J61l36J67K86o4j08j79J52j5J67l08K05J03MJ38k25j87
4400c06l71N40k15P3M8O8k45j2L30k80J88K63k38l85K37Q9k1M0O7j41Q0j10L39
4423C8l3J60j51j01j32K05j95j5O5K24j06P8J53k84L8J62j22l4K85j07m6Q7j9
4446A50j56L22J6M9k42pk36L45k2N8n7n9N1J42j35J72k83K95K27l07j37j20M90
$$ y = [-233, -341, -383, -34, -111, -81, -396, 28, -102, -325, -11, -220, -307, 8, -92, -229, -184, -197, -248, 36, 83, 67, 17, 289, 42, -267, 77, 157, -236, -187, -19, 14, -219, -76, -112, 102, 173, 110, 76, 105, 63, 390, 128, 219, 287, 145, 218, -294, 282, 338, 178, -222, 377, 246, 143, 94, 177, 7, 284, 201, 223, 307, 584, -99, -29, 238, 93, 188, -113, 350, 89, -112, 261, 38, 130, -177, -45, 44, -11, 9, 312, 302, 149, -98, -111, 153, 443, -3, -17, -430, 27, -29, -254, -303, 106, 50, -111, -119, -267, -106, -442, -275, 11, -53, -161, -340, -188, -203, -36, -344, -139, -36, -32, 106, -119, -306, -677, -137, -352, -279, -231, -163, -408, -420, -90, -370, -182, 81, -157, -542, -305, -216, -237, -197, -130, -271, -191, -301, 38, 5, 165, 14, -87, -219, -14, -209, -224, -159, 65, -41, 37, 190, -94, -56, 106, -16, -50, 235, 128, 82, 169, 150, -6, 316, 332, 381, 139, 132, -104, 241, 219, 277, 220, 161, 212, 354, 219, 391, 108, 403, 630, 323, 186, 66, 556]
4469E56k06j95j76M22j85J93k78J92j21K35j03k29Q6k33L19k08l58N21O9l41L07
4490B67j93k94M37j66k26J16J04Ro9K16j93M5m6k57J87L1j27J4P0j45K36l54J99
4513a39O2k35J32k38K32n5M71l32k6k45J47K46l97M1J64j23m9q2P4L65k70Q7q1
4536b51J7L9n2j63J96M9ML2J86k14k49M61k17l2j12j02L85k23pK45k54J92O6j87
4560a91L99k03j90L9J2M05j26k35M7L17l64j29J21L31n27M37q3J89l05L15j63
4581I6n6J54j93K13J67m28K80m1p5J02q3K83l50O7j04J8K26l56J84J37j06k7n
4604A03J43O8k43m3K42l35k19L67Q2j06J6j25m8O1K05j08j36Q2j8Q0k51O2O7l56
4628d10K33j72J04j3K27j78K21j85L80k80n1k36J39j04J41J16k93M32l68K40k05
$$ y = [556, 350, 155, -21, 401, 216, 409, 131, 323, 202, 437, 334, 105, 191, -42, 277, 69, -289, 232, 301, -40, 267, 74, -220, 217, 51, -175, -59, 45, 54, -15, 201, 8, 53, 7, -250, -63, -32, -159, -145, -75, -220, 16, -338, -139, -77, -312, -180, -418, -186, -241, 230, -102, -128, -373, -226, 20, -377, -336, -172, -295, -344, -426, -352, 13, -257, -170, -251, -234, -195, -247, -410, -214, -165, -161, -129, 57, -157, -406, 55, -162, -194, -306, -408, -23, -246, -253, -8, -262, -70, -4, -191, 208, 5, -185, -146, -134, 271, 145, -90, -43, 274, -90, -219, -98, 233, -294, 143, 60, 249, -56, 259, 96, 40, 194, 1, 214, 381, -47, 233, 192, 117, 219, 136, 419, 69, 136, 32, 50, 276, -80, 104, 241, 135, 108, 103, 246, 314, 71, 28, 270, -65, -284, 83, 165, 59, 75, -50, -98, -37, 168, 60, -76, 6, -12, 68, -183, -121, -54, -410, -177, -349, -245, -258, -31, -209, 12, -173, 207, -73, -124, -360, -221, -325, -184, -68, -361, 71, -297, -57, -262]
4649b62m3K56k63L90l27K09q8K78k94r8L6J48Q9m13M00k89K01J41q6k08J79j03
4671a47j71M74m21J76j27N4j11J40K73J14j91o1k07K71p5j46J88rK57kk8r0k30
4694f9L14p8j77M44l80m5Q8K67j61l00J55k2K12k35J68M7n5JJ61k21lJ90R4n5
4718C40J6J45k66j5K24j62j63K55k97j48N57m97J02P8M6k5N2k3j00j10j82r7K69
4741aK79j88J44P4m70J96m5J32j54K43l32j44M18k57J9L80p03O3K13K11q3k33
4763b38K57l99M48J06m55K21p2J09ol43K26j58K37j18r4M0j02k08L45q4J19O9
4785a00k16m3M1J49o5j73L27m2Jm0J21j46j44L77k46J05J5k04k15J37K98%k73
4808c36M69j33Kj39KJ93J10j10N8J9J10R0o28L87j55J68M6k29m7J82q7j21L44
$$ y = [-262, -305, -49, -312, 78, -249, -40, -128, 150, -144, -242, -206, -58, 31, -382, 18, -271, -70, 71, -15, -223, -44, -147, -318, 156, -265, -89, -216, -162, -273, -133, 140, 254, 63, 2, -205, 66, -9, -155, 33, 24, 281, 279, 251, 161, -69, 245, 167, -10, 434, 54, 9, 97, 364, 203, -97, 58, 36, 248, 13, 181, 228, 173, 174, 335, 114, 111, 301, 395, 340, 356, 501, 235, 220, 444, 282, 119, 374, 77, -71, 486, -11, 91, 169, 215, 190, 242, 219, 119, 9, -173, -270, -1, 278, 90, 234, 308, -162, 34, -11, 121, -33, 210, -122, -266, 152, -105, -86, 294, -409, -346, -133, 78, -5, -238, 19, -380, 68, 174, -281, -60, -132, -23, -29, -372, -146, -304, -67, -185, -279, -239, -341, -549, -204, -288, -169, -100, -316, -359, -318, -169, -234, -407, -80, -122, -121, -161, -40, -186, -330, 47, -199, -94, -79, -283, -498, -361, -63, -63, -336, 133, 0, 2, -137, -135, 58, 168, 58, 116, 135, 245, 335, -293, 94, -61, 107, 153, -76, -123, 59, -28, -149, 195]
4831A95k34P9P8p0J46j78Q9L7j52N3q4K66J70m02k9J69nj60J73j2q0J04N0Nm85
4856b77K37K14j18j31L7K83q1j48n3K58j52J37o8Q6p5q2Nk49L06j67J20j05J59
4879A36j79j69n8j11M07J78m78j26O57k65m6j94J9J35K12k13l17N29l13p7J20
4900a53j43K46O3l49J60oJ34j45j64P7R5P6J02M1k84L2K78K2j17r5j2K80k81k
4924a45L98l79j20K45j12l2K02J64k85L1J97Pq4n2j97J23l11L02l09L03mO10l41
4947B11J4j51K82m77L75k8j19o3j37K65J46j64J43kR6r9j30K8K40j57J35k40J33
4970C01J94l6l82J23r7j9K57j30K2m2R4l3p1R6Q6M5o39L67J45j54J89m54L37k37
4994c8mk43J52K93j38J18M7j22J28l08J15j61m9L06l18K36K27k59J01j11J33o1
$$ y = [195, -39, 40, 118, 48, 194, 16, 105, 142, -10, 43, -41, 225, 395, -7, -36, 133, 128, -32, 141, 129, 49, 153, 203, 208, -277, -40, 174, 56, -75, -38, 245, 164, 16, -37, 221, 69, 206, 138, 224, 149, 67, 72, -177, 129, -38, 82, -23, 136, -43, -212, -270, -381, 26, 204, -274, -400, 257, -8, -54, -248, -229, -94, 118, -95, -412, 117, -196, -273, -153, -296, -50, 13, -336, -176, -182, -48, -193, -357, -280, -185, -109, -7, 34, -250, -218, 60, 82, -35, -130, -142, 138, -143, -145, 253, -126, -246, -1, -113, -145, 57, 221, -64, -33, 164, 171, 87, 35, -162, -39, -350, -48, -357, -54, -58, 552, 211, 225, 74, 356, -121, 254, 226, 107, 44, -93, 172, 318, 154, 297, 295, 391, 292, 162, 190, 430, 273, 408, 168, 301, 495, 459, 77, 200, 103, 84, 341, 211, 233, 191, 285, 252, 181, 277, 363, 408, -231, 136, 281, 127, 316, -138, 199, -38, -42, -285, -133, 160, 22, 140, 187, 65, 193, -115, 0, -161, -210, 96, -222, 14, 241, -18, 83, -28, 105, 44]
5016D4M5j09q1J49m25L73n6j62J74j09k21J49J38P5k92M08j88j25N4R1n7j65J5
5039b75J56j12K53j93o5L3n6K3N9N5N4k00k5K1K53j24J8M9j33N1k4l09N20o0P6
5064D5j30Q6j18J15O9q4M2j69K84l74J91J40J93k82L64m20L60k09j51J1K20r3
5086I0J38k16J58r8L8J84k62J57n6M5j64r3L01k87K35j74j59M42l74J2Q0J14K07
5109C18k58m7k92J47K97j51n9K62m7k84K38j01k68K9o0N51m01j51L32l29J13m0
5131b01K49l61J47j6r7J26m2K2j47L48j79j50j1M7L55m15M1L97l43j43L04L7l3
5154f5QJ18m38L17k57j76M51j92j59L54k30L00l18O80m27l16M3M17j80j82J6K66
5176C0K47n35K22k60L15k11r8L25N8j28J81k59J64K48m24K51J8m6j2J51l14K01
$$ y = [44, 89, -20, -101, 48, -377, -4, -60, -222, -48, -157, -378, -229, -91, -16, -308, 100, -88, -213, -159, -68, -125, -290, -275, -119, -231, 22, -171, -236, -203, -259, -236, -177, -122, -68, -268, -293, -272, -19, -143, -125, -76, -209, -158, -182, -491, 29, -31, 45, -85, 1, -117, -2, 67, -17, 25, -144, 140, -234, -43, 97, 290, 8, 372, -48, 312, 103, -48, -37, 183, 90, 228, 12, 170, 72, 110, 294, 32, 189, 133, 178, 14, -79, 222, -65, 170, -4, -163, 279, -95, -83, -3, 111, 318, 60, 13, -279, -132, 165, 14, -45, 217, 170, -114, 124, 23, -245, -216, -276, 275, -126, -277, 55, -274, -161, -201, 48, -313, -166, -182, -279, -153, -195, -173, -320, 28, -151, -301, -312, -265, 90, -325, -284, 113, -230, -373, -69, -32, -65, -57, 61, -377, -60, -317, -493, -42, -234, -393, -39, -269, 31, -287, 393, -34, -350, -307, 110, -70, -252, -236, 30, 277, -258, -36, -296, 19, -192, -290, 35, 93, -35, 146, -113, 51, 299, -125, 126, 144, 98, 86, 237, -77, 124]
5198A24L7k6p4q2J35L92l50p8J99k48M57l98L3M17m26N3k02R1P6N1J15k92J59
5221A63L37k48k41K73r4r5k6mO6j63K31K2J13Pj57O1l3m22K65K1l57O10rj41L8
5246B17K68k89k49L1n6N9k6m3N3J95m21J81J33L97n55K84k36rp7j04K56l4k39
5269b64K16j36M5R0k51J26J38R8j68k03K88k53n7p7K42K44k54m0J34Jl4jj36q1
5293c33J61O2L1L4l91N03n6o1J48j03l2l4j9J47O5l46O7k7J38J0j07L48Nk65R4
5318C9r0j2n9M4m3M5j59M76o9k0kk51j24J38J89L46m20K73j72N8M4r9J88k82J65
5343B03m70J92N3K63l09L49k78L79j54r0K44m42K97k73J03r4J53PO0r9l29K18
5365a7j7J47j19pJ61k23J30J27L8l68J06k7J67o9l46K85n9J66j7j86kk40L11p1
$$ y = [124, 161, 135, 61, -21, 114, 506, 156, 78, 277, 29, 486, 88, 121, 538, 112, 165, -37, 54, 130, 181, 296, 4, 163, 500, 252, 11, 284, 190, 95, 69, 65, 131, -32, 199, 221, 334, 341, 184, 245, 212, -210, 55, 76, -281, 329, 320, 179, 217, 485, 196, -53, -22, -78, -19, -45, -88, -35, 160, -261, -80, 53, 450, -105, 179, -57, -66, -143, -247, 9, -25, -264, -48, -184, -139, -49, -300, -174, -36, 62, -106, -309, -21, -274, -331, -408, -166, 78, -176, -216, -82, -81, -115, -116, -252, -333, -172, -110, -79, -45, -436, 67, 11, -50, 98, -5, -37, -71, -90, 57, 122, -224, -157, -184, -46, -36, -143, 205, 210, -55, 39, -51, -63, -122, -78, -121, -76, -235, 241, 172, 152, 150, -101, -225, -87, 102, 448, 28, 301, 129, 187, 231, 132, 320, 38, 203, -267, -75, -22, 241, -68, 281, 3, 382, 228, 138, 382, -60, 237, -36, 67, -27, 126, 133, 193, 94, -235, -17, -34, 113, -6, -13, 148, -75, 55, 182, 220, -148, -42, -69, 98, 29, -317, -32, -91, 75, 58, -128, -130, -370, -59, -130]
5389a30P3k45N5N52n69R4K41m58P1K11k0o4%M9K8O0kk04j6L8K87k65K55l22K29
5414e2L4n8l1rk2R3l00j64K68K47j91p8j56M44q9J67j63J79j23k49K49k0J21k99
5438b02L20j45j88L16l61M20K9J6q9m56L40J51k64J16Q0R4k85Q6K04n1L4J22q4
5461B03J09m17J87K09L9m13Q8K27j24L10o9k63J50Q3j33q9K5J18l0J8J44k37j36
5484aJ05K40k09M6L6j54J64j62l95M66J30j82j78N0Q5O8L63k95r5O5j39j47L07
5507A68l46L54n07M33n6l92L26J59m40M87k38k30N1j58M88o7K11m65L87n46K90
5528i1q3K16l7j03k05M7J78J78J20o80L87j9k22J15j11K35j36j5J85j78k8P5J01
5551g1k96Q6Q3K15K73k23j07j96K43l37L24j56j8L69l22N6m5O1J26j59r1K30J38
$$ y = [-130, -57, -302, -247, 305, -264, -170, 71, -387, -316, -105, -125, -189, -189, -140, -112, -52, -54, -258, -274, -236, 51, -214, 41, -281, -52, -18, -76, -107, -116, -138, -45, -345, -509, -241, 6, -185, -263, -419, 25, -64, 103, -60, 119, -4, -253, -4, -24, 97, -202, 118, -27, -215, 101, -260, 160, 189, 205, 116, -340, 0, 151, -113, 3, 83, 177, -108, -22, 182, 131, 165, 287, 203, 312, -105, 82, 291, 330, -83, 5, 232, 108, 418, 349, 86, 236, 319, 186, 97, 122, 240, 210, 228, 372, 135, -1, 104, 344, 135, 181, 217, 63, 227, 65, -330, 136, 266, 84, -94, -44, 41, 109, 472, 177, 82, 147, 8, -139, 168, -178, 176, -331, 102, 46, -346, -20, 139, -301, 186, -52, -282, -231, -389, 99, 32, 243, -222, 165, -381, -91, -174, 42, 5, -98, -303, -256, -78, 100, 220, -460, -73, -92, -314, -199, -310, -75, -211, -226, -41, -219, -247, -172, -71, -367, -281, -198, 17, 290, 67, -40, -236, 7, -330, -6, -162, -180, 189, -133, -77, -122, -61, 65, -94, -185, 45, 183]
5574A83j55j66K99J6o8j59L93j10l08K42l8k6K3P9k79j18N8L02Rn7J70j19j00
5597G1j9k04L18m1j13N4j89L04j85L6Q5j19N6K49j51J23j45N0j94L14k1k52J60
5620A87J51k71j49J30l3K15l03m4kO6k11J67L50k88k6j92J81n8J41l35J73N3N5
5643d3o7J41k10r0J19o9On5N7J62k59J55J32O5M2k28k1J01Q8k81J04J19P5m1q
5668fj30l2j10j40K05K32P9l1m4r8R4Q9l38O6K66k21j9K27k86J41j11J16n5M0
5692f6J96L04k80l28L41q1K28j81L1o6n7O4j35J65j30J70p5k31N43j79M6l09J94
5715A64k92L57m7L42l30P2l3j09J18k8J91m79J44R5J9k1l9j54q6L07k14K54K12
5738D43m07L9J12k11K53j19J52k49k3J14J1N5j11R5j45K85k80j80J90l1j60J0
$$ y = [183, 28, -138, 161, 177, 109, -50, 343, 233, -75, 167, 129, 103, 126, 205, -74, -192, -134, 168, 177, 120, 290, 171, 71, 52, -152, 166, 125, 12, 66, -123, 181, -4, 32, 117, -2, 54, 303, 152, 275, 130, 180, -14, 300, 279, 27, 187, 338, 67, -82, 48, 15, 230, -73, -117, -119, -53, -264, -97, 253, -35, -61, -253, -72, -130, 11, -324, -151, -98, -43, -110, 31, -179, -269, -150, -219, -213, -268, -211, -49, -308, -153, -21, 44, 86, -142, -163, -62, 26, -255, -151, -32, 43, 2, -6, -136, -168, -278, -418, -213, 19, 98, 67, 23, -75, 19, 108, -230, -164, 102, -119, -138, 89, -197, -56, -167, -51, -106, -66, 130, 434, 154, -174, 167, 86, 314, 133, 164, 98, 41, 105, -30, 135, 5, 175, 100, -131, 412, 233, 279, -30, 164, -128, 229, 182, 524, 194, 266, 233, 124, 242, 214, 405, -74, 70, 165, 184, 163, 124, -30, -116, 191, -23, 231, 443, 36, 75, 187, -24, 229, 110, 262, 13, -10, 104, 115, 170, 59, 154, 9, 294, 14, -166, 24, -7, -167, -157]
5760a57L18k3l04j94P61l25Q5j09j73J7N03l48k40L49l57j2J14lJk03K06M5k77
5783c26J56L6L4o5l6J61q3lj42L84k39k06L49j28pj44J71J9L5M8j26p8J76k08
5807b22j54M12k3j60j36J85N8J28O9j21J81j80l9L9J05q8p7J30K8l3k68J92K73
5830B99o4k27N0J77j63J92j23J2k97J82O1L5J67j2%l49K85J11k14J54m51L89K6
5853B40J6j51Q1j95q9K61l5O8N7J86l24n8j52j7O2K58l11K66l23K62j27j12K07
5876G0j00Q1N3J44k08j00O5k12O5R3N0l48J36j43M8K54J05j40rK79k71N4k37K52
5900a9J36k92J54r5OJ34k69j17L01%j20K56J08k95j58K65k06P3j1J0j36K38J43
5923A06l36k1j39J61K74Nj52k2K03k15Q3O1k81J05K80p7J2mk36J41K75p2j01R1
$$ y = [-157, 161, 138, -166, -360, 401, 76, 161, 52, -121, -104, 399, 51, -189, 160, -197, -209, -95, -98, -97, -300, -94, -49, -326, -170, -134, -100, -165, -201, -40, -123, -126, -268, 116, -123, -329, 20, -108, -115, -259, -88, -69, -34, 14, -112, -190, -14, -222, -376, 36, 13, -147, -283, -98, -40, 88, 157, 36, 217, 37, -2, 37, 142, 54, -23, 107, 135, 102, -166, 26, 299, 235, 8, 58, 235, 72, 264, 141, 153, -144, 38, 99, 134, 301, 289, 289, -60, 225, 336, 122, 276, -175, 214, 240, 256, 105, 186, -9, -98, 163, 128, 196, 253, 439, 115, 57, -95, -112, -50, 208, -103, 163, -160, 102, -25, -137, 70, -30, 51, 104, 248, 40, -60, 5, -207, -142, -49, 1, -347, -211, -354, -306, -52, 53, -87, -96, 183, -88, -34, -271, -19, 117, -175, -21, -116, -110, 24, -245, -362, -61, -61, -181, 75, 183, -112, -270, -5, -211, -138, -149, -139, -275, -37, 106, -230, -251, -390, -229, 45, 50, -102, -124, 79, -136, -53, 8, -273, -168, 112, 35, 47, 43, -193, -52, 223, 151, 50, 141]
5947A41P2j99J89k8j85J97j94o5m5L0J99l58J23J34O7j30P2J59k2K2j66L09m2
5970B80n7k04L86k44j32M0P7l8K34l23R1J5k97K30L83m46K60n1r3l30L71j09J25
5993A68L7q0J55Mr6K22j27l61N95l75qk39m9K12n9K01nk05L7k53n2K37O3qj7O0
6019E7m4j19J38k12N1j70Q1N7K15J08l72L61k98j92L61j57m7K87j51L0j81Q5l16
6042d28M27J21n41K56r6J28p8m7j34K22J42j68m2N27k68j60J63k10J65K57k39
6063cJ12j53o8q8K85k26N2P4j72J93J81J13l33K18j94P9l4j33J43K07j74j0o8
6086AJ28P1l10J67L6K24l19K64l4l70K47J56k35R8J75k50J27q6R4r9k10M13k92
6109dN9K34k62n9M56m37J61Q2k71K73j64M68m28j20l55M46J30L3j00m47K40J02
$$ y = [141, 213, 14, 203, 175, -10, 187, -7, -72, -117, -87, 112, -246, -123, 11, 78, -52, 20, 179, 157, 179, 13, 322, 280, 223, 19, 405, 161, 29, 69, 146, 108, 342, 19, 110, 125, -172, 58, 441, -5, 255, 204, 111, -219, 152, 43, 168, 205, 125, 280, 284, 188, 410, 283, -78, 517, 142, 134, -105, -154, 58, -1, 200, 195, -10, 27, -226, -278, -41, 22, 14, -3, 57, 13, -106, 32, -180, -129, -299, -218, -161, 54, 162, -210, 151, -147, -339, 22, -135, -182, 105, -46, -16, -197, -112, -428, -1, 120, -421, -165, -261, -133, -211, -258, -392, -170, -28, -196, -238, 289, 21, -139, 24, -186, -21, 236, -3, 109, -44, -112, -200, 85, -141, -89, -15, -187, 6, 187, 300, -33, 185, -9, 70, 36, -97, 46, 253, 79, 69, 1, 129, 200, -110, 57, 93, 317, -2, 262, 228, -142, 105, 261, 26, 124, 299, 49, 176, 90, 184, 85, -125, 288, -4, 55, 289, 27, -32, 424, -13, 148, 230, -41, 232, 68, 536, 108, -12, -367, 79, 209, 242, 142, -305, -65, 37]
6131C7L4j32lJ54n3j75j55J97M05l25k17K16j37J49m0k4j68n4K03q5M42m02m0
6154a73K75l34J86o4J11p1j63K39L8k30r0q4J79J07J2J38k43k52J04n5K84k99
6176c85L07l60L35J96J6j25R1m04j15M59L9j38n7K92j62MP8k73K08J33j29j91
6198a81R4Q7j14R4j32L42j20j82P1p0L03k2r5N6J46o28K97J92k5k67R4M01k94
6221D7J9j03J92j31J54k05K42l09K33j90J18k0PRJ32J35n7k52j51K22J26R1j20
6244A89o3K69l37j11L16k61mLK25q8l07J25J88l77J19J06m0K27k64J21N3j94J7
6267h8j17K56j47R7J0q5K68j65k20O0P7J38k27J59l76M03k19J73J15k8j99oJ49
6290B8j97J27J26k15J55q6j43K76m0k07J39j7pr0K7j89L59Mj08J80j63N6k64K98
$$ y = [37, 71, -61, -64, 90, 37, -138, -293, -96, 309, -16, -233, -17, -154, -5, -45, -69, -237, -291, -88, -173, 269, -133, -173, 102, -232, -46, -110, 1, -70, -233, 6, 44, -186, -276, -360, -181, -74, -62, 76, -167, -419, -315, -370, -86, -385, -78, -438, -103, 93, 109, -16, 75, -329, -444, 15, 54, -84, -141, 151, -11, -7, 71, -202, 6, 139, 10, -181, -87, 0, -114, -20, -152, 190, 70, -112, -41, -111, 192, 170, 75, 131, 277, -351, -54, 138, 113, -154, -60, 341, 47, 66, -37, 155, 24, 178, -27, 215, -94, 139, -51, 67, 47, 54, 63, 195, 330, 273, 21, -130, 92, 218, 309, 189, 126, 395, 58, -53, 263, 2, -2, 1, 226, 138, -169, -44, 144, -233, -114, -8, -48, 179, -85, 36, 89, -105, -88, -205, 51, -96, 1, 11, -74, 194, 29, -191, -131, -54, 84, -143, 16, -360, 43, -176, -3, 112, 84, -115, -121, 28, -169, -42, 84, -131, 24, -62, -205, 71, 31, -176, -37, -54, -61, -151, -124, -313, 46, 50, -58, 122, -41, 15, -249, 49]
6314D9k10j55L28m4j1K7K05j37q4j92M77k12K89l65L87k53P1j35J96n4P3K3P2
6337C45k22n2j55Nn8K00J33k26N9J38j71j70L51R2M5k08K44j57j72J65r3j57Q6
6360B2o2O0j17L51J27k15Q1m76N84l91l5O3L9j9n0j45O29k10l09j16K14l00M40
6383A65l11J73J71k24Ol11M12O1j17o2j06J07j28R9m0j58L41l80J57j56J84K58
6405A41n03K93j21L73m67K78p3j19Q8K4j24K6l98N06M1k10L20k17J05j08m6K48
6427E7l34K35k96N65l32p2n3L01l24N3o0K0K76K0J82j27q8R1N0q4r3k09N2K04
6451C4Q2j46j21K4J39L3j69O8K45l54J86J49j07O9o9Jk70L26J95j33N0r5J12N1
6475C00m03K28L4j13j26K86p8k51M09l33L50p7q1j5PJ91m8k05J42O3j04r8J16
$$ y = [49, -161, -316, 12, -32, -43, -16, 189, 52, -32, -224, 253, 41, 330, -35, 352, 99, 170, 35, 231, 177, 250, 273, 345, 123, 71, -84, -79, -137, 63, 196, -30, 29, 167, -4, -174, 177, 269, 314, 106, 350, 193, 21, 186, 93, -64, 22, -40, 20, -97, 254, 381, 166, 247, -229, 355, -36, -71, -8, 31, 12, -38, -183, 446, 236, -73, -189, 25, -275, 165, -146, 27, 198, -26, -20, -331, 81, 142, 25, -37, -143, -36, -164, -65, -105, -263, 78, -302, -145, -301, -117, 141, -362, -69, -190, 183, -284, -6, -79, -198, -110, -86, -210, -184, -582, -76, -35, -245, 75, -142, -37, -145, -191, 57, -277, -42, -338, 227, -105, -177, -230, 71, -253, -200, -260, -240, 36, 56, 238, 111, 23, 114, 164, 80, -13, -222, -170, 34, 116, -30, -151, -127, 12, 45, -124, -56, 189, -165, 21, 170, 63, 132, 63, 64, -206, 120, 315, 182, 232, 137, 249, 300, -103, 125, 159, 46, -80, 206, 128, -123, 286, -47, 303, 226, 145, 130, 137, 328, 280, 75, 217, 280, 176, 78, 194]
6498A94j84Q2j75qL08k68L82m55J83J77k93P7M4J6j88j04K35k43P3K98j90N6m2
6521b5N5j75M4qo5J42R3J9j05k17O0R9J3K25j51j37K7K6l56N29m59L60J64m61
6545c03M3n8J97m5j71L18P2l0M3l42N5K32j03PR8Q9k18j06N30n75K61k65K51K40
6569B20m32K17j17L62k27J67r3J09p5K8k48Q9PL0L7L46l34M1J77j55P2L0l25J99
6593A25m1n0M8J27j72k14M71k35j65K59j50l7k6L50n3jl31L7k4J90N6q4j16L20
6617B84j99J5M9r1l0p7l3R2R6j30K44k09K16J6m3j24J11j10R2j66K8k23L48j86
6641c0j32j17L11M2r5q7J84k39P3K02m39K24J79k18L14o6j14l22Q6j85L64n8j31
6664b54J41j8J04j72j52N10k6n63Q1M20n23M06J87j58J4k62R5J35jq6j18L2P0
$$ y = [194, 10, 92, -83, -91, 217, -51, 331, -124, 59, 236, -57, 20, 64, 80, -108, -212, 23, -220, -147, 151, -39, 17, -25, 30, -145, -101, -109, -174, -32, 61, 80, -25, -242, -182, -83, -70, 155, 4, -133, -106, -80, -436, 93, -366, -6, 158, -303, -260, -318, -121, -166, -337, -19, 53, 23, 66, -276, -221, 11, -92, -85, 13, 102, -116, -222, 308, -267, -6, -271, -20, 220, -212, 5, -112, 250, 23, 190, 97, 206, 131, 159, -89, 0, 7, 37, 74, 420, 86, 127, 304, 149, 221, 251, -74, 125, 84, 34, 82, 209, 37, -177, 294, 59, -106, 153, 3, -34, -60, 290, 237, 236, -95, -58, -82, 108, 164, 80, -36, 284, 85, 100, 149, 58, 28, -49, -82, 10, 106, -24, 220, 11, 227, 243, 200, 76, 187, 77, 169, 3, 31, -192, 156, -30, -162, -279, 32, 74, -21, -108, 76, -163, -90, 112, -327, -103, 76, -142, 172, 106, -8, -330, -244, -429, -65, -123, -254, -113, -131, -27, -199, -351, 159, 133, -430, -349, 71, -452, -46, 141, -17, -3, -265, -170, -35, -36, -122, -240, -208, -138]
6687a38q2J26K5q9O5j15K29Q1k08J49K30l33lM3O8L08m40mJ74j92j09K99K3k84
6711a77k5K52k55J80Q2R7m5l60M74m9O6l01j4r4M35o01N24k27L55m1l55J25k4
6734B2N8j42K43l78J33j61M06j63l9j01M15m74M84j02n1j53j17L0J02j40K46j07
6756A1j65p9K04L04n03L79j4m00K39k57L12q2p2k3J70L4J20k49q1O8J54k50J90
6779A0l56KK34j47M1J69j01K18n7l39K60P3k74K69k59J70j34J81j39KK69k04K08
6802I6p1k95M54j24nj65K61k29J72k03K90l75N3R4ll23M17j89J47R8K2m5n2r8
6826g3pR9r9J85j15p7K09j60J90k1l4M1p0K7p9P7j95L91l6j14j20L97m19L91j11
6851B77j13n2J11k39L14j1l5p3Q3q1k50J43J82k51K06k9J12j32LK48l55J41K6
$$ y = [-138, -220, -94, -69, -158, -93, -208, 21, 102, -106, 43, 273, -60, -63, -20, 48, 356, -84, -88, 86, -106, -215, 84, 107, -177, -202, 50, -205, -25, 57, 154, 109, -251, 223, 174, 240, -61, -75, -169, 266, -335, 189, -38, 317, 276, -79, 46, 22, 80, -62, 181, -197, -64, -225, 181, 18, -21, -122, 293, -181, 303, 201, 150, -3, -120, -90, 12, -128, 118, 11, -154, -233, -29, 275, -228, 151, 137, -263, -24, -281, 31, -51, -123, -146, 24, 58, 178, -71, -152, -84, 70, -180, 10, -346, -344, -110, -257, -216, -47, -148, 70, 13, -326, -66, 7, -267, 2, -257, -87, -221, -40, -179, -177, 92, -112, 96, 25, -270, 184, 60, 55, -110, 151, -78, 94, -109, 181, -194, -141, -47, -50, -373, 44, -145, 2, 100, 122, 77, 25, -73, -80, 19, -80, 105, -10, -87, 122, -38, 152, 131, 97, 138, 68, 95, 16, 93, -102, 289, 253, 139, 19, 416, -3, 388, 277, 164, 112, 223, -16, 298, 287, 252, 179, 262, 181, -69, 74, 256, 5, 211, 182, 294, 162, 165, 413, 58, 199, 225]
6874B25j33J43l38L07n6o8k17L10n7mm3K84m58M04K9k70k31mL54k35J16j77l3
6897a52o7l8J71J53j70J06Nk05N6j76J02P0Q5Q4J24j73k99K97p4P1m4m72M94K31
6921A79m28R5j42L62M8j18q8j2K05q8k44J29R5k46J11J63k09M77k59K5l27K4M27
6944A79q5j9k70N8K53q0K48l61J78k01J4J56M6l3P1k74Q0q2L31n3n57K42J81O1
6968H3l8j10J53j23R3m9K27M2k03M9j86K08J10l22J90K24r5k38j77M9J79l16J89
6991f1k30K68J26J07l66L46l2N1l28K91j72J14J77n5j61j28J08j41K73k00K5J00
7013A12l45J6L71k91K85j22n5pn7L41m96M2K21j15J19j20K7J95Q9o0k74p5P9j28
7037b48Q5J3N2j01K46Q3L6j54j76K14j63j8j14L25j43J02k01J87j80p0J1K73K16
$$ y = [225, 92, 235, -103, 204, 148, 80, -137, 173, 116, 112, 69, 353, -105, 299, 328, 58, -173, -177, 177, -58, 58, -119, -152, -219, -257, -86, 67, -103, 3, 8, -197, -141, -317, -215, -145, -60, 24, 148, -25, -324, -27, -101, -30, -74, -546, -52, 179, -249, -154, -296, 66, 114, -4, -92, -104, 101, 13, -231, -102, -7, -253, -142, 21, -188, 289, 30, 55, -272, -248, 179, 94, 75, -195, -137, 116, 36, 284, -77, 101, -100, -86, 70, 116, 83, 154, -120, -40, -122, 209, 156, -401, -159, 22, 83, 45, -65, 88, -35, 58, 9, 236, 278, 75, 124, -62, 146, 256, -66, 124, 348, 253, 15, -162, -113, 66, -250, -61, -291, -23, 103, 210, -156, 190, 158, 209, -119, 172, 0, 114, 291, 236, 75, -53, 55, -86, 187, -13, 12, 112, -233, -217, 154, -137, 148, 26, -29, -36, -93, 248, -248, -206, 15, -100, 19, -101, -74, 121, 210, 150, -124, -199, -120, -248, -163, -150, -98, -199, 47, 130, 166, 12, -164, 50, -113, -131, -245, 80, -63, 39, -162, 25, -155, -225, -214, 59, 275]
7060B75m84J20K32j08j55J39j78J01p6p6L08J5J23l74J67k59K46K9J6m2J97k83
7082f7M59k55o6l54mM82k23J99j74k32L03j99Q5K98j61L73l11J35j22k38P6J78
7104A82j3l31N38Rk44Q3m88O90l18OK6R1m1m7n6o5L3J21l12mJ48l0q9r9K85m0
7130C5Nm5p6r7J41j0R2R7j81j65L63j20o5p7L30j71J8m03J14K14k15J52P5k31
7154b20P2P5O0N5j98QK11J20k17l13K05K14k65J59o2k19K95j04J05%r8j83K51
7177d9k89k6N04k07j12L4K90l99K26n17P64m83K86j43K14o2j29J2M8j11j21NK83
7200A8j04j64L60j7K4j35K9J8j8k89M18j92J24K32k39l1j18L43m14K67j31L38
7222C19n28K76o8k28K28J73j09O1Oj3m6r0L14k31Q6j14j5P4j40o6K58p5r2j32
$$ y = [275, -209, -89, 143, 35, -120, 19, -159, -58, -134, -210, 98, 113, 236, -138, 29, -230, 16, 45, 61, 19, 216, -67, 392, 137, 71, -283, -287, 195, -28, 171, -3, -235, 68, -131, -46, 252, 91, 464, 153, 288, 166, -72, 4, 182, 169, -162, 376, 385, 141, 224, -264, 426, 108, 114, 140, 231, 190, 143, 87, 22, 55, 176, -136, -140, 8, -22, -111, -210, 75, 35, 40, -5, -81, -178, -37, -47, 45, 142, -39, -204, 159, 39, -26, -103, 227, 56, 74, -329, -215, -1, -216, -64, 11, -220, -148, -73, -13, 42, -156, -148, 63, 183, -34, -347, -142, 72, -193, -34, -96, -315, -20, -124, -19, -19, -117, -300, -49, -338, -364, 140, -67, -179, -145, 145, -254, -28, -545, 219, -264, 22, -121, 93, 31, -98, -86, -38, -149, -270, -265, 18, -86, -250, 110, 93, 117, -18, 11, 29, 11, -278, 140, -52, 72, 304, 65, 34, -84, 259, -155, 112, -19, 319, -209, 67, -1, -229, -1, 172, 63, 124, 130, 117, 71, -19, 295, 64, 150, 36, 21, 95, -45, -111, 147, 72, -20, -152]
7246a52M24k52j07L42P1n8l95J99J09J7p0k98M04l71p6K03K30j64j72N9q1J16
7268b2L4l0n3K64n28L55j33P8O9Q6jJ58m50K7M55k74L0j06l17O2K48O5m72N00
7292D5J2k28K4J6rp3K83j52k39N15j53q6j95J84L9o4k48J41O8J73k42k3K62K4
7316G4j38J31J3q0O3J06l72P9K97l73K67p5K85r2j40k88L05j25K29k44PJ52o7
7339A4kJ37m9K79p0l32J65K5rj24p0L69m37J24K33j4R3j47J23k52M6l2J11k48
7363f7k7m0mk3J46K51k02j86Q3K29q0j26J88J2j65k28L61j20j09M56k61O0r2k80
7387b24J16K85l6j42j1p3j01L09J1l54M53Kj25j78k2J22l7m3N4j10k2p1L9K22
7411F4p9k7k73Q6J33J06k44K0j47M80m53P4J78r1rO6J25n5O3k42J29j59j22K86
$$ y = [-152, 272, 20, -87, 255, 326, 268, -127, 72, 181, 198, 128, -170, 234, -137, -213, -10, 220, 56, -116, -57, -138, -22, 12, -18, -71, 193, -335, 20, -113, -35, 34, 120, 119, 277, -173, -146, 309, 35, 65, -41, -358, -296, -48, 17, -455, 45, 57, -171, -147, -131, -140, -213, 70, -82, -321, 194, 41, -45, -240, -56, -17, -81, -329, -188, -120, 53, -189, -212, 50, 74, -64, 67, 80, 0, 63, 169, -203, -124, 173, -200, 67, -8, 277, 185, 45, -243, 62, -63, 166, -78, -71, 81, 14, 12, 149, 100, 379, 309, -23, 142, 167, 158, 34, -36, 333, -104, 20, 253, 239, 332, 185, 308, 56, 102, 70, 181, -67, -94, -134, -138, -161, -15, 236, 34, -152, -69, 160, 80, -46, 142, 154, -11, -239, 122, 2, -107, 349, 88, 148, 56, -224, -108, 177, 141, -1, -12, -85, -186, 123, 134, -220, 233, 235, 110, -68, -90, 32, -5, -48, 6, -104, -126, -197, -158, 64, -15, -42, -315, -229, -96, 10, -234, -214, -361, 119, -334, -260, -82, -173, -182, -116, 9, -46, 17, -225, -96, -255, -377, -91]
7435i1M5k08K08P5j61rm1J46j17P2J57m32K85r8M09j71J12m9l87M28j18Kp2n8
7459g3L17l12R2pR5j21K71j27n7K56k25J4O4k9nk2j09O5n6K05k44J92k49m9J98
7484H4pmj39K5oK29j16k28M54k63m1L33j49M6K6l76L04j56J33J02l48K92j20k5
7508E0j00m9L74k77l48N31Rk05K26k20L06k34j28l0J46j2j42K48k50j05K99j14
7530b5M3M0K09m81M68j78q6m18K32lN6j25J56K75n07K46j56K74k80J27K36r0k99
7553b86J68J47n0J21l78K33N9l72L05k3j6k17M74j64j7m9r0K86j24Q5P2k80M2
7576g4K04q6l85K67n1L33q1k07K38m13K84j6j25j5L18m43J30J63O2l63K84k2J29
7599A31J95l08j10L00q3l19M27j58J23m42N92l02j81p4L60q6K6j13K23K02q5l05
$$ y = [-91, -46, -254, -46, 29, -132, -141, -182, -36, -153, -81, 76, -356, -71, -169, 240, 69, 181, 132, -255, 173, 55, 57, -15, -73, 244, -68, 24, 17, 112, -9, 262, 135, 78, 334, 109, 123, 187, 158, 153, 131, 22, 87, 31, 236, -8, 184, -65, -114, 84, 77, 73, -66, -41, -47, 182, 66, -162, 292, 29, -12, 321, 172, 218, 244, -132, 172, 16, 149, 251, -97, 195, 75, 50, -50, -99, 275, -2, -350, 181, 190, -15, 211, -9, 297, 63, -65, -95, 51, 39, -103, 145, -105, -210, 89, -25, 18, 58, 267, -214, 254, 76, -10, -428, -196, -199, -143, -268, -112, 163, -344, -98, -254, 20, -260, -133, 103, 13, -286, -118, 29, -21, 100, -278, -45, 14, -358, -53, -76, -92, -309, 165, 1, -16, -65, -155, 131, 7, 92, 164, -116, -74, 130, 44, -341, -74, -125, 208, 127, -80, 158, -255, 29, 13, -112, -127, 191, -252, -122, 41, 103, -260, 24, 2, 131, 326, 18, -92, 208, 125, -194, 233, 75, 198, -244, 348, 46, -135, -209, 151, 65, 91, -22, 201, 403, 318, 13]
7621A3n0K21k64L5K89M2j08j84Q6R8n5j34L18j94j39J37l2k13L22k40R7J05j35
7644A5k38J73M12l23n5o9q2K40l14J00m4J48K5l27L16j3J2o3L60m03J86k93K10
7667b7J8l60N83l87mr7J65k6k05L41j80L66j94k67J19K52j26J2k23p4O9j0K55
7690@j51J21N1O6j0j44n9K0J56k81J59k16K92J21n02K2K55J90mj19k67J12M5q5
7714b28J91k6L26n05K51n3J12J23m3J64k16l39K14J31j03L5K89j43j57J68M7k58
7736b0J16l00L40m44O33k48OQ9j12PQ9k24KR5j05M2j5R1k37o1L41N0k50J42M07
7761D34l69k31P7l5M97o07K50j41K3J98k48L1o1J62l5K1K03M8l40j69N61j07l61
7784a99P0j13J69j90O8m2K18k76K46Q1k84K96r9Rj79K02K93l01N7J19o22K18J94
$$ y = [13, -37, 184, -80, -45, 244, 286, 178, -6, 80, 178, 123, -11, 307, 113, -26, 111, 79, -134, 188, -52, 45, 150, 15, -223, -50, 362, 39, -16, -85, -167, 73, -241, -141, -185, -37, -12, -339, -23, -36, -24, -87, 273, -130, 56, -237, -27, -9, -369, 214, -173, -177, -274, -109, -135, -340, 1, -179, 187, -7, -274, -155, 97, -29, -17, -240, -314, -245, -255, 0, -151, -30, 21, 87, 77, -67, -126, -106, 50, -231, -72, -288, 4, 125, -377, -355, -100, 90, 86, -33, -300, -188, -143, -228, -37, -63, 263, -242, 9, -44, 68, 191, 148, 312, 96, -243, -29, 102, -1, 34, 323, 180, 23, 191, 238, -20, 96, -204, 136, -308, 325, 77, 83, 172, 60, 67, 156, -68, -66, 29, -76, -34, -49, 42, -195, -256, 85, 135, -115, 27, 434, 65, -166, -89, -124, 373, -234, 16, -125, -102, 96, -152, -121, -182, -20, -55, -34, 169, 217, -123, -292, 269, 162, -199, -129, -242, -73, -263, -195, -237, -19, -295, -49, 32, -252, 44, -55, -46, -225, -23, 270, -31, 26, 145, -477, -259, -65]
7807f5j63J37J36j11l8O2j5mr5O8J85%K7k08j1J60o0j12q6n7j19L86p7L2l18M34
7833H8J91m05q9j59K05J64J07lP4j01L70o03M13J5l48J33l1J05r7j65J74K02m4
7856A96j20l2q0Q6k61J27L11j99P0k58j9P1O6K13K19l15j14J87j2K68r7n21L22
7879A08j58J0r9K35N9J8M9k15j98J34M7J14k45k56O97k73m17L01Q5k94K54J16
7901G2o8j08j20K94j61j20K00j58K56J51l23K16k03J34l3p6J63l98M7K74Rj06
7923e8K63k50K3M3P6j37N1q0P5j14L49l05J76p0l0J11k82j88K74J81p6j00Q3j20
7947a05J72j71k17O92m19J32K75l51L68m79P6j16L38j04J6q9J52OJ66k97O4L5
7969A44m8k01J16J58l08PJ99O6J54j21j99k48O70l81J96j12l00M76k03j62K09
$$ y = [-65, -228, -91, 45, -66, -104, -42, -57, -61, -156, -88, 97, 97, 124, -84, -95, 65, 5, -107, -193, -250, -369, 17, -60, -28, -346, 88, 279, -126, -215, -374, -169, -5, 102, 99, 173, 72, 442, -161, 252, 267, -81, 52, 21, 126, 29, -136, 38, 240, 196, 76, 44, -36, 50, -211, -84, 227, 28, 98, -160, -179, -108, -42, 171, 390, 75, -39, 148, 136, 404, 307, -214, 108, -50, -40, -139, 96, 155, 173, 222, 7, -191, -57, -10, 104, -141, -397, 300, 27, -390, -89, -4, -298, -44, 72, 4, -104, -224, 70, -91, -211, -11, -169, 87, 238, -85, 131, -72, 62, 29, -47, 116, -282, -235, 39, 48, -58, 205, -45, -22, 21, 97, -40, 11, -69, 6, -108, 241, -64, 112, 42, 12, 123, -159, -347, -73, 108, 32, -68, 15, -105, 67, -104, -321, 371, -48, 84, 359, 8, 376, -103, -27, -143, 195, 91, 107, 18, 170, 176, 342, 45, 109, 144, 96, -105, 11, 169, -139, -132, 67, 133, 287, 166, -33, -281, 389, 8, 204, 92, -208, 268, 65, -97, 112]
7990A12K77j30Q0k04l91L89R2j46k9J69k45M7Q9J5J37q5j30Q7j19k67L51Q6l05
8013a20R5L19k08J05k44j33M35k97l0m8K56j57l0j13K20l43J12K60j44q5J83j7
8035A6N8k30K48j06j1l02L79r2k39L90k21l2m2K5J91j39Ko9L9K88k50L21l58l8
8059a72j23P1K82k18r5L94rl8l7j69L03k71K81o1k29K89m13K80k47J50J60p0j63
8082a05K85k46j79L73j69N3Q3N0j97J21L5p0j06L83j65k16lK43j6p8j7J49j77
8105C1J64q5k63J08L8J15Nn5m0Q3O5k26K40j71L6j70J03K22j44K05k78k8k8L87
8129C14l04o9Q9p5L32m64K37k94J59L05j79k37j2L8R0J24k71K24K2J15r2R2l82
8152b38L03l4j00j3l67M67K02j18N4J8J32o05N02l26J29l35R0m0J81QJ69j88r1
$$ y = [112, 389, 259, 339, 135, -256, 133, 225, 79, 50, 219, -26, 21, 110, 125, 262, 177, 47, 134, 15, -252, 99, 185, -120, -25, 294, 86, 191, -53, -186, 249, -48, -78, -126, 130, -27, -57, -170, 50, -293, -181, 79, -65, -150, 33, 16, 74, -156, 92, -14, -25, -327, 52, -40, -279, 111, -110, -142, -184, -159, 32, -107, -105, -174, -135, 153, -97, 224, -134, -172, -295, -224, 58, -160, -255, 139, 130, 92, 55, -114, 189, -82, 199, 138, -91, 198, -215, 65, -182, -32, 128, 58, -105, 180, -66, -245, 128, -41, 12, 95, 145, -52, 69, 104, 34, -72, 311, 146, -70, -73, 170, 154, 76, 59, 208, 31, 195, 110, -153, -45, -7, 108, 113, 58, 18, 101, 166, -60, 180, 9, 45, -125, -22, 200, 56, 261, -17, -45, -73, 314, 10, -59, 30, -45, 287, -177, 60, -234, -75, 230, 51, -186, -198, -160, -70, 54, -217, 7, 29, 144, 52, 144, -238, 65, 31, -69, -82, -449, 18, 220, 102, 156, 174, 306, -299, 203, -123, 6, -329, -239, -279, -98, -90, 79, -109, -200]
8175b00L13K13l59J90j27j62j08J84j04J67o1j67K88j77l6%
$$ y = [-200, 113, 326, -33, 157, 30, -132, -240, -56, -160, 7, -54, -221, 67, -110, -146, -146]
8191a46
$$ Imaginary data points
##PAGE= N=2
##DATA TABLE= (X++(I..I)), XYDATA
0@%%%%%%%%%%qJ6j6J6j7K5l2L9m7N1n9P2q4R5j10J27j46J65j86K12k37K63k95
33a56L32l73M15m61N11n67O30o97P70q54R45j044J162j292J438j608J803k035
51a081K315k659L090l654M430n562P371j0724J8953p3512j02753K03763R9270
64A39247j59530j41397O8205O0586n790O3191P4738q8967j14426K3227K1309q4936
76a44543L0142J93586O0831j59797r2613N0428k0711p2765R3686J56241l6346
87E8139j36011n670M0395n2645j5354J03386M1938q3726m0704K0749n0007l2080
99a51590J36210J33376q4466j41390J3688L7712p4946k2901J26636Q3335n4286
110A378m3467N030n4985m8902Q5695R4921n3902p5910M0538K3084p6980q910J09189
$$ y = [0, 0, 0, 0, 0, 0, 0, 0, 0, 0, 0, -8, 8, -8, 8, -9, 16, -16, 23, -24, 27, -32, 40, -44, 51, -59, 68, -78, 87, -99, 113, -124, 139, -156, 176, -197, 218, -243, 268, -299, 331, -366, 404, -450, 495, -549, 613, -679, 759, -849, 954, -1081, 1234, -1425, 1665, -1989, 2441, -3121, 4250, -6474, 12479, -61033, -163786, 39977, 139247, -20283, -161680, -93475, -32889, -38679, 24512, 99250, 10283, -104143, -80916, -59607, -144543, -114401, 79185, 140016, -19781, -112394, -61966, -82677, -155442, -61756, 94485, 58139, -77872, -83542, -43147, -95792, -111146, -7760, 34178, -49548, -90252, -69503, -119510, -151590, -15380, 117996, 33530, -107860, -94172, -56460, -131406, -154307, -27671, 55664, 1378, -42089, -37059, -92044, -140946, -55251, 39670, -14232, -90142, -49604, -26520, -103500, -112410, -3221]
123c221L4093p9096k0308L6286n1900o2430Q5488J14160l1512p0571K4023M339
135b0649q5110j8761R2516L7541m1570K1911M8830o3519q1858N8530Q4698m1792
147i233n5499M6963K0569p7915j9355R1319L7298n0252L028L8197n5865p8123
159a08868M4075Q2975j1104k2506M6294J708q7727k6741P2306K3503m1652K3209
171d528N8444l8333p4555K6726O3022j7572k8233L4045L254o5609j3063O4450
183H048K1315k8097K4966M0104n1591p3193K3726N3045j3988r523N0994J3128
195E8934o2053k3673M2147P439k7725K5048L9408l5342m7936K8158L6141k4683
207A5863q956M5453J685o2588j5657M4802Q790k0617K9759L8007l5353m9345J5432
$$ y = [-3221, 30872, -48224, -68532, -32246, -84146, -146576, -61088, 53072, 21560, -49011, -24988, -20649, -105759, -124520, -32004, 5537, -36033, -14122, 34708, -28811, -110669, -52139, 32559, -9233, -64732, -17769, 2800, -75115, -94470, -3151, 34147, -16105, -13077, 25120, -30745, -108868, -64793, 18182, 7078, -15428, 30866, 32574, -55153, -81894, -9588, 13915, -27737, -4528, 53916, 15583, -58972, -32246, 30776, 13204, -15029, 19016, 22270, -43339, -56402, 8048, 29363, 1266, 26232, 66336, 14745, -58448, -34722, 18323, 4335, -5188, 45806, 58934, -3119, -26792, 15355, 22794, -4931, 20117, 59525, 24183, -23753, 4405, 40546, 15863, 6907, 52360, 54045, -8543, -24200, 20602, 29392, 8775, 38534, 76541, 41188, -8157, 7275]
220G275K0236k4544J287N1563R066m8016q706L4245p368k9102K5223L5275k9053
233C7381l7738K1351K2035k2871o77M1238K913m5561j0156K6513q002k0535L0440
246C6331L6626k3423l3887J2465R809k7166l566L9239J0126k9914l676K2314j1380
259C3898k4330J9936K7125j9755k6456J3814J1316k0761l72L3265O134k9435o967
272A7412J3581j3455j9183K1649K8627j0996j8531Q994J151k4339l803K5978O041
285C3126j8636J355J4498j1740j8244J3755J8086j3086j5041Q791R19j7557K994
298g80K4386L643j7651j298O574j5851j7192J3312J9569m240n848R023l040j9857
312i250m082J4321j21j1305M978J0582r560j0988J0362J0656r184p754M824l759
$$ y = [7275, 27511, 2967, 4254, 55817, 64883, 16867, 8161, 42406, 35038, 5936, 31159, 66434, 37381, -357, 20994, 43029, 20158, 19481, 60719, 63632, 18071, 7915, 34428, 26426, 5891, 36331, 72957, 49534, 15647, 28112, 37921, 10755, 7189, 46428, 56554, 26640, 22964, 45278, 33898, 9568, 29504, 56629, 36874, 10418, 24232, 35548, 14787, 14415, 47680, 53814, 24379, 17412, 30993, 17538, -1645, 20004, 48631, 37635, 19104, 28098, 29249, 4910, 1107, 27085, 33126, 14490, 15845, 30343, 18603, 359, 14114, 32200, 19114, 4073, 12864, 13783, -3774, -780, 23606, 27249, 9598, 8300, 14874, -977, -18169, -4857, 14712, 10472, 4624, 13647, 10607, -9250, -13332, 989, 868, -10437, -5459, 5123, -4437, -15425, -5063, 5593, -3591, -11345, -6521, -10280]
326a0280j5254K559J7308M150o506K744K804j4319j3551N795Q774k464K323J1252
340d665j313j3758l237P663l675q846L907O926n425m802Q635P642m209l049K889
355a5317o603j3726o23J0002M401O43Q416N104q556j0679n96R19l612K189R470
370a8568K723m371r1L993k816n070M19N35m586k129O016P053J787L112L099m839
386a3733j1362n952Q87J975M403Q989P480J94l703k478l802m603j259K128J624
401a9212O80K912M458K525J157q41k972n436m336q60L156N669O639M863R8l866
417e366n496n562k891J538M347N232M948L943Q38j092l535l677l741k431m99J608
433a1836M021O210N526K438o46l155o192n545k723J063M069N787O816L297j342
$$ y = [-10280, -25534, -22975, -5667, -1517, -8023, -5279, -2475, -16794, -30345, -24550, -15776, -18240, -15917, -4665, -5978, -19736, -22973, -15310, -18985, -27831, -23924, -16998, -22423, -27225, -18590, -10948, -15157, -18206, -15317, -21920, -35646, -36269, -26267, -21866, -21223, -12807, -7703, -16259, -26938, -27534, -26615, -30227, -28038, -18568, -15845, -20216, -20307, -16314, -19130, -24200, -23781, -23246, -27832, -29961, -23945, -16892, -15105, -11993, -8894, -13733, -25095, -31047, -30160, -28185, -23782, -14793, -7313, -7119, -10822, -13300, -17102, -21705, -22964, -20836, -19212, -18532, -15620, -11162, -8637, -7480, -8321, -11293, -16729, -21065, -21925, -18769, -13100, -6461, -1598, -1500, -5366, -10862, -16424, -19315, -17777, -13430, -8198, -3250, 693, 1531, 439, -3096, -6773, -10514, -12945, -13444, -11836, -7815, -1605, 3921, 6359, 5713, 2558, -3634, -9179, -11902, -10839, -6770, -983, 5833, 9130, 7788]
448G788l297l153m204k966J596L682L383L327M091J941k574l405k036l226m132
463c185k08M493N215M987N437K105l432o014m565l800l868K180P885N815K715
478A5760J960J999l727n705j930l03j814l3N358M821R51J300K965l135o710l522
494H235L87j186J230Q421P028n16k423o61l973p962k817L818K733J193N394N659
510B4560q08k878Q86k218q268m045L482J900q71N335Q483l13n720j836j468p168
526I053m006N592M125l63K636N468k203p887j157J644m709m766N634O222j227
541A4056o41N646N84q914m907J263k647m852M928Q289m77j175M300n44r900n674
557f65L494o66n841L276R699m3n242J975K598p273o174L125J274m472J828Q916
$$ y = [7788, 4491, 1338, -2866, -5832, -4236, -554, 2829, 6156, 10247, 12188, 9614, 6209, 4173, 947, -3185, -3393, 1100, 6315, 11302, 16739, 18844, 15412, 9398, 4833, 1033, -2835, -655, 7230, 13045, 15760, 17720, 19719, 15992, 10287, 8357, 8054, 6240, 6207, 11565, 16386, 17337, 18637, 21602, 18467, 11757, 8235, 8622, 7436, 8666, 17087, 24115, 23599, 21176, 20515, 16542, 8580, 5763, 9581, 12314, 13507, 18901, 24560, 23752, 20874, 21760, 19542, 11274, 7229, 10711, 12611, 11740, 17075, 25558, 25245, 19525, 17689, 16221, 9053, 5047, 10639, 14764, 14401, 17037, 22505, 20302, 12415, 11258, 12902, 8193, 3427, 9061, 15283, 14056, 13415, 19061, 19645, 10731, 5824, 7087, 4440, -412, 4516, 12805, 12328, 11153, 15453, 14909, 5009, -665, 2829, 2163, -3678, -402, 9297, 9254, 4012, 5987, 8585, 1312, -4862, -1737, -463, -4935, -3107, 5809]
573E809Q3o786J199L557p952q634M482O154l778o53R387K645r157l762M374m207
589g239r309L409Q845k870l452Q683M250r343m830O641j283j2185Q85J1893M46
604e459p041M635Q447p302r419M509L661q480j230J1597K763r405R69R529m900
619g126j2189L165Q401n845n337J0381P697q273l657Q806j037j2903r00J0229
633h588j226o750P153Q906o253o559P543K070j2240k747J2141K060r774K809J1415
648d0l252j0284M397N120q556m394J1013N003r313p7J1760j258j3181J288R070
663b704n515p713R641Q220q266l503J1949J216j4908j959J2215j707j0635N944
677g725J1841n783p632Q769M929j3303n249J4004K623j2820J538J5155j949j2910
$$ y = [5809, 5892, -894, 305, 3862, -4090, -12724, -8242, -2088, -5866, -6519, 2868, 5513, -3644, -7406, -3032, -7239, -16548, -13139, -4294, -7164, -10616, -1933, 2317, -7026, -11856, -5215, -6498, -18683, -17798, -5905, -5459, -12500, -7865, 582, -6720, -16139, -11630, -7969, -16449, -17679, -6082, -3319, -12724, -11755, -2226, -7126, -19315, -16150, -7749, -13594, -18931, -8550, -853, -9126, -12783, -3977, -5014, -17917, -18817, -8588, -9814, -16564, -9411, -505, -6758, -13317, -5774, -3704, -15944, -18691, -6550, -4490, -14264, -11455, -40, -3292, -13576, -9179, -4059, -12615, -17009, -5996, -993, -10306, -10383, 1377, 119, -13062, -11774, -2704, -8219, -15932, -6291, 1929, -6337, -9840, 2109, 3325, -11583, -13542, -1327, -3034, -13669, -7725, 4116, -1667, -9299, -530, 4399, -8904, -14153, -149, 2474, -10346, -8808, 6347, 4398, -8512]
691h512M255R434r241r554J1665Q344j1284l884J5779K854j5803j928J2587l536
705A176j2018O831J2109p033p172J1724O117j4747o116J3316K677j3511O85J4782
719H820q75j0868N603R474r748j0050R967P260j1952k410J5491L023j3170J98
733G63J0485n302j1714P240J0559q709o241J3142O624j2569m925J1259l80j2324
747b092K023J1907l931p333J0237P874j1936q127J1352L360j4020j278J5381R82
761A4399j1228M148J0798p843j1343Q169O659j1342m855J4879M782j2410p1J2624
775A7366m212j5058L774J1264o995r376J2237J0650j1069p633J0789K532j4699
788d30k509J3149p75j0805O570J2511q201j1088Q848O372j3492p848J3383N554
$$ y = [-8512, -4257, 5177, -4064, -13618, -1953, 6391, -4893, -8777, 7002, 9856, -5947, -7875, 4712, 1176, -10842, -4011, 8098, 1065, -6107, 5617, 11734, -3013, -9129, 4187, 6864, -6647, -5962, 8820, 7945, -2923, 2680, 12154, 2406, -7644, 2323, 9583, -2369, -4779, 10712, 13735, 565, 763, 11248, 5946, -5768, 1472, 12031, 3322, -2919, 10223, 16847, 4278, -647, 10612, 10232, -2092, -69, 11838, 7907, 574, 10811, 18685, 6749, -1378, 9974, 13334, -686, -1964, 13417, 14399, 3171, 7319, 18117, 10274, -1069, 7100, 13759, 2417, -2438, 12441, 17223, 4813, 4742, 17366, 13154, -1904, 1870, 13134, 6139, -3237, 9000, 19650, 8581, 948, 11737, 14269, -430, -2939, 10210, 9435, -1370, 5200, 17711, 9510, -1578, 7270, 13642, 150, -7698, 5685, 11239]
802A1239j1421L46J3586j807j3274J921Q124q191r458R890Q860q908l468J1702
816I141J468j4126j868J0651m049j1455O667J1802n545p638Q304N214j2131o337
830i902R128R98r884K977J2548k181r454N006O654j0246r154Q684N280r350p37
845i633J2148J843j0556R02Q338o488j0436N387Q200o711l692J1069M648j0865
859e846k607Q556k663j1754L217J1070k976p278Q018P466q909p162O915K562j0518
874a1909j177J1919J208q042M014R019o135j0179M460O108q091m614J1309N311
888C201q077j081Q975j947j0347P18P643l619o297P328P835n753m158O908J252
903B581j0541k175Q538k05o477M497Q998l404o967L355L873p729m538P357L442
$$ y = [11239, -182, 164, 13750, 11943, -1331, 590, 8714, 523, -8935, 955, 9815, 907, -2561, 9141, 10609, -3517, -5385, 5266, 1217, -10238, -3571, 8231, 2686, -4952, 3352, 8566, -3565, -9902, -774, 224, -9660, -6683, 5865, 3684, -5770, -764, 5890, -4356, -13510, -4826, 454, -8896, -9633, 2515, 4358, -6198, -5296, 3042, -3446, -13882, -8495, -295, -7006, -10698, 371, 5019, -5846, -8453, 103, -2560, -14314, -11097, -27, -3003, -10281, -2263, 5203, -3706, -10868, -3953, -1391, -11909, -13086, -1167, 41, -8001, -3987, 5032, -1103, -11282, -6822, -714, -8805, -13419, -2110, 3201, -4876, -5957, 3018, 1071, -9276, -8558, -915, -4534, -10831, -3503, 4332, -1421, -5579, 1329, 2581, -7960, -10135, -1597, -1802, -8279, -3782, 5216, 1812, -5155, -1800, 2073, -5656, -10194, -2837, 605]
918F05n769J275Q610q62p388Q09M643n503n974N997N473l935j772P194J213p382
934b766j457N111k595n842L656O638k583l345N317K679o874l811N043O31n494
949e692J628P497j43m875K538L864n373n163L830K552m270l01P328J624n376O05
965B73M168l458o265K561M619k575k107N924K974m467k196M132j020n631O14N373
981B919p99k596L401M128l423m220K857Q85m379r79N369J693l017J620L914k143
997E230m824J185K179l366j299M286K800j984j35L164r34m588l99K690j497j595
1013I13L135L293j486j810J683P17m100j399K726L64j728K047L362q68k753P74
1029D870N61l008k008K524J421j336J383K809l84k938l36M26k054j604J932J395
$$ y = [605, -5164, -3889, 4721, 3859, -3529, -2720, 1923, -3580, -9554, -3557, 1916, -2019, -3791, 3403, 4616, -2766, -4223, 888, -1707, -7549, -3893, 2745, 162, -3183, 2134, 4813, -2061, -5872, -829, -198, -5692, -4064, 3433, 3290, -1585, 953, 4817, -556, -5719, -1889, 663, -3607, -3908, 3420, 5044, -332, 273, 4441, 983, -5282, -2721, 1898, -677, -2784, 3140, 6114, 1647, -549, 3583, 2563, -3068, -2454, 2919, 2120, -476, 2925, 7053, 3630, -590, 2267, 3152, -1227, -2206, 3163, 4856, 1839, 3459, 7373, 5230, 406, 1591, 3770, 404, -895, 3391, 6191, 4207, 4072, 7236, 6302, 1714, 1315, 4005, 2508, 913, 4048, 7341, 5855, 4045, 5728, 6445, 2345, 946, 3672, 4036, 2308, 4355, 7717, 6849, 4096, 4870, 5431, 2423, 415, 2939, 4360, 3024, 4407, 7216, 6832, 3894, 3558, 3984, 1930, 326, 2258, 3653]
1045C653k96j20K000K34k081j429N69j226j642J227K313Qo28R66K97k643j819
1062f17J025l32r63O37K405K63j232M29K42j872k087L71K56n38N84K324J175j899
1080A71m12Q7j533k060L39J504k48N6J312O69p64j207j34p17j480MJ119P86J97
1099b311J014R4o85j120o27o63m03J92J420Q83j35M88L73o73j132j051j06j19
1117d561M21Q86J171O98k65k44o11j162p35k04O58O66P94P14O29nj046p15n27
1136c438m13M3O99P55J217J80O11l67q57j349k73J44P5J066R37M97J30J98l85
1155e30j029j053K91j21M79N21J337O25m2k68l04j079j389O6R81M05N77J291L69
1174A127j43j206k78p88r26L41R33Q16k36J078N97o04j054r9o65r71M36J630L40
$$ y = [3653, 3357, 3237, 5237, 5471, 3390, 1961, 2530, 1304, -338, 889, 3202, 3210, 2582, 3548, 3845, 1202, -617, 408, 76, -887, -250, 2155, 2418, 1186, 1615, 1857, -15, -2102, -1731, -1475, -2013, -1429, 895, 2070, 171, -241, -154, -1687, -3747, -3408, -1904, -2152, -2096, -784, -115, -879, -2086, -2220, -2937, -4417, -4413, -3294, -2508, -2311, -1297, -1203, -1888, -3008, -3635, -4298, -4701, -4509, -3089, -2206, -2341, -1853, -1480, -2153, -3285, -4336, -4442, -4561, -4140, -3254, -2083, -1385, -1650, -1894, -2505, -3667, -4402, -4606, -3948, -3282, -2488, -1774, -1145, -1150, -2196, -2911, -3438, -3851, -3808, -3109, -2354, -1137, -957, -346, -713, -1570, -2919, -3192, -3048, -2973, -1907, -970, -473, -343, -145, -530, -1559, -2612, -2321, -2442, -1963, -1442, -105, 520, 478, 210, -94, -1173, -2562, -2496, -1515, -1110, -533, 758, 1127, 984, -222, -500, -1288, -2214, -1873, -940, -124, -360, 718, 1315, 711, -343, -442, -1107, -2078, -1642, -12, 328]
1193C28J51N11Q04j003j577P0n13l63J85J291J013L71n1J19p78j296l83q1m3N53
1213f92Q62J457m66K1M9o46j567n55R17K07L03J294R73k65p22L45j130j147J89
1232e73Q46J74K62J397P94n49q25j22l49j397j30J080P88M71J040P03n47j045
1250B018m61k35q33J8J279J106l80K76Q84n28j087n15O6p30j5Q73J458L97k0K07
1270C778m74j562n63O59m05n0J077J260J8l96J51o22j304m14L11L05j23J026R50
1289C622j95o87K07n70j436p49J096J72n7Q73J072l42j427j82N8j233o36J219
1307H05P19p18N20J205n13j497k46Q3j030q28J001J453o25p8J278k11j935j147
1325a764Q34j96j004R94J283l59m89Q00Kj918q29J087j74j045K58K602j79j188
$$ y = [328, 479, 990, 1794, 791, -786, -716, -1229, -1592, -1407, -116, 897, 1268, 1217, 1336, 558, -738, -1121, -1202, -1245, -692, 170, 1627, 1161, 1182, 1231, 585, -982, -1537, -620, -413, -110, 1184, 2157, 1892, 1170, 1515, 385, -762, -573, 273, 447, 709, 2106, 2900, 2351, 1526, 1404, 1055, -342, -472, 608, 1396, 1867, 2907, 3610, 3063, 2018, 1557, 1322, 489, 507, 1786, 2892, 2512, 2788, 3672, 3144, 2057, 1542, 1608, 878, 863, 1736, 3194, 3591, 3571, 3778, 3304, 1742, 1179, 1838, 1433, 1383, 2460, 3720, 3738, 3342, 3493, 2871, 1567, 1153, 1464, 1769, 1646, 2672, 3622, 3427, 2740, 2947, 2377, 941, 192, 1288, 1460, 1403, 2276, 3348, 3006, 1579, 1397, 1455, 222, -414, 805, 1524, 806, 1326, 2531, 2018, 521, 275, 358, -672, -1500, -499, 954, 329, 251, 1529, 1318, -617, -1764, -930, -1126, -2130, -1136, 147, -212, -701, 99, 101, -1817, -2646, -1559, -1733, -2778, -2520, 82, -97, -1285]
1343a285O2O88j654j643O24J128k43J73J744j57j605k02O39j013j194Q78J274
1360a786m90m8J592L59j477m65O07r18j586Q81J758k7J1J034P51k100p52P03k74
1379b227j055R36J964l33j105Q67J290j614j452P92M50j270N23K164P16j640Q89
1396a05J276j971k132P65J679r45L31K003J039k464k23J136m71k329N67J820j15
1413a39j411K014K169k019j311J410n2k699j19K514N91j598J146J851j406k161
1429a220R05Q27j425j026K183J335j559j23K136n57k636r4J338j051j310J822
1445d55K213j024p94J365r2k630l94J681k53j134J409J847j015j326J293K31j796
1462h74j047J599K71j312J028K280l11k005M24Q48k227j072J879J235r78M79K016
$$ y = [-1285, -1223, -535, -2189, -3832, -3208, -2080, -2323, -2150, -406, -563, -2168, -2370, -1731, -2744, -3938, -3060, -1786, -2276, -2324, -732, -373, -1850, -2315, -1708, -2626, -4212, -3331, -1573, -1600, -1589, -555, 196, -1904, -2656, -1953, -2227, -3282, -2346, -382, -715, -1820, -953, 337, -1277, -2729, -1937, -1487, -2757, -2234, -70, 646, -994, -105, 1171, -800, -2932, -2167, -488, -1433, -1102, 901, 1940, -524, -747, 389, -82, -2411, -1844, -24, -139, -1550, 464, 2633, 614, -697, 713, 661, -2038, -2157, 357, 948, -650, 496, 2347, 941, -1220, -315, 512, -913, -1939, 244, 1579, 20, -103, 2033, 1476, -1160, -1254, 84, -967, -2277, -455, 1758, 734, -60, 1305, 1213, -1417, -1811, -130, -383, -1517, -108, 1739, 724, -602, 691, 922, -874, -1921, -322, -51, -1363, -335, 1945, 1634, -371, 53, 901, -1326, -2398, -519, 716, -262, 217, 2233]
1479B233k87k353O9J493j368j879J589J969j058q42K605N37k597r87J861n79j727
1496a321N35L089k28j519J786M08k028j574J725N65k043L70K749L59j847N11J670
1513C207j396k332J196J405j675l14K601J008j502o57J353p83k460J79K118j99
1529A749r94J807J240j407j392J312l4k442j43K324m7j341J531J523j237j752
1545F97K72O90j442p94K256L60j021M22J431q17k340N80J037j488r32K027J108
1562B046j547l66J925m22k272m66J365n83j235J192K282j041j239J152L20k574
1578a463r86J837Q2j345Q69K114q54j839Q09P91j655j653J804Q26j214O1K202
1595C86J50k235K6R68j347j246R42J647m22n98J578J13j586p04J154l00j622O07
$$ y = [2233, 1946, -407, -338, 1155, -213, -2092, -503, 1466, 408, -434, 2171, 2708, 111, -876, 985, 406, -1321, -786, 2303, 2075, 556, 2342, 2750, 722, -852, 873, 1438, -605, -235, 2514, 2873, 1026, 1537, 3207, 1811, -521, 675, 2080, 405, 91, 2692, 3700, 2198, 1541, 2894, 2111, -349, -170, 1948, 1749, 755, 2562, 3802, 2395, 1003, 2315, 2281, -161, -304, 2020, 1973, 632, 2163, 3686, 2449, 697, 969, 1659, 217, -577, 1679, 2039, 1018, 1440, 2871, 2054, -286, 294, 1331, -157, -1089, 938, 2046, 499, 133, 2058, 1636, -636, -1102, 263, -320, -1555, -363, 1919, 878, -361, 791, 1111, -1463, -2449, -612, -530, -1875, -1006, 1108, 254, -1585, -776, 15, -1640, -3293, -1489, -663, -1877, -1816, 386, 536, -1699, -1673, -705, -2052, -3298, -2356, -709, -1131, -1729, -151, -38, -1624, -2328, -1174, -1474, -3096, -2489]
1613b489K065m25p06R21J005j587j333Q77M67j152j49K139L80j201L13J293j289
1630h71j304N13P66q65k18J757P59j123l56J017o11j403M43J030k03q73J405R32
1648G95r45p17O58J59j435RJ557k26p27J125R54p55j045M20O30j392k16J286O50
1667G85j087M93J305p55j326M06M12q09l76J142R67j131L2O42J77j434j4P09m54
1686c16l22O48R20k70q67P05R9j081o64Q34K18n41K66J240j22j098K69K96q27
1705f13n39P35P36p77%P52K5o90J24K90m43q03P76L31K64j96K81K61r03o00O76
1726c13J49n03P9R61K17p62L43M11q35l87N08J7k20L23N73M12l89l67L33n92m64
1747e06L90N73k50K36Q93Rp85j1M75m95o39K59P02K4rL00K03o57l4L44k51k90
$$ y = [-2489, -424, -849, -1555, -634, 371, -1216, -2549, -1672, -1205, -2357, -2506, -367, 13, -1188, -875, 418, -871, -2175, -1662, -896, -1761, -1979, -222, 537, -586, -942, 75, -536, -1939, -1496, -466, -669, -1542, -137, 795, -150, -867, -209, -50, -1485, -1476, 81, -145, -872, 253, 1207, 452, -593, -173, 457, -935, -1151, 135, 785, -302, 191, 1496, 741, -585, -179, 233, -576, -952, 190, 1157, 26, 58, 700, 877, -557, -571, 138, -316, -638, 10, 930, 660, -207, 498, 597, -484, -1148, -314, -96, -637, -371, 869, 747, -351, -82, 214, -613, -1152, -417, 319, -458, -458, 294, 319, -371, -247, 43, -400, -1203, -427, -96, 168, -28, 253, 514, -389, -989, -313, -164, -667, -588, 373, 590, -172, 171, 582, -253, -640, -132, -115, -335, -12, 561, 973, 584, 217, 550, -42, -506, -116, 457, 207, 443, 1336, 1345, 560, 549, 1024, 529, -110, 149, 851, 875, 866, 1166, 1369, 712, 678, 1022, 771, 481]
1769D81Q2P59K80p4M23l78n05k62q9M68n57K53P67p6R6J10j04n92n76J53K14o
1791H67J01N69L39j67l17k61k01k11j68K77j28K03l2M40J28m86n41r6j32l37M70
1812C17L4J67K20K38k82k87m04n63P6j25L26N63N7J97j20k77l96n63j37L9kJ73
1834g49L85L45kk35k66l53n65o7n8M93Q9M03M1J25n1q00l28pl47K80J72M81R1
1857i23N76J54q64k14m39J5l26K98N76J01N23O2n6m07n53K34k35K35J56L19O26
1878a42j91L62n28l83l38K3R1J26R3Q74K08k26L9N8j58r40J59K53J22J78L86M74
1900E40k82k60J42j34n57l04L94M13L52M24K21K5m68m72k95q1L6M23K76N44j38
1921G99J25L8j52p65l30q1R5K53M14L83J73R9o17j92m56m73J84K34M33O64P0m0
$$ y = [481, 563, 1322, 1602, 1528, 1951, 1573, 1068, 806, 717, 1185, 628, 881, 1648, 1572, 1668, 1778, 1674, 1082, 506, 659, 873, 867, 968, 1537, 1876, 1709, 1392, 1131, 930, 719, 551, 828, 700, 903, 871, 1311, 1439, 953, 412, 316, 184, -153, 317, 351, 518, 738, 976, 694, 407, 3, -560, -484, -609, -283, 280, 337, 534, 414, 137, -259, -822, -959, -920, -922, -749, -364, -19, -21, -256, -522, -875, -1440, -1507, -1565, -1072, -983, -580, -539, -414, -465, -1265, -1593, -1600, -1947, -1667, -1495, -1014, -923, -347, -193, -1057, -1271, -1710, -1695, -2021, -1723, -1147, -1046, -523, -461, -517, -924, -1477, -1243, -1478, -1243, -1087, -768, -142, -333, 29, -499, -882, -1220, -1197, -1106, -980, -887, -13, 195, -31, 8, 66, -92, -1032, -873, -620, -498, -320, 66, 540, 258, -2, 140, 6, -551, -855, -461, -48, 304, 728, 949, 974, 506, 34, -261, -342, -306, 117, 393, 937, 799, 924, 962, 810, 45, -285, -366, -271, -18, 396, 779, 952, 1051, 434, 242, -214, -687, -503, -269, 164, 828, 898, 858]
1943H58j36l23q84o8J04j97L01N26M50j1m53L22j22r46j95M69l52M25K03P73j21
1964F23l28l69j69m50l02J6R52J29nM92J84p86j01J58o50l96K84N91J99N5J89
1985C16N67n40m39l12J97m33M1N28N90j0Q7K77l89m24n70K47L27J5N01L12N6j05
2007H39J4j82o08J62j42Q4L53K62O89k7k54l72j60j79j54J25J63L99J28M66k62
2028A344J8j32p35k52M81l4O3K05M38K22o05R9k17n4o89K41L94j65L52K68J71
2049A413o19k32J59j49n34j22M29P08rj55K55j87o72l50J94k04l13N38M19j96
2069C73L7L8l22l67k53L66J13o15J66N17oj44j22k1l50j63q9r3J78k22N33J09
2091c37k12l12Q1j31l54K13J83P6n4j98J48N1k43Q4k58o5M62j88q2M14J3J08n86
$$ y = [858, 722, 399, -485, -553, -449, -646, -345, 181, 631, 620, 167, 489, 367, -579, -774, -305, -657, -232, -29, 744, 623, 295, -74, -243, -693, -995, -979, -27, 102, 97, 589, 773, -13, -114, 44, -606, -1002, -718, -127, 72, 127, 316, 883, 343, -96, -408, -211, -644, -603, -75, 515, 505, 592, 869, 480, 56, -514, -267, 60, 75, 576, 888, 944, 839, 853, 671, 63, 225, 83, 167, 520, 782, 1471, 1444, 1190, 818, 658, 479, 325, 450, 613, 1012, 1140, 1606, 1344, 1362, 1230, 495, 243, 724, 690, 753, 958, 1396, 1618, 1013, 1112, 895, 841, 152, 393, 787, 622, 974, 1242, 1413, 794, 562, 721, 572, 38, -84, 345, 1053, 1044, 889, 1144, 957, 285, -65, 129, -75, -388, 150, 569, 373, 410, 448, 126, -241, -494, -128, -15, -630, -464, 53, 47, -97, -219, -240, -590, -753, -842, -935, -757, -979, -446, -337, -549, -861, -780, -911, -1265, -1052, -869, -793, -847, -1045, -897, -846, -1089, -1005, -1263, -1328, -866, -1054, -1136, -722, -709, -601, -1187]
2114a187K75q5j55j35L72M04l36R0J07J92r13J97M37j47l15J33Q88l49l50M52
2134d25M81o71p81J059L20p96K17N75o5n67o9O35m01l96M47O82l62j27J44M72
2154C72k79o55O86m9j26k06O47m6l40K6L52j64m25m9O69l94j12L16N11o18K8J54
2176B98l2k54n7O09k46O3m8k4J8k11L23ln31J80J21L6j16K57K27o62l43N20k13
2199h8k69k26Q52l07k62R56j61l56n27M45N8o64k03O92L17l30K70K47l65q03J88
2220e36O62o73r3P03N10m80l51M56j01j059K45Q31l09l79O79O43k96m80p9M79
2240C72p08l12N51J35M3N65j13m0k50l51M78o80k28P82J22k06J58N57P1n20k75
2261A51J54j03l01O10R1K44L8L51k86m71P7l25L11m87M72K71M90l51K85k28k88
$$ y = [-1187, -912, -997, -1152, -1287, -915, -511, -847, -757, -650, -458, -1371, -1174, -737, -884, -1199, -1066, -178, -527, -877, -425, 56, -615, -1396, -337, -17, -813, -596, -21, -86, -653, -722, -87, -488, -884, -437, 245, -117, -244, -100, 372, 93, -562, 124, 75, -51, -257, 390, 344, 4, 30, 382, 218, -207, -256, 413, 19, -93, 223, 734, 116, 144, 298, 266, 12, -45, 564, 318, 381, 333, 309, 327, 116, 439, 436, -95, 85, 206, 242, 126, 383, 610, -52, -395, 125, -88, -357, -583, 269, -38, -300, 656, 495, 139, -388, 57, 115, -549, -752, -60, 257, -73, 197, 444, 79, -724, -536, 126, -547, -640, 63, 573, 93, -258, 198, 97, -962, -717, 114, -195, -574, 105, 748, 452, -28, -107, 372, -336, -648, -97, 38, 81, 646, 533, 493, 243, -108, 370, -310, -538, 244, 366, 160, 318, 875, 946, 426, 151, 305, 202, -99, 511, 602, 846, 884, 1235, 949, 478, 555, 230, 541, 54, 526, 797, 1287, 936, 1221, 993, 705]
2282G05k77J02K30k29M02K78l01m7O48k67m92m93K71L52o62J70P31L04m81l5J45
2303A054l80o24lP48q2j17M01Q7l70m05M64m21n53R0M69Q9l49O88K2j52r81J36
2325a89Rn36j10O41J91j77K00J34k12n21q9K02l28l01O54J43k5K02j68k4m10j49
2347h63Q2r6M9K35J02K98j97K91p07m4k44J21N9n98N48Q47j64k83k47J38j90k99
2369a162Q1L66k95K24O22j13k13j52J18l95l97N68K42L1J96K63j81j07j98J8l40
2390h24M7r1M62K77j97M36J35n09m25L38L2j27K22L25K31k75j55L89k83J6j52
2411a28J19l66j7R06j48N4k65R2m08M5j25K06J78j79M50Q0j39k0k40M9o53M32
2433g7L16j63k83L75N92n98j40j19J8k13Q7n0K63K78r7R6k11l11r9j73J03j74
$$ y = [705, 428, 530, 760, 531, 933, 1211, 910, 863, 1511, 1244, 752, 259, 530, 882, 220, 390, 1121, 1425, 944, 909, 1054, 674, 50, 47, 795, 713, 596, 997, 1084, 714, 309, 773, 352, -201, -111, 358, 447, 98, 786, 808, 656, -325, -189, -180, -716, -826, -185, 6, -171, 29, 163, -49, -570, -659, -457, -785, -1086, -432, -289, -314, -112, -280, -304, -714, -863, -781, -877, -828, -593, -491, -193, -390, -99, -806, -850, -1094, -973, -914, -1512, -964, -117, -281, -564, -811, -673, -863, -1162, -1081, -715, -1010, -786, -164, -277, -490, -642, -524, -919, -1316, -748, -506, -475, -279, -16, -197, -304, -502, -484, -824, -777, -868, -406, -129, -326, 110, 245, -264, -689, -351, -319, -446, -224, 101, 332, 57, -98, 291, 8, 24, -128, -9, -375, -392, 514, 366, 420, 155, 247, -161, -116, -241, -35, 143, -36, 414, 494, 355, 335, 95, 144, -509, -77, 239, 76, -207, 168, 760, 162, 22, -97, -79, -292, -205, -255, 8, 286, 189, 285, 74, -237, -336, -509, -406, -580]
2455e80M64j48J10J97k66K31l08k47L00l46J71J00R9K06j08k84L90r8j59Q1j89
2476c84J30r6J52J74k56K50l8m77K31j06J21J87L8J42j53J36j23K26m27KM4qJ55
2499h0J4K6K22j9k34M89k78l21M3K27J42R2J12k65N5J77r0l4k8J98k2L00qL3J12
2524H63m30L58l20O3L98k44J90J37j3r3Q0l66J18k11o1M21lQ2M5l31L69m71N2
2547F33k61M29l42M70K03k18Jk62K87l92L23k74J21m3l4M03k31l46K83n45j84
2568B1L35k21k8K51j13R7n5o2j61o9j59rJ74K82k07j54J26o9M22n39j14j65J15
2591c02J71R3k95J11K20k14k61N69m17m01K38K24N6J2K8l37J90l86j10K27j88
2612g72K23J54J4l0j44J36j33o4l01J57L91k60kL19J54m33Q4J66n2m22J49L64
$$ y = [-580, -116, -264, -154, 43, -223, 8, -300, -547, -247, -593, -422, -322, -223, -17, -125, -409, -19, -117, -276, -195, -384, -254, -350, -198, -24, -280, -30, -68, -545, -314, -420, -299, -112, -74, 68, -85, 51, -72, 154, -273, -271, -227, -235, -80, -66, -40, 182, 163, -71, 418, 140, -181, -138, 89, 231, 323, 435, 170, 225, 402, 312, 278, 250, 448, 426, 726, 718, 751, 863, 433, 791, 471, 534, 932, 688, 878, 1015, 1002, 909, 989, 623, 741, 530, 469, 890, 887, 969, 1014, 683, 1052, 581, 633, 372, 801, 459, 929, 1132, 914, 915, 653, 940, 548, 871, 597, 718, 675, 641, 1044, 813, 467, 750, 205, 21, 356, 135, 107, 358, 245, 342, 287, 225, 64, -5, -164, -173, 1, 283, 76, -78, 48, -21, 401, -138, -252, -417, -302, -131, -38, -333, -222, -2, -216, -477, 92, -325, -726, -488, -264, -208, -196, -168, -505, -315, -701, -811, -584, -772, -549, -395, -381, -411, -555, -419, -552, -616, -917, -760, -369, -629, -631, -312, -158, -591, -507, -341, -393, -815, -666, -302]
2634c02P8n5R1J75k27l74L06k90L74j40K43m6J34l0J75Rl18p6o3L26OJ43k34L89
2658B94j9nk14m34L2L86k24K23J96j77K97L04n69r4K8k51L57J9k42K14K86m13
2680fK86k12k04r3p3L13k87L83J17m2l85nJ38K61n76J85l0J19l22L11J28N2k16
2703a58k96K09m08N64l27N75l35j87J96j75m2l02K32j53M9J23L90j12l42J32J25
2724b42l23l13L76N4Op7L64J18p23N73k24l6k50j8P81n54J37J62L7M8k80K75l28
2747d37R8k6o7K7K77J19K8K35l95j31o9J92k08M94N4j73N96j71k25k55K31j33
2769F1p8J86L02j04j39N60m4k10l03k06L81k70J23O14k45k15J10L00j13o28L50
2790D32M08l66K99M5K04j6k23J41j35j18j25K85M2l83L1N19q6j76n24N52l73Q
$$ y = [-302, -224, -279, -188, -13, -240, -614, -308, -598, -224, -364, -121, -167, -33, -63, 112, 121, -197, -273, -336, -10, -4, 139, -95, 294, 275, 270, 56, -378, -346, 40, -184, 39, 235, 58, 355, 659, 90, -4, 24, -227, 130, 149, -93, 121, 407, -6, 280, 68, -136, -229, -302, 11, -276, 107, 224, 182, -203, -208, -70, 191, -385, -200, -230, -111, -433, -122, 6, 58, -158, -454, -245, -653, -89, -416, 159, -176, -363, -167, -342, -384, -686, -454, -607, -558, -435, -45, -157, -499, -367, -242, -565, -878, -502, -448, -442, -519, -155, -37, -760, -187, -411, -447, -697, -715, 66, -488, -351, -189, -152, -104, -384, -109, -437, -339, -365, -432, -405, -128, -9, 19, 254, -141, -272, -341, -149, -357, 137, 191, 18, 614, 443, 218, -37, 194, 61, -17, 169, 471, 367, 228, 788, 744, 534, 231, 25, 406, 136, 259, 873, 628, 413, 523, 823, 710, 82, 432, 840, 474, 773, 818, 1022, 1006, 783, 924, 789, 671, 546, 831, 873, 490, 521, 1040, 954, 778, 254, 806, 433, 441]
2812D41M4J12j4k67L35J51j94k98J43j57l43J50L28j90P9J4L61o90K74l02Oj75
$$ y = [441, 485, 597, 583, 316, 651, 802, 608, 310, 453, 296, -47, 103, 431, 241, 320, 334, 695, 5, 279, -23, -17, -192]
$$ [...]
8191G2
##END NTUPLES=NMR FID
##END=
