##TITLE=1H_LR-688A-C2KCF
 DMSO-d6, 8 sc, 
 1.6.2020
##JCAMPDX= 6.0         $$ Bruker NMR JCAMP-DX V2.0
##DATA TYPE= NMR FID
##DATA CLASS= NTUPLES
##ORIGIN= UXNMR, Bruker Analytische Messtechnik GmbH
##OWNER= root
$$ XWIN-NMR		Version 3.5
$$ Mon Jun  1 12:13:58 2020 Russian Standard Time (UT+4h)  she@DPX200
##.OBSERVE FREQUENCY= 200.1315
##.OBSERVE NUCLEUS= ^1H
##.DELAY= (6, 6)
##.ACQUISITION MODE= SIMULTANEOUS
##.ACQUISITION SCHEME= undefined
##.AVERAGES= 8
##.DIGITISER RES= 18
##SPECTROMETER/DATA SYSTEM= spect
##.PULSE SEQUENCE= zg30
##.SOLVENT NAME= DMSO
##.SHIFT REFERENCE= (INTERNAL, DMSO, 0, 15.7039)
##AUDIT TRAIL= $$ (NUMBER, WHEN, WHO, WHERE, WHAT)
$$ ##TITLE= Audit trail, XWIN-NMR		Version 3.5
$$ ##JCAMPDX= 5.01
$$ ##ORIGIN= Bruker BioSpin GmbH
$$ ##OWNER= she
$$ F:/spectra/data/she/nmr/H-F/1/audita.txt
$$ ##AUDIT TRAIL=  $$ (NUMBER, WHEN, WHO, WHERE, WHAT)
(   1,<2020-06-01 12:12:43.62 +0400>,<she>,<DPX200>,
      <created by zg, POWCHK disabled, PULCHK disabled
       configuration hash MD5:
       00 E9 B6 7A A2 85 ED C7 34 08 36 98 17 FE 4E 26
       data hash MD5: 16K
       75 1B FF 05 5D 46 20 9A C5 4B 5F C9 6F CF 63 8F>)
$$ ##END=
$$ 
$$ hash MD5
$$ 1A 15 76 0B 7E 40 7C 64 C9 ED 2A 66 FB 8E D8 65
##$RELAX= 
##$RELAX= 
##$RELAX= 
##$RELAX= 
##$RELAX= 
##$RELAX= 
$$ Bruker specific parameters
$$ --------------------------
##$DU= <F:/spectra>
##$EXPNO= 1
##$NAME= <H-F>
##$PROCNO= 1
##$TYPE= <nmr>
##$USER= <she>
##$AMP= (0..31)
100 100 100 100 100 100 100 100 100 100 100 100 100 100 100 100 100 100 
100 100 100 100 100 100 100 100 100 100 100 100 100 100 
##$AQSEQ= 0
##$AQ_mod= 1
##$AUNM= <au_zg>
##$AUTOPOS= <>
##$BF1= 200.13
##$BF2= 200.13
##$BF3= 200.13
##$BF4= 200.13
##$BF5= 200.13
##$BF6= 200.13
##$BF7= 200.13
##$BF8= 200.13
##$BYTORDA= 1
##$CFDGTYP= 0
##$CFRGTYP= 5
##$CHEMSTR= <none>
##$CNST= (0..31)
1 1 145 1 1 1 1 1 1 1 1 1 1 1 1 1 1 1 1 1 1 1 1 1 1 1 1 1 1 1 1 1 
##$CPDPRG= <>
##$CPDPRG1= <>
##$CPDPRG2= <>
##$CPDPRG3= <>
##$CPDPRG4= <mlev>
##$CPDPRG5= <mlev>
##$CPDPRG6= <mlev>
##$CPDPRG7= <mlev>
##$CPDPRG8= <mlev>
##$CPDPRGB= <>
##$CPDPRGT= <>
##$D= (0..31)
0 1.2 0 0 0 0 0 0 0 0.06 0 0.03 0 0 0 0 0.0002 0 0 0 0 0 0 0 0 0 0 0 0 
0 0 0 
##$DATE= 1590999163
##$DBL= (0..7)
120 120 120 120 120 120 120 120 
##$DBP= (0..7)
150 150 150 150 150 150 150 150 
##$DBP07= 0
##$DBPNAM0= <>
##$DBPNAM1= <>
##$DBPNAM2= <>
##$DBPNAM3= <>
##$DBPNAM4= <>
##$DBPNAM5= <>
##$DBPNAM6= <>
##$DBPNAM7= <>
##$DBPOAL= (0..7)
0.5 0.5 0.5 0.5 0.5 0.5 0.5 0.5 
##$DBPOFFS= (0..7)
0 0 0 0 0 0 0 0 
##$DE= 6
##$DECBNUC= <off>
##$DECIM= 24
##$DECNUC= <off>
##$DECSTAT= 4
##$DIGMOD= 1
##$DIGTYP= 9
##$DL= (0..7)
0 120 120 120 120 120 120 120 
##$DP= (0..7)
150 150 150 150 150 150 150 150 
##$DP07= 0
##$DPNAME0= <>
##$DPNAME1= <>
##$DPNAME2= <>
##$DPNAME3= <>
##$DPNAME4= <>
##$DPNAME5= <>
##$DPNAME6= <>
##$DPNAME7= <>
##$DPOAL= (0..7)
0.5 0.5 0.5 0.5 0.5 0.5 0.5 0.5 
##$DPOFFS= (0..7)
0 0 0 0 0 0 0 0 
##$DQDMODE= 0
##$DR= 18
##$DS= 0
##$DSLIST= <SSSSSSSSSSSSSSS>
$$ [...]
##$SUBNAM2= <"">
##$SUBNAM3= <"">
##$SUBNAM4= <"">
##$SUBNAM5= <"">
##$SUBNAM6= <"">
##$SUBNAM7= <"">
##$SUBNAM8= <"">
##$SUBNAM9= <"">
##$SW= 24.9337058887773
##$SWIBOX= (0..15)
0 0 2 0 0 0 0 0 0 0 0 0 0 0 0 0 
##$SW_h= 4990.01996007984
##$TD= 16384
##$TD0= 1
##$TE= 0
##$TE2= 300
##$TE3= 300
##$TEG= 300
##$TL= (0..7)
0 120 120 120 120 120 120 120 
##$TP= (0..7)
150 150 150 150 150 150 150 150 
##$TP07= 0
##$TPNAME0= <>
##$TPNAME1= <>
##$TPNAME2= <>
##$TPNAME3= <>
##$TPNAME4= <>
##$TPNAME5= <>
##$TPNAME6= <>
##$TPNAME7= <>
##$TPOAL= (0..7)
0.5 0.5 0.5 0.5 0.5 0.5 0.5 0.5 
##$TPOFFS= (0..7)
0 0 0 0 0 0 0 0 
##$TUNHIN= 0
##$TUNHOUT= 0
##$TUNXOUT= 0
##$USERA1= <user>
##$USERA2= <user>
##$USERA3= <user>
##$USERA4= <user>
##$USERA5= <user>
##$V9= 5
##$VALIST= <valist>
##$VCLIST= <CCCCCCCCCCCCCCC>
##$VD= 0
##$VDLIST= <DDDDDDDDDDDDDDD>
##$VPLIST= <PPPPPPPPPPPPPPP>
##$VTLIST= <TTTTTTTTTTTTTTT>
##$WBST= 1024
##$WBSW= 4
##$XGAIN= (0..3)
0 0 0 0 
##$XL= 0
##$YL= 0
##$YMAX_a= 224578
##$YMIN_a= -91693
##$ZGOPTNS= <>
##$ZL1= 120
##$ZL2= 120
##$ZL3= 120
##$ZL4= 120
##$ABSF1= 10
##$ABSF2= 0
##$ABSG= 5
##$ABSL= 3
##$ALPHA= 0
##$AQORDER= 0
##$ASSFAC= 0
##$ASSFACI= 0
##$ASSFACX= 0
##$ASSWID= 0
##$AUNMP= <proc_1d>
##$AZFE= 0.1
##$AZFW= 0.1
##$BCFW= 1
##$BC_mod= 2
##$BYTORDP= 1
##$COROFFS= 0
##$CY= 11.3945322036743
##$DATMOD= 1
##$DC= 2
##$DFILT= <>
##$DTYPP= 0
##$F1P= 16.9975609425685
##$F2P= -3.02152046262296
##$FCOR= 0.5
##$FTSIZE= 0
##$FT_mod= 4
##$GAMMA= 1
##$GB= 0.15
##$INTBC= 1
##$INTSCL= 1
##$ISEN= 128
##$LB= 0.24
##$LEV0= 0
##$LPBIN= 0
##$MAXI= 10000
##$MC2= 0
##$MEAN= 0
##$ME_mod= 0
##$MI= 1.114404
##$NCOEF= 0
##$NC_proc= 0
##$NLEV= 6
##$NOISF1= 3.799351
##$NOISF2= 2.8
##$NSP= 1
##$NTH_PI= 0
##$NZP= 0
##$OFFSET= 15.70392
##$PC= 1
##$PHC0= -9790.603
##$PHC1= 12.00082
##$PH_mod= 1
##$PKNL= yes
##$PPARMOD= 0
##$PSCAL= 0
##$PSIGN= 0
##$REVERSE= no
##$SF= 200.130013532006
##$SI= 16384
##$SIGF1= 3
##$SIGF2= 2
##$SINO= 400
##$SIOLD= 16384
##$SREGLST= <1H.CDCl3>
##$SSB= 0
##$STSI= 0
##$STSR= 0
##$SW_p= 3612.71676300578
##$SYMM= 0
##$S_DEV= 0
##$TDeff= 0
##$TDoff= 0
##$TI= <>
##$TILT= no
##$TM1= 0
##$TM2= 0
##$TOPLEV= 0
##$USERP1= <user>
##$USERP2= <user>
##$USERP3= <user>
##$USERP4= <user>
##$USERP5= <user>
##$WDW= 1
##$XDIM= 8192
##$YMAX_p= 0
##$YMIN_p= 0
$$ End of Bruker specific parameters
$$ ---------------------------------
##NTUPLES= NMR FID
##VAR_NAME=  TIME,          FID/REAL,        FID/IMAG
##SYMBOL=    X,             R,               I
##VAR_TYPE=  INDEPENDENT,   DEPENDENT,       DEPENDENT
##VAR_FORM=  AFFN,          ASDF,            ASDF
##VAR_DIM=   8192,          8192,            8192
##UNITS=     SECONDS,       ARBITRARY UNITS, ARBITRARY UNITS
##FACTOR=    0.0002004,     1,               1
##FIRST=     0,             0,               0
##LAST=      1.6414764,     0,               0
##MIN=       0,             -91693,          0
##MAX=       1.6414764,     224578,          0
$$ Real data points
##PAGE= N=1
##DATA TABLE= (X++(R..R)), XYDATA
$$ [...]
2017A34j78Q00r68k7M95M30m83r77M81J06n8N9K30N40r31q29P32K53o0p53J122
$$ 134 -44 756 -212 -239 256 686 203 -774 -293 -187 -245 -186 44 584 -347 -1176 -444 -191 -251 -1004 118
2038A18M61r98q56J001P42q16q30J048K4p43m71J062O40r92k64N85k21q83m06
$$ 118 579 -419 -1275 -274 468 -348 -1178 -130 -106 -849 -1320 -258 382 -610 -874 -289 -510 -1393 -1799
2057a799J975L26j499k63J214l31j031J73J364k88j150J98J002l12j180J011Q89
$$ -1799 176 502 -997 -1260 -46 -377 -1408 -1235 129 -159 -1309 -1111 -109 -421 -1601 -590 299
2074B99n87j865N64J416m7j275P77J269j041j330J059R99r68p60J205O25j586
$$ 299 -288 -2153 -1589 -173 -220 -1495 -718 551 -490 -1820 -761 238 -730 -1490 -285 340 -1246
2091a246m40J561Q2o52l77R87J79j213j87J177M44o31j40O73k21j138P0J355O3
$$ -1246 -1686 -125 -43 -695 -1072 -85 94 -1119 -1306 -129 315 -316 -456 217 -4 -1142 -1072 283 346
2110C46o44k19P47o4q08M69N39K2o04j54L28N08n67K44P55k06r76j10L58O15j87
$$ 346 -298 -517 230 166 -642 -173 366 388 -216 -370 -42 466 -101 143 898 692 -284 -394 -36 579 392
2131C92r9O77K8p96n74P24L44k22j39L84K37p92N4Q76L05j165l35J185J18j358
$$ 392 293 970 998 202 -372 352 696 474 335 719 956 164 218 1094 1399 234 -101 1084 1202 -156
2151a56K03J708j65j046p92J388l90q20K33J526j62j566K01J202m27j209R63J204
$$ -156 47 1755 1590 544 -248 1140 750 -70 163 1689 1527 -39 162 1364 937 -272 691 1895
2169A895q53j757O37J407m01q88N82J249j681r58J351P64q54q91J607J26j495
$$ 1895 1042 -715 -78 1329 928 40 622 1871 190 -768 583 1347 493 -398 1209 1335 -160
2186a60n70J343P93j313r5O32K87j337l6J238L24q14n62J012l75j196O32J171
$$ -160 -730 613 1406 93 -2 630 917 -420 -456 782 1106 292 -270 742 367 -829 -197 974
2204I74n22q18m6Q02l31m90L01N83m47m04K03K90k94m10N16N35q19p69L39P83
$$ 974 452 -366 -412 390 59 -431 -130 453 6 -398 -195 95 -199 -609 -93 442 -377 -1146 -807 -24
2224b4q2m59N19K51n91n67J4J96M58j49K64j91j82l90K15N09L21j122QP71m63
$$ -24 -106 -565 -46 205 -386 -953 -939 -743 -285 -434 -170 -361 -543 -933 -718 -209 112 -1010 -1002 -231 -694
2245f94l51k54J168J81j009m16O82M80n91k1R42n76q44M63Q74m43q61N14R52q64
$$ -694 -1045 -1299 -131 50 -959 -1375 -693 -213 -804 -825 117 -459 -1303 -840 34 -409 -1270 -756 196 -668
2265f68p94N58J183l07r19Q64J37o98r04J157O04p22k33J178k22j406n3J208Q62
$$ -668 -1462 -904 279 -28 -947 -83 54 -644 -1548 -391 213 -509 -742 436 214 -1192 -1245 -37 825
2284H25j257o36J200L26j215J24J117N7j084q3O40J72r26O25J182o52j128L97
$$ 825 -432 -1068 132 458 -757 -633 484 541 -543 -626 14 186 -740 -115 1067 415 -713 -316
2302c16Q36n47n82L66J209m59p58M80L12m17k80L88L34k86l94Q35N70p01k10K83
$$ -316 520 -27 -609 -243 966 507 -251 229 541 124 -156 232 566 280 -114 721 1291 590 380 663
2322F63l05M1m40K99m4K46L15j13L5l61L53m0K8l55J76j6N19j67n08K16M13k97
$$ 663 358 399 -41 258 214 460 775 662 697 336 689 649 677 322 498 482 1001 834 326 542 955 658
2344F58m14j45N97j7L05n13O2l9k00m00M48J02m44L54N18l67l14J85M06l30l63
$$ 658 244 99 696 679 984 471 533 494 294 -106 342 444 0 354 872 505 191 376 782 452 89
2365H9JN03m18k83M07O67o47p11P11M0r00K1Q27N80q50l27O02K38m27o93N52j03
$$ 89 90 593 175 -108 299 966 319 -392 319 359 -541 -520 307 887 37 -290 312 550 123 -570 -18 -121
2387a21p5k4N75k50k31L90j88k83n53J71O97k32p50O01M88l09k72L91l72l28J28
$$ -121 -196 -220 355 105 -126 264 76 -207 -760 -589 108 -124 -874 -273 215 -94 -366 25 -347 -675 -547
2408e47K26M36n23k97O79L99r87k77M75M9k10k5o3K02R3j27O9l60J6L83N3k93
$$ -547 -321 115 -408 -705 -26 373 -614 -891 -416 -367 -577 -602 -665 -463 -370 -497 -428 -788 -772 -389 -336 -629
2430f29j19M63m06J03J60J35m35J47J70N5j60l57M61M65m62j43j69J86J5K78m6
$$ -629 -748 -285 -691 -588 -428 -293 -728 -581 -411 -356 -516 -873 -412 53 -409 -552 -721 -535 -520 -242 -288
2451b88j50K50K62k08k45j08M97K6n14J5L8K56K99k08r7j77N22k97J88j46m95
$$ -288 -438 -188 74 -134 -379 -487 10 36 -478 -463 -425 -169 130 -78 -175 -352 170 -127 61 -85 -580
2472e80L73M57J29q81N22K79j63l09o4J79M05l4J81j20n25L22K32m66J60j35Q72
$$ -580 -207 250 379 -502 20 299 136 -173 -237 -58 347 313 494 374 -151 171 403 -63 97 -38 834
2493H34k44m45K60j58K79k73J34j0m01J36M23J52k07m17O18Q4n69o1J06K96k34
$$ 834 590 145 405 247 526 253 387 377 -24 112 535 687 480 63 681 765 196 135 241 537 303
2514C03J82j7l05J48L65J46r07J0M96K33j91L0k85O50J26n25l29j21K3M82Ln08
$$ 303 485 468 163 311 676 822 -85 -75 421 654 463 493 208 858 984 459 130 9 32 514 517 9
2536IM12M5J04o9n02K0O93k66m0j98k70K94M14m93j23k27K23K37j4K9k58K86L13
$$ 9 421 466 570 501 -1 19 712 446 406 208 -62 232 646 153 30 -197 26 263 249 278 20 306 619
2559F19l97p1q37Q09L19l61K3m35L44J43k32l68J13K33K12k50j30k20L62k7M78
$$ 619 222 151 -686 123 442 81 104 -331 13 156 -76 -444 -331 -98 114 -136 -266 -486 -124 -151 327
2580C27m76m61K07L76o8j72k94K43L55j79k89p4k78K49L61j62l44J16N61Qn82
$$ 327 -149 -610 -403 -27 -95 -267 -561 -318 37 -142 -431 -505 -783 -534 -173 -335 -679 -563 -2 6 -576
2601e76j8J95L97m10j54J51K28j04j21M71o04Q0J57M69l76l22%L88o4k07q9J31
$$ -576 -594 -399 -2 -412 -566 -415 -187 -291 -412 59 -545 -465 -308 161 -215 -537 -537 -149 -213 -420 -509 -378
2623c78N59n04j55K21J53k66J35L66m94l22O44J63n19k18L25N85M3o73J76J64
$$ -378 181 -323 -478 -257 -104 -370 -235 131 -363 -685 -41 122 -397 -615 -290 295 338 -335 -159 5
2643EJ46l65O7Q8l77M36J77J81o17N8R9L51k45n53M70P46k38m96j46L74p6M5J85
$$ 5 151 -214 -147 -59 -436 0 177 358 -259 -201 -102 249 4 -549 -79 667 429 -67 -213 161 85 130 315
2666C15m22K22j08L89j98l32K10J96K15n75J95m19R37J58n19N3J9k54j7N01O8
$$ 315 -107 115 7 396 198 -134 76 272 487 -88 107 -312 625 783 264 317 336 82 65 566 634
2687F34n36L63J25k98k90P0N09J37l86n14M65M55j71k86M3J51l72l9J50J0l96
$$ 634 98 461 586 288 -2 68 577 714 328 -186 279 734 563 277 320 471 99 60 210 220 -176
2708a76J18M85J30m51j40K46R2m5n0J76L01l44k59M75m13K10k69K37l45l77M46
$$ -176 -58 427 557 106 -34 212 304 259 209 385 686 342 83 558 145 355 86 323 -22 -399 47
2729D7M12j03k78l6M72j91m37l9J82L81n78J47J04l95L17K27K92o56l10Q7P11
$$ 47 459 356 78 42 514 323 -114 -153 29 410 -168 -21 83 -312 5 232 524 -132 -442 -355 356
2750C56l93l64K81O74q60j95L66K20j74o06R79q6o86K08K51J24n30l16P16K11
$$ 356 -37 -401 -120 554 -306 -501 -135 85 -89 -695 284 198 -488 -280 -29 95 -435 -751 -35 176
2770A76o95k20N49J90j73r5L48l76k60L27K71M0o91L45N06k75l96K7L38K27o09
$$ 176 -519 -739 -190 0 -173 -268 80 -296 -556 -229 42 82 -609 -264 242 -33 -429 -402 -64 163 -446
2791d46j53K96R4J4m8J15j32j59j83L28L5n08P85J42J40r74K36P61m84J20k13
$$ -446 -599 -303 -209 -195 -243 -128 -260 -419 -602 -274 -239 -747 38 180 320 -654 -418 343 -141 -21 -234
2812b34K84l99L7P7M60m18j90K82J83m70l42N66O26n87k83J33K90Rl42L35K31
$$ -234 50 -349 -312 -235 225 -193 -383 -101 82 -388 -730 -164 462 -125 -408 -275 15 24 -318 17 248
2833B48l97j06L77K3M7n53K33Q91p11n95K77P77n03k45K77M75k77o07M06K56m56
$$ 248 -149 -255 122 145 192 -361 -128 763 52 -543 -266 511 8 -237 40 515 238 -369 37 293 -163
2854a63K21M46k88o50K55Q43k82R4n21M91Q1m55k5L69J9n38L62J87o4n89L28K75
$$ -163 58 504 216 -434 -179 664 382 476 -45 446 527 72 47 416 435 -103 259 446 382 -207 121 396
2876C96j7k49j9M84k00m53N11K21l69l82p1O45n46K37M47j65l58j28K57L44n07
$$ 396 379 130 111 595 395 -58 453 674 305 -77 -148 497 -49 188 635 470 112 -16 241 585 78
2897G8o14J122L8p32J56l71Q02J6k31P4k23k2j97J51J46L0l33N02K8n22k89O94
$$ 78 -536 586 624 -108 48 -323 479 495 264 338 115 93 -104 47 193 223 -110 392 420 -102 -391 303
2919C03O3k31N5j77J69M2n03J48M95m53j01J52J49o24J26P57k53o31j07R27j2
$$ 303 366 135 190 13 182 224 -279 -131 364 -89 -190 -38 111 -513 -387 370 117 -514 -621 306 294
2940B94m02P9j12J34j52m32N40Q3k14l50O74J25m55m00R67m00l76J30K54o3k84
$$ 294 -108 -29 -141 -7 -159 -591 -51 32 -182 -532 142 267 -188 -588 379 -21 -397 -267 -13 -76 -360
2961c60k41R78l13k18R5j11l14O4J48M52j73o08N56K20l68l09P2O62l99m39K56
$$ -360 -601 377 64 -154 -59 -170 -484 -420 -272 180 7 -601 -45 175 -193 -502 -430 232 -167 -606 -350
2982c50J07J03KJ30o6k65r2K29M3j11o9K62K15k63o47O85R7k30m8L27m2k85j5
$$ -350 -243 -140 -138 -8 -74 -339 -431 -202 -159 -270 -339 -77 138 -125 -772 -87 10 -220 -268 59 17 -268 -283
3005b83k7J5J74j12J49K83l06k99O51m4n6m00J66jJ64k2j56K01k05L16m3l5j67
$$ -283 -310 -295 -121 -233 -84 199 -107 -406 245 201 145 -255 -89 -90 74 52 -104 97 -108 208 165 130 -37
3028c7r3M37k26m55M73o2K07J63l89K24r9j23K1J05j16K00n1k34j4M8l2K65K88
$$ -37 -130 307 81 -374 99 37 244 407 18 242 143 20 41 146 30 230 179 -55 -69 -21 -53 212 500
3051E00o66P2L86J67k68k5J83j47p8q2J36J47k41J96L20m65N2lQ1j26r8QK10J5
$$ 500 -166 -94 292 459 191 166 349 202 124 42 178 325 84 280 600 135 187 184 265 139 41 49 259 274
3075B74j04j67K25J0q4L38j2l12r8K09o7j48J46l16K33kk06K22j06K38k82L02
$$ 274 170 3 228 238 154 492 480 168 70 279 212 64 210 -106 127 125 -81 141 35 273 -9 293
3097B93k16j48M0K21o4k93MM72k42o2nR2P2K00m06Q2m6L7k57K29j84mN46o49K17
$$ 293 77 -71 -31 190 126 -167 -163 309 67 5 0 92 164 364 -42 40 -6 31 -226 3 -181 -185 361 -288 -71
3122g1p9rJ02J31l82j84L50J44m9J18l38P2l1L54j82k3K7k16OJ1j4K57m1O3o25
$$ -71 -150 -159 -57 74 -308 -492 -142 2 -47 71 -267 -195 -226 128 -54 -77 -50 -266 -260 -249 -263 -6 -47 16 -609
3147f09L96O1l13L01m1J58j23k47K61M5J24m33K63K01l47l0L3J75J38k22j21K6
$$ -609 -213 -152 -465 -164 -205 -47 -170 -417 -156 -111 13 -420 -157 44 -303 -333 -300 -125 13 -209 -330 -304
3169c04MR1J61j58m7j2M64n24J72j17J03L5J44l3j63K12k17N6P7j2k55L24O2q4
$$ -304 -300 -209 -48 -206 -253 -265 199 -325 -153 -270 -167 -132 12 -21 -184 28 -189 -133 -56 -68 -323 1 63 -21
3193b1k43N03k68K78n38K12JK54k36j09k13L89j27L42j84k65J96L09j28q1O1p8
$$ -21 -264 239 -29 249 -289 -77 -76 178 -58 -167 -380 9 -118 224 40 -225 -29 280 152 71 132 54
3215E4J94k22J06q2J5K8n7J45k07J42k23L24J03p44Q44l57J9kk9K09K37m35q3
$$ 54 248 26 132 50 65 93 36 181 -26 116 -107 217 320 -424 420 63 82 80 51 260 497 62 -21
3238b1J86J14K8j56J23o8Jj99J33K05n2m69N48l45K78l92L94k56j6j0J84R8j0
$$ -21 165 279 307 151 274 206 207 8 141 346 294 -175 373 28 306 -86 308 52 36 26 210 308 298
3261B98J19n1k54K42j00j6j0o8r8j4J5O6L27k42L8N6k47K4rp2J27l49K25J69j61
$$ 298 417 366 112 354 254 238 228 160 62 48 63 129 456 214 252 308 61 85 76 4 131 -218 7 176 15
3286A5P5j53R2k3J57P7n18K02N37m25k80L23j5J4o4q3k2J31l30L62j98j42L9K09
$$ 15 90 -63 29 6 163 240 -278 -76 461 36 -244 79 64 78 14 -69 -91 40 -290 72 -126 -268 -229 -20
3310b0q0P6j10J47P8m16J06K75k0r7k16K05l47L30n8R2J13m83K12K69J23k81j66
$$ -20 -100 -24 -134 13 91 -325 -219 56 36 -61 -277 -72 -419 -89 -147 -55 58 -425 -213 56 179 -102 -268
3333b68Q5L53n72L64j85p3K6J00k14M05o6j93J89J34m26J09J36J49l90Q2J50M3
$$ -268 -183 170 -402 -38 -223 -296 -270 -170 -384 21 -45 -238 -49 85 -341 -232 -96 53 -337 -255 -105 -62
3355f2j36PQ9l46P5L16j38Jj62OL44N2k27j07J99K32k55L4l9K19k81J16q1J25
$$ -62 -198 -191 -102 -448 -373 -57 -195 -194 -356 -350 -6 46 -181 -288 -89 143 -112 -78 -117 102 -179 -63 -144 -19
3379a9k99L08J11l20j06P1L63j60o6K21L2J13m74j71L15qK28j36J2j00j37O15
$$ -19 -318 -10 101 -219 -325 -254 109 -51 -117 104 136 249 -225 -396 -81 -89 139 3 15 -85 -222 393
3401C93j39k89L5M69k48q8j69J68K16l60j15L88k62r8J68J20J78l79k5L2K69j72
$$ 393 254 -35 0 469 221 133 -36 132 348 -12 -127 261 -1 -99 69 189 367 -12 -37 -5 264 92
3423I2Q6J65j34j91n0Q4L32l88L19Ml96K61k65L62j21k80O2N23o1n82K74R9K21
$$ 92 178 343 209 18 -32 52 384 -4 315 319 -77 184 -81 281 160 -120 -58 465 404 -178 96 195 416
3446D16l30j54O21l19n04J76P00j80n52N6L70k19j75J90J74l08k7N47k27k87P
$$ 416 86 -68 553 234 -270 -94 606 426 -126 -70 300 81 -94 96 270 -38 -65 482 255 -32 -25
3467b5N65m14k86o0N64j68k82K56j92M43m72j91J32l4K21k77K08pl07K82k9L83
$$ -25 540 126 -160 -220 344 176 -106 150 -42 401 -71 -262 -130 -164 57 -220 -12 -19 -326 -44 -73 310
3489C10l53j28K25J19l43k55O04q8k19j17J72J48n23L8M83k07j25kN46l32k07
$$ 310 -43 -171 54 173 -170 -425 179 91 -128 -245 -73 75 -448 -410 73 -134 -259 -261 285 -47 -254
3510b54j97N56J15m91j65N03l49k17N24J76j58k40J46j8O5o03J74K15Qj85Q5j03
$$ -254 -451 105 220 -271 -436 67 -282 -499 25 201 43 -197 -51 -69 -4 -607 -433 -218 -210 -395 -310 -413
3532d13M17j33n4oK9k92L50p1N6k07P9L48l62lj48N61k28n03N77j20P6k93M77
$$ -413 4 -129 -183 -189 -160 -452 -102 -173 -117 -324 -245 103 -259 -262 -410 151 -77 -580 -3 -123 -47 -340 137
3555A37K4l82n6J83K32k04k01K15NO7l20K38J4j82L93l2pk8k49L39k5l78K28l3
$$ 137 161 -221 -277 -94 138 -66 -267 -52 -47 20 -300 -62 -48 -230 163 131 124 96 -153 186 161 -217 11 -22
3579b2K08o86M09L32J17l28j96L00L60q92N10Lk5k71m1K42M6o4j08K62L41o66
$$ -22 186 -500 -91 241 358 30 -166 134 494 -398 112 115 90 -181 -222 20 66 2 -106 156 497 -169
3601a69M3L13m1l40K12L83k10J18j88K99p5p04K94M81j03l59o6M18p7k22J6L16
$$ -169 -126 187 146 -194 18 401 191 309 121 420 345 -359 -65 416 313 -46 -112 306 229 7 23 339
3623C39l79NJ67J73N3m54J94J57k27j38N21K91p52p7J74K87n09m7M81j96P8k26
$$ 339 -40 -35 132 305 358 -96 98 255 28 -110 411 702 -50 -127 47 334 -175 -222 259 63 141 -85
3645h5J61p4K19j45m4m1j60K89PJ45j71l27L76o5k14j9M25j75l01K64j31K46l11
$$ -85 76 2 221 76 32 -9 -169 120 127 272 101 -226 150 85 -129 -148 277 102 -199 65 -66 180 -131
3668a31k87O97l87k79K52L94k28J4k49k02O09k34j86K82j19j54J6M78k86j51j6
$$ -131 -418 279 -108 -387 -135 259 31 45 -204 -406 203 -31 -217 65 -54 -208 -192 286 0 -151 -167
3689a67J53J50j67n09O20P0m01K17J65j81k41m6J72n9Q4j71L83j37l87L64J08
$$ -167 -14 136 -31 -540 80 150 -251 -34 131 -50 -291 -337 -165 -224 -140 -311 72 -65 -452 -88 20
3710B0l49J02J41K53j31o92N31J37j34k71K86K7J6l57L22Q9p6m05N28O0l15J15
$$ 20 -329 -227 -86 167 36 -656 -125 12 -122 -393 -107 -80 -64 -421 -99 -10 -86 -491 37 97 -218 -103
3732a03K04Q4o39M73J85j48n91N25O8k4j43j59Q3J69j82O1K03mJ0J79j35j72M
$$ -103 101 185 -454 19 204 56 -535 -10 58 34 -109 -268 -185 -16 -198 -137 66 62 72 251 116 -56 -52
3755e2M8K16j63k53J87o0J03j71J40K12j89o3k00J97K12j51j22J13L47k68j45
$$ -52 -4 212 49 -204 -17 -77 26 -145 -5 207 18 -45 -245 -48 164 13 -109 4 351 83 -62
3776f2K36J3r9J47Om3j11l6K25j84J77K01k80j98J50m0j77M28k33R4j10K30o62
$$ -62 174 187 88 235 241 198 87 51 276 92 269 470 190 -8 142 102 -75 353 120 214 104 334 -328
3799c28M81J50k69j68M80k7j90r7K22l94K14j28K58j71J16m2K98n19K06K31k96
$$ -328 153 303 34 -134 346 319 129 32 254 -140 74 -54 204 33 149 107 405 -114 92 323 27
3820B7j07k3L0R2K27M8l08l9K30k06j82M62k34j95L94j6k91M69m52J77j02r6K17
$$ 27 -80 -103 -73 19 246 294 -14 -53 177 -29 -211 251 17 -178 216 200 -91 378 -74 103 1 -95 122
3843A22j56qJ32j10K65k33j24R8mJ95m43K27K2N2j61K05k48q7R4m7k6l05L99J24
$$ 122 -34 -42 90 -20 245 12 -112 -14 -18 177 -266 -39 -17 35 -126 79 -169 -256 -162 -209 -235 -540 -141 -17
3867a7q7j8k9J75J08R4k29j94m7L62m33L15l26K85n5j40K02nl48J23L42m00K01
$$ -17 -104 -122 -151 24 132 226 -3 -197 -244 118 -315 0 -326 -41 -96 -236 -34 -39 -387 -264 78 -322 -121
3890a21l4L48n25L68j00j89L08J87j88j39nm6j20K28P5l8P7q4k48J97k89K91n5
$$ -121 -155 193 -332 36 -64 -253 55 242 54 -85 -90 -136 -256 -28 47 9 86 2 -246 -49 -338 -47 -102
3913a02K45l14N2J74j0J61k58j70k6J99r6j98K05J8O8j35l5J78K06m10J91kk8
$$ -102 143 -171 -119 55 45 206 -52 -222 -248 -49 -145 -343 -138 -120 -52 -187 -222 -44 162 -248 -57 -59 -87
3936h7l8J72j08O9j20J5r0K98j58L31j54j70k3L87m78L55j87K9P3k92L23J5j47
$$ -87 -125 47 -61 8 -112 -97 -187 111 -47 284 130 -40 -63 324 -154 201 14 43 116 -176 147 162 15
3959A5j0L40l32J87j70j50K05k0M27k59O2k85P5j21j45L53k39K24j4O3k6m07K38
$$ 15 5 345 13 200 30 -120 85 65 492 233 295 10 85 -36 -181 172 -67 157 143 206 180 -227 11
3982A1K48q7j27L18k01l8m1k0l8J14n0OL0q9j21L78M5n6j73l9O8J14k21n7j57
$$ 11 259 172 45 363 162 124 83 63 25 139 89 95 125 36 -85 293 338 282 109 70 138 252 31 -26 -183
4007a83K71n5k42O27k32l81K08K0l3J03o8O1R8n99M75O5l14o7M23k43J08J75j33
$$ -183 88 33 -209 418 186 -195 13 33 0 103 35 96 194 -405 70 135 -179 -246 177 -66 42 217 84
4030H4L8l44M81j13j67J07k43J32R7J63l83j29p6K53Q0P6m7k60L25j60k89K98
$$ 84 122 -222 259 146 -21 86 -157 -25 72 235 -148 -277 -353 -100 -20 56 9 -251 74 -86 -375 -77
4052g7J6K15j54J8p3K18k27J8J17k59J01l1j48L44k14j8j7K98m12J62P5j9k24
$$ -77 -61 154 0 18 -55 163 -64 -46 71 -188 -87 -118 -266 78 -136 -154 -171 127 -285 -123 -48 -67 -291
4075b91l7K96r8O3M3K25l63RJ28K15k38j11l7J29Q9j22j3J62J54n58N40j75N8
$$ -291 -328 -32 -130 -67 -24 201 -162 -153 -25 190 -48 -159 -196 -67 22 -100 -113 49 203 -355 185 10 68
4098F8Q3k36q9K23k44J60J01k79r7J68N8q8r8N88q7k91j44n3L59j52K32r9M44
$$ 68 151 -85 -174 49 -195 -35 66 -213 -310 -142 -84 -172 -270 318 231 -60 -204 -257 102 -50 182 83 527
4121E27p64l0J86K27k96l65M99p3K04j10J68l8j57K17r2P0j10j58L90j15j76j87
$$ 527 -237 -267 -81 146 -150 -515 -16 -89 115 5 173 135 -22 195 103 173 63 -95 295 180 4 -183
4143a83L59j05O8k32L70l1j70j22N04m75J2q2L34p2k09L2J8J30k02n4L23l45L00
$$ -183 176 71 139 -93 277 246 76 -46 458 -17 -5 -87 247 175 -34 -2 16 146 -56 -110 213 -132 168
4166A68j16jJ00R8kk37J07l69K95K48r7J5m0K41m73J19N5J31j4k15p8L24m33J22
$$ 168 52 51 151 249 247 10 117 -252 43 291 194 209 169 410 -63 56 111 242 228 13 -65 259 -174 -52
4190e2L65k70K26l97K41J31k15l58N70j09j00j72M20k17L16n45O99l83l61j49
$$ -52 313 43 269 -128 113 244 29 -329 241 132 32 -140 280 63 379 -166 533 150 -211 -360
4210c60L82R6J1l39M97l33j31J14J13R9j81k9K72m58O8J65J16k22J7J66k35K38
$$ -360 22 118 129 -210 287 -46 -177 -63 50 149 -32 -61 211 -247 -179 -14 102 -120 -103 63 -172 66
4232F6p18P04J11j06K4n69P28k35k61J04J86l4j60NQn2k52L02K64k60j99L03R9
$$ 66 -652 52 163 57 81 -488 240 5 -256 -152 34 0 -160 -155 -147 -199 -451 -149 115 -145 -344 -41 58
4255E8L7j06j58M62r2o27M16Pp6l92N26j03k47O2N6M00j78k09m1L47n11L53K72
$$ 58 95 -11 -169 293 201 -426 -10 -3 -79 -471 55 -48 -295 -233 -177 223 45 -164 -205 142 -369 -16 256
4278B56P3k90j01J30L0ll25J37K07m63qN12m03K19k18K77K0l98L81O3j29j28Q8
$$ 256 329 39 -62 68 98 95 -230 -93 114 -349 -357 155 -248 -29 -247 30 50 -348 33 96 -33 -161 -73
4301g3J09J26n76K32K80L33l54k55L07J5k70l2L73M3k25k06M61l50Nj63K79N6
$$ -73 36 162 -414 -182 98 431 77 -178 129 144 -126 -158 215 258 33 -173 288 -62 -57 -220 59 115
4323A15K1m17M70q5J90m63K71m8j33m5J44J50j35R2j75O4j57L33o3J55l23K02
$$ 115 136 -281 189 104 294 -169 102 54 -79 -124 20 170 35 127 -48 16 -141 192 129 284 -39 163
4345A63K04n57L90n3N3K7k07O8O5K6Jj71J60k83K66l05M19J12m51K34l9k78k7
$$ 163 367 -190 200 147 200 227 20 88 153 179 180 9 169 -114 152 -153 266 378 -73 161 122 -156 -183
4368a83L06K66k25k23L15pj16m4R3m2j17l56K45J90kk95J62L01k3k56Q3Q5j54
$$ -183 123 389 164 -59 256 249 133 89 182 140 23 -333 -88 102 100 -195 -33 268 245 -11 72 157 3
4391Ck28K62k8k17J15J92J33n72q7J29K12J89j46P5k2kk46J16K20r5j45M7r2M
$$ 3 -225 37 9 -208 -93 99 232 -340 -427 -298 -86 103 -43 32 10 8 -238 -122 98 3 -142 -95 -187 -183
4415a83j74M85r3j51j11M75o09L15j00q8L33m55J78L00k8k26Q2Q5r3j32j37L83
$$ -183 -357 128 35 -116 -227 248 -361 -46 -146 -234 99 -356 -178 122 94 -132 -50 35 -58 -190 -327 56
4437E6m9q7O2j34j16k8K23K64m68J50l40K7L78o3R1m7K20k17k20L58L18m83M2
$$ 56 7 -80 -18 -152 -268 -296 -73 191 -277 -127 -467 -440 -62 -125 -34 -81 139 -78 -298 60 378 -105 -63
4460f3l07O44l60j90j22K7m3L75O7j42K07k53L02j04J23k65L7m9J13k93L07L6
$$ -63 -370 274 -86 -276 -398 -371 -414 -39 28 -114 93 -160 142 38 161 -104 -67 -116 -3 -296 11 47
4482D7l57M31k47k7M02k43K74j58p7j04J92k25J00m2J50J4p3J24j61J37j76J98
$$ 47 -310 121 -126 -153 249 6 280 122 45 -59 133 -92 8 -34 116 130 57 181 20 157 -19 179
4504A79j56L8j64K14P0j30o4j93O51j76p5l21L17q2Q6o09J57K35L14j88P1k20
$$ 179 23 61 -103 111 181 51 -13 -206 445 269 194 -127 190 108 194 -415 -258 -23 291 103 174 -46
4526d6j47L34j36o9J08q4k14L98J15j11K20m73R2o4J48Rj04q1J15L23l68J25J77
$$ -46 -193 141 5 -64 44 -40 -254 144 259 148 368 -105 -13 -77 71 80 -24 -105 10 333 -35 90 267
4549B67P6m60J88M4P5j29O7Q7j86j97K87j02j2M0K92m07o7J46j19K58k2o0j94
$$ 267 343 -117 71 115 190 61 128 215 29 -168 119 17 5 45 337 -70 -137 9 -110 148 126 66 -128
4572a28K37k55N93o04K03o4k77K77k0j34l3K1N52k39p8n9j20K71k61p3L92k44
$$ -128 109 -146 447 -157 46 -18 -295 -18 -38 -172 -205 -184 368 129 51 -8 -128 143 -118 -191 201 -43
4594d3j08J74J54k10K03kj30j86Np7j46L22J57j82q5j94N26l11M5j92j03M10j22
$$ -43 -151 23 177 -33 170 168 38 -148 -143 -220 -366 -44 113 -69 -154 -348 178 -133 -88 -280 -383 27 -95
4617i5J49j20j10R4L26k24p0J97J11J01n32p2O04m83k78J90M38k27j79k9L18j46
$$ -95 54 -66 -176 -82 244 20 -50 147 258 359 -173 -245 359 -124 -402 -212 226 -1 -180 -209 109 -37
4639c7n6J19r1k8K7J05j3p5L6q1k32K86l61J19L35k35L07m8j37Mj04M32l98L05
$$ -37 -93 26 -65 -93 -66 39 26 -49 -13 -94 -326 -40 -401 -282 53 -182 125 77 -60 -56 -160 272 -126 179
4663A79k63J77q5K13k72R1J02l2j91k00M28L22m84P9Kmj26J9J59p0l16R4J23K06
$$ 179 -84 93 8 221 -51 40 142 110 -81 -281 147 469 -15 64 66 62 -64 -45 114 44 -272 -178 -55 151
4687A51j53K67Mj19J27l46O8k7N0J79k22J47p0M10m82J02r4j16J83M4l9J84l07
$$ 151 -2 265 269 150 277 -69 -1 -28 22 201 -21 126 56 466 -16 86 -8 -124 59 103 64 248 -59
4710e9J45ml4P1O8j61J49j45L3Q4k10m3K48n6K92k08j18l06O07k18M0q4K14j48
$$ -59 86 82 48 119 187 26 175 30 63 147 -63 -106 142 86 378 170 52 -254 353 135 175 91 305 157
4734A57l0n7K44m21L10k19J60k01J97k75L39j79N1k6k64J18kK40j27J31kj3L8
$$ 157 127 70 314 -107 203 -16 144 -57 140 -135 204 25 76 50 -214 -96 -98 142 15 146 144 131 169
4757A69k46J24j28J96k17l88N94j97j48L50l55K88L6j90J57L08m11k35J47L1j07
$$ 169 -77 47 -81 115 -102 -490 104 -93 -241 109 -246 42 78 -112 45 353 -58 -293 -146 -115 -222
4778b22J24j3J76Ll56M26l23J51p6J8J39n49K48L39J26m32K5K18n9J64j29q1j47
$$ -222 -98 -111 65 68 -288 138 -185 -34 -110 -92 47 -502 -254 85 211 -221 -196 22 -37 127 -2 -83 -230
4801b30K30k74L1o4M24j65P4j16k51PM58m5J2n5j49J19J3k3J08p2N9K39l00k55
$$ -230 0 -274 -243 -307 117 -48 26 -90 -341 -334 124 79 91 36 -113 6 19 -4 104 32 91 330 30 -225
4825b25J39k80O53M8p12J29K07K14n15K99J97k02q5jM13k23p4j79N8J96n3k64
$$ -225 -86 -366 287 335 -377 -248 -41 173 -342 -43 154 -48 -133 -134 279 56 -18 -197 -139 57 4 -260
4847b60L81k28K07r0j25N5j47J63K6K3J13k9k07j04R9J61q0K10l75J01K58l67
$$ -260 121 -107 100 10 -115 -60 -207 -44 -18 5 118 89 -118 -222 -123 38 -42 168 -207 -106 152 -215
4869b15J30L35J31o38J01K26L80m99j08P0j31J17l5M62r0j56m3N8Q8K7l72K34
$$ -215 -85 250 381 -257 -156 70 450 -49 -157 -87 -218 -101 -136 326 236 80 37 95 183 210 -162 72
4891G2p9pk56K61L01n90J73L91j13j71K1M57n25J0M4O5l4k5J79j8Pl0m31O07j85
$$ 72 -7 -14 -270 -9 292 -298 -125 266 153 -18 3 460 -65 -55 -11 54 20 -5 174 156 163 133 -298 309 124
4916A24j2n6j31L6J59k19N48n28Q2R5j56J81l03J33K00Rl92M13OK17k94m03J79
$$ 124 112 56 -75 -39 120 -99 449 -79 3 98 -58 123 -180 -47 153 162 -230 183 189 406 112 -291 -112
4939a12Q8M64l32j15N3J16R7l13p8j41L21oM4k74J54K13j63k25N08j18m15L1K83
$$ -112 -24 440 108 -7 46 162 259 -54 -132 -273 48 42 86 -188 -34 179 16 -209 299 181 -234 -203 80
4962H0j65L41j61mj9k79L03j9Ml11R9J09j98J64k49M28j51l01K59J56m4k60q6
$$ 80 -85 256 95 91 72 -207 96 77 81 -230 -131 -22 -220 -56 -305 123 -28 -329 -70 86 42 -218 -304
4985c04M16k69j64L19N31m68j85J9l0M27n54L05o0l62M58j66J62j86P7j05J67
$$ -304 112 -157 -321 -2 529 61 -124 -105 -135 292 -262 43 -17 -379 79 -87 75 -111 -34 -139 28
5006B8j56J7L02j07j69l19M08r5K5j99N6L48k08J70j41J50l18n9L64k10O1k9K02
$$ 28 -128 -111 191 84 -85 -404 4 -91 -66 -265 -209 139 -69 101 -40 110 -208 -267 97 -113 -52 -81 121
5029A21k87J40j67M58lk72j31P0K37j00m3j02Kl55L69N6j54L17k48J28q7O0m98
$$ 121 -166 -26 -193 265 262 -10 -141 -71 166 66 23 -79 -77 -432 -63 -7 -161 156 -92 36 -51 9 -489
5052d89O98j91j7k23L51o0J34l3k93J04r6L66Q0j82j96K10l58j8M43k43J18o1
$$ -489 209 18 1 -222 129 69 203 170 -123 -19 -115 251 331 149 -47 163 -195 -213 230 -13 105 44
5074D4k23L06j06n1J6j4L37m19nM02k01j14r7J83J88l86R4K3K15m4p1j12L30m05
$$ 44 -179 127 21 -30 -14 -28 309 -110 -115 287 86 -28 -125 58 246 -140 -46 -23 192 148 77 -35 295 -110
5098a10P1q8K14j3R7L9r8J60l19J09r1R9rQ4K41j44j06K7l05r2K81J82j58o2J02
$$ -110 -39 -127 87 74 171 210 112 272 -47 62 -29 70 61 145 386 242 136 163 -142 -234 47 229 71 9 111
5123A11j23J84J11j77K2q1k4R5j81k14L03j49P6j62K47j94K24N1J61m00J90k71
$$ 111 -12 172 283 106 128 47 23 118 -63 -277 26 -123 -47 -209 38 -156 68 119 280 -120 70 -201
5145b01K82j55k63K45J4L6K07j27k05L46j50j19J28P1j05j20Q4n6J55J24l83K97
$$ -201 81 -74 -337 -92 -78 -42 165 38 -167 179 29 -90 38 109 4 -116 -32 -88 67 191 -192 105
5167A05k74j35J54P2R3L1k28k15N24j55j8M0k00N5J6K7l5J18M1P0k93l8K85J48
$$ 105 -169 -304 -150 -78 15 46 -182 -397 127 -28 -46 -6 -206 -151 -135 -108 -143 -25 16 86 -207 -245 40 188
5191A88l3j11k91K03K43l95j7J39j19J23J79k77J82k16K35j18j6K90j74k51K0
$$ 188 155 44 -247 -44 199 -196 -213 -74 -193 -70 109 -168 14 -202 33 -85 -101 189 15 -236 -216
5212b16L81m02K35k34N08l96R3K31j96j79J27p9L28j70j06l2J51m11L35J78j64
$$ -216 165 -237 -2 -236 272 -124 -31 200 4 -175 -48 -127 201 31 -75 -107 44 -367 -32 146 -18
5233a8J5O9o0k62J75K41l89K7N6K69j28j13J32k28L22n56K51j32L16j8J41j49
$$ -18 -3 66 6 -256 -81 160 -229 -202 -146 123 -5 -118 14 -214 108 -448 -197 -329 -13 -31 110 -39
5255c9j91L20j18q5k22O06m41L99j49O4m4p1Ql5J35k10K67P3l29M71j32k64J26
$$ -39 -230 90 -28 -113 -335 271 -170 229 80 144 100 29 37 2 137 -73 194 267 -62 409 277 13 139
5278A39J3Qk07K54o5p4N5n2Q3R9k03k56K46R0l01J50Q6J39j22O6l41K3J98K22
$$ 139 152 160 -47 207 142 68 123 71 154 253 50 -206 40 130 -171 -21 65 204 82 148 -193 -170 28 250
5302B50k87j5JN1K11n04K53K97j74m9k0J86j45q7Q8Q2k46r7J75L20K1m61J00K43
$$ 250 -37 -52 -51 0 211 -293 -40 257 83 34 14 200 55 -32 56 138 -108 -205 -30 290 311 -150 -50 193
5326A93j50j13J36j68K53k52L8j67j23J99J00j68K51kj01R7k66M03k96M9J04k47
$$ 193 43 -70 66 -102 151 -101 -63 -230 -353 -154 -54 -222 29 27 -74 23 -243 160 -136 -87 17 -230
5348b30J75J29p6M4j33N1J08K55k33m9k79M45k49J01j31m45M78L6J89l09o6J42
$$ -230 -55 74 -2 42 -91 -40 68 323 90 41 -238 207 -42 59 -72 -517 -39 -3 186 -123 -189 -47
5370d7J02O8j75j72R6M9K28j84k15K51j54K69p2m4K31l07k18L88j6l08L5J85q7
$$ -47 55 123 -52 -224 -128 -79 149 -35 -250 1 -153 116 44 0 231 -76 -294 94 78 -230 -195 -10 -97
5393i7M6L09k40M5l09k1N0L36l36J23N9n1q9K9j8K18j55m6R4O2j5L53m64J99j36
$$ -97 -51 258 18 63 -246 -267 -217 119 -217 -94 -35 -86 -175 -146 -164 54 -101 -147 -53 9 -6 347 -117 82 -54
5418e4K4J04J88k81O4r3q0M03k52k01q4J12l51M59j23O1K79k6Q7k25K66j55l68
$$ -54 -30 74 262 -19 45 -48 -128 275 23 -178 -262 -150 -501 -42 -165 -104 175 149 236 11 277 122 -246
5441b46P32o45L76j73l4L8O8k32k7K05k15R3N9l5J32j26J25j03J1Q9n2O5J16k11
$$ -246 486 -159 217 44 10 48 116 -116 -143 62 -153 -60 -1 -36 96 -30 95 -8 3 92 40 105 221 10
5465A0p9l7L39m72J61K09j69K46j21k63K04N7l23J39J73j71O4L54m25J94j8k24
$$ 10 -69 -106 233 -239 -78 131 -38 208 87 -176 28 85 -238 -99 74 -97 -33 321 -104 90 72 -152
5487a52l7K54l11K59L8p8k79M60k35J81k27J87L28j41j33j84O8J83J5k27LJ29
$$ -152 -189 65 -246 13 51 -27 -306 154 -81 100 -127 60 388 247 114 -70 -2 181 196 -31 -28 101
5509A01J22p0nl40L1j27J57P9M1M7j00P0J4Jj31J69L7j3rk17J9J50N6j49m17O25
$$ 101 223 153 148 -192 -161 -288 -131 -52 -11 36 -64 6 20 21 -110 59 96 83 74 -143 -124 26 82 -67 -484 141
5535A41K7n21L91j95K93n7k63M05j90Q0k56J64M2k1J18k15P2l06K97j42l8J57
$$ 141 168 -353 38 -157 136 79 -184 221 31 111 -145 19 61 40 158 -57 15 -291 6 -136 -174 -17
5557a7J01R3l04J79m10N75k41j27k8K63j91J06j57K66J1q3Q8l5k14J35Q4J11o8
$$ -17 84 177 -127 52 -358 217 -24 -151 -179 84 -107 -1 -158 108 119 36 124 89 -125 10 94 205 137
5580A37k75J96r9N2j00J38kj25j23N76k36j99q4J95J58Lk68K26q7l5k19n3J51
$$ 137 -138 58 -41 11 -89 49 47 -78 -201 375 139 -60 -144 51 209 212 -56 170 83 48 -171 -224 -73
5603g3J69k63J56J08j68p1P7N28o11L46k22K13j65j64R7lJ45j16J18J1k64L58
$$ -73 96 -167 -11 97 -71 -142 -65 463 -148 198 -24 189 24 -140 -43 -46 99 -17 101 112 -152 206
5625B06k3l23L41l18r5K90L13m88m0J81j12J43ok31K74J68m43K02Q6o5j8J32p1
$$ 206 183 -140 201 -117 -212 78 391 -97 -137 44 -68 75 69 -162 112 280 -163 39 125 60 42 174 103
5648A03k50l3O4K07q9l7r6K49L29m15N6n7k7L39m13l2J8K66l95L61k6j61m4J32
$$ 103 -147 -180 -116 91 2 -35 -131 118 447 32 88 31 4 343 -70 -102 -84 182 -213 148 122 -39 -83 49
5672D9L9n4J45l22J31K19k19Q5l06O71k69k71R4L83n25M8L24j45J46k26R2j15
$$ 49 88 34 179 -143 -12 207 -12 73 -233 438 169 -102 -8 375 -150 -102 222 77 223 -3 89 -26
5694b6K39l31J10L9k37J92j56L51l83K93K4p2kR0k58N19l07L3K3M0l30K16j21
$$ -26 213 -118 -8 31 -206 -14 -170 181 -202 91 115 43 41 131 -127 392 85 118 141 181 -149 67 -54
5717e4L56m52R4K21o8l66J31K0n7J37o2K43l07M7k21O05mn37L59K43l66l9K77
$$ -54 302 -150 -56 165 97 -269 -138 -118 -175 -38 -100 143 -164 -117 -338 267 263 -274 85 328 -38 -77 200
5740B00P0l48p0o6L17m27J61M00j46k8j66L02k1j29k54J68J70j67KO5r1P6n4j6
$$ 200 270 -78 -148 -214 103 -324 -163 237 91 63 -103 199 178 49 -205 -37 133 -34 -32 33 -58 18 -36 -52
5764e2n3K32M0k6l95J55J9J52p5r2O4o3M12k42k77K70j60ok70N15J6m74J43LJ42
$$ -52 -105 127 167 141 -254 -99 -80 72 -3 -95 -31 -94 318 76 -201 69 -91 -97 -367 148 164 -310 -167 -164 -22
5789b2j80N0K14m7N1j35L8J23q1k4J09l43M40p3m11K78J22L7k71J16p0N2n3J19
$$ -22 -202 -152 62 15 66 -69 -31 92 11 -13 96 -247 193 120 -291 -13 109 146 -125 -9 -79 -27 -80 39
5813C9l90M86k56j9P6J16L1j06Q9j00p4J40j64M27l34M99o76K29q6J11J61j57
$$ 39 -351 135 -121 -140 -64 52 83 -23 66 -34 -108 32 -132 295 -39 460 -216 13 -73 38 199 42
5835D2k00j02M39j67j00J79Q2q4l3l31M29p7J43m4j9J8k64L14j95p2p8K89k39
$$ 42 -158 -260 179 12 -88 91 173 89 56 -275 154 77 220 176 157 175 -89 225 30 -42 -120 169 -70
5858g0o2J93R1n7K00j39j25q2R4j09j50L84k6p3l31L28r8o7L3R5P7l95L74q9k26
$$ -70 -132 61 152 95 295 156 31 -51 43 -66 -216 168 142 69 -262 66 -32 -99 -66 29 106 -289 85 -4 -230
5883b30K07j4J22M4j97j0K96l67N16k63J13J1k53q9n1J90K15l47J79j02Q0j01
$$ -230 -23 -37 85 129 -68 -78 218 -149 367 104 217 228 -25 -114 -165 25 240 -107 72 -30 50 -51
5905e1Mj88L97m6j32l6j19J42K0J5m03K26J22R4N9J17o3R7j60k65K65k51J26l4
$$ -51 -47 -235 162 116 -16 -52 -171 -29 -9 6 -397 -171 -49 45 104 221 158 255 95 -170 95 -156 -30 -64
5929f4J20k13L4J52N1l13J96J79m41K13l5N8pP8J08k47O9P5m1m1J88k24L64k97
$$ -64 56 -157 -123 29 80 -233 -37 142 -299 -86 -121 -63 -70 8 116 -131 -62 13 -28 -69 119 -105 259 -38
5953c8J1Rj20P8Qq6L42L1k54m0q4k6K30J5j77L46k41l8k7K94o52M14r8P0j6K42
$$ -38 -27 -18 -138 -60 -52 -138 204 235 -19 -59 -143 -169 61 76 -101 245 4 -34 -61 233 -419 -5 -103 -33 -49 193
5979A93k43Q7k00N0j33K92K12k34j32pJ10j77N97n15J45K8j08k83J17K25K7j23
$$ 193 -50 37 -163 -113 -246 46 258 24 -108 -115 -5 -182 415 -100 45 73 -35 -318 -201 24 51 -72
6001g2K82k60K64l77J19qL04n44J83L98q6j83Q8Pl66M61l73K64r6m2j74L04p7
$$ -72 210 -50 214 -163 -44 -52 252 -292 -109 289 203 20 108 115 -251 210 -163 101 5 -37 -211 93 16
6024A6K23k36nj3j52J61J10j03r7L28j51M2r0k06M77m19j18K17K01j41q7K49n8
$$ 16 239 3 -2 -15 -167 -6 104 1 -96 232 81 123 33 -173 304 -115 -233 -16 185 44 -43 206 148
6047A48l3j14R4j52L3K27j74K5j99K59j44j53K45j20k8pL59n69M94j84o3L3l7
$$ 148 115 1 95 -57 -24 203 29 54 -145 114 -30 -183 62 -58 -86 -93 266 -303 191 7 -56 -23 -60
6070f0j1j87K34k08K39j26M7r0K24j34J35O6l49L98j01mo3j21q8J81R9k0J90k54
$$ -60 -71 -258 -24 -232 7 -119 -72 -162 62 -72 63 129 -220 178 77 73 10 -111 -199 -18 81 61 251 -3
6094cO9j78l7O3j6L28l22K86J63q07M73M5J57m6j91j23J50N2l2J32m01J94o3k15
$$ -3 66 -112 -149 -86 -102 226 -96 190 353 -454 19 64 221 175 -16 -139 11 63 31 163 -238 -44 -107 -322
6118c22L21k5p6J59%k09L01K01l53P0J40k55j81K57p2O3N2j15K21j30j30L92k93
$$ -322 -1 -26 -102 57 57 -152 149 350 -3 67 207 -48 -229 28 -44 19 71 -44 177 47 -83 309 16
6141A6r3j50L97k45M8K65l56L81k85L44j81j65J99j87NP9J36j90L97m16j86L43
$$ 16 -77 -227 170 -75 -27 238 -118 263 -22 322 141 -24 175 -12 -7 72 208 18 415 -1 -187 156
6163A56O6k40j36J11K46k17o6J70L3j13p4K59r3l53l6L37j46N3K67j65J17k99
$$ 156 222 -18 -154 -43 203 -14 -80 90 123 10 -64 195 102 -251 -287 50 -96 -43 224 59 176 -123
6185a23J27J07k00J53J2j07L14k69j76M58k36M9l3J4K2j51K95k65n5Q1j3L72l99
$$ -123 4 111 -89 64 76 -31 283 14 -162 296 60 109 76 90 112 -39 256 -9 -64 17 4 376 -23
6208b3L8Lj11J9J03m8j03P5J28p5j11J96K84m94L15m5N9l59P5J02Lq1L3LJ72n91
$$ -23 15 18 -93 -74 29 -19 -122 -47 81 6 -105 91 375 -119 196 151 210 -149 -74 28 31 -50 -17 -14 158 -433
6234d33M38m1J41o0j18K92n88L32M06l67K5k66l6K24K35N6j24j9q5p4M5k8M3j10
$$ -433 5 -36 105 45 -73 219 -369 -37 369 2 27 -239 -275 -51 184 240 116 97 12 -62 -17 -45 -2 -112
6258a12L42j63J50j41K23j84l0l20M93k44k37L50J00k38j81Q4j13K17j83L40m03
$$ -112 230 67 217 76 299 115 85 -235 258 14 -223 127 227 -11 -192 -108 -221 -4 -187 153 -250
6279b50M41P8j23k9j74p7o9j1L72l47J82j93M8K36j27J01k91K81J95j91rr5N9
$$ -250 191 269 146 117 -57 -134 -203 -214 158 -189 -7 -200 -152 84 -43 58 -233 48 243 52 43 -52 7
6302Go9J36j43J1L04j54q5j71L06m90L84j76J95K54k13m20K74J16k36J17R8R2
$$ 7 -62 74 -69 -58 246 92 7 -164 142 -348 36 -140 55 309 96 -324 -50 66 -170 -53 45 137
6324A37J7j56j92N2j12L54j55J7K00l32M4M6Q9K57n14R7K61M4k94o4k2L3J06J96
$$ 137 154 -2 -194 -142 -254 100 -55 -38 162 -170 -126 -80 9 266 -248 -151 110 154 -140 -204 -226 -193 -87 109
6348A09l3m1j41m2P9J32Q6l13K18O7j90M5Q3q0J6J17k52K22k55N80n23K23K0r8
$$ 109 76 35 -106 -148 -69 63 149 -164 54 121 -69 -24 59 -21 -5 112 -140 82 -173 407 -116 107 127 29
6372B9r0L92o16L34R0L3l30K3K38k58K30k42M70k73n3K27J46n13M64l41J76j68
$$ 29 -61 331 -285 49 139 172 -158 -135 103 -155 75 -167 303 30 -23 204 350 -163 301 -40 136 -32
6394c2J47k95K29J11l77j04K84J23k57L7J33J82o33L34Q9n6m3r7K52j90r5L23
$$ -32 115 -180 49 160 -217 -321 -37 86 -171 -134 -1 181 -452 -118 -29 -85 -128 -225 27 -163 -258 65
6416F5J45l47L19k42J87N7j8PK00m90J36j52K96l09K31j05j26J47%k2k33K60r3
$$ 65 210 -137 182 -60 127 184 166 173 373 -117 19 -133 163 -146 85 -20 -146 1 1 -21 -254 6 -87
6439h7K09j53j19L5L80k54q0P5j62J06K17ok26K02m44L56K14k31J51l55J72J02
$$ -87 122 -31 -150 -115 265 11 -69 6 -156 -50 167 161 -65 137 -307 49 263 32 183 -172 0 102
6461A02O2j36J57J60m86J69N3M1J30l43K08k43P4k6K50j12k26J83j1M1k17Q9K33
$$ 102 164 28 185 345 -141 28 81 122 252 -91 117 -126 -52 -78 172 60 -166 17 6 47 -170 -81 152
6484A52l61N08l86J52K5J2J0j0l43J12J10K06n1j7j91L09k17p4J97J15j43j45
$$ 152 -209 299 -87 65 90 102 112 102 -241 -129 -19 187 136 119 -72 237 20 -54 143 258 115 -30
6506c0P9j71K75p6r6j47L07n2J35j04j12k03O3K51pk35K15r4j68j5K16k57K22
$$ -30 49 -122 153 77 -19 -166 141 89 224 120 8 -195 -132 119 112 -123 92 -2 -170 -185 31 -226 -4
6529dj20K98j26K3k56K74r7o1j0r9K25k9k57L34nl5Q6j48q6k14N21k61L94n26
$$ -4 -124 174 48 71 -185 89 -8 -69 -79 -178 47 18 -239 95 90 55 141 -7 -93 -307 214 -47 347 -179
6553a79J90l2k01pK51J63k06P7k27J30k3J84j03k65P6K83O8k04j24k1L71m74K44
$$ -179 11 -21 -222 -229 22 185 -21 56 -171 -41 -64 120 17 -248 -172 111 179 -25 -149 -170 201 -273 -29
6576b9J03K26k29N2l0j29K92N3l37J5Q5R2K06k33R9j3k38R0OQr0R2M5p2oQ1OJ49
$$ -29 74 300 71 123 93 -36 256 309 -28 -13 72 164 370 137 236 223 -15 75 81 89 -1 91 136 64 58 139 145 294
6604B94j46mj91K01l03L7lj79K58K04k60j99O18j76l41J43k5k8q1M10r6k07J49
$$ 294 148 144 -47 154 -149 -112 -115 -294 -36 168 -92 -291 327 151 -190 -47 -72 -100 -181 229 133 -74 75
6627G5j11RM7p5j18L63r4l70O9Q5%o9Q7N2p2M6J49J51p9k18n3L41J06k31k78K23
$$ 75 -36 -27 20 -55 -173 190 96 -274 -205 -120 -120 -189 -102 -50 -122 -76 73 224 145 -73 -126 215 321 90 -188 35
6653C5P7J77m33K66k21K40P3l98K80P5K4o3j55j00n4J46J34j06J66j71J12r5k88
$$ 35 112 289 -144 122 -99 141 214 -184 96 171 195 132 -23 -123 -177 -31 103 -3 163 -8 104 9 -279
6676b79L06L25l2k19j40M21j61k41l8K15r6J09l3p3J86j02p2L0q9Q0k93L97j73
$$ -279 27 352 320 101 -39 382 221 -20 -58 157 61 170 137 64 250 148 76 106 17 97 -196 201 28
6699B8j3j27J67j51J86n3l82K37o8R6M8j28K61j68K50J73k76o2R6J0jj92k70J00
$$ 28 15 -112 55 -96 90 37 -345 -108 -176 -80 -32 -160 101 -67 183 356 80 18 114 124 123 -69 -339 -239
6723b39K69j35Q4Kj05m0K65l0R8k07J52O5j84J29J81p7p9j59M3qj25J61l12J24
$$ -239 30 -105 -21 -19 -124 -164 101 71 169 -38 114 179 -5 124 305 228 149 -10 33 25 -100 61 -251 -127
6747a27L06l17K68j79k4K59j21l20O52n32K81n1j3m9k09L22p5l24K6J64N1J97
$$ -127 179 -138 130 -49 -73 186 65 -255 397 -135 146 95 82 33 -176 146 71 -253 -227 -63 -12 185
6769A85M4j70j31m5K86l03L96M5k77o6j35Q8K41o0k29J24j0J93j10J7oj33j71
$$ 185 229 59 -72 -117 169 -134 262 307 30 -36 -171 -83 158 98 -131 -7 -17 176 66 83 77 -56 -227
6792b27n1M9L78m45K39J05l2Q0l19J38m1M88m27j48L01o2K30m49J30M81n39O0
$$ -227 -278 -229 149 -296 -57 48 16 96 -223 -85 -126 362 -65 -213 88 26 256 -193 -63 418 -121 -61
6814f1J30k14O9K16j51R5j36J92J83n06J71K3O6k14L38l62L4J36j8K5k34K67j73
$$ -61 69 -145 -76 140 -11 84 -52 140 323 -183 -12 11 77 -137 201 -161 -127 9 -9 16 -218 49 -124
6837a24J67m53M53J25k51l3L31k65Q5J78k44j27J53L4r2PK4J19J86k20p1J21j87
$$ -124 43 -410 43 168 -83 -116 215 -50 35 213 -31 -158 -5 29 -63 -56 -32 87 273 53 -18 103 -84
6860h4K69k10j38M72k88k48J67j21J41J44j62J07k12J79o2J0n0J67q3j08o9R5
$$ -84 185 -25 -163 309 21 -227 -60 -181 -40 104 -58 49 -163 16 -46 -36 -86 81 -2 -110 -179 -84
6882h4O0j61N4Q5nq1J90p0q0M05m29O4J10PRK8J89j65l72M00M4P9m19J61M6j77
$$ -84 -24 -185 -131 -46 -51 -132 58 -12 -92 313 -116 -52 58 65 74 102 291 126 -246 154 198 277 -142 19 65 -112
6908a12J7M4K11l26Q8L3K3Pj36R9K74m02K02l5k01K34J79l60K14j68J47L4j24
$$ -112 -95 -51 160 -166 -78 -45 -22 -15 -151 -52 222 -180 22 -13 -214 20 199 -161 53 -115 32 66 -58
6931e8j23K98k22J84k73K02l29M89k69R5j69k7o7L49n9K02l49nK80k45L0L76m27
$$ -58 -181 117 -105 79 -194 8 -321 168 -101 -6 -175 -202 -269 80 21 223 -126 -131 149 -96 -66 310 -117
6954a17J1J78k94K91m1n8J58k43J45J90k19J64l84J95OJ18j65j75K98J37j73k72
$$ -117 -106 72 -222 69 28 -30 128 -115 30 220 1 165 -219 -24 -18 100 -65 -240 58 195 22 -250
6976b50P9k1r3K15J67k56K32o2J29k81K85j15q7L2j21K93k27J02J4j32p4J09j34
$$ -250 -171 -192 -285 -70 97 -159 73 11 140 -141 144 29 -58 -26 -147 146 -81 21 35 -97 -171 -62 -196
6999a96J92P5J56m7l10J22M6j4k14J88J08O0k59K69l2l15K93q7j24K42k57m1K63
$$ -196 -4 71 227 180 -130 -8 38 24 -190 -2 106 166 -93 176 144 -171 122 35 -89 153 -104 -145 118
7022A18P5k21M8J34j33J14j51K2l95M57j03l3L9j36J04k1NP7J5l2L18r4l11J51
$$ 118 193 -28 20 154 21 135 -16 6 -389 68 -35 -68 -29 -165 -61 -82 -77 0 15 -17 301 207 -104 47
7046D7j09k63K93J42j11J27J42k91M5j12J15J58n13O0K12O0j11J21k8j56J40j40
$$ 47 -62 -325 -32 110 -1 126 268 -23 22 -90 25 183 -330 -270 -58 2 -109 12 -16 -172 -32 -172
7068a72J94J20q3m4k30M60j50j58K44l38L06p5O7p0R6R4j59l7P9j17J61l59K69
$$ -172 22 142 59 15 -215 245 95 -63 181 -157 149 74 141 71 167 261 102 65 144 27 188 -171 98
7091I8l5J56m45L46Q7K5p0j83K97l02J56j43K26l46j78L28k9K96j80J46l15K41
$$ 98 63 219 -226 120 207 232 162 -21 276 -26 130 -13 213 -133 -311 17 -12 284 104 250 -65 176
7113A76m4k94J30K0L18m08J08K67m91O7J88J58k39k14P20m16j46J65j0o6RL7k
$$ 176 132 -162 -32 -12 306 -102 6 273 -218 -151 37 195 -44 -258 462 46 -100 65 55 -11 -2 35 33
7136C3j09kl9j42L49l20J49M5R7Q8k08j40N32m57J59k83K22J35n0L7j53n2J0L38
$$ 33 -76 -78 -117 -259 90 -230 -81 -36 61 149 -59 -199 333 -124 35 -248 -26 109 59 96 -57 -109 -99 239
7160B39j86q2J28l2P1k66J74J31k49J43j18Qk64L87j48O56o82k34K19J10J08k22
$$ 239 53 -29 99 67 138 -128 46 177 -72 71 -47 -39 -303 84 -64 592 -90 -324 -105 5 113 -109
7182a09K50m36P34m82J6j53K51j67J2M80m01On3K60j05l01L03j28L2J41n2q3J43
$$ -109 141 -295 439 -43 -27 -180 71 -96 -84 396 -5 1 -52 208 103 -198 105 -23 9 150 98 15 158
7205A58j18n7K33m55L17j72L06j2l46o5J86k66J59o3J20K91j18m90M71k56L08
$$ 158 40 -17 216 -239 78 -94 212 200 -146 -211 -25 -291 -132 -195 -75 216 98 -392 79 -177 131
7226A31qJ14k50k64P0L80j52k21J48j4J61k91M16j84R1j25R2j88K20l10J52j1
$$ 131 123 237 -13 -277 -207 173 21 -200 -52 -66 95 -196 220 36 127 2 94 -94 126 -184 -32 -43
7248d3J51k9N9O6k87j43J06J19l4J24k4l90Q4M58j66j39R0P9pk1l52J14L48j85
$$ -43 108 79 138 204 -83 -226 -120 -1 -35 89 65 -325 -241 217 51 -88 2 81 74 53 -299 -185 163 -22
7272b2L44m43J91J71m34L62O2n6j96n7N0j82K43j86K26o5k8j25L14k8k22k15K01
$$ -22 322 -121 70 241 -193 169 231 175 -21 -78 -28 -210 33 -153 73 8 -20 -145 169 141 -81 -296 -95
7295i5J87l7K45k44J1PJ46k39%J1J44J72j18j78j27J72k65M3K41O7O3k18o8N2
$$ -95 92 55 300 56 67 74 220 -19 -19 -8 136 308 190 12 -115 57 -208 -165 76 143 206 -12 -80 -28
7319b8j73L35J5k26j58K70L9j92K15j74j68O3L18L8m14M46P6k93o0J50k5k01K38
$$ -28 -201 134 149 -77 -235 35 74 -118 97 -77 -245 -182 136 174 -240 206 282 -11 -71 79 54 -147 91
7342I1Q4k53K36lr1k45M23k51J0j32J62J52l4Lk54K32k80L68j95K06j96K01l19
$$ 91 175 -78 158 155 64 -181 242 -9 1 -131 31 183 149 152 -102 130 -150 218 23 229 33 234 -85
7365h5J04r2j06j6J23nJ09L79l08K00l76K42K1o0k01M4j91K33n5K5j12P6L08k60
$$ -85 19 -73 -179 -195 -72 -77 32 411 103 303 -73 169 190 130 -71 -27 -218 15 -40 -15 -127 -51 257 -3
7389cJ6k2O8j64R3J70r9K31j66m60K62N9J01j31K9m1L3L55o23O5M65q8k10K96
$$ -3 13 -9 59 -105 -12 158 59 290 124 -336 -74 -15 86 -45 -16 -57 -24 331 -292 -227 238 150 -60 236
7413B36k37j7K2k84J47p1J56K59j21j20k72N0J46J26m9M2P4k50M80n85J57K82
$$ 236 -1 -18 4 -280 -133 -204 -48 211 90 -30 -302 -252 -106 20 -29 13 87 -163 317 -268 -111 171
7435A71l09q6K45q1K9J97j68j29J54k0P8j3K74k15k87N91n54l9J90R6j01l36K4
$$ 171 -138 -224 21 -60 -31 166 -2 -131 23 3 81 68 342 127 -160 431 -123 -162 28 124 23 -313 -289
7458b89M38l03Q2oNJ41j65%J99q2J36j06q7l9J32J78N6l42j3J4j9K32p2j16P1
$$ -289 149 -154 -72 -78 -73 68 -97 -97 102 20 156 50 -37 -76 56 234 290 -52 -65 -51 -70 162 90 -26 45
7483D5L4R2k33j8Op4J84P1k32K3J45r6mk83M19Q4j63k98L79k45j41J92J87K5k24
$$ 45 79 171 -62 -80 -74 -148 36 107 -125 -102 43 -53 -57 -340 79 163 0 -298 81 -164 -305 -113 74 99 -125
7508a25L31l82k34M56l0j92J65o8r6K0J27j08K53k27J73M9M7O8m36J32K76O2n1
$$ -125 206 -176 -410 46 16 -176 -11 -79 -175 -155 -28 -136 117 -110 63 112 159 227 -209 -77 199 261 210
7531B10j06k20o2M51k69P5j38R5k16L67r9N4j66L68n62K02k91J96K17j13j17L69
$$ 210 104 -116 -178 273 4 79 -59 36 -180 187 88 142 -24 344 -218 -16 -307 -111 106 -7 -124 245
7553B45k52o5J00K29m32P3K6j02J99n8J62l75K29k75L18L6k4j71J39j39J04Q7
$$ 245 -7 -72 28 257 -175 -102 -76 -178 21 -37 125 -250 -21 -296 22 58 34 -137 2 -137 -33 54
7575E4j06o8lL54l24J3P7j40J94k2k2l9oj39O8M26j55l21J58K23m13M30k24J38
$$ 54 -52 -120 -123 231 -93 -80 -3 -143 51 29 7 -32 -38 -177 -109 317 162 -159 -1 222 -191 239 15 153
7599A53k75m3R5j1M0j53K22j42J57j25R8k0o8OK11j17Rj40p7M6J25J63q9Pm8n9
$$ 153 -122 -165 -70 -81 -41 -194 28 -114 43 -82 16 -4 -72 -66 145 28 37 -103 -180 -134 -9 154 65 72 24 -35
7625c5j46O1J8Q5q3J32k47J08K27J37k62Q1L77m30O7j75K59j41J72k44k29L21
$$ -35 -181 -120 -102 -17 -100 32 -215 -107 120 257 -5 76 453 23 90 -85 174 33 205 -39 -268 53
7647E3j02J12o7K8K2k35K22J51k68K4K21j51m5J96k82J81k19l03M31O7j46K01
$$ 53 -49 63 -4 24 46 -189 33 184 -84 -60 161 10 -35 161 -121 60 -159 -462 -31 36 -110 91
7669I1J29j28k13K44o2l23L28N5k2l08Q0L64k81j87N07l34lj41K85LL01j61k91
$$ 91 220 92 -121 123 61 -262 66 121 99 -209 -129 235 -46 -233 274 -60 -63 -204 81 84 385 224 -67
7692f7L07k47O3O7K8j95j04L41k73K61j07j08J76j52j94J18J1M57m02N1J51j47
$$ -67 240 -7 56 123 151 -44 -148 193 -80 181 74 -34 142 -10 -204 -86 -75 382 -20 31 182 35
7714C5n7k00J8J81l7J52j08j08J44J45K7l86n7M54R7k37PQ7k28J04k61M05k90
$$ 35 -22 -222 -204 -23 -60 92 -16 -124 20 165 192 -194 -251 203 300 63 70 157 -71 33 -228 177 -113
7737a13M35m70K20L2j80J97o4N15o30j21R7O6j21N5k41L48n0j27K91lR1k47j34
$$ -113 322 -148 72 104 -76 121 57 572 -58 -179 -82 -16 -137 -82 -323 25 -25 -152 139 136 227 -20 -154
7760a54o2K17K6J57l87K75J88k15O0j84L4L58l15P2q0J85k95NK03j69J71J8m29
$$ -154 -216 1 27 184 -203 72 260 45 105 -79 -45 313 -2 70 -10 175 -120 -115 88 -81 90 108 -321
7783c21M84J29j64N8k02K33k18o1K4J51k49J42k13J74J73m89K42M9J89l3j76J04
$$ -321 163 292 128 186 -16 217 -1 -62 -38 113 -136 6 -207 -33 140 -349 -107 -58 131 98 -78 26
7805B6j06K08L6K92m71J16k74J46NJ19J8q9K63j20j67m15N00j43L10k67j88L06
$$ 26 -80 128 164 456 -15 101 -173 -27 -22 97 115 26 289 169 2 -413 87 -56 254 -13 -201 105
7827A05J21k18l47L44q3K00p7k24K57k9O2l22r5K10mK19m2p9J71M7k87N4R3r3
$$ 105 226 8 -339 5 -78 122 45 -179 78 49 111 -211 -306 -96 -100 119 77 -2 169 216 -71 -17 76 -17
7851a7K1N1Lj28L3j43N52l70J47k10O7J67l96L09j73K52j67k4Q1J66j79j43KP3
$$ -17 4 55 58 -70 -37 -180 372 2 149 -61 6 173 -223 86 -87 165 -2 -26 55 221 42 -101 -99 -26
7875b6M44l45j79J95n1N9k55M9K57k92j8qj76N82j82l7P8o1J01R6j31j77K38j10
$$ -26 418 73 -106 89 38 97 -158 -109 148 -144 -162 -170 -346 236 54 17 95 34 135 231 100 -77 161 51
7899E1q4M2j70K55j41l7K78j80l3K19m00M94q9k77PR6l99K54J00j63j6r9L50j54
$$ 51 -33 9 -161 94 -47 -84 194 14 -19 200 -200 294 205 -72 -65 31 -368 -114 -14 -177 -193 -292 58 -96
7923i6k30L66k41L21r7j69R4J0k27L69J50k42J91o6l37J42J7j8k78K00l7J46Q5
$$ -96 -326 40 -201 120 23 -146 -52 -42 -269 100 250 8 199 133 -204 -62 -45 -63 -341 -141 -178 -32 53
7946E3L1q0k52O6qK10k4j6J92j75p4K3J15m30M4N95l82K59m38K22P4j20K82n9
$$ 53 84 4 -248 -182 -190 20 -4 -20 172 -3 -77 -54 61 -369 -325 270 -112 147 -291 -69 5 -115 167 108
7970A08r7k85K59n1K7K09j53N2j46J47m12J88M52l48j58R2rJ41j08K42N2n3N3
$$ 108 11 -274 -15 -66 -39 170 17 69 -77 70 -342 -154 298 -50 -208 -116 -125 16 -92 150 202 149 202
7993B02J2n22L28K47j58mk71p4J42K15k3kp1M9J43k48j0n9k13K05K93R1k92o7
$$ 202 214 -308 20 267 109 105 -166 -240 -98 117 94 92 21 70 213 -35 -45 -104 -317 -112 181 272 -20 -87
8017h7K34j61l9n5M37kn05L32j68q4m1J06%k62K02J18J02j65q4J28m25N46k07
$$ -87 147 -14 -53 -108 329 327 -178 154 -14 -98 -139 -33 -33 -295 -93 25 127 -38 -122 6 -419 127 -80
8040h0O3Q9k26J87j85K60j47J10j84L43k48K10k42J9j95J89J70K2nj89J61o6J82
$$ -80 -17 72 -154 33 -152 108 -39 71 -113 230 -18 192 -50 -31 -226 -37 133 155 150 -39 122 56 238
8063B38l07r5M43l62J32K99l18Q0j7k24N0j9R0K8q2K3J07O8p3j83J20q8J10K2
$$ 238 -69 -164 279 -83 49 348 30 110 93 -131 -81 -100 -10 18 -64 -41 66 134 61 -122 -2 -90 20 42
8087D2m4J00o6j67K97k97N0lJ05O2j42l1O2p4J50l58m7K89J5K09j8l64j29L42
$$ 42 -2 98 32 -135 162 -135 -85 -88 17 79 -63 -94 -32 -106 44 -314 -361 -72 -57 152 134 -230 -359 -17
8111a7K0N5J15j5p1k54K46K74m35p9K81J11k33k8j36L97j10j19L64l99o1o6L17
$$ -17 3 58 173 158 87 -167 79 353 -82 -161 120 231 -2 -30 -166 231 121 2 366 -33 -94 -160 157
8134A57Kj93j91L44j51K4k0l7J44r9K2J39k60J35l83L04Q4O8J30l16J75j58J55
$$ 157 159 -34 -225 119 -32 -8 -28 -65 79 -20 2 141 -119 16 -367 -63 21 89 219 -97 78 -80 75
8157G5Nj76kJ68j17R0j65mN4J57m7N8k04M52n8j16Rl1j85K60j4q5j98J54j33K67
$$ 75 80 -96 -98 70 -47 43 -122 -126 -72 85 38 96 -108 344 286 170 179 148 -37 223 209 124 -74 80 -53 214
8183B14J77m13j30L67j82j81O3K8
$$ 214 391 -22 -152 215 33 -148 -85 -57
8191e7
$$ Imaginary data points
##PAGE= N=2
##DATA TABLE= (X++(I..I)), XYDATA
0@%%%%%%JrJ6j6J7k5L2m0N2o0P2q8J04j21J45j71J96k26K61k99L42l90M42m99
$$ 0 0 0 0 0 0 0 1 -8 8 -8 9 -16 16 -24 28 -32 40 -48 56 -65 80 -91 105 -121 140 -159 183 -207 235 -264
30b64N63o35P11p96Q91r91J101j225J361j509J671j851K049k267K512k786L093
$$ -264 299 -336 375 -421 470 -521 580 -645 716 -793 878 -973 1076 -1191 1321 -1465 1628
47A628l442L843m306M848n499O292p281Q562j0290J2765j6627K3555l9808J45243
$$ 1628 -1814 2029 -2277 2571 -2928 3364 -3917 4645 -5645 7120 -9507 14048 -25760 119483
61A19483J05095k54801r654J24013J8100j20003K0110Q4428q205n6357M4602K1850
$$ 119483 224578 -30223 -39877 84136 102236 -17767 2343 86771 78566 22209 66811 88661
73H8661o4617j6591R3274j606j20635k4219J24458M2282q0072k1395O3358j3610
$$ 88661 24044 7453 100727 99121 -21514 -45733 78725 121007 40935 19540 82898 69288
85F9288o6251J6032M4085m7606l4116Q6536O4778q7402q2106O3044O8862n9549
$$ 69288 3037 19069 63154 15548 -18568 67968 132746 45344 -36762 26282 95144 35595
97C5595o4055M3315M9891k8532k6521K1483Q970j0320J7457K847o0574m0758N3003
$$ 35595 -28460 14855 64746 36214 9693 31176 40146 29826 47283 50130 -10444 -51202 1801
110A801N8703j7295k8065J4288l885l6551K642L1605j9354l2782L7891M2582m8740
$$ 1801 60504 43209 15144 29432 25547 -11004 -8362 23243 3889 -28893 8998 51580 2840
123B840n3554N2246O5516m4829p5575J0263M2953n130p892K1501m513k4571K2032
$$ 2840 -50714 1532 67048 22219 -53356 -43093 -140 -5270 -13162 8339 3826 -20745 1287
136A287K3773n5766n4537N6039P0573m3812o2484M6341N6832n0148n4050M4474
$$ 1287 25060 -30706 -85243 -29204 41369 -2443 -64927 -18586 38246 -11902 -65952 -21478
148b1478L6757n2538k6065N7121J4620o1751L595Q1493m30r1524j9359O5890P003
$$ -21478 15279 -37259 -63324 -6203 8417 -53334 -49739 31754 31324 -60200 -79559 -13669 -6666
161f666m7158J9495N4299k4418n1175K7206L5587m3760l2251N6005L1451o1536
$$ -6666 -53824 -34329 19970 -4448 -55623 -28417 7170 -36590 -68841 -12836 18615 -42921
173d2921l0990O6868L7654n4041k8033M2108L888n1099N247N7128l385m5851K0047
$$ -42921 -73911 -7043 30611 -23430 -51463 -9355 -5467 -56566 -51319 5809 2424 -43427 -23380
186b3380N0729k8223o0057J8310N2163j3006l6447J8843L0722j6599j4996K1806
$$ -23380 27349 -874 -60931 -42621 9542 -3464 -39911 -21068 9654 -6945 -21941 -135
198a35L460k9927J574L2486r236l5704J6053M8708j737l8157k019J8470j0887
$$ -135 3325 -26602 -25028 7458 -1778 -37482 -21429 27279 25542 -12615 -14634 3836 -7051
211g051j4213J9940J5081j5666k545K4703r50l0636m05K9801l2k7623L26K1746
$$ -7051 -21264 -1324 13757 -1909 -4454 20249 19299 -11337 -11742 18059 18027 -9596 -9270 12476
225A2476R22n304J5385K884k6673p746K6323L186l0096K031L9773P507l1915o775
$$ 12476 13398 8094 23479 26363 -310 -8056 18267 21453 -8643 -6612 33161 40668 8753 1978
239A978K2091l792j9717J0383J6105j6758j1661K9999J6668l1813j8406L1532
$$ 1978 24069 20277 560 10943 27048 10290 -1371 28628 45296 13483 -4923 26609
251B6609J5150l5631j8575L0017J7895j7882j559K0363j0186k6411J1070K3715
$$ 26609 41759 6128 -12447 17570 35465 17583 16024 36387 26201 -210 10860 34575
263C4575j8857k6572K4912L3917k0171l1720J7298K5772j8058k2854J2302J0231
$$ 34575 15718 -10854 14058 47975 27804 -3916 13382 39154 21096 -1758 10544 20775
275B0775j5341J159K6241j315k9095J766K7962q984l5365L199L3369K412k2398
$$ 20775 5434 6593 32834 31519 2424 4190 32152 23168 -12197 -8998 24371 26783 4385
288D385K464J6008q180j3477R005L617j9055m330K5287P861k2738o617K1945N641
$$ 4385 6849 22857 14677 1200 10205 13822 -5233 -9563 15724 23585 847 -5770 16175 21816
302B1816k3475j1140J1536L688n531O302Q110r354o971J1840L862k0639j2230
$$ 21816 -1659 -12799 -1263 2425 -3106 3196 11306 1952 -5019 6821 10683 -9956 -22186
315b2186J7400J3086j1656q291J0713O289p056l926J21q344o165J1750J0310j0186
$$ -22186 -4786 8300 -3356 -11647 -934 5355 -1701 -5627 -5506 -13850 -20015 -8265 2045 -8141
329h141q229J3240J1014j3553j5297L645P544l547q13O117j80l936O674O150j2963
$$ -8141 -16370 -3130 7884 -5669 -20966 -17321 -9777 -13324 -14137 -8020 -8200 -12136 -5462 688 -12275
344a2275j4780P454J3914m833j1063O347J2952j726p198r38k386p023K594J0111
$$ -12275 -27055 -19601 -5687 -10520 -21583 -15236 -2284 -4010 -11208 -12146 -14532 -21555 -18961 -8850
358h850k251q799O794J4967k849j6888l298R975J222o980O08O056J841K366N033
$$ -8850 -11101 -19900 -13106 1861 -988 -17876 -21174 -11199 -9977 -16957 -16349 -10293 -8452 -6086 -1053
373a053l434j1601j876R904K037r304o32J2123O935o033n046Q73l75k411J792
$$ -1053 -4487 -16088 -17964 -8060 -6023 -15327 -15959 -3836 3099 -2934 -7980 -7107 -7482 -9893 -8101
388h101P28k482K213J0853M413q697q588M249N999l731n925K564O512M535J381
$$ -8101 -7373 -9855 -7642 3211 7624 -1073 -9661 -5412 587 -3144 -9069 -6505 7 4542 5923
403E923j845l860k041L204J334n718l009P394R468j02o121j910L031R75k687l470
$$ 5923 4078 218 -1823 1381 2715 -3003 -6012 1382 10850 10748 4627 2717 5748 6723 4036 566
419E66r56L683O399L778k743m614K77L355r05n406k309M623P176J232l505k388
$$ 566 -390 3293 9692 13470 10727 6113 6390 9745 8840 3434 1125 5748 12924 14156 10651 8263
435H263K047K727k488n281k547L550O117K817k210l570K67L816o03o075m329M478
$$ 8263 10310 13037 10549 5268 2721 6271 12388 15205 12995 9425 9692 13508 12905 6830 2501 6979
451F979O441j83l138l06K624R70k841l683k328Q31M196L498k568l935K649M300
$$ 6979 13420 13237 10099 9793 12417 13387 10546 6863 4535 5366 9562 13060 10492 6557 9206 13506
467A3506k552n804k487K974K203M48L90j006j072J973K309m977o327J561O129
$$ 13506 10954 5150 2663 5637 7840 8288 8678 7672 6600 8573 10882 5905 -422 1139 7268
482G268M13m972p05M292K221k697l424k317j430K582L814j960m581K376N157j491
$$ 7268 7681 2709 2004 6296 8517 5820 2396 79 -1351 1231 5045 3085 -1496 880 6037 4546
498D546o963j348M874p61l285J488K666k969r81N127P70q767l023P112L470p270
$$ 4546 -2417 -3765 1109 348 -2937 -1449 1217 -1752 -2733 2394 3164 -5603 -8626 -1514 1956 -5314
514e314l177P557L097n421k682K530j853k925M514M160o880n554Q510O804q511
$$ -5314 -8491 -934 2163 -3258 -5940 -3410 -5263 -8188 -3674 486 -6394 -11948 -3438 3366 -5145
529e145p542P558O157q034n625P525M330o440q85P167j120j0695J402J1502j296
$$ -5145 -12687 -5129 1028 -7006 -12631 -5106 -776 -7216 -8101 -934 -2054 -12749 -11347 155 -1141
544a141j0936J213J1595p12r973M19P087j421l971L437K451p145j377R825L404
$$ -1141 -12077 -10864 731 19 -9954 -9535 -2448 -3869 -7840 -4403 -1952 -9097 -10474 -649 2755
559B755r916l772R993K952r859k840R115M362n717k352L373j632k734M718N296
$$ 2755 -7161 -10933 -940 2012 -7847 -10687 -1572 2790 -2927 -5279 -1906 -3538 -6272 -1554 3742
574C742m936n542L656N909k575m180K726L694r36k257j334n32J832N989P59o807
$$ 3742 -1194 -6736 -3080 2829 254 -3926 -1200 2494 1558 -699 -2033 -2565 -733 5256 6015 -792
590g92l087N914L855m713k415M374K433k298o48L72k772N44P766J792q880m640
$$ -792 -3879 2035 5890 1177 -1238 3136 5569 3271 2623 2995 223 767 8533 10325 1445 -3195
606c195Q589M749p243k859Q581K413q036k025N972j249m827P166P913r910j2004
$$ -3195 5394 10143 2900 41 8622 11035 2999 974 6946 5697 870 8036 15949 6039 -5965
621e965Q970J3559p113j2099Q374R935r068j0204Q649Q916p298m234Q778j89j3984
$$ -5965 3005 16564 9451 -2648 5726 15661 6593 -3611 5038 13954 6656 2422 11200 11011 -2973
636b973P26J6671J602j6432j561J5001o52j4954Q80J4595l19j2093K546P982p408
$$ -2973 -2247 14424 16026 -406 -1967 13034 12382 -2572 -1692 12903 12584 491 3037 11019 3611
651C611q226J1404R846j1159j0849R312Q478j0405p638J1919Q410j0465p949N697
$$ 3611 -4615 6789 16635 5476 -5373 3939 12417 2012 -5626 6293 14703 4238 -3711 1986
665A986L135n681J637R234k580j2420K68J0386l14q418K495Q347k792j0201m57
$$ 1986 5121 -560 1077 10311 7731 -4689 -4421 5965 5651 -2767 -272 8075 5283 -4918 -5375
680e375O861K277j830O9r12l851j795L466J954j127K16N67k032k621l74J576J755
$$ -5375 1486 3763 1933 2002 1090 -2761 -4556 -1090 864 -263 -47 520 -1512 -4133 -4507 -2931 -1176
697a176K754l54n471l571L322L970k277k68L565j854o255k41N317M74l601L777
$$ -1176 1578 1224 -4247 -7818 -4496 -526 -2803 -3071 494 -1360 -7615 -7856 -2539 -2065 -5666 -1889
713a889M953p724r205O558J0736l995q046M786N747q939p028J0221Q548q543n820
$$ -1889 3064 -4660 -13865 -7307 3429 -566 -8612 -3826 1921 -7018 -14046 -3825 4723 -3820 -9640
728i640Q755J997j3077k097J6375M952j4258n068J1055J604j1895J783J4113j041
$$ -9640 -885 1112 -11965 -14062 2313 7265 -6993 -12061 -1006 598 -11297 -9514 4599 3558
742C558j2712O63R376m936q070J0153J1541j0275j2957P867J0620q275p775J2407
$$ 3558 -9154 -8491 885 -4051 -12121 -1968 9573 -702 -13659 -5792 4828 -3447 -11222 1185
756A185Q607j3011j0223J0828Q613q624m418J1070K923j3131n121J1855O032p546
$$ 1185 9792 -3219 -13442 -2614 5999 -2625 -7043 4027 6950 -6181 -11302 553 6585 -961
770i61j724P382j713r102P98Q793M60m801K295L940n269o022N858P464k207n975
$$ -961 -2685 4697 2984 -6118 -5320 3473 3933 -868 1427 5367 98 -5924 -66 7398 5191 -784
786g84J263K543k268j859M144M001j329k931j689l40o03J623L427K542j889m084
$$ -784 479 3022 754 -1105 3039 7040 5711 2780 1091 751 148 1771 5198 7740 5851 1767
802A767j379K665K167j425j060K550J917m837m322M939P148k219n921J030K478
$$ 1767 388 3053 5220 3795 2735 5285 7202 2365 -1957 2982 10130 7911 1990 3020 5498
817E498m106l152O790N812m118m938L178Q80o153p90Q540K353q230j729O936m89
$$ 5498 1392 -1760 5030 10842 6724 1786 4964 5844 -309 -1099 7441 9794 1564 -165 6771 6282
833F282p158K885R008l486j1979J452J0434j515q092M793R255n483j1414K565
$$ 6282 -876 2009 11017 7531 -4448 -2996 7438 5923 -2169 2624 11879 6396 -5018 -2453
847b453Q760l481n826O292N874p404o544O947N055p555m075P730K606r323l865
$$ -2453 6307 2826 -3000 3292 9166 1762 -4782 2165 7220 -335 -4410 3320 5926 -3397 -7262
862g262R947N071p317l199N180j125q255N61Q981J372n892K75M138l377n896K874
$$ -7262 2685 7756 439 -2760 2420 1295 -6960 -6399 2582 3954 -1938 -1663 2475 -902 -6798 -3924
878c924O371k445n787J403M399j185l059L591K319m428m601J349L373q61n06K779
$$ -3924 2447 2 -5785 -4382 17 -1168 -4227 -636 1683 -2745 -7346 -5997 -2624 -3485 -3991 -1212
894a212J552k483l106q6J042k63k55J250O21n18m86N32L22o55j220n8J135p98
$$ -1212 340 -2143 -5249 -5335 -4293 -4556 -4811 -3561 -2940 -3458 -3944 -3412 -3090 -3745 -4965 -5023 -3888 -4686
912d686k069Q55M570K157l644l207R25O27k426K59M167K462l161j524J694M43
$$ -4686 -6755 -5900 -1330 827 -2817 -6024 -5099 -4472 -6898 -6639 -2472 -10 -3171 -4695 -3001 -2558
928b558k364Q58K469j892m259K188N925P9l730P10K687k897m582K639M862q90
$$ -2558 -4922 -4064 -1595 -3487 -7746 -5558 367 446 -3284 -2574 113 -2784 -7366 -4727 135 -755
944g55l015K814L596l775l360L275J964l624k507N306L459l645k445L678J858
$$ -755 -3770 -956 2640 -1135 -4495 -1220 744 -2880 -5387 -81 3378 -267 -2712 966 2824
959B824l659j243K723M5l633J209N159J073l320m65K001j837l335J811M471j64
$$ 2824 -835 -2078 645 690 -2943 -1734 3425 4498 1178 713 2714 877 -2458 -647 3824 3660
975C660k934R82K211o89j515J168Q30k714j970K973K746m45q21J077K40k733j628
$$ 3660 726 1708 3919 3230 1715 2883 3713 999 -971 2002 4748 4303 3482 4559 4799 2066 438
992D38K077J255q95l20J253J109j26m41m47q29j222K87J190N35L05K37j55k83
$$ 438 2515 3770 2875 2555 3808 4917 4791 4350 3903 3074 1852 2139 3329 3864 4169 4406 4251 3968
1010C968k35k89j55q63l27k00J344J603M78j289j295n41k12q6M02M22M35m80J62
$$ 3968 3733 3444 3289 2426 2099 1899 3243 4846 5324 4035 2740 2199 1987 1901 2303 2725 3160 2680 2842
1029B842N81Q3j282k52n07r79m70J973J767o29j789l21R18o95j280M2N99n11m8
$$ 2842 3423 3506 2224 1972 1465 486 16 1989 3756 3127 1338 1017 1935 1240 -40 2 601 90 42
1048D2J303N78p98j088K37j042j170J28J807N62j148l61P18O18r66j018p01o20
$$ 42 1345 1923 1125 37 274 -768 -1938 -1810 -3 559 -589 -950 -232 386 -580 -1598 -2299 -2919
1066b919L91J017J142l20r66O79J28j726j333Q28R54J90p27K54R86N57r57j114
$$ -2919 -2528 -1511 -369 -689 -1655 -976 -848 -2574 -3907 -3079 -2125 -1935 -2662 -2408 -1422 -865 -1822 -2936
1084b936j072m54P14J441k8k64l7Q99j04r02j162RK58R7k53P37P58R50l16r27
$$ -2936 -4008 -4462 -3748 -2307 -2335 -2599 -2636 -1737 -1841 -2743 -3905 -3896 -3638 -3541 -3794 -3057 -2299 -1349 -1665 -2592
1104b592j327o7K23Q79k97J54Q28J172L6j013j144j90L45p9P2L19J173Q00J7q15
$$ -2592 -3919 -3986 -3763 -2884 -3181 -3027 -2199 -1027 -991 -2004 -3148 -3338 -2993 -3072 -3000 -2681 -1508 -708 -691 -1506
1124a506q98m4L0O5j42J86P61J208P27n73p50o83n2N5n9K43J036O54Q62j78p07
$$ -1506 -2404 -2448 -2418 -2353 -2495 -2309 -1548 -340 387 -186 -936 -1619 -1671 -1616 -1675 -1432 -396 258 1120 942 235
1145B35r49M69j54o38j57J537J556N11r36k07m21j85n03l67N57R84J31J095N63
$$ 235 -714 -245 -399 -1037 -1194 343 1899 2410 1474 1267 846 661 158 -209 348 1332 1463 2558 3121
1164C121j19j163l31l1m56m25O41J344Q75j7j84o6n39q29o00K81k0J211J324N5
$$ 3121 3002 1839 1508 1477 1021 596 1237 2581 3456 3439 3255 3189 2650 1821 1221 1502 1482 2693 4017 4072
1184D072n76l43L7l61j443n10J105Q69l2M54J316P7j725j013J41j2o54L0J790
$$ 4072 3496 3153 3190 2829 1386 876 1981 2850 2818 3272 4588 4665 2940 1927 2068 2056 1402 1432 3222
1203C222J295p66p15L10k91j145j234L29O91P29m9R55L33o55r15m08r10j012Q90
$$ 3222 4517 3751 3036 3346 3055 1910 676 1005 1696 2425 2376 3331 3664 3009 2094 1686 776 -236 654
1222F54J182M84j88Q19m6j560j213k87P29n78p44J498J827n85j530J19J210j321
$$ 654 1836 2320 2132 2951 2905 1345 132 -155 574 -4 -748 750 2577 1992 462 581 1791 470
1240D70k419k2J910M07n68N17J149n67j947p56N9J27q35J146J588j59j069J4P00
$$ 470 -1949 -1971 -61 346 -222 295 1444 877 -1070 -1826 -1767 -1640 -2475 -1329 259 100 -969 -955 -255
1259b55j143j417J34N08j99JJ060J407j334p42M92j25k225j250K287K385j156
$$ -255 -1398 -2815 -2681 -2173 -2372 -2371 -1311 96 -1238 -1980 -1488 -1613 -3838 -5088 -2801 -416 -1572
1276a572j165J658O98k093k109J394J321j476q69K039J195j274o80J722K39l118
$$ -1572 -2737 -1079 -381 -2474 -4583 -3189 -1868 -3344 -4213 -2174 -979 -2253 -2933 -1211 -972 -4090
1292d090j009J504J429p34K49K147O61k496j308R79j19j165J229K535j051j885
$$ -4090 -5099 -3595 -2166 -2900 -2651 -504 157 -2339 -3647 -2668 -2787 -3952 -2723 -188 -1239 -3124
1308c124Q77K260m30k696K45K059r52j938J402L068k24j556k81Q44j394j852J635
$$ -3124 -2247 13 -417 -3113 -2868 -809 -1761 -3699 -2297 771 547 -1009 -1290 -446 -1840 -3692 -2057
1325b057K942n09j493O73J631j145k074Q19K011Lk576O13K010O0m93J128J114
$$ -2057 885 376 -1117 -444 1187 42 -2032 -1213 798 801 -1775 -1162 848 908 415 1543 2657
1342B657k181j968O48J923n48o64K255J854j842l002P85K322p15j559J504J198
$$ 2657 476 -1492 -844 1079 531 -133 2122 3976 2134 -868 -83 2239 1524 -35 1469 2667
1358B667j491q22J982J938k236j799J537J135k588j287M005K593k170k792J291
$$ 2667 1176 354 2336 4274 2038 239 1776 2911 323 -964 3041 5634 3464 672 1963
1373A963J189k616r12L196J783k952j072K761M42k746k11L312q6m095j144L732
$$ 1963 3152 536 -376 2820 4603 1651 579 3340 3782 1036 825 4137 4051 -44 -1188 2544
1389B544J275j954k6K653j192m125J0L241q4k085J657K801k139l991J193L779
$$ 2544 3819 1865 1839 4492 3300 -825 -815 2426 2342 257 1914 4715 2576 -1415 -222 3557
1405C557j235k904J006K168j370k499K185K705j254k534J73J208k347j134K892
$$ 3557 2322 -582 424 2592 1222 -1277 908 3613 2359 -175 -2 1206 -1141 -2275 617
1420F17K724j348k852J041N14j552j166K139J673j684j823J121R28q79q91J920
$$ 617 3341 1993 -859 182 696 -856 -2022 117 1790 106 -1717 -596 332 -547 -1438 482
1436D82P82l261j812J947K220o58q05J086N09k332k207J423K103m39q79R16P32
$$ 482 1264 -1997 -3809 -1862 358 -300 -1105 -19 490 -1842 -4049 -2626 -523 -962 -1841 -925 -193
1453a93k134j547K744J917k499k201J522J709k197r86L123J888k706k392J501
$$ -193 -2327 -3874 -1130 787 -1712 -3913 -2391 -682 -2879 -3865 -742 1146 -1560 -3952 -2451
1468b451N67k184K88M127N22l410j551L243J19l053Q7L738j1m118n7L660P16k421
$$ -2451 -1884 -4068 -3780 347 869 -2541 -4092 -849 -730 -3783 -3696 42 31 -4087 -4144 -484 232 -2189
1486b189O7K655k002m075J622M371p0k945J589K257k688l223J894L387j080k051
$$ -2189 -2122 533 -1469 -5544 -3922 449 379 -2566 -977 1280 -1408 -4631 -2737 650 -430 -2481
1502b481J479J926k141k011L509J376k766k180K272J555k173p97L653J900k818
$$ -2481 -1002 924 -1217 -3228 281 1657 -1109 -3289 -1017 538 -1635 -2432 1221 3121 303
1517C03k128J332P14j725qL007N72k431l10J464O87j971Q2J835o1j549p81J715
$$ 303 -1825 -493 221 -1504 -1512 1495 2067 -364 -674 790 1477 -494 -412 1423 1362 -187 -968 747
1535G47J723o21q57M71k59j544n38J666J360l11r8K82j86j430k40J763N52j287
$$ 747 2470 1849 992 1463 1204 -340 -878 788 2148 1837 1739 2021 1835 405 165 1928 2480 1193
1553A193q34J410Q59j205m81J984L24k482q67J656Q14j478M2K670Q9k550j298
$$ 1193 359 1769 2628 1423 942 2926 3250 768 -99 1557 2371 893 935 3605 3694 1144 -154
1570a54J840Q08j807m28K773k8k407j28K496o3k610J32J961j007k374J277K937
$$ -154 1686 2494 687 259 3032 3004 597 469 2965 2902 292 424 2385 1378 -996 281 3218
1587C218k21k671P95J087j642k031J738K508j502j528J656R42k129j522K489J258
$$ 3218 2997 326 1121 2208 566 -1465 273 2781 1279 -249 1407 2349 220 -1302 1187 2445
1603B445k773j163J735J585j939n11K165O07k844j002J637O57j754M20J955J16
$$ 2445 -328 -1491 244 1829 -110 -621 1544 2151 -693 -1695 -58 599 -1155 -735 1220 1336
1619A336j913l92Q50j82j187M21J031o40q93N56J065o92p73P40K96j511p74J437
$$ 1336 -577 -969 -119 -301 -1488 -1067 -36 -676 -1569 -1013 52 -640 -1413 -673 -377 -1888 -2662 -1225
1637a225J115k13q16Q6l7l75o59K13R83j70k41M0l23N90m91m46P91m11k67m48
$$ -1225 -110 -323 -1139 -1053 -1090 -1465 -2124 -1911 -928 -1098 -1339 -1299 -1622 -1032 -1523 -1969 -1178 -1589 -1856 -2304
1657b304M52Q51l7o64K11Q97j141n14K44J087l80m80J005N4r36m19J132n9q16
$$ -2304 -1852 -1001 -1038 -1702 -1491 -594 -1735 -2249 -2005 -918 -1298 -1778 -773 -719 -1655 -2074 -942 -1001 -1817
1676a817J11R29K52j291M75J308n94j131J36J319n41r90P89J406o63j194P83J011
$$ -1817 -1706 -777 -525 -1816 -1341 -33 -627 -1758 -1622 -303 -844 -1834 -1045 361 -302 -1496 -713 298
1694B98j344m85N71J335o01j014J134O73p84l75J024lj071k8J530l01q90L34J261
$$ 298 -1046 -1531 -960 375 -226 -1240 -106 567 -217 -592 432 429 -642 -670 860 559 -331 3 1264
1713A264k43j413M89N56r3m54M21P07o45m26P34N28q65o74Q57N26n67r3J64O08
$$ 1264 1021 -392 97 653 560 106 527 1234 589 163 897 1425 560 -114 743 1269 702 609 773 1381
1733A381j51k66K79j88m06N82K08m04O2L09K66l78J0J16k3k33P7K05J59j80J02
$$ 1381 1230 964 1243 1055 649 1231 1439 1035 1097 1406 1672 1294 1304 1420 1397 1164 1241 1446 1605 1425 1527
1754A527K38o35j70K37M37m38m13K11N75l23j58K83l29n17L32J58N2p09N72N97
$$ 1527 1765 1130 960 1197 1634 1196 783 994 1569 1246 1088 1371 1042 525 857 1015 1067 358 930 1527
1774A527m76o65P10j74n25l9L12K01n41J26M41J5p09J89K77op84jN20j3l08j6
$$ 1527 1051 386 1096 922 397 358 670 871 330 456 897 912 203 392 669 663 -121 -122 398 385 77 61
1796F1R8j47k15K28L63r37m0O95J79r06l3K26L47m04k06K89j59k37K23N60l66
$$ 61 159 12 -203 25 388 -549 -589 106 285 -621 -654 -428 -81 -485 -691 -402 -561 -798 -575 -15 -381
1817c81m98l2L81n85j61M88J83k57n37N63j91m8j4J13J77m92K13K53Pl01m64L81
$$ -381 -879 -911 -530 -1115 -1276 -788 -605 -862 -1399 -836 -1027 -1075 -1089 -976 -799 -1291 -1078 -825 -818 -1119 -1583 -1202
1839a202m5l07L72RJ6k14K44O2r3k77N84J88n50o0m8N07Oj63P8k7p7nN6j14q1
$$ -1202 -1247 -1554 -1182 -1173 -1157 -1371 -1127 -1065 -1158 -1435 -851 -663 -1213 -1273 -1321 -814 -808 -971 -893 -920 -997 -1002 -946 -1060 -1141
1864a141J26L42j00K88m27J66j0k8K11pq7N33n80P8J42J93K53k11l14N15o2k22
$$ -1141 -1015 -673 -773 -485 -912 -746 -756 -784 -573 -580 -667 -134 -714 -636 -494 -301 -48 -259 -573 -58 -120 -342
1886c42M42l2j85j0M12q2k72j9M87j42k05K1N49p8m03K41k2j63j1N62m5j59j56
$$ -342 100 68 -117 -127 285 203 -69 -88 399 257 52 73 622 544 141 382 360 197 186 748 703 544 388
1909C88K39P82l29l59l87J78K20k52M53O5Pl92Q2N57m95K5K60K63m92m07N26L35
$$ 388 627 1409 1080 721 334 512 732 480 933 998 1005 613 695 1252 757 782 1042 1305 813 406 932 1267
1931A267O6n48R5K77j53j32J47M6J45l31K49K16m11n40M87N64p09l89N47N39p78
$$ 1267 1333 785 880 1157 1004 872 1019 1065 1210 879 1128 1344 933 393 880 1444 735 346 893 1432 654
1952F54m59M77L68k95j20L70n02l41K8P35J37j021q7Q94k02p88l2J093K01j336
$$ 654 195 672 1040 745 625 995 493 152 180 915 1052 31 -56 838 636 -152 -184 909 1110 -226
1972b26k57R25q7p08N00M97m89r51K85J025m98r68Q46O62l17r82L92K67n8o23
$$ -226 -483 442 355 -353 147 644 155 -796 -511 514 16 -952 -106 556 239 -743 -351 -84 -142 -765
1992g65N87K64n99o00O28M92p38j84M64P0o08j94O50J60j28p49M03O9k58ON30
$$ -765 -178 86 -513 -1113 -485 7 -731 -915 -451 -381 -989 -1183 -533 -373 -501 -1250 -847 -778 -1036 -1030 -500
2013e00J01j78o51K90M04m26k55K17N99m67o05L98O09l54L8J39J05p10l67O86
$$ -500 -399 -577 -1228 -938 -534 -960 -1215 -998 -399 -866 -1471 -1073 -464 -818 -780 -641 -536 -1246 -1613 -927
2033i27J55k8m79R16L63r55n08P21O79p82l99J22P15n05k02R14N17p36q33R68
$$ -927 -772 -800 -1279 -363 0 -955 -1463 -742 -63 -845 -1244 -1122 -407 -912 -1114 -200 317 -419 -1252 -284
2053b84L82j198r2J549L06j318n97J001K77j033J45J473j72j499M37J168l77j162
$$ -284 98 -1100 -1192 357 663 -655 -1252 -251 26 -1007 -862 611 439 -1060 -623 545 168 -994
2071i94Q33J156r50j259M40J558j88r64P43Q58r31j506J341J105r62k32P96O06
$$ -994 -161 995 45 -1214 -774 784 596 -368 375 1233 302 -1204 137 1242 280 48 844 1450
2089A450j359p47J719P42j410p51J209n7q16J49J105M1o35l68M18l02m25L26J421
$$ 1450 91 -656 1063 1805 395 -356 853 796 -20 129 1234 1275 640 272 690 388 -37 289 1710
2108A710k67r24m30J065k38m09j27P64J50r97j42O33N09n76J3M64l12n94j12M81
$$ 1710 1443 519 89 1154 916 507 380 1144 1294 297 155 788 1297 721 734 1198 886 292 180 661
2128F61N19j82m93O41j35o42m20L66R66m84n85J52L85j69j73P12k38o63n26O81
$$ 661 1180 998 505 1146 1011 369 -51 315 1281 797 212 364 749 580 407 1119 881 218 -308 373
2148C73O2o47R1J654j09j687o51J056M49j251M98J001k90j483J64J624m48j417
$$ 373 435 -212 -121 1533 1424 -263 -914 142 591 -660 -162 839 549 -934 -770 854 406 -1011
2166a011O39J225r59j489R32J401o00j100O74O00j109r94J474R84o83j120J007
$$ -1011 -372 853 -106 -1595 -663 738 138 -962 -288 312 -797 -1791 -317 667 -16 -1136 -129
2183a29Q24j822p44J538R24j437n82Q85P39j167m41J545j8j137j42P62l3q11K33
$$ -129 695 -1127 -1871 -333 591 -846 -1428 -543 196 -971 -1412 133 115 -1022 -1164 -402 -435 -1246 -1013
2202a013J353m96j137l23J546l76j019N04R96j89r78L34K55K84o40J30P50r59
$$ -1013 340 -156 -1293 -1616 -70 -446 -1465 -961 35 -154 -1132 -798 -543 -259 -899 -769 -19 -978
2220i78j99O21N54j08m28K08k09l1m01K21M63J45j33m75K62lj48K01L56J09o93
$$ -978 -1177 -556 -2 -110 -538 -330 -539 -570 -971 -750 -287 -142 -275 -750 -488 -491 -639 -438 -82 27 -666
2241f66m23R20J79o00L26M39L36j056k09J010q7k58j77R80k91q38J33P94l22n39
$$ -666 -1089 -169 10 -590 -264 175 511 -545 -754 256 169 -89 -266 714 423 -415 -282 512 190 -349
2261c49O09N37k06j032O08J078q49p49J37J231q66n56J112Q22q18q29O55K24o52
$$ -349 260 797 591 -441 167 1245 396 -353 -216 1015 149 -407 705 1527 709 -120 535 759 107
2280A07k66J068M92j347n22J207L51r19k11J146K41j391l2J014j08q19O57R46
$$ 107 -159 909 1401 54 -468 739 1090 171 -40 1106 1347 -44 -76 938 830 11 668 1614
2298A614r87p94J30J203m92m57M85L69l13o22J57J49q1l16O98K46q40p5O81K71
$$ 1614 627 -167 -37 1166 674 217 702 1071 758 136 293 442 361 45 743 989 149 74 755 1026
2318A026r53J2K49K6l56J93m8O06k56j8j69j48P4j0j49j00j59K42j22L87m41R9
$$ 1026 73 85 334 360 4 197 149 755 499 481 312 164 238 228 79 -21 -180 62 -60 327 -114 -15
2340a5j03K73j43l79j58J89P42m36m1k03k2k21j32M06J17k82J12M36k34o17RN11
$$ -15 -118 155 12 -367 -525 -336 406 -30 -71 -274 -296 -517 -649 -243 -126 -408 -296 140 -94 -711 -702 -191
2362a91r0o51j40R31P7n06J18K14j94l01K89r9m62Q3N17L82n21l33O23jm16k63
$$ -191 -281 -932 -1072 -141 -64 -570 -452 -238 -432 -733 -444 -543 -1005 -922 -405 -23 -544 -877 -254 -255 -671 -934
2384i34K25M68m59L5K80qj46r9O09l53p77M50M70J40m85J72N98o75m91P19l09
$$ -934 -709 -241 -700 -665 -385 -393 -539 -638 -29 -382 -1159 -709 -239 -99 -584 -412 186 -489 -980 -261 -570
2405e70k98O37P5L72p83k5O44M1o46l83P53O7l90L89O9K04l42K91m16l98J65L75
$$ -570 -868 -231 -156 216 -567 -592 52 93 -553 -936 -183 -116 -506 -117 -48 156 -186 105 -311 -709 -544 -169
2427a69L51n7j63K2M26j82r6k67k03L78Q3J69l23J34M16K8k85J03k64L74R2J35
$$ -169 182 125 -38 -16 410 228 132 -135 -338 40 123 292 -31 103 519 547 262 365 101 475 567 702
2449G02o75N04j57K74k51l65J29O58m55j57j5K80L04m54K46r5j77K01J00Q3j36
$$ 702 27 531 374 648 397 32 161 819 364 207 192 472 776 322 568 473 296 497 597 680 544
2470E44j63O56k69l96n01N57j00J22k34J16JL04n9r0l13m5j0N22j40m16M1M48
$$ 544 381 1037 768 372 -129 428 328 450 216 332 333 637 578 488 175 130 120 642 502 86 127 575
2492E75J53r13L37J67n9J3J93l7n35J4L34L14p79K05M10J58o85j83K94K32P3K0
$$ 575 728 -185 152 319 260 273 466 429 -106 -92 242 556 -223 -18 392 550 -135 -318 -24 208 281 301
2514C01p5k82K81K9l32l62J9M59J84j38m57J95J01J69m17j23J37L09j55J61k82
$$ 301 226 -56 225 254 -78 -440 -421 38 222 84 -373 -178 -77 92 -325 -448 -311 -2 -157 4 -278
2535b78l60L48K16l75k94J94L84R6k11j22j54K14K79k08m26J04K07L19k58j56
$$ -278 -638 -290 -74 -449 -743 -549 -165 -69 -280 -402 -556 -342 -63 -271 -697 -593 -386 -67 -325 -481
2555d81j11L13K23l13n4m61M69J91%l26J85J41k88M11o07K95J68j78M45n33o3
$$ -481 -592 -279 -56 -369 -423 -884 -415 -224 -224 -550 -365 -224 -512 -101 -708 -413 -245 -423 22 -511 -574
2576e74M33k83L43m24L5J62K53j82o5j23L29L5n20L43j70Q3Q8L33l28m35M01O28
$$ -574 -141 -424 -81 -505 -470 -308 -55 -237 -302 -425 -96 -61 -581 -238 -408 -325 -237 96 -232 -667 -266 362
2598C62n98m18j3M05L84k6j49P0M1l35L37o2k13J41K84j8j62l1K9N18l75m40P5
$$ 362 -236 -654 -667 -262 122 96 -53 17 58 -277 60 -2 -215 -74 210 192 30 -1 28 546 171 -269 -194
2621a94M65o8K53o22L61M33k51l5j65j74J36J1M79k21m23M29R8kn65K20L15N0
$$ -194 271 203 456 -166 195 628 377 342 177 3 139 150 629 408 -15 414 512 510 -55 165 480 530
2643E30j99r3l0K86l5K15l97k36J22r1O90n66r0R4M33M4p07j16K12M72l30J79
$$ 530 331 238 208 494 459 674 277 41 163 72 762 196 106 200 633 677 -30 -146 66 538 208 387
2665C87k12m1J82R4p7l10L7L67N9k60n00L99M94k77r9j30k73J76Q5l17K21j36
$$ 387 175 134 316 410 333 23 60 427 486 226 -274 125 619 342 243 113 -160 16 101 -216 5 -131
2687a31N41j49k29j52k66O61O2o85M9K30L54r5l70K52k9j4j81m9j19l5L24N62
$$ -131 410 261 32 -120 -386 275 337 -348 -299 -69 285 190 -180 72 43 29 -152 -201 -320 -355 -31 531
2709E31m44m89K57j9M03o17j15N52k15Q4m37J90K96l22J68k29r7j48L85M71k19
$$ 531 87 -402 -145 -164 239 -378 -493 59 -156 -72 -509 -319 -23 -345 -177 -406 -503 -651 -266 205 -14
2730a4o11J22L79k12J44m43N32j95k08J57M0o9k00N19Lm28k86L94M13n02K5j20
$$ -14 -625 -503 -124 -336 -192 -635 -103 -298 -506 -349 -309 -378 -578 -59 -56 -484 -770 -376 37 -465 -440 -560
2752e60P34o32l65M30K20j72J0K05j2n27J71M27K70q51K08M57J20n32M4O21J95
$$ -560 174 -458 -823 -393 -173 -345 -335 -130 -142 -669 -498 -71 199 -652 -444 13 133 -399 -355 266 461
2773D61m10k89J74k22J07J36L65j62l74k38Q00l21o33K66M31K54m67J77k77L59
$$ 461 51 -238 -64 -286 -179 -43 322 160 -214 -452 348 27 -606 -340 91 345 -122 55 -222 137
2793A37j25rO0p7m16O73o9j44l2M9M68n60m87L01M42K58n22K69l1r9oL12J19j98
$$ 137 12 3 63 -14 -430 243 174 30 -2 47 515 -45 -532 -231 211 469 -53 216 185 86 80 392 511 313
2817C13j95J80j07n3l48N44M82p45j28J59L12k56m2J42J88j93k98K33M67n14J53
$$ 313 118 298 191 138 -210 334 816 71 -57 102 414 158 116 258 446 253 -45 188 655 141 294
2838B94m8L76n40j46L04N20m5p51L57N0k90l7M33j67k84Q4N08l8r76J81O90k6
$$ 294 246 622 82 -64 240 760 715 -36 321 371 81 44 477 310 26 110 618 580 -396 -215 475 449
2860D49l49l29N65J52p81J08N73O6k95j89k2O3k67O41L00m32o52k6P30k09m96
$$ 449 100 -229 336 488 -293 -185 388 454 159 -30 -52 11 -256 385 685 253 -399 -425 305 96 -400
2881d00L16M95k59l47j12O31j95j12m8N09p30m87N87J73k96o8K61K85n11j54K08
$$ -400 -84 411 152 -195 -307 324 129 17 -31 478 -252 -739 -152 21 -275 -343 -82 203 -308 -462 -254
2902b54Q38n32k83K50j0m81r3N60O8l4n67M16K20o98J01K88M72l13p16O51K34
$$ -254 584 52 -231 19 9 -472 -565 -5 63 29 -538 -122 98 -600 -499 -211 261 -52 -768 -117 117
2923A17k34l26L17q8j79K05k04K02j37j09L71K41p03n8L98N10q26K2J18K13m80
$$ 117 -117 -443 -126 -214 -393 -188 -392 -190 -327 -436 -65 176 -527 -585 -187 323 -503 -481 -363 -150 -630
2944f30P3M86L46o76P5O52o41j61o7M25M62r46p9P99l43n9j33K50N17n95K30j49
$$ -630 -557 -71 275 -401 -326 326 -315 -476 -543 -118 344 -602 -681 118 -225 -284 -417 -167 350 -245 -15 -164
2966a64m8J38o8M14l61l49L93L61j42j88p6M78m39o5M9K92P6n78O41k15j59k37
$$ -164 -212 -74 -142 272 -89 -438 -45 316 174 -14 -90 388 -51 -116 -67 225 301 -277 364 149 -10 -247
2988b47J37L59l73L9L71n9l28m4K31J75k68o1M2K58K0rj6J23l12J13L78k03k27
$$ -247 -110 249 -124 -85 286 227 -101 -145 86 261 -7 -68 -26 232 252 243 227 350 38 151 529 326 99
3011I9J86L95l24l90K0J15K20l5j15K80l16L7j81K65J02n18N8M93Q2n36o7K32
$$ 99 285 680 356 -34 -14 101 321 286 171 451 135 172 -9 256 358 -160 -102 391 473 -63 -130 102
3033A02K52j43k27J03J47r4kJ72k35n7J97P5j19j4n1K97p3l06p0O17j11m57K6
$$ 102 354 211 -16 87 234 140 138 310 75 18 215 290 171 157 106 403 330 24 -46 571 460 3 29
3056B9P2L48m44m5j34J38K05j13L06j96k96K66Q1N6m89L10k6Q6m29J41K92m29
$$ 29 101 449 5 -40 -174 -36 169 56 362 166 -130 136 217 273 -216 94 68 154 -275 -134 158 -271
3078b71J9J26M8j00k09K93qJ08l72O0J09J51kO8Q3k69j50K01l03M25j49k51K41
$$ -271 -252 -126 -78 -178 -387 -94 -102 6 -366 -306 -197 -46 -48 20 103 -166 -316 -115 -418 7 -142 -393 -152
3101a52q9k5J0K95o35N87j06p6K6n4P5j35L58k60J26p30N95K12r3j36k63M18l64
$$ -152 -241 -266 -256 39 -596 -9 -115 -191 -165 -219 -144 -279 79 -181 -55 -785 -190 22 -71 -207 -470 -52 -416
3124d16J83M5l05L20J97J57l73m61O61l1On1omk24L92m32K40J02K19K9p29Q0K93
$$ -416 -233 -188 -493 -173 24 181 -192 -653 8 -23 -17 -68 -74 -78 -302 90 -342 -102 0 219 248 -481 -401 -108
3148a08L22k77L0j45o6L88k82J50L36m44J52k5k36M3K44J52ml61K8K0J25J04K9
$$ -108 214 -63 -33 -178 -244 144 -138 12 348 -96 56 31 -205 -162 82 234 230 -131 -103 -83 42 146 175
3171A75j98J00Qj00K04m59J14O43l94J7J25k16L29k60n1K43k58J39J11m05M5j0
$$ 175 -23 77 85 -15 189 -270 -156 487 93 110 235 19 348 88 37 280 22 161 272 -133 -88 -98
3193i8O11R1o49N3PL48J86n06K77j86K77k23j27N8k7J19K78j60k67P8K75k37k03
$$ -98 513 604 -45 8 15 363 549 43 320 134 411 188 61 119 92 211 489 329 62 140 415 178 -25
3216b5P8J14K61m16R4o2L08n8J71k10jl17J01J75Q9k02M0J11o7l33j57K18L78
$$ -25 53 167 428 12 106 44 352 294 465 255 254 -63 38 213 302 100 140 251 184 -149 -306 -88 290
3239B90k18j29J67j14r7J37M1j54K05J43m14K16k07J7l8N85m99j20K41k08K14
$$ 290 72 -57 110 -4 -101 36 77 -77 128 271 -143 73 -134 -117 -155 430 -69 -189 52 -156 58
3260E8k39j32L63P1p9k38Nn7J57J55L1l77J60L5Pp0Ok18N5M65o53K24P1Qj44R3
$$ 58 -181 -313 50 121 42 -196 -191 -248 -91 64 95 -282 -122 -87 -80 -150 -144 -362 -307 158 -495 -271 -200 -192 -336 -243
3286b43J53l38K15K01jQk43J34j35K93j06j38o1QJ75l8j05j73L49n5j69r4L33
$$ -243 -90 -428 -213 -12 -13 -5 -248 -114 -249 44 -62 -200 -261 -253 -78 -116 -221 -394 -45 -100 -269 -363 -30
3309c0j44L3q4J98n2J53j54j92K2P0k8N7M34n92L11J30%o37L18J20l7O5j94J47
$$ -30 -174 -141 -225 -27 -79 74 -80 -272 -250 -180 -208 -151 283 -309 2 132 132 -505 -187 -67 -104 -39 -233 -86
3333h6Q4k3R5Q1l8k10J56k08K40K7k31J81l2j56J72RJ60k67mM15l02j94K89J78
$$ -86 -2 -25 70 151 113 -97 59 -149 91 118 -113 68 36 -120 52 61 221 -46 -50 365 63 -131 158 336
3357C36r2q0J79k46K10l22J94j98L06l14J1K73k99K77l13O12l03j67l9K02l22
$$ 336 244 164 343 97 307 -15 179 -19 287 -27 -16 257 -42 235 -78 534 231 64 25 227 -95
3378i5N0J88J63k01l28L55J53K5j60m9N06l67k88K84j06J8oj92K22p5r2L26j17
$$ -95 -45 143 306 105 -223 132 285 310 150 101 607 240 -48 236 130 148 142 -50 172 97 5 331 214
3401B14J23l84J31N7l3K58J1M0k04q3M1j73k0J31m1J58M6l25j40L79K1k92J34
$$ 214 337 -47 84 141 108 366 377 417 213 130 171 -2 -22 109 68 226 272 -53 -193 186 207 -85 49
3424D9K30k15l4Q1R9j79k70M30j34k38J87k15O86o61LM80l24p0J59k3m3j66r2
$$ 49 279 64 30 111 210 31 -239 191 57 -181 6 -209 477 -184 -181 299 -25 -95 64 41 -2 -168 -260
3447b60J58K29n44L44L33j49o07N89j52j37k00M00J12m91m1L23l2j16l12N37L81
$$ -260 -102 127 -417 -73 260 111 -496 93 -59 -196 -396 4 116 -375 -416 -93 -125 -241 -553 -16 365
3468C65l94r6rM12m08j71K95J13l50m8L40K15l87J09k34K64n22J97K34R9n0k84
$$ 365 -29 -125 -134 278 -130 -301 -6 107 -243 -291 49 264 -123 -14 -248 16 -506 -309 -75 24 -26 -310
3490c10L00o3k04J56Q5J15m06J67M09n04Q7k12K95K62r5k80NL08m53O34k95J51
$$ -310 -10 -73 -277 -121 -36 79 -327 -160 249 -255 -168 -380 -85 177 82 -198 -193 115 -338 296 1 152
3512A52n02K93l7K00k10L72r3k51j89K10M86l63k49k11N26j47l22J79M40k63j68
$$ 152 -350 -57 -94 106 -104 268 175 -76 -265 -55 431 68 -181 -392 134 -13 -335 -156 284 21 -147
3533a47j63L51n0J48P6r7L8j04O1j19j56Rp2L06l8k59M16J54j34k51K41J58k74
$$ -147 -310 41 -9 139 215 118 156 52 113 -6 -162 -153 -225 81 43 -216 200 354 220 -31 210 368 94
3556I4k20N38K55q28R1J63K28n2j94K43Pj65q5J85J03k23k14M59j39j65J64m6
$$ 94 -126 412 667 -161 -70 93 321 269 75 318 325 160 75 260 363 140 -74 385 246 81 245 199
3578A99J07m67n6O55j89J40o88O81n9n86M00K19r3j79RK89l00j68P3J21K22o31
$$ 199 306 -161 -217 438 249 389 -299 382 323 -263 137 356 263 84 93 382 82 -86 -13 108 330 -301
3600c01j10L59K49k59j79M24j80j16j4K01j87m2M57q7Jl90K04Q7j36K12m73J92
$$ -301 -411 -52 197 -62 -241 183 3 -113 -127 74 -113 -155 302 215 216 -174 30 117 -19 193 -280 -88
3622h8O1k19L31K28j18k83J06P1j21l40M19k1O4n22L72O5n2l56K80j7j02j3M16
$$ -88 -27 -246 85 313 195 -88 18 89 -32 -372 47 26 90 -432 -60 5 -47 -403 -123 -140 -242 -255 161
3645A61Jl71j39L39j8l71r1M10L27o57J4L72j78k77K90j37L72j48k13K54R5l85
$$ 161 162 -209 -348 -9 -27 -398 -489 -79 248 -409 -395 -23 -201 -478 -188 -325 47 -101 -314 -60 35 -350
3667c50J06L49k34j75M15O9o15Q6J08J76k70j06K97L0k24n5M71J02n5m43o7M83
$$ -350 -244 105 -129 -304 111 180 -435 -349 -241 -65 -335 -441 -144 -114 -338 -393 78 180 125 -318 -385 98
3689I8J9k48r4K74j13n9l12L37L9oj2L92l29r8M81p8k07j14J25Pk1k14n8N23r0
$$ 98 117 -131 -225 49 -64 -123 -435 -98 -59 -65 -77 315 -14 -112 369 291 84 -30 95 102 81 -133 -191 332 242
3714B42l39Q6K33j08j20K12M1l14J5J36J04l47k63M52K61j87j19J14J17k38k3
$$ 242 -97 -11 222 114 -6 206 247 -67 -52 84 188 -159 -422 30 291 104 -15 99 216 -22 -45
3735d5M1J58K39k47K5L63o65K89J28J89k04k58L22p8J7l6q9L1K8k6k43L31r2k6
$$ -45 -4 154 393 146 171 534 -131 158 286 475 271 13 335 257 274 238 149 180 208 182 -61 270 178 152
3759A52k9l1j19j8J85m9j33J47o2RJ9K64l92J21M1j89N66m30R5m64M24j00n8n
$$ 152 123 92 -27 -45 140 91 -42 105 43 52 71 335 -57 64 105 -84 482 52 147 -317 107 7 -51 -56
3783e6K00o3J06P6q1l68Q2O7k8J45j39m6K19r3j55j13M17q7k11K16lj13j95L99
$$ -56 144 81 187 263 182 -186 -104 -37 -65 80 -59 -105 114 21 -134 -247 170 83 -128 88 85 -28 -223 176
3807A76j88m1LJ30K6r6J0r1L78k18q8J30k67NN6K36l14j4J17p8K50j95l13K62
$$ 176 -12 -53 -50 80 106 10 20 -71 307 89 1 131 -136 -131 -75 161 -153 -167 -50 -128 122 -73 -386 -124
3831a24L1P1k35K79k75QJ22j67K14k0k6J12O3k17j3rJ24l97J45J53Q7k38K38J6
$$ -124 -93 -22 -257 22 -253 -245 -123 -290 -76 -96 -122 -10 53 -164 -177 -186 -62 -459 -314 -161 -74 -312 -74 -58
3855e8k63J88K20l17K30k32J21l0OL7K6J73J05l67L49k63j51K95j24P6J1j39k9
$$ -58 -321 -133 87 -230 0 -232 -111 -141 -135 -98 -72 101 206 -161 188 -75 -226 69 -55 21 32 -107 -136
3878a36l1J81k12Q9Lj45M10j50L7j59J83j21m2J5O8m11O51Pn42L66o2K95j64K78
$$ -136 -167 14 -198 -109 -106 -251 159 9 46 -113 70 -51 -93 -78 -10 -421 230 237 -305 61 -1 294 130 408
3902D08m76L2J25M8o7j0j28M1J06J0k32L72k49K55K38l13m25M28k39K06q7k5m6
$$ 408 -68 -36 89 137 70 60 -68 -27 79 89 -143 229 -20 235 473 160 -265 163 -76 130 43 18 -28
3925b8j31J00J46k09Q6J15K10n82N70J59k68j60J50l78k1K91L25k51Q3n3j62N7
$$ -28 -159 -59 87 -122 -36 79 289 -293 277 436 168 8 158 -220 -241 50 375 124 207 154 -8 49
3947D9J25p5j42J95J70l08L2j34K23k3k65K42j43j57K00K92m22M17n6k1k69l27
$$ 49 174 99 -43 152 322 14 46 -88 135 112 -153 89 -54 -211 -11 281 -141 276 220 199 -70 -397
3969c97O16j27k7L0j33J8j68L73k77K5N5N5M5k38M01j06n47M66k19L51k30q6L6
$$ -397 219 92 65 95 -38 -20 -188 185 -92 -67 -12 43 88 -150 251 145 -402 64 -155 196 -34 -120 -84
3992h4J04n3k80Q0N63m32l5m2K14l4o5l18K01L27j28j33J61j56P6j31L9j7j40
$$ -84 20 -33 -313 -233 330 -102 -137 -179 35 1 -64 -382 -181 146 18 -115 46 -110 -34 -165 -126 -143 -283
4015b83M59j78m01K38M9J02k06J49p5J36j11L6p3K23l09J72q5j26K67l45N47N1
$$ -283 176 -2 -403 -165 -116 -14 -220 -71 -146 -10 -121 -85 -158 65 -244 -72 -157 -283 -16 -361 186 237
4037B37k92p7J31l8j75K91O8q0j75J93j16k3p8j93M65R4k04k57M83r3k97j8KK06
$$ 237 -55 -132 -1 -39 -214 77 145 65 -110 83 -33 -56 -134 -327 138 232 28 -229 254 161 -136 -154 -152 54
4061E4m3j08L18j95k5j66j0K25L6k72L35k7k19J17l28M15n02K28M05J56o46K98
$$ 54 11 -97 221 26 1 -165 -175 50 86 -186 149 122 -97 20 -308 107 -395 -167 238 394 -252 46
4083D6J2l53L13j06J2j79K91l00M09K5k02J37K16k90k50J77J37j50M0L07k20K87
$$ 46 58 -295 18 -88 -76 -255 36 -264 145 170 -32 105 321 31 -219 -42 95 -55 -15 292 72 359
4105C59m51N2K17K39k33k01K90m10K44O0l62J65J6J75j7k44J56K2K9K03k66J76
$$ 359 -92 -40 177 416 183 -18 272 -138 106 166 -196 -31 -15 160 143 -101 55 77 106 309 43 219
4127B19o1r1J50p4Q2j03Q7q0q9O9q5j73K03l73K12L09K39m44j30L27m1l10K29
$$ 219 158 67 217 143 225 122 209 129 40 109 24 -149 54 -319 -107 202 441 -3 -133 194 153 -157 72
4150G2n3nQ5j66K00M3l98o5K7O5QM9M04m2l28j86P12n81j40N08j69P5p2k35M29
$$ 72 19 14 99 -67 133 176 -222 -287 -260 -195 -187 -138 266 224 -104 -290 422 -159 -299 209 40 115 43 -192 237
4175B37l13q2K08K08k66m28M87J84l20j30n3N23n20J94M9J29q3j79k48L50j49
$$ 237 -76 -158 50 258 -8 -436 51 235 -85 -215 -268 255 -265 -71 -22 107 24 -155 -403 -53 -202
4196b02m4K65l3m5j00J91o7q9N2Q5M9m11Q2J8N12m83n3J80K47k30j02J36N5j90
$$ -202 -246 19 -14 -59 -159 32 -35 -124 -72 13 62 -349 -267 -249 263 -220 -273 -93 154 -76 -178 -42 13 -177
4220a77N5J21M9j42J33J13j40k10j03r3K15j03n6L90Q1j05l92L40Oj01K02P6l63
$$ -177 -122 -1 48 -94 39 152 12 -198 -301 -394 -179 -282 -338 52 133 28 -364 -24 -18 -119 83 159 -204
4243b04l5J41J0P3p4J29k53N79n08n2O18n98j54J52J49K0J06r0N8j09O6j27M50
$$ -204 -239 -98 -88 -15 -89 40 -213 366 -142 -194 424 -174 -328 -176 -27 -7 99 9 67 -42 24 -103 347
4266C47l51O1j52K40j9k45K8Q9j69J04J06o2M00l61M71k71k69n1O18j67l70l61
$$ 347 -4 57 -95 145 126 -119 -91 -2 -171 -67 39 -23 377 16 487 216 -53 -104 514 347 -23 -384
4288c84Q1N53q4l26K14L5J26l79L28Oo5k75K17J8N2J7J14o4m01j72O82p2j10n5
$$ -384 -303 250 166 -160 54 89 215 -164 164 170 105 -170 47 65 117 134 248 184 -217 -389 293 221 111 56
4312E6j81K94j63j61L79j76J01jr7L17j21j95p8J50k10k7K32l3j31K43j47m7J38
$$ 56 -125 169 6 -155 224 48 149 148 51 368 247 52 -26 124 -86 -113 119 86 -45 198 51 4 142
4335A42oJ21j14l48J94lj30m8J08L12l54RM9K18jl60L32j79j52J39L16j56J18
$$ 142 136 257 143 -205 -11 -14 -144 -192 -84 228 -126 -117 -68 150 149 -211 121 -58 -210 -71 245 89 207
4358B07m66J27M2J59j51j25K91l4q0k70L09j71J73O1p0j68r0L45j50l34L17J31
$$ 207 -259 -132 -90 69 -82 -207 84 50 -30 -300 9 -162 11 72 2 -166 -256 89 -61 -395 -78 53
4380E3rm30L39J1j4J11nq7k23P3K43j91L80k64j44P4pM4N4k80M21l18K01J72k33
$$ 53 44 -386 -47 -36 -50 61 56 -31 -254 -181 62 -129 251 -13 -157 -83 -90 -46 8 -272 149 -169 32 204 -29
4405b9m15L14L65j65m93N70j86j59p0J82N8J24k13K0M80m07J61l22M43m74mP9
$$ -29 -444 -130 235 70 -423 147 -39 -198 -268 -86 -28 96 -117 -97 383 -24 137 -185 258 -216 -220 -141
4427a41j82K12N2Q2k4m16k2N85l67J45J68Mr3P1J09l62J99Q5j42K34j63j70k0
$$ -141 -323 -111 -59 23 -1 -417 -439 146 -221 -76 92 96 3 74 183 -179 20 105 -37 197 34 -136 -156
4450a56K78k47L5m1J20lJ2K64l65L20j53k51K07j26J97j21l8L67m13L11rk76L40
$$ -156 122 -125 -90 -131 -11 -14 -2 262 -103 217 64 -187 20 -106 91 -30 -68 299 -114 197 188 -88 252
4473B52k25n7J78j97q7o9L60j62L03l5p0k94J16j26L71q1j34m6K69k37j38J65
$$ 252 27 -30 148 -49 -136 -205 155 -7 296 261 191 -103 13 -113 258 177 43 -3 266 29 -109 56
4495E6Oj55J08j49P2J44k90K04M4j83L10P4j99J13j93K30j89j82L40n2Mj23Q6
$$ 56 62 -93 15 -134 -62 82 -208 -4 40 -143 167 241 42 155 -38 192 3 -179 161 109 113 -10 76
4518G6Oo4L9k16M23m16J51J50j59N0l09N12j60L9k66J66J49j87q8K81n4j54k75
$$ 76 82 18 57 -159 264 -152 -1 149 -10 40 -269 243 83 122 -144 22 171 -16 -104 177 123 -31 -306
4541c06L00K2M6j36K7K5J93j69L3j34J58qj76q3j69K68L22l9m02J26j34L37m58
$$ -306 -6 16 62 -74 -47 -22 171 2 35 -99 59 51 -125 -208 -377 -109 213 174 -228 -102 -236 101 -357
4564c57K51j78M37l01m9J40l99L36l4O2k14Q3k92Q72p55M50j66j74M68m94J57
$$ -357 -106 -284 153 -148 -197 -57 -456 -120 -154 -92 -306 -223 -515 357 -398 52 -114 -288 180 -314 -157
4585a57l7K43k55K36o8j73Q1j7O3j89R5J81k28j55K44J45Q7j00j8K5j20K9K94
$$ -157 -194 49 -206 30 -38 -211 -130 -147 -84 -273 -178 3 -225 -380 -136 9 96 -4 -22 3 -117 -88 206
4608B06l69K27k70L00j1j97K08m38K49J27M7k68J44R1k2K77j17k61J59k39L31
$$ 206 -163 64 -206 94 83 -114 94 -344 -95 32 79 -189 -45 46 24 301 184 -77 82 -157 174
4629A74p8J0j1O2k03L60j48l40L90l75M23l81K69l66q4M80r7j67K26m53M09m9
$$ 174 96 106 95 157 -46 314 166 -174 216 -159 264 -117 152 -214 -298 182 85 -82 144 -309 100 51
4651E1q3M3k35L05m28M53O7j64K48k67L45j29Q3j15r8k06J7J64K44l62j34M84
$$ 51 -32 11 -224 81 -347 106 173 9 257 -10 335 206 289 174 76 -130 -113 51 295 -67 -201 283
4673B83k88J34Q7j49j5K04j76l6j04K06l03N33j67k32j47M96l64L3j71L4L20j77
$$ 283 -5 129 216 67 52 256 80 44 -60 146 -157 376 209 -23 -170 326 -38 -5 -176 -142 178 1
4695AK5P4q6J8J50k13n8M4O7J47m10L0J25J41rk56L00K3r6r8K32n22L76l5q5J05
$$ 1 26 100 14 32 182 -31 -89 -45 22 169 -241 -211 -86 55 46 -210 90 113 17 -81 151 -371 5 -30 -115 -10
4721a0k79K92n7J80j31j70l7M17j88l28K56J03k05j02j03M22M7N3L8j97o1N0k27
$$ -10 -289 3 -54 126 -5 -175 -212 205 17 -311 -55 48 -157 -259 -362 60 107 160 198 1 -60 -10 -237
4744b37L6J58l3N3K52k61k87n6L68Q8J56q3l70L92k13L76k92k97L16Q6nk91J11
$$ -237 -201 -43 -76 -23 229 -32 -319 -375 -7 81 237 154 -216 176 -37 339 47 -250 66 152 147 -144 -33
4767c3O5Rl21M56l60p8L29N4L5l72j80L66r0K18k32q0J61J05n2r1j09J75j97K66
$$ -33 32 41 -280 176 -184 -262 67 121 156 -216 -396 -30 -120 98 -134 -214 -53 52 0 -91 -200 -25 -222 44
4791D4j08Q3k43J44K19k74K02j53K23r7j2p3r4l0J49o0K3k1L32M4l15j48J29L3
$$ 44 -64 19 -224 -80 139 -135 67 -86 137 40 28 -45 -139 -169 -20 -80 -57 -78 254 298 -17 -165 -36 -3
4815cQ4J36m17J81K80k76j77p6K81K30q8l54M17n15M08j9P1k20R6K03j97j80K71
$$ -3 81 217 -200 -19 261 -15 -192 -268 13 243 155 -199 218 -297 111 92 163 -57 39 242 45 -135 136
4838A36Rl62N38l40J48J7m0l05L61j31r2K79j16k54J10k9K51k23l15J91L77K2
$$ 136 145 -217 321 -19 129 146 106 -199 162 31 -61 218 102 -152 -42 -71 180 -43 -358 -167 210 232
4860B32k11J73j81M4k43J56K76j83j23M74n45j39L59q9J26k47K52j93L15p0j11
$$ 232 21 194 13 57 -186 -30 246 63 -60 414 -131 -270 89 0 126 -121 131 -62 253 183 72
4881G2L2j6l4r0p9L65l73n6J46k7k6L1q1K25n68N04O7j73j56N23j04Lj14ro0n6
$$ 72 104 88 54 -36 -115 250 -123 -179 -33 -60 -86 -55 -136 89 -479 25 92 -81 -237 286 182 185 71 62 2 -54
4907e4J62l1M1p7N2r2J02q5j75K38r9K2O0k22J04M9o2j20J65Q0J32n68N22j08
$$ -54 108 77 118 41 93 1 103 18 -157 81 -18 4 64 -158 -54 -5 -67 -187 -22 58 190 -378 144 36
4931C6j06J98R5m42p0N4J73j21K24J12o2q4l69L99J15k79q7L1L46m07k2K06j11
$$ 36 -70 128 223 -219 -289 -235 -62 -183 41 153 91 7 -362 37 152 -127 -214 -183 163 -244 -266 -60 -171
4954a71m6K24J76R2l05j69R1K65m00K73L4q6k33K76N5Jj64O0M1j36l5J08L31l71
$$ -171 -217 7 183 275 -30 -199 -108 157 -243 30 64 -22 -255 21 76 77 -87 -27 14 -122 -157 -49 282 -89
4978h9J57j35n1k6J48L7K13k21k09O4K85R0o44L60K90l29N7l07J55k32K33R5J87
$$ -89 68 -67 -118 -144 4 41 254 33 -176 -112 173 263 -381 -21 269 -60 -3 -310 -155 -387 -154 -59 128
5001A28k08J4L96L0k81j01J74m2P7l50M06k79N9r4O8M35m55K7L15l28K05j42K30
$$ 128 -80 -66 330 360 79 -22 152 110 187 -163 243 -36 23 -71 -3 432 -23 4 319 -9 196 54 284
5024B84l32N1r1K3K17l71J25J22o2j00l16M45J69l6K29j99m00J96K17j14m8p7
$$ 284 -48 3 -88 -65 152 -219 -94 28 -34 -134 -450 -5 164 128 357 158 -242 -46 171 57 9 -68
5046f8P0J20J10m01J71j23K01k68K57J0Nj0J48J69l41k28l8J18K32k3j91M6K71
$$ -68 2 122 232 -169 2 -121 80 -188 69 79 84 74 222 391 50 -178 -216 -98 134 111 -80 -34 237
5069B37j98J86J4l5o7p1J31j63K22j60p8%k38J77K62l35J45o4N15o11K34J02j62
$$ 237 39 225 239 204 137 66 197 34 256 96 18 18 -220 -43 219 -116 29 -35 480 -131 103 205 43
5092D3M7o6j25K59o0k05K8L29j11p4j80J06Rl53K86L85k07O2m47J56J74j04J4
$$ 43 90 24 -101 158 98 -107 -79 250 139 65 -115 -9 0 -353 -67 318 111 173 -274 -118 56 -48 -34
5115c4L4j2M6J52k59J57m09M28N6L1n58J77K94j90J14k08P4J83l53K43l11K41
$$ -34 0 -12 34 186 -73 84 -325 103 159 190 -368 -191 103 -87 27 -181 -107 76 -277 -34 -345 -104
5137a04Q5j40L41m94M26j04r8J53j59P4o7K44k74R0oL9L7P9P6k48P2j54j23M4
$$ -104 -19 -159 182 -312 114 10 -88 65 -94 -20 -87 157 -117 -27 -33 6 43 122 198 -50 22 -132 -255 -211
5161b11l1o1K83K06k15p9K65k69K13r6l1o9J07K0j48l19L54N3Rj73j15O19j34
$$ -211 -242 -303 -20 186 -29 -108 157 -112 101 5 -26 -95 12 32 -116 -435 -81 -28 -19 -192 -307 312 178
5184A78J1l03K59l4q0j57J53J89m7l4j27j18j03J68o9M00l56j0P8r3J96k66J77
$$ 178 189 -114 145 111 31 -126 27 216 169 135 8 -110 -213 -45 -114 286 -70 -80 -2 -95 101 -165 12
5207A2K15j58j26p7J17M7O1l1k13K8P1J31j46J72J49o29L16j84L23j32L55o52
$$ 12 227 69 -57 -134 -17 30 91 60 -153 -125 -54 77 -69 103 252 -377 -61 -245 78 -54 301 -351
5229c51N73k38QM8K6R5j38n5J33R6O6k41k3K44l48L74p3J12l97J83j17K74j34
$$ -351 222 -16 -8 40 66 161 23 -32 101 197 263 22 -1 243 -105 269 196 308 -89 94 -23 251 117
5252A17k65K24l94L92k86L12j51j23J46K49m7j68K33k09N4J45m8K7m4Q7l79L20
$$ 117 -148 76 -318 74 -212 100 -51 -174 -28 221 174 6 239 30 84 229 181 208 164 251 -128 192
5274A92Q1j47k37K55r2J33j28n8p2N16l52j13K97l57R0K16l67l23M56j58K93j26
$$ 192 273 126 -111 144 52 185 57 -1 -73 443 91 -22 275 -82 8 224 -143 -466 -10 -168 125 -1
5296al76O32LM6k91j80L2P8j65M65l98J15N8j32O1j85K77k9%p1k2K32l66J75J0
$$ -1 -377 255 258 304 13 -167 -135 -57 -222 243 -155 -40 18 -114 -53 -238 39 10 10 -61 -83 149 -217 -42 -32
5321c2r5J76j33J66j2j75l5J36m17L83O4m1K55m44K86r8K6k14Q6J77l49M45k55
$$ -32 -127 49 -84 82 70 -105 -140 -4 -421 -38 26 -15 240 -204 82 -16 10 -204 -118 59 -290 155 -100
5344a00K19k67K12r1N0k89K57m9j32K11M3O9L00m40j0O9l4m99K36J28Q3J40k34
$$ -100 119 -148 64 -27 23 -266 -9 -58 -190 21 64 133 433 -7 -17 52 18 -481 -245 -117 -34 106 -128
5367a28J60j76n0j2r4J02L37m8Q1k23K56m03K13m3Jj4J99n2J11k38o3P8l72L97
$$ -128 32 -144 -194 -206 -300 -198 139 91 172 -51 205 -198 15 -28 -27 -41 158 106 217 -21 -84 -6 -378 19
5391A9L4L16k85j80Q1o4P1k6o3K8k2J31J34p9k7o0Q9q2l5N2j12K84j23j18MQ3
$$ 19 53 369 84 -96 -15 -79 -8 -34 -97 -69 -91 40 174 95 68 8 97 15 -20 32 -80 204 81 -37 -33 50
5417E0N0J05l91L85k53K56j29R0k17L19k65K7K94l26J55l68O3M38m36K99k52J68
$$ 50 100 205 -186 199 -54 202 73 163 -54 265 0 27 321 -5 150 -218 -155 283 -153 146 -106 62
5439F2j99N14n37J73KK73j46j59J1J62l63N01m47L98j24j47L69l41j44L42J2k28
$$ 62 -137 377 -160 13 15 288 142 -17 -6 156 -207 294 -153 245 121 -26 343 2 -142 200 212 -16
5461a6R6j69K26j77jJ9k49K75R6J39j04r3P3k70M04l17m0MJ60j81K29k62M3J56
$$ -16 80 -89 137 -40 -41 -22 -271 4 100 239 135 42 115 -155 249 -68 -108 -104 56 -125 104 -158 -115 41
5485D1r7p7K20l52j9K90r0o8K60k0j78R0K86l28J65j17J34j03q7J7j95J55K95
$$ 41 -56 -133 87 -265 -284 6 -84 -152 108 88 -90 0 286 -42 123 6 140 37 -50 -33 -228 -73 222
5508B22n23K74k9J15j88L06r1k51k6N6K37j40l43K05N10j5k93l88M70k59J78L51
$$ 222 -301 -27 -56 59 -129 177 86 -165 -191 -135 102 -38 -381 -176 334 319 26 -362 108 -151 27 378
5530C78m69k23K57N7j15PJ47j41L63j67K7j09l41K73K99k93j64K25k59K43J96
$$ 378 -91 -314 -57 0 -115 -108 39 -102 261 94 121 12 -329 -56 243 -50 -214 11 -248 -5 191
5551A91l52K69j80J4P3q2R3j32l7J90k59L3J0J34P2Kk39K70K20m19K4J34M05l07
$$ 191 -161 108 -72 -58 15 -67 26 -106 -143 47 -212 -179 -169 -35 37 39 -200 70 290 -129 -105 29 434 127
5575A27k42J93j42K20k65j24K56O7k91m8K66J05j43N5n4J41k13j80K23K28l57
$$ 127 -115 78 -64 156 -109 -233 23 90 -201 -249 17 122 -21 34 -20 121 -92 -272 -49 179 -178
5596a78L9L81K1l33j15J80j44L2J12%k25J97KL41k81r8K5j8L2j53j49J85R2P5
$$ -178 -139 242 263 -70 -185 -5 -149 -117 -5 -5 -230 -33 -31 310 29 -69 -44 -62 -30 -183 -332 -147 -55 20
5620B0q9L18k75pJ04J3j41k16M88J43n59J38J04k5M09m71J4o3j00K57K62l92J10
$$ 20 -69 249 -26 -33 71 84 -57 -273 215 358 -201 -63 41 16 425 -46 -32 -95 -195 62 324 -68 42
$$ [...]
8191D63
##END NTUPLES=NMR FID
##END=
