##TITLE=1H_LR-688A-C2
 CDCl3, 8 sc, 
 20.9.2019
##JCAMPDX= 6.0         $$ Bruker NMR JCAMP-DX V2.0
##DATA TYPE= NMR FID
##DATA CLASS= NTUPLES
##ORIGIN= UXNMR, Bruker Analytische Messtechnik GmbH
##OWNER= root
$$ XWIN-NMR		Version 3.5
$$ Fri Sep 20 14:35:50 2019 Russian Standard Time (UT+4h)  she@DPX200
##.OBSERVE FREQUENCY= 200.1315
##.OBSERVE NUCLEUS= ^1H
##.DELAY= (6, 6)
##.ACQUISITION MODE= SIMULTANEOUS
##.ACQUISITION SCHEME= undefined
##.AVERAGES= 8
##.DIGITISER RES= 18
##SPECTROMETER/DATA SYSTEM= spect
##.PULSE SEQUENCE= zg30
##.SOLVENT NAME= CDCl3
##.SHIFT REFERENCE= (INTERNAL, CDCl3, 0, 15.7039)
##AUDIT TRAIL= $$ (NUMBER, WHEN, WHO, WHERE, WHAT)
$$ ##TITLE= Audit trail, XWIN-NMR		Version 3.5
$$ ##JCAMPDX= 5.01
$$ ##ORIGIN= Bruker BioSpin GmbH
$$ ##OWNER= she
$$ F:/spectra/data/she/nmr/H-F/1/audita.txt
$$ ##AUDIT TRAIL=  $$ (NUMBER, WHEN, WHO, WHERE, WHAT)
(   1,<2019-09-20 14:34:44.18 +0400>,<she>,<DPX200>,
      <created by zg, POWCHK disabled, PULCHK disabled
       configuration hash MD5:
       00 E9 B6 7A A2 85 ED C7 34 08 36 98 17 FE 4E 26
       data hash MD5: 16K
       17 EA C4 DE 53 DD 80 66 D2 69 83 8C 92 C3 ED 99>)
$$ ##END=
$$ 
$$ hash MD5
$$ 99 A7 B1 80 7E 75 CB 45 64 22 A8 42 9B 02 37 31
##$RELAX= 
##$RELAX= 
##$RELAX= 
##$RELAX= 
##$RELAX= 
##$RELAX= 
$$ Bruker specific parameters
$$ --------------------------
##$DU= <F:/spectra>
##$EXPNO= 1
##$NAME= <H-F>
##$PROCNO= 1
##$TYPE= <nmr>
##$USER= <she>
##$AMP= (0..31)
100 100 100 100 100 100 100 100 100 100 100 100 100 100 100 100 100 100 
100 100 100 100 100 100 100 100 100 100 100 100 100 100 
##$AQSEQ= 0
##$AQ_mod= 1
##$AUNM= <au_zg>
##$AUTOPOS= <>
##$BF1= 200.13
##$BF2= 200.13
##$BF3= 200.13
##$BF4= 200.13
##$BF5= 200.13
##$BF6= 200.13
##$BF7= 200.13
##$BF8= 200.13
##$BYTORDA= 1
##$CFDGTYP= 0
##$CFRGTYP= 5
##$CHEMSTR= <none>
##$CNST= (0..31)
1 1 145 1 1 1 1 1 1 1 1 1 1 1 1 1 1 1 1 1 1 1 1 1 1 1 1 1 1 1 1 1 
##$CPDPRG= <>
##$CPDPRG1= <>
##$CPDPRG2= <>
##$CPDPRG3= <>
##$CPDPRG4= <mlev>
##$CPDPRG5= <mlev>
##$CPDPRG6= <mlev>
##$CPDPRG7= <mlev>
##$CPDPRG8= <mlev>
##$CPDPRGB= <>
##$CPDPRGT= <>
##$D= (0..31)
0 1.2 0 0 0 0 0 0 0 0.06 0 0.03 0 0 0 0 0.0002 0 0 0 0 0 0 0 0 0 0 0 0 
0 0 0 
##$DATE= 1568975683
##$DBL= (0..7)
120 120 120 120 120 120 120 120 
##$DBP= (0..7)
150 150 150 150 150 150 150 150 
##$DBP07= 0
##$DBPNAM0= <>
##$DBPNAM1= <>
##$DBPNAM2= <>
##$DBPNAM3= <>
##$DBPNAM4= <>
##$DBPNAM5= <>
##$DBPNAM6= <>
##$DBPNAM7= <>
##$DBPOAL= (0..7)
0.5 0.5 0.5 0.5 0.5 0.5 0.5 0.5 
##$DBPOFFS= (0..7)
0 0 0 0 0 0 0 0 
##$DE= 6
##$DECBNUC= <off>
##$DECIM= 24
##$DECNUC= <off>
##$DECSTAT= 4
##$DIGMOD= 1
##$DIGTYP= 9
##$DL= (0..7)
0 120 120 120 120 120 120 120 
##$DP= (0..7)
150 150 150 150 150 150 150 150 
##$DP07= 0
##$DPNAME0= <>
##$DPNAME1= <>
##$DPNAME2= <>
##$DPNAME3= <>
##$DPNAME4= <>
##$DPNAME5= <>
##$DPNAME6= <>
##$DPNAME7= <>
##$DPOAL= (0..7)
0.5 0.5 0.5 0.5 0.5 0.5 0.5 0.5 
##$DPOFFS= (0..7)
0 0 0 0 0 0 0 0 
##$DQDMODE= 0
##$DR= 18
##$DS= 0
##$DSLIST= <SSSSSSSSSSSSSSS>
$$ [...]
##$SUBNAM2= <"">
##$SUBNAM3= <"">
##$SUBNAM4= <"">
##$SUBNAM5= <"">
##$SUBNAM6= <"">
##$SUBNAM7= <"">
##$SUBNAM8= <"">
##$SUBNAM9= <"">
##$SW= 24.0689530833862
##$SWIBOX= (0..15)
0 0 2 0 0 0 0 0 0 0 0 0 0 0 0 0 
##$SW_h= 4816.95568400771
##$TD= 16384
##$TD0= 1
##$TE= 0
##$TE2= 300
##$TE3= 300
##$TEG= 300
##$TL= (0..7)
0 120 120 120 120 120 120 120 
##$TP= (0..7)
150 150 150 150 150 150 150 150 
##$TP07= 0
##$TPNAME0= <>
##$TPNAME1= <>
##$TPNAME2= <>
##$TPNAME3= <>
##$TPNAME4= <>
##$TPNAME5= <>
##$TPNAME6= <>
##$TPNAME7= <>
##$TPOAL= (0..7)
0.5 0.5 0.5 0.5 0.5 0.5 0.5 0.5 
##$TPOFFS= (0..7)
0 0 0 0 0 0 0 0 
##$TUNHIN= 0
##$TUNHOUT= 0
##$TUNXOUT= 0
##$USERA1= <user>
##$USERA2= <user>
##$USERA3= <user>
##$USERA4= <user>
##$USERA5= <user>
##$V9= 5
##$VALIST= <valist>
##$VCLIST= <CCCCCCCCCCCCCCC>
##$VD= 0
##$VDLIST= <DDDDDDDDDDDDDDD>
##$VPLIST= <PPPPPPPPPPPPPPP>
##$VTLIST= <TTTTTTTTTTTTTTT>
##$WBST= 1024
##$WBSW= 4
##$XGAIN= (0..3)
0 0 0 0 
##$XL= 0
##$YL= 0
##$YMAX_a= 376964
##$YMIN_a= -419823
##$ZGOPTNS= <>
##$ZL1= 120
##$ZL2= 120
##$ZL3= 120
##$ZL4= 120
##$ABSF1= 10
##$ABSF2= 0
##$ABSG= 5
##$ABSL= 3
##$ALPHA= 0
##$AQORDER= 0
##$ASSFAC= 0
##$ASSFACI= 0
##$ASSFACX= 0
##$ASSWID= 0
##$AUNMP= <proc_1d>
##$AZFE= 0.1
##$AZFW= 0.1
##$BCFW= 1
##$BC_mod= 2
##$BYTORDP= 1
##$COROFFS= 0
##$CY= 11.3945322036743
##$DATMOD= 1
##$DC= 2
##$DFILT= <>
##$DTYPP= 0
##$F1P= 20.1720416913024
##$F2P= 0.152960286110954
##$FCOR= 0.5
##$FTSIZE= 0
##$FT_mod= 4
##$GAMMA= 1
##$GB= 0.15
##$INTBC= 1
##$INTSCL= 1
##$ISEN= 128
##$LB= 0.24
##$LEV0= 0
##$LPBIN= 0
##$MAXI= 10000
##$MC2= 0
##$MEAN= 0
##$ME_mod= 0
##$MI= 1.114404
##$NCOEF= 0
##$NC_proc= 0
##$NLEV= 6
##$NOISF1= 3.799351
##$NOISF2= 2.8
##$NSP= 1
##$NTH_PI= 0
##$NZP= 0
##$OFFSET= 15.70392
##$PC= 1
##$PHC0= -9570.062
##$PHC1= 11.20096
##$PH_mod= 1
##$PKNL= yes
##$PPARMOD= 0
##$PSCAL= 0
##$PSIGN= 0
##$REVERSE= no
##$SF= 200.130013532006
##$SI= 16384
##$SIGF1= 3
##$SIGF2= 2
##$SINO= 400
##$SIOLD= 16384
##$SREGLST= <1H.CDCl3>
##$SSB= 0
##$STSI= 0
##$STSR= 0
##$SW_p= 3612.71676300578
##$SYMM= 0
##$S_DEV= 0
##$TDeff= 0
##$TDoff= 0
##$TI= <>
##$TILT= no
##$TM1= 0
##$TM2= 0
##$TOPLEV= 0
##$USERP1= <user>
##$USERP2= <user>
##$USERP3= <user>
##$USERP4= <user>
##$USERP5= <user>
##$WDW= 1
##$XDIM= 8192
##$YMAX_p= 0
##$YMIN_p= 0
$$ End of Bruker specific parameters
$$ ---------------------------------
##NTUPLES= NMR FID
##VAR_NAME=  TIME,          FID/REAL,        FID/IMAG
##SYMBOL=    X,             R,               I
##VAR_TYPE=  INDEPENDENT,   DEPENDENT,       DEPENDENT
##VAR_FORM=  AFFN,          ASDF,            ASDF
##VAR_DIM=   8192,          8192,            8192
##UNITS=     SECONDS,       ARBITRARY UNITS, ARBITRARY UNITS
##FACTOR=    0.0002076,     1,               1
##FIRST=     0,             0,               0
##LAST=      1.7004516,     0,               0
##MIN=       0,             -419823,         0
##MAX=       1.7004516,     376964,          0
$$ Real data points
##PAGE= N=1
##DATA TABLE= (X++(R..R)), XYDATA
0@%%%qJ6j6J6k4L2m0N6p1Q7j04J28j58J89k24K65l12L68m33N01n78O66p63Q74
27D67r94J126j278J443j623J821k038K279k542K829l145L493l875M292m752N262
43B765n827O453p152P940q834R854j1031J2412j4056J6047j8521K1699k5950L1968
57A7767m1207N7374r3840L18606J892m83672K46968J00437j83472k7837L63317
68B76333N1726k55450r8416J04621j00061l4486K70385J62312l17142k53660J61723
79c2115J65486j08984L7346K32661m9249l47967r0776J93467O0814n4566J35657
90A41774J36268j56915k28345J1744J01440K4907N4182N4792j35346j76976O7369
101a05106J75154J143m8752Q6575K5161j89019j47818P6159J28010N8423N8576
$$ plain form
0 0 0 0 0 -8 8 -8 8 -16 16 -24 32 -39 48 -56 72 -86 103 -121 144 -168 200 -233 268 -310 356 -407 467
27 467 -527 599 -679 764 -859 962 -1076 1203 -1339 1490 -1655 1838 -2037 2255 -2497 2765
43 2765 -3062 3391 -3761 4179 -4655 5199 -5832 6580 -7476 8571 -9950 11749 -14201 17767
57 17767 -23440 33934 -59906 258700 260592 -223080 23888 124325 -59147 -86984 276333
68 276333 328059 72609 -25807 78814 -21247 -55733 214652 376964 59822 -193838 -32115
79 -32115 133371 24387 61733 294394 245145 -102822 -193598 -131 60683 6117 141774
90 141774 278042 121127 -107218 -95474 5966 30873 85055 139847 4501 -172475 -105106
101 -105106 70048 71191 22439 109014 134175 -54844 -202662 -126503 1507 59930 118506
112A18506k767j55435j23753P2864R2476l0255Q117Q5827m6940j48523J7636J33713
124B1466l800n3650P7732Q652k17952j17865J93680J66685p9143m0667J05465
135F0603m6854j95340J2480J77646q318j07948Q3133Q5350j70159j26719J92523
146d3603J60083j50351j22273J18620K3232j78587O057K37105M6768j77662k5999
157a06610J02042q2995j40083J07441J68076o7521j10357P6300N0784j13628j4671
168a31222J59372K0665j70322m1251J18958j790r5036O4741J34169n0976j33321
179a26013P907N6443l8002p332R5310K7882r0969k8676O2753k374n3292L2033
191f4330N6681m9618o8317L6159N9608n523M143L6969k0850o8403q892L4106k675
$$ plain form
112 118506 115739 -39696 -163449 -90585 1891 -28364 -20247 65580 18640 -129883 -112247 21466
124 21466 17666 -35984 41748 50400 -167552 -285417 -91737 74948 -4195 -44862 60603
135 60603 13749 -181591 -169111 8535 217 -107731 -24598 60752 -109407 -236126 -43603
146 -43603 116480 -33871 -156144 -37524 -14292 -192879 -186822 50283 97051 -80611 -106610
157 -106610 -4568 -87563 -227646 -120205 47871 -19650 -130007 -53707 -2923 -116551 -131222
168 -131222 28150 48815 -121507 -162758 -43800 -45590 -140626 -75885 58284 7308 -126013
179 -126013 -118106 -61663 -99665 -106997 -11687 16195 -74774 -103450 -40697 -43071 -96363 -64330
191 -64330 -7649 -57267 -125584 -89425 -29817 -35340 -31197 5772 -15078 -83481 -92373 -58267 -60942
204f0942L627M9563N425o3685j4858N2222L201l6277K6592L6147n2037m7157O0115
217c8064N5090l9207j7871N2635j5136r2453K018R3987J0547n3318L1013N3110
229D2351o1333o5288O7678O4628o2969m6883O4460J8800p9174K038J05654J1286
241F1248q9068m899N9655l5837o0689O7545Q8122m6854o9595L9326L3004o0874
253a8916j5957Q1842K1078p5609j3499O4005l267m8991L6848O4138m3367p6550
265b8245K1027M9414j8559p213N4712J4675o2893k5902L9444P012k6032K4132
277D1572M1100k5922m5478J5911L4164p863n638K1312j0583m4084j489M1255J2609
290F6866r257J6637Q767l8256l1571J8539K2512k570J1350K0278k0493l5052J1781
$$ plain form
204 -60942 -57315 -7752 -2327 -66012 -80870 -28648 -25447 -61724 -35132 1015 -51022 -98179 -38064
217 -38064 17026 -22181 -40052 12583 -2553 -95006 -92988 999 11546 -41772 -10759 42351
229 42351 -18982 -84270 -16592 48036 -14933 -61816 2644 21444 -57730 -55692 49962 61248
241 61248 -27820 -32719 26936 -8901 -69590 -2045 86077 39223 -30372 8954 41958 -18916
253 -18916 -34873 46969 68047 -7562 -21061 42944 39677 -9314 27534 91672 48305 -28245
265 -28245 -7218 42196 23637 16424 71136 85811 22918 -2984 36460 43472 17440 41572
277 41572 82672 56750 11272 27183 61347 53484 47846 69158 58575 14491 13002 54257 66866
290 66866 57609 74246 83013 44757 13186 31725 54237 51667 63017 83295 62802 27750 39531
303C9531L0651q329j7520J3289J141l2822n643L9915J9352j8316j532R549l0047
316C9219l7449J9539M2178q0j4827J1008K04l1785r591K8737P325k4531k028J7722
330D5641j1588j9826K3254L3088j3733l3478o205k551j8133M260L6027J4983j8870
343C2869o889P073j6791k2699J3896K4282j1643k1910P371J3489q567m32J8337
356B8386j404l0986j8147R042M994N73J8946K1332j0805k6859j0205j32p514j754
370b4533J3893P728q612l234J0022O987j282j873o426j7690j4660L729J2752J1222
384a1977J1513Q200j0175k3134j3044J902M299M231Q849O802l293n232K640L897
398a4522m465q761p642q482o142P139K1252J9868N096p570j2473j4084j3667l563
$$ plain form
303 39531 70182 61853 44333 57622 58763 25941 20298 60213 79565 61249 59717 69266 39219
316 39219 1770 21309 63487 63407 48580 59588 59792 28007 18416 47153 54478 29947 27919 45641
330 45641 34053 14227 37481 70569 56836 23358 17153 14602 -3531 729 36756 51739 32869
343 32869 25980 33053 16262 -6437 7459 31741 20098 -1812 5559 19048 10481 10049 28386
356 28386 26982 -4004 -22151 -13109 -8115 -7542 11404 32736 21931 -4928 -15133 -15265 -22779 -24533
370 -24533 -10640 -2912 -11524 -14758 -4736 2251 969 -904 -7330 -25020 -39680 -35951 -23199 -11977
384 -11977 -464 7736 -2439 -25573 -38617 -36715 -32416 -28185 -19336 -12534 -15827 -21059 -18419 -14522
398 -14522 -18987 -27748 -35390 -43872 -50014 -42875 -21623 -1755 3341 -4229 -16702 -30786 -44453 -48016
412d8016R575J3213N081l009q00J821L30k700j525l819r275q258M317J5600J4747
427a2718Q013l30j0928j9519j5561j259R340J2039J1627P096J105l148l088l090
441b0421k637m766r368j0455L55J3608J5523Q070M658j734j5365k0960n634J0877
455c8249R777N919J1189P562r174j1663K538M212j0184r856L977N292k38J0782
469a8116K2156P506j3806j3528p642j4561j0890J2990K2561N164l096N632L973
482a657j0372p394O171J083j0379k467J1212Q410L941J0202O020j3913j9733m848
496b3724L922j147P620K1625J4123p198j0090l83j733r959o275K207K934K588
510e490O997J0163Q261N618k207j1830j2462l603K894N300J0938J2811L308n132
$$ plain form
412 -48016 -38441 -25228 -20147 -23156 -23956 -22135 -21805 -24505 -26030 -29849 -39124 -47382 -43065 -27465 -12718
427 -12718 -4705 -5035 -15963 -35482 -51043 -52302 -42962 -30923 -19296 -12200 -11095 -14243 -17331 -20421
441 -20421 -23058 -27824 -37192 -47647 -47292 -33684 -18161 -10091 -5433 -7167 -22532 -43492 -49126 -38249
455 -38249 -28472 -22553 -11364 -3802 -12976 -24639 -22101 -17889 -28073 -37929 -33952 -28660 -28898 -18116
469 -18116 4040 11546 -2260 -15788 -23430 -37991 -48881 -35891 -13330 -8166 -11262 -5630 -1657
482 -1657 -12029 -19423 -13252 -12169 -22548 -25015 -13803 -5393 -1452 8750 14770 857 -18876 -23724
496 -23724 -19802 -20949 -13329 8296 22419 15221 5131 4748 3015 -6944 -13219 -11012 -8078 -5490
510 -5490 1507 11670 19931 25549 23342 11512 -950 -4553 -1659 3641 14579 27390 30698 25566
524B5566m928o355r479j025Q842J259m965J0121J8571q93j4431K918J0085j5846
538A9440k5628M551K2434L231l645J6278J4059j3688j6024N432L81j6474L53K2303
552C3003M179j5798M793J9252p817k4045K893J4254j2992j5910J9429K4876q017
565C8100j4458J1436Q547k2374k0827Q666J1283m575K011J6297L665j0696J05
578B7180N621j1595j7142L513J3787k416q999O801J3311l278j3417l335K737n052
592G716q427M592J4571M817p766k019R252k661k1174j2463J2035J2401n936m074
606H64J2093O742j0002m617M669q223j5225P417J6417j1298j7817J7070K5944
619B4034j3513k6647P170J4858j6402j4585K2391J7662j7039r198K2082J227l4223
$$ plain form
524 25566 20638 14283 4804 3779 12621 13880 8915 19036 37607 36714 22283 25201 35286 19440
538 19440 -6188 -1637 20797 24028 20383 36661 50720 37032 21008 26440 26821 10347 10700 33003
552 33003 37182 21384 26177 45429 37612 13567 16460 30714 17722 1812 21241 46117 38100
565 38100 23642 35078 43625 21251 424 9090 20373 15798 17809 34106 37771 27075 27180
578 27180 32801 21206 4064 7577 21364 18948 9949 16750 30061 26783 13366 10031 12768 7716
592 7716 -711 3881 18452 23269 15503 13484 22736 20075 -1099 -13562 -1527 10874 4938 864
606 864 12957 19699 9697 5080 9749 1526 -13699 -6282 10135 -1163 -18980 -1910 24034
619 24034 10521 -16126 -8956 5902 -10500 -25085 -2694 14968 -2071 -11269 10813 12040 -22183
632b2183q945L0018Q032k4984k478K4217m42j8309J0091J6673k0208k2607J8031
645a3094J6820k4462j4792L3193K4779k5624k4633J4284R451j6704j358K2412
657B72J750j9378L161J9687q403k4716O390K4660m125k4471k076J8629P612l731
671d739Q09O09r175q840L026N143j900k42J0623R586p969j9607l523J7278J0033
686A112j1631r117R956O322j0628k383J5268J711j8690k345J5754o555k2340J3071
700b0495L6802k612l3495l453J9754p947j8322J5636K0173j5157j2827K0983O831
713E871l1141n406L7560O951m0840j0099L5890P504k7221O271L1213j3658l5640
726c2745J0131K5933j8396j8510L3100K6671l0415k6326K3205J4364k6078o412
$$ plain form
632 -22183 -31128 -1110 6922 -18062 -20540 3677 3235 -15074 -4983 11690 -8518 -31125 -13094
645 -13094 3726 -20736 -35528 -2335 22444 -3180 -27813 -13529 -4078 -20782 -22140 272
657 272 2022 -17356 -14195 5492 -2911 -27627 -21237 3423 -702 -25173 -27249 -8620 -1008 -4739
671 -4739 -3930 -3321 -12496 -21336 -18310 -13167 -15067 -15309 -4686 4900 -3069 -22676 -26199 -8921 1112
686 1112 -10519 -19636 -9680 -3358 -13986 -16369 -1101 610 -18080 -20425 -4671 -11226 -33566 -20495
700 -20495 16307 13695 -19800 -23253 -3499 -11446 -29768 -14132 6041 -9116 -21943 -960 5871
713 5871 -25270 -30676 6884 13835 -27005 -37104 -1214 6290 -20931 -14660 16553 2895 -32745
726 -32745 -22614 3319 -15077 -33587 -487 26184 -4231 -30557 -7352 7012 -19066 -25478
738b5478K9465K542k9637L927L2010m266k8294R920K5994j6680l2005J1117K8424
751G039j917j1073J1756Q719j6110j2896O621N322l574M469R510p34o390J800
765B542L152k471j14N65n416l084N442N389J865P998O238j1966j2693N232L298
780E977j1979J445K5593R047k2263n889K1807j335k6970R30K6248l996k4335R450
794C730K5267p462j5789J5025Q991k7584j3338K5910P390k4350O837L8823l754
807C9696m2298p67L2090j0146l2677J4305L3302j2811k3575K0642J9986k3870
819A3877j7065K2688M661l2491n001L2966O331k2537P424K4534j6690l2163Q928
832d538K2890j3852j5726K2925K0552j8547j7355J3268P720j6763p058R586j959
$$ plain form
738 -25478 3987 6529 -23108 -19181 12829 8563 -19731 -9811 16183 -497 -32502 -21385 7039
751 7039 5122 -5951 5805 14524 -1586 -14482 -7861 -2539 -6113 -1644 7866 7132 742 2542
765 2542 5694 3223 3109 3674 -1742 -4826 616 6005 7870 15868 22106 10140 -2553 2679 5977
780 5977 -6002 -4557 21036 30083 7820 1931 23738 22403 -4567 -3637 22611 18615 -5720 3730
794 3730 28997 21535 5746 20771 29762 2178 -11160 14750 22140 -2210 4627 43450 39696
807 39696 -2602 -3369 28721 18575 -14102 203 33505 20694 -2881 17761 37747 13877
819 13877 -3188 19500 24161 -8330 -13331 19635 25966 3429 10853 35387 18697 -13466 -4538
832 -4538 18352 4500 -11226 11699 32251 13704 -3651 9617 17337 574 -6484 3102 1143
845A143q105J0111J4116n504p103O912j246j8371q131R887N615j913P173Q292
859A2876p773q974M166M32j0366n83Q456j676m208J0297Q537j1372o531J1325
873D606j749k4653n459K3946R187j3716L092J8076n797k0261J847R076j3336q498
887b3639J9564J1213j7144l674K3407K977k6166m674J8990m630k1433J0646K6597
900A2034o638j7607J1594J3881j9995j9905J3930J2173j2723j335K1288L452j7536
913g387J393J5206j1454k2285Q528J9093q603j2963J5236J6994j0186j1267P666
926b9P70j5629j876J3669K036p712P680J2465q526j3535L022M270q825k681J1672
941c229M601o476L253R905m267j1933L09L901p465m885R682P097k277K982P315
$$ plain form
845 1143 -6962 3149 17265 11761 4658 11570 10324 -8047 -16178 -6291 -676 -2589 4584 12876
859 12876 5103 -3871 295 727 -9639 -10222 -1766 -3442 -7650 2647 11184 -188 -6719 4606
873 4606 2857 -21796 -27255 -3309 5878 -7838 -4746 13330 7533 -12728 -10881 -1805 -15141 -23639
887 -23639 -4075 7138 -10006 -13680 9727 12704 -13462 -18136 854 -3776 -25209 -14563 12034
900 12034 5396 -12211 -617 13264 -6731 -26636 -12706 -533 -13256 -14591 6697 10149 -7387
913 -7387 -5994 9212 -2242 -24527 -15999 3094 -5509 -18472 -3236 13758 3572 -7695 -29
926 -29 741 -14888 -16764 -3095 -1059 -8771 -1091 11374 2848 -10687 -7665 -3395 -12220 -14901 -3229
941 -3229 1372 -5104 -1851 8054 3787 -8146 -7837 -3936 -11401 -16286 -6604 493 -1784 1198 8513
956H513o023j3864J470P185n995n593J0174R013o655m085P373m13j1500j658Q195
971c863l603p248R401J2727m390p610O245J668j4518o565J1163M686p830L424
985f313J4771j443j3633J946Q639o827j0827N707Q509n660k112J1836M488j1099
999b018m106P422k346j1102L307J4028J047o258L663N703o254p959L698K646n929
1014d458n5Q798K279m248L893O454n484r213J313L736l685j271R061N605n398
1029G327j910L758j743o473J118O058j877l600N717O012l542l453L464k48p978
1044B630k603N760L430j215L237L904k528m775K34P46l303o73L567J240k744J746
1060H653M988j125m240j87M85m027j543N438L422j844m28K095k550o293l72M317
$$ plain form
956 8513 2490 -11374 -9904 -2719 -8714 -14307 -4133 4880 -1775 -5860 1513 1100 -10400 -12058 -3863
971 -3863 -7466 -14714 -5313 7414 3024 -4586 1659 3327 -11191 -17756 -6593 -1907 -9737 -6313
985 -6313 8458 7015 -6618 -4672 3967 -2860 -13687 -7980 529 -5131 -7243 4593 9081 -2018
999 -2018 -6124 1298 -1048 -12150 -8843 5185 6232 -26 3637 9340 3086 -4873 -1175 1471 -4458
1014 -4458 -4513 4285 6564 2316 6209 12663 7179 -2034 -721 3015 -670 -1941 7120 12725 7327
1029 7327 5417 9175 7432 959 2077 8135 6258 2658 8375 14387 10845 7392 10856 10608 2630
1044 2630 27 5787 9217 8002 11239 15143 12615 7840 8074 8820 5517 4844 8411 9651 6907 8653
1060 8653 13641 12516 8276 8089 8574 4547 3004 8442 11864 10020 9592 11687 9137 2844 2472 6789
1076F789r78k875K008M276j419k625K514J209m464m468J043J679j044R87M021
1091F653P69l477k714k0r91j350Q74K016r5j103P27J12q70j214j385j489j444
1108e001M29K367J740O83K57r93k407k907j017J263J099K07P89P89j32j044n75
1125d453k9j176k061J68J715M24RK412J746k693m204j26J955k134j287M220L842
1142a672j604k332J344O96l619k345K350J134j970J734M865K81l820mJ745l197
1158f414l585J571L922K31p2K690K044l068k593J13j266j898J627L800J143N8
1174a697J978o3l439j701P27j050j726J972L287M21j19K221N50l944k263K68j437
1191f015k021M196N628l79k010J292K13n429l310L614J592l127K210O359p99n831
$$ plain form
1076 6789 5811 2936 4944 9220 7801 5176 7690 8899 4435 -33 1010 2689 1645 2632 6653
1091 6653 7422 3945 1231 1211 220 -1130 -256 1760 1665 562 1289 1401 531 -683 -2068 -3557 -5001
1108 -5001 -4572 -2205 -465 218 475 -518 -2925 -5832 -6849 -5586 -4487 -4280 -3491 -2702 -2834 -3878 -4453
1125 -4453 -4482 -5658 -7719 -7551 -5836 -5412 -5403 -2991 -1245 -3938 -8142 -8268 -6313 -8447 -9734 -5514 -1672
1142 -1672 -3276 -5608 -4264 -3568 -7187 -9532 -7182 -6048 -8018 -6284 -1419 -1138 -4958 -4962 -3217 -6414
1158 -6414 -9999 -8428 -4506 -4275 -4347 -1657 387 -2681 -5274 -5161 -6427 -8325 -6698 -2898 -1755 -1697
1174 -1697 281 218 -3221 -4922 -4195 -5245 -6971 -4999 -1712 -1291 -1410 811 1361 -2583 -4846 -4578 -6015
1191 -6015 -8036 -3840 1788 1409 -601 691 904 -4525 -7835 -4221 -2629 -5756 -3546 2813 2014 -3817
1207c817L060M927o291q048L563N269l453p87Q524M312p282l351L587l457q629
1222a1873L635J0540p11o729M956P603o508p962N247M333q513m731Q577N207n428
1237b357P91R384o69j1908k557N059j912l731Q147Q360m102n637M795J580q718
1252c475l628P427L234n819p26O998L126k361P66J551n843n527J619K676j58L958
1268C818P272J46m958k623o03l559l80N323K331k519R37M157p48k237K636M8o503
1285B538l757M760J559l313O563J1720k376j3597k515N710l643o594Q202J0490
1299A5747m230p001N892L366q586k508R066j35j2865j81J2005J044o751P114Q807
1314B0784j0798j6205M686J0109n994l902J3738Q738j2334j0401P084L708p986
$$ plain form
1207 -3817 -757 4170 -2121 -10169 -6606 -1337 -4790 -5577 2947 7259 -23 -3374 213 -3244 -11873
1222 -11873 -8238 2302 1591 -5138 -182 7421 913 -7049 -1802 2531 -5982 -10713 -2136 3071 -2357
1237 -2357 -1566 7818 7149 -4759 -7316 -2257 -4169 -7900 247 8607 4505 -1132 3663 5243 -3475
1252 -3475 -7103 324 3558 -2261 -2987 4011 7137 4776 5542 7093 1250 -4277 -2658 18 -140 3818
1268 3818 11090 11236 6278 3655 3052 -507 -887 4436 6767 4248 5185 9342 8594 6357 8993 9041 2538
1285 2538 -1219 3541 5100 1787 8350 20070 17694 4097 1582 7292 3649 -2945 5257 15747
1299 15747 11517 4516 10408 13774 5188 2680 11746 11611 -1254 -1435 10570 11614 4863 11977 20784
1314 20784 9986 -6219 -1533 8576 2582 -1320 12418 21156 8822 -1579 5505 9213 1227
1327A227q57P943l051r083N021J0568l175o280O675K411j4446j0163R891J0219
1341F900l711p29P874p04j2852m879N726K817k656J310K924l085k564M173K942
1356C486k593j257O0n774o701K768Q116M362N97M63l713o743k798J261L2K695
1372e739O056O37p320k154O215L03n852J613N913o699j0024N736J2365j143n466
1387e559N857K688j3195q914R298O690m904K118J1002l512j4719P13J2527k104
1401b014j0123N026Q832r077r287J1520J1826p497p226P606k89j4970k878J6569
1415a982P472p629n20O392o640j0715M722R908m299n314Q181K917j0486l136J2891
1430A762O739r829o221L445j184n280M621J0161N31n322L93j334p045j386P443
$$ plain form
1327 1227 370 8313 5262 -3821 1200 11768 8593 2313 8988 11399 -3047 -13210 -3319 6900
1341 6900 3189 2460 10334 9630 -3222 -8101 -2375 442 -2214 -904 2020 -1065 -3629 544 3486
1356 3486 893 -364 -304 -6078 -12779 -10011 -1895 2467 3064 3527 -186 -6929 -9727 -8466 -8434 -5739
1372 -5739 317 954 -6366 -8520 -2305 -2002 -7854 -6241 -328 -7027 -17051 -11315 1050 -93 -5559
1387 -5559 298 2986 -10209 -19123 -9825 -3135 -8039 -5921 5081 1569 -13150 -12437 90 -2014
1401 -2014 -12137 -7111 1721 -7356 -16643 -5123 6703 -794 -8020 -414 -703 -15673 -18551 -1982
1415 -1982 5490 -2139 -2659 3733 -2907 -13622 -8900 1008 -3291 -8605 -424 2493 -7993 -11129 1762
1430 1762 8501 -1328 -7549 -4104 -5288 -10568 -5947 4214 4745 -577 -184 -1518 -8563 -9949 -2506
1445b506N079k353j860M33j875j591L688L018k832k177l33k178j285M921N250
1460C399r24j569P22m178p948J747J0281J745n692J342M336m578n964N132N851
1475C702o070l610P148J165r690J63J3607K062j2022k849P136j920q035N435J0656
1490F878l459o591N246L081j0302m058J1511N538r925l261R408J277r371J200
1504b828J0049j892q806J388O507l912m459P512O987o201n504L544M12n702J856
1519a049Q579M68o029O88M553l003m823K793N731j420l597J2J702R0J583K261
1535H539j632k694k44K49j111R87M162J775j704j378j264k539k05L932J499k127
1551F245l21K628j260k920K214L853l413m406K344K394l559r61O852L266o581
$$ plain form
1445 -2506 2573 220 -1640 -1207 -3082 -4673 -985 2033 -799 -2976 -3309 -5487 -6772 -1851 3399
1460 3399 2475 906 1628 -2550 -10498 -8751 1530 3275 -2417 -1075 3261 -1317 -7281 -2149 3702
1475 3702 -2368 -5978 1170 2335 -7355 -7192 6415 8477 -3545 -6394 742 -1178 -9213 -3778 6878
1490 6878 3419 -3172 2074 5155 -5147 -9205 2306 7844 -2081 -5342 4066 5343 -4028 -2828
1504 -2828 7221 5329 -3477 -2089 4418 506 -3953 3559 10546 4345 -1159 2385 2797 -2905 -1049
1519 -1049 7530 7998 1969 2657 7210 4207 -616 2177 7908 6488 2891 2903 4605 4695 6278 8539
1535 8539 6907 4213 3969 4218 3107 4094 8256 10031 8327 6949 5685 3146 2941 6873 8372 6245
1551 6245 5924 8552 7292 4372 6586 10439 7026 2620 4964 7358 3799 2838 9690 12956 6375
1566F375l719L209p1n225J935O683q34n161J749L571m369m404M637L542n634l269
1582i85N096K976m762n71N547p95p801j320N161l72l776K639N602k413m925Q03
1598A04J245l448j435L590R66l483Q20L803k68m123k88K389k075l818N17L605
1614a899Q73k17P80j00k073j731o90q80L76J904J294m62N5J154q49k573l56M45
1632d949j178o81J646J865L3O32J714j790l479o40J710j687l74K967L682j444
1648a973j768J201J64l585j440K469N70j612J480L798K76k672N48M27k901k606
1664g624K218K228j199R70M031M24l565j276J381j668k600J294L497K62n45K064
1680a08J196k355k399M34n5k118J50L081J993n59R15Q08j710l309j59O48n38k26
$$ plain form
1566 6375 2656 5865 5794 569 2504 9187 8353 3192 4941 8512 4143 -261 4376 7918 2284 -985
1582 -985 4111 7087 2325 1754 7301 6506 -1295 -2615 2546 2174 -1602 1037 6639 4226 -699 104
1598 104 1349 -2099 -3534 56 1022 -2461 -1641 2162 1894 -2229 -2517 -128 -2203 -6021 -5504 -1899
1614 -1899 -1026 -1243 -463 -563 -2636 -4367 -5057 -5937 -5561 -3657 -2363 -2825 -2770 -1616 -2465 -5038 -5394 -4949
1632 -4949 -6127 -6808 -5162 -3297 -3264 -2632 -918 -2708 -6187 -6827 -5117 -6804 -7178 -4211 -529 -1973
1648 -1973 -3741 -2540 -2376 -5961 -7401 -4932 -4362 -5974 -4494 -696 -420 -3092 -2544 -2117 -5018 -7624
1664 -7624 -5406 -3178 -4377 -3407 624 1048 -2517 -3793 -2412 -4080 -6680 -5386 -1889 -1627 -2172 -108
1680 -108 1088 -1267 -3666 -3232 -3287 -5405 -5255 -2174 -181 -740 175 983 -727 -4036 -4195 -3547 -4085 -4311
1698d311K844J966k47j9j98j654j822n26l3q2J111K840Q94q27M9N63k319k828
1716d599P5R88M43L70K841J132q44j153L5j662k180l77K239P75k9J969K027r19
1734A131k158n32o86j746n33J945J534Q12J573R50j059j869o42k80j595k72K496
1751i31J892j78J214J104o85k729n69K01q18l78K185K727N87k93K68K45k539j945
1769f42P07R66l71J181K439J235m21n49m67j391j602P5P67J300R58J568R45k81
1787F417j374j067m58n84o45Q12J970J509N94k89j90n26j451j632k77J022P59
1804D590R58J529M78k48r85p57j532j129L77J036K64K52J461P52p09j344j020
1821C973l96j418n56J810J429J09L13N37n31k063j324j98l5n99R82J837L23q76
$$ plain form
1698 -4311 -1467 499 252 233 35 -1619 -3441 -3967 -4000 -4082 -2971 -131 763 -64 -15 548 -1771 -4599
1716 -4599 -4524 -3536 -3093 -2723 118 1250 406 -747 -712 -2374 -4554 -4931 -2692 -1917 -1946 23 2050 1131
1734 1131 -1027 -1559 -2245 -3991 -4524 -2579 -1045 -233 1340 2290 1231 -638 -1280 -1560 -3155 -3427 -931
1751 -931 961 783 1997 3101 2416 -313 -882 -681 -1499 -1877 308 3035 3622 3329 3597 3842 1303 -642
1769 -642 65 1031 660 1841 4280 5515 5094 4545 4078 2687 1085 1160 1927 3227 4185 5753 6698 6417
1787 6417 5043 3976 3518 2934 2289 3101 5071 6580 7174 6885 6695 6169 4718 3086 2809 3831 4590
1804 4590 5548 7077 7555 7307 6322 5565 4033 2904 3281 4317 4581 4833 6294 7046 6337 4993 3973
1821 3973 3577 2159 1603 3413 4842 4951 5264 5801 5270 3207 1883 1685 1650 1051 2033 3870 4193 3317
1839C317J4K2j839j821L9M85l2k57J444J416k85j769o74K2j386j573N78J961L90
1858E2n65M21P95j242k537L17J040j053j489J921J962j415q22J683L18l129j657
1875e400J668J083k407J031L542O88l838q28K146r07l297J438L606j159k789J938
1891c485K932j915k622K121J234l517j736L615K664k706k60L452o14m617o06L653
1907b407L22k580J204L184j322k752J017K634j293k277J160J499j532j097K610
1922a630K418j481j993K91M28j183n12J557J499J90j034K52j37l96j233O78J615
1939f71o78j934J245K515r34j946R96K347k637l129K095L083j596k053L580K679
1955B962m895l382L929K194m011q36N021J212n134p90N082r48n656K219N322k964
$$ plain form
1839 3317 3331 3353 1514 -307 -268 217 185 -72 1372 2788 2503 734 60 82 -1304 -2877 -2299 -338 52
1858 52 -513 -92 703 -539 -3076 -2759 -1719 -2772 -4261 -2340 -378 -1793 -2615 -932 -614 -3743 -5400
1875 -5400 -3732 -2649 -5056 -4025 -483 205 -3633 -4461 -2315 -3222 -6519 -5081 -1475 -2634 -5423 -3485
1891 -3485 -553 -2468 -5090 -2969 -1735 -5252 -6988 -3373 -709 -3415 -3675 -223 -837 -5454 -6060 -2407
1907 -2407 -2085 -4665 -3461 -277 -1599 -4351 -3334 -700 -1993 -4270 -3110 -1611 -3143 -4240 -1630
1922 -1630 788 -693 -2686 -2395 -1967 -3150 -3662 -2105 -606 -416 -1450 -1198 -1335 -1731 -2964 -2286 -671
1939 -671 -1349 -3283 -2038 477 -457 -2403 -1407 940 -1697 -4826 -2731 352 -1244 -3297 283 2962
1955 2962 -1933 -5315 -1386 808 -3203 -4039 982 2194 -2940 -3730 1352 404 -5252 -3033 2289 -675
1971f75n719L895O299l550n302M348L710n765m574N640M412m823j653O297Q72
1986C412p736q72O118J85n256J332N542j881m892K409N163k756m680L043K977
2001B108m201k924N070M612k580l174J918Q44l241j747L437K331r77o50J483J49
2017B458k085l86K065J071j936k072J200K645m46l3J798J644l489l008J278K615
2033C319j381n59M377K614m988l847M322K573m572j796M978J695n046p26O209
2048G172O37n202L04M871l706o878L702Q157k262n423M118M665o658o441O189
2063C245N001o153k879P594K847p940k436Q431J556r028j346O463r10o261L234
2078A418P486k278o817K709M377o449n067N906N741m247m259M779L326n778l243
$$ plain form
1971 -675 -6394 -2499 3800 250 -5052 -704 3006 -2759 -7333 -1693 2719 -2104 -3757 2540 3412
1986 3412 -4324 -5196 922 1107 -4149 -2817 2725 844 -4048 -1639 3524 768 -3912 -869 2108
2001 2108 -2093 -5017 53 4665 2085 -1089 829 1673 -1568 -3315 122 2453 1476 826 2309 2458
2017 2458 373 -13 2052 3123 1187 -885 315 2960 2514 2481 4279 5923 2434 -574 704 3319
2033 3319 1938 1379 5756 8370 3382 -465 3857 6430 1858 62 5040 6735 1689 963 7172
2048 7172 7809 2607 2911 7782 4076 -2802 900 9057 6795 1372 5490 10155 3497 -2944 3245
2063 3245 8246 2093 -786 6808 9655 1715 -721 7710 9266 238 -1108 5355 4445 -1816 1418
2078 1418 8904 6626 -191 2518 6895 446 -4621 1285 7026 2779 -1480 3299 6625 847 -2396
2093b396M662J399m883j268M017Q14l028Q16L777n99m617j629J546l25r98K209
2109e03K488j40k313p96L39q17j706J34K284R88l025o63L182K128k582k999J927
2126b074L82l775j169N133K499k732q18L536j843o142N74N546n10m456K703N436
2142B290l352m985M059M538n675n042N001L917o169j806Q622L492p513l209N693
2157a39l71p381J038Q458k83o357K585O130m000o244L779N199n216m227N480M002
2173B453m520j896O282J301o977k227M938J54m179Q24O350r5m140k4K686j739
2189h09l397J889K632j746r70K331J112j318q03J002m65j746j098J054J092R66
2205b74M39J05L09r51k047j276J449J062q36k50K714O58k736j014K689O3l533
$$ plain form
2093 -2396 2266 3665 -1218 -2486 1531 2345 -683 133 3910 3311 -1306 -2935 -1389 -1714 -2712 -503
2109 -503 1985 1845 -468 -1264 -925 -1742 -3448 -3314 -1030 -42 -3067 -3730 -548 1580 -1002 -4001 -2074
2126 -2074 -1692 -5467 -6636 -1503 996 -1736 -2554 982 -861 -7003 -6429 -883 -1393 -5849 -3146 2290
2142 2290 -1062 -6047 -1988 2550 -3125 -8167 -3166 751 -5418 -7224 1398 4890 -2623 -5832 -139
2157 -139 -510 -7891 -6853 1605 1322 -5035 -2450 3680 -320 -6564 -2785 2414 -2802 -7029 -1549 2453
2173 2453 -2067 -3963 2319 3620 -3357 -5584 -646 -492 -4671 -3847 2503 2408 -1732 -1756 930 -809
2189 -809 -4206 -2317 315 -1431 -2401 -70 1042 -276 -1079 -77 -542 -2288 -3386 -2332 -1240 -274
2205 -274 165 270 579 -372 -2419 -3695 -2246 -1184 -2020 -2270 444 1102 -1634 -2648 41 104 -3429
2222c429m51L066l09k874K582M364k021m410J867K431m151k487M474L835l982
2237a495j765M336O83m827j517N238j0n072O50N783j055m269K958L952l480m564
2253d454K528L063l285j075M568K724m247j817L515K39m169kM364n83k903J792
2269B58L316j617k740K157J476k482j992K617J715j271J13K146k80k006l09J233
2285B334m09j267J320J448k92m42N39K7o52N2J6l69j58J369K05p61P14J060r53
2304C781j256N52J41j104J67K246qj576n3J916j246k010O42K109j278j514J835
2321C344J652k060j197J916M64k541j110K477L09j910N31K349p62k790N83J608
2337B863j578j262J899J350j809j276J879L37k207p79K100o81j907Q27J765m20
$$ plain form
2222 -3429 -3880 -814 -1123 -3997 -1415 2949 928 -3482 -1615 816 -3335 -5822 -1348 2487 -1495
2237 -1495 -3260 1076 1759 -3068 -4585 653 643 -4429 -3779 2004 949 -3320 -362 3590 110 -4454
2253 -4454 -1926 1137 -2148 -3223 1345 4069 -178 -1995 1520 1759 -2410 -2412 1952 1369 -1534 258
2269 258 3574 1957 -783 1374 2850 368 -1624 993 2708 1437 1550 3696 3416 1410 1101 2334
2285 2334 1925 658 1978 3426 3134 2692 3231 3258 2606 2658 2674 2305 2147 3516 3721 2960 3674 4734 3781
2304 3781 2525 3077 3218 2114 2281 4527 4519 2943 2890 4806 3560 1550 2192 4301 3023 1509 3344
2321 3344 4996 2936 1739 3655 4119 1578 468 2945 3254 1344 1875 4224 3462 672 1255 2863
2337 2863 1285 23 1922 3272 1463 187 2066 2403 196 -583 1517 836 -1071 -244 1521 1101
2353A101j545Q15P87j524j672J311J066j505n8J368J06j809j3J378p10j480N26
2370a858Q76p62m9J037J32p97n43L39j98q36N07J065j87m26K17K99n52o80M03
2389b013q3o09N71J084o67N8O84J5r79p64J147j03r95N71J619J93j445j00R90
2408h26m28j116N81P30m31o5J071O49j028k98N62l03j342N29J289J08o86Q55O60
2427E11n78j191L17L30o76P0J204r1m08M94J72j93j362K28O68p99k84J340P07
2446D59o25l94O89j02j194p51Q69M10m23K65Q73J0m71J19l54k27r86J81N13p6
2466a215N76K95O75j099j55n69k30J02p5K66P00M19J18m62j64l45n76n23M53N43
2486a266k87M51Q49L05p54p45K92m27o68Q6R62L06N4R16N81p73j541O05K03m96
$$ plain form
2353 1101 -444 371 1158 -366 -2038 -727 339 -1166 -1224 144 250 -1559 -1572 -194 -904 -2384 -1858
2370 -1858 -982 -1744 -1793 -756 -624 -1421 -1964 -1625 -1823 -2659 -2152 -1087 -1274 -1700 -1483 -1184 -1736 -2416 -2013
2389 -2013 -2096 -2705 -2134 -1050 -1717 -1659 -975 -960 -1939 -2703 -1556 -1659 -2654 -2083 -464 -271 -1716 -1816 -826
2408 -826 -1254 -2370 -1789 -1059 -1490 -1555 -484 165 -863 -1161 -599 -902 -2244 -1715 -426 -318 -1004 -149 511
2427 511 -67 -1258 -941 -611 -1287 -1217 -13 -104 -512 -18 154 -39 -1401 -1173 -505 -1304 -1588 -248 459
2446 459 -166 -560 129 27 -1167 -1918 -1049 -639 -1062 -797 76 86 -385 -266 -620 -847 -1833 -1652 -1139 -1215
2466 -1215 -639 -344 331 -768 -923 -1492 -1722 -1620 -1695 -1429 -729 -310 -192 -654 -818 -1163 -1739 -2262 -1809 -1266
2486 -1266 -1553 -1102 -253 52 -702 -1447 -1155 -1582 -2250 -2164 -1202 -896 -842 74 655 -118 -1659 -1054 -851 -1347
2506a347n21J339J174p28k77J095K38j417o96O11K66o08O08J593L91q65K4L74
2524A254p56j099N18J155L46l92P23R75r96r56N27P82r10j132J165J222l64k78
2542A784J333R41j703j412O96M15q75L6K211Q99j566l58P82J44k008k65J971J91
2560C216k056Q56K112J44k342R36R88j516k379R13K306n66j114J912J202k092
2576B520k278J268J170j814o55J756J151k027m95K487P1k486o13J842r55k080
2592a138Q74K646J48j952j62J352j351k237O02K141k74j281M79J364q99j732P80
2609f40J617j308k100L45J724p05k67J456J562k023k255K67J184j125o69K597
2625c40J534k167k187J941J255k291j358K875J006k796j255L064J491k455l69
$$ plain form
2506 -1347 -1868 -529 645 -83 -360 735 973 -444 -1140 -529 -263 -871 -263 1330 1721 856 880 1254
2524 1254 498 -601 -83 1072 1418 1026 1749 2724 1728 772 1299 2081 1171 39 1204 2426 2062 1784
2542 1784 3117 4058 2355 943 1639 2054 1179 1215 3426 4325 2759 2401 3183 3327 1319 1054 3025 3216
2560 3216 1160 2016 4128 4272 1930 2866 3854 2338 -41 872 3178 2612 1498 3410 4612 2520
2576 2520 242 1510 2680 866 211 1967 3118 1091 596 3083 3154 668 55 1897 942 -1138
2592 -1138 -264 2382 2530 578 416 1768 417 -1820 -1218 923 649 -632 -153 1211 312 -1420 -640
2609 -640 977 -331 -2431 -2086 -362 -1067 -1334 122 1684 -339 -2594 -2327 -1143 -2268 -2937 -340
2625 -340 1194 -973 -3160 -1219 36 -2255 -3613 -738 268 -2528 -3783 -719 772 -1683 -2052
2640b052K925p75m765J66M075O83k656J482K909k541l833K057L457k125k351K773
2656e71K171l464k132L831K896l374k342K930L98l922O5M853J076l309m59K523
2672A170j373l623J532L910q3l437J182K082j549k234K339K846k381k580R63J986
2688G50j511j206L159K016k541k996N12K026j332k20K190J392k120k256J409J399
2704F71j319j001K464M53k582k194K880K107j656q12J923ol697j229M131J548
2720A681k570n67K841r18m182m1M671L42l528M04K913j932l679K394M524k213
2736A40l523K044K003l504k253M776L577l923k702L252M29m149j56N393Q04m469
2752b261o36L773o08l800J573M896j565m351R45L174j588k307L182L275l341l317
$$ plain form
2640 -2052 873 98 -4667 -4501 -426 257 -2399 -917 1992 -549 -4382 -2325 1132 -993 -3344 -571
2656 -571 1600 -1864 -3996 -165 2731 -643 -2985 -55 343 -3579 -3514 1339 2415 -894 -1353 1170
2672 1170 -203 -3826 -2294 1616 1533 -1904 -722 1360 -189 -2423 -84 2762 381 -2199 -1236 750
2688 750 -761 -1967 1192 3208 667 -2329 -1817 209 -1123 -1343 847 2239 119 -2137 -728 671
2704 671 -648 -1649 815 1268 -1314 -3508 -628 1479 -177 -989 934 928 -2769 -3998 133 1681
2720 1681 -889 -1456 1385 467 -3715 -3756 915 1257 -2271 -1867 1046 -886 -4565 -2171 2353 140
2736 140 -3383 -1339 664 -2840 -5093 -317 3260 -663 -3365 -113 316 -3833 -3989 1404 2208 -2261
2752 -2261 -2897 876 268 -3532 -1959 2937 1372 -2979 -2034 1140 -448 -2755 427 3702 361 -2956
2768b956J853K294k110p70L919J152l081k311K457J544k202j75L047L14k805j419
2784a249K453J260j405j82K002o21k304o47K332J604j320j65R53j92k726j97L347
2801B943J036k441k93J731m90k583M31L999j97l230l67K756r48k821J835M050
2817E411j706l571P05K031j716j953L456K865l332k566K334J072l244n50M269
2832C505N28m184r59L723K99l630O02M299j801m507Q35L516j124k497K265K801
2848C671l050l405K029K449k066j354L031R08l447j269L011P25k904o7K834o60
2864D36l103J05K738O09k093J41J401r48k010M79J696J32n40K05M33r00j144P52
2882a611R48l67n81l5Q69o6o32J44J145P2j640o43J317j2j047J070J979m36k252
$$ plain form
2768 -2956 -1103 1191 -919 -1689 2230 3382 301 -2010 447 1991 -211 -386 2661 2975 170 -1249
2784 -1249 1204 2464 1059 877 2879 2258 -46 -693 1639 3243 1923 1758 2711 2519 -207 -404 2943
2801 2943 3979 1538 1245 2976 2486 -97 334 4333 4136 906 539 3295 2347 -474 1361 5411
2817 5411 3705 134 839 2870 1154 -799 2657 5522 2190 -376 1958 3030 -214 -764 3505
2832 3505 4033 -151 -1110 2613 2912 -718 -116 4183 2382 -2125 -1290 2226 1102 -1395 870 3671
2848 3671 621 -2784 -755 1694 -372 -1726 1305 2213 -1234 -2503 508 1233 -1671 -1738 1096 436
2864 436 -2667 -2562 176 785 -1308 -1167 234 -714 -2724 -2245 -549 -417 -957 -752 -319 -1219 -2363 -1611
2882 -1611 -663 -1030 -1611 -1646 -777 -843 -1475 -1331 -186 -114 -1754 -2397 -1080 -1092 -2139 -1069 910 474 -1778
2901a778k24J738n46j431J069K074j201j795J533J393j399j282J885Q91k739q35
2917b647K743J112j861k09K636p56k931j35K635k29k424J647K489j645j994J367
2933b02K013j786j453J646Q71k153o35K760O48k120OJ321m63k280N30K086k28
2950E61j403P01J470j028j291M61O25q94o02J125K04p16L03O31K10q77k55Pl10
2969a078l39Q07M19O0J7l9l87l54k79kj99N13n2q8JN20K73p89m37K63J10o53J4
2992a699J482k19q24N14R12j212j079J106Q53j230k13J748M18j677j13J342m05
3009b96r52k47J367l10o66P50J127j25j056M25L86q74o90J290O38j130K54J379
3027A270k82p45k57O66P6j069P02O34K57l33P13K92n66p08K06M74o63J31J228
$$ plain form
2901 -1778 -2002 -264 -810 -2241 -1172 902 -299 -2094 -561 832 -567 -1849 36 927 -1812 -2647
2917 -2647 96 1208 -653 -862 1774 1018 -1913 -2048 587 358 -2066 -419 2070 425 -1569 -202
2933 -202 1811 25 -1428 218 1089 -1064 -1699 1061 1709 -411 -405 916 453 -1827 -1297 789 561
2950 561 -842 -141 1329 301 -990 -529 96 -798 -1400 -275 -71 -787 -484 147 357 -520 -775 -768 -1078
2969 -1078 -1417 -610 -191 -131 -114 -153 -540 -894 -1173 -1175 -1374 -861 -913 -1001 -1000 -480 -207 -996 -1433 -1170 -1060 -1713 -1699
2992 -1699 -217 -436 -1260 -746 166 -1046 -2125 -1019 -166 -1396 -1609 139 557 -1120 -1233 109 -296
3009 -296 -1248 -1495 -128 -438 -1104 -354 773 648 -408 17 403 -471 -1161 129 767 -363 -109 1270
3027 1270 988 243 -14 652 728 -341 361 995 1252 919 1632 1924 1358 650 856 1330 667 798 2026
3046B026k0n35J91J87J04r04K58M20m24J74L23N93n64J47K02l89l46P9Q9j66K43
3067A688J26K16J37k95K61p09k33L28k5j92M0N45n3j17m81M64m36o43J74L40l33
3088H02j40M44K90m09m52N30j25j097l29Q93K83o03J28L74J6j001K66K54p32l31
3108i39L83K87j63p4M43k45o89j50N89l25l73L15O38m56l48M18Pj11m33P2K72
3129h82n24k86R84L67p46K3m0j58l3j5K74K1r7L2K29O7p7Q4j40l17j25J17N55
3152f87j8j4K6N62n15m00L53K1J95k30L81K18k06k06L93K24j92k47k78M90q5l36
3174e51L50P03j87k58m74O46m07k60O28K58l03m07L65K35k12j79m1L62o99J8O82
3195B69n9k84n2L96k2j002K14O28J77q13N11O58o67n27J38P39j76q19K82O22q36
$$ plain form
3046 2026 2006 1471 1662 1849 1953 1049 1307 1727 1303 1477 1800 2393 1829 1976 2178 1789 1443 1522 1611 1445 1688
3067 1688 1814 2030 2167 1872 2133 1424 1191 1519 1494 1302 1342 1887 1834 1717 1236 1700 1264 621 795 1135 802
3088 802 662 1106 1396 987 535 1065 940 -157 -486 407 690 87 215 589 605 -396 -130 124 -608 -939
3108 -939 -556 -269 -432 -506 -63 -308 -997 -1147 -558 -883 -1256 -941 -303 -759 -1107 -689 -682 -793 -1226 -1154 -882
3129 -882 -1406 -1692 -708 -341 -1087 -1064 -1104 -1262 -1295 -1310 -1036 -1015 -1112 -1080 -851 -784 -861 -777 -917 -1234 -1359 -1242 -687
3152 -687 -705 -719 -693 -131 -646 -1046 -693 -672 -477 -707 -326 -108 -314 -520 -127 97 -95 -342 -620 -130 -215 -551
3174 -551 -201 502 315 57 -417 229 -178 -438 190 448 145 -262 103 338 126 -53 -94 268 -431 -413 269
3195 269 210 -74 -126 270 248 -754 -540 88 265 -548 -37 621 -46 -573 -435 304 128 -691 -409 213 -623
3216f23l30L29N71j93q23O86M66j080r0R10J62q81k83O78o1q38j00J132O8p06
3236a006k16J088m65r65K93Q32j02o49K28P04k41q10K85R35o00j028P26Q07o20
3255h04p74J131P93q12q19N89M89q44p6J185Q20j147o51Q27K9n15J61R52L43j376
3275d99L46Q44Q0r13P95P41n34j168M28R25k96l09N39P28m79j053K10J292l35
3294A342p26L90R81q82l63L95Q21r4j011Q19M11j114q16J454J097r50p02J276
3312B328j37j051p28J548L00j176j80J149j63q93k89J554k16j663jJ479l76j335
3330A50R08J538p64j709M98R21r07r78J145J103j028r65R60L30j320p30J723J78
3348A053j249o80J276N39j280p5J346m62j736j63J259r7p63O91J157p39j498K50
$$ plain form
3216 -623 -953 -624 -53 -246 -1069 -383 83 -997 -1087 -177 -15 -896 -1179 -501 -562 -1400 -1500 -368 -300 -1006
3236 -1006 -1222 -134 -599 -1564 -1271 -439 -541 -1190 -962 -258 -499 -1309 -1024 -89 -689 -1717 -991 -184 -804
3255 -804 -1578 -447 346 -466 -1285 -696 -207 -1051 -1127 58 878 -269 -920 -93 -64 -579 -418 534 877 -499
3275 -499 -153 691 771 -142 653 1394 860 -308 120 1045 749 440 979 1707 1228 175 385 1677 1342
3294 1342 616 1006 1987 1105 742 1137 1958 1864 853 1672 2083 969 153 1607 2704 1754 1052 2328
3312 2328 2191 1140 412 1960 2260 1084 904 2053 1890 997 708 2262 2046 383 382 1861 1485 150
3330 150 1058 2596 1832 123 621 1542 635 -343 802 1905 877 -88 872 1202 -118 -848 875 1053
3348 1053 -196 -876 400 939 -341 -416 930 468 -1268 -1431 -172 -269 -1032 -341 816 77 -1421 -1171
3366a171J197j72j033K37J183j030r13R24J030o68j114Q49K68q75j165J208J326
3383H1l55q07L78L84q97r49J410O45m88j041J410K21j388j75J472M87j673l01
3401a586J132M98j771N38K103j95j596k71J360k50j494Q72J667m21j644P80J000
3418G22r21j009J537N70j466o39J235J058j143n54J767J67k267k73J507L24p38
3435a23J32J479o15j559K23R93J27j132J81J205o35r16N38R63m88p18M07N63j074
3454d49q16Q85R15l24n61M08N59q09q19L23J015l89r05J030J82o29q69J203Q03
3473G53j337q65N41P18q78j57J373K58p43j094R79O4j167j56J809L16j826J9J445
3492E2o56q39K83J297p38j153L50J327n49p05Q65R00j051j273J333P99j046k79
$$ plain form
3366 -1171 26 -146 -1179 -942 241 -789 -1702 -778 252 -416 -1530 -681 -413 -1288 -2453 -1245 81
3383 81 -274 -1081 -703 -319 -1216 -2165 -755 -110 -598 -1639 -229 -8 -1396 -1571 -99 388 -1285 -1586
3401 -1586 -454 44 -1727 -1189 914 719 -877 -1148 212 -38 -1532 -660 1007 586 -1058 -278 722
3418 722 -199 -1208 329 899 -567 -1206 29 1087 -56 -610 1157 1324 -943 -1216 291 615 -123
3435 -123 9 1488 873 -686 -463 530 657 -475 -294 911 276 -640 -102 861 373 -345 62 625 -449
3454 -449 -1265 -380 535 211 -350 58 617 -192 -1011 -688 327 -62 -967 63 245 -384 -1253 -50 753
3473 753 -584 -1449 -908 -190 -1068 -1225 148 406 -337 -1431 -452 -388 -1555 -1711 98 414 -1412 -1393 52
3492 52 -604 -1443 -1160 137 -601 -1754 -1404 -77 -626 -1331 -466 434 -617 -1890 -557 242 -804 -1083
3510a083J259O43j642o03J327K85j205k9J704l36j142K64J256k69p55m6J150p72
3528Fn71N11P66m19j41N71L32o36n75O15J65o8j74M06J84l0j43J72L85k64j60
3549I32j66Q10n96k29O64L58j90q96K75N84m67m94P56O40m45p21L00O52p58k10
3569G99O15K35r31k20N65N59o95o3O07L9j178J99J049m02p41N30P79r87o93K89
3589C55Q90p65m42N94P68j322n90J055L12r41j68R40M0j242NR39k6r04M47L35
3609B80l31r74L69P26n32l06M80J5o68k51P17O3m78K54J56n87J00K65J63j10j14
3630g63m0J25l85K02J92J60m54L3O6k34N04N5k26J6J52J29m02L5M81j71l68L54
3652e39L57j65m58O3P25m52j73L36L39l60m39R98Qp86O9O06J64p54J7R73j42q84
$$ plain form
3510 -1083 176 819 -823 -1426 -99 186 -1019 -1048 656 320 -822 -558 698 429 -326 -372 778 6
3528 6 -565 -54 712 293 152 723 1055 419 -156 459 624 556 382 788 972 942 799 971 1356 1092 932
3549 932 766 1576 980 751 1415 1773 1583 687 962 1546 1079 585 1341 1981 1536 815 1115 1767 1009 799
3569 799 1414 1649 718 498 1063 1622 927 864 1471 1510 332 531 1580 1178 437 967 1746 759 66 355
3589 355 1245 480 38 632 1400 78 -512 543 855 -86 -254 686 726 -516 -511 428 402 -502 -55 280
3609 280 -51 -1025 -656 70 -462 -768 -288 -273 -941 -1192 -475 -412 -890 -636 -480 -1067 -967 -702 -539 -649 -763
3630 -763 -803 -678 -1063 -861 -669 -509 -963 -930 -864 -1098 -594 -539 -765 -749 -597 -468 -870 -835 -354 -525 -893 -539
3652 -539 -182 -347 -805 -742 -17 -469 -642 -306 33 -327 -766 232 240 -546 -477 129 293 -461 -444 529 387 -497
3674d97N15N39l01p57Q29N16q44m05P89J66o40M8P17l77m10J10N75k52o30M62
3694A53L51k65m66P64J50l67m67L14L05n12k12L84k5n0K89K27n13j79K04r5k56
3715b66k06N12k57j86K41k31J82k05pJ67l01j91N00r9j16k4L27n73q7N02k31p53
3737a302L42L50J40l55J22P6Ok82K9L25j72l22M63Rj28k0K75l0l40k56N91l9r8
3760f16J6K53k6k49J96K17m06k08P80j24K6j88L78J68n05M00j42j27n3M57j36
3781A11jk94O13M70o76R0P2k8n3O2M45j19j73R9L33j44j06j56J22P6j33K78K94
3804A182j37m0k3L49m60K4J39k59K39k7J23j00K53r7K69n07q6L61j99j12K03j6
3826A079k18L29j20j49j80n2m4j74L19k31L13q7Om12K42n02J46k0J87o20O43N1
$$ plain form
3674 -497 18 557 256 -501 328 844 0 -405 384 550 -90 -42 675 298 -112 -2 573 321 -309 153
3694 153 504 239 -227 537 687 320 -147 167 472 -40 -252 132 107 57 346 573 60 -119 85 -10 -266
3715 -266 -472 40 -217 -403 -162 -393 -211 -416 -423 -256 -557 -748 -248 -347 -463 -487 -160 -733 -820 -318 -549 -1302
3737 -1302 -960 -610 -470 -825 -703 -627 -621 -903 -874 -549 -721 -1043 -580 -571 -699 -719 -444 -474 -814 -1070 -479 -518 -616
3760 -616 -600 -347 -373 -622 -426 -209 -615 -823 -43 -167 -141 -329 49 217 -288 112 -30 -157 -210 247 111
3781 111 110 -184 429 899 223 313 385 357 304 366 811 692 519 618 951 807 701 545 667 743 610 888 1182
3804 1182 1045 1005 982 1331 871 895 1034 775 1014 987 1110 1010 1263 1166 1435 928 842 1203 1004 892 1095 1079
3826 1079 861 1190 1070 921 741 689 645 471 790 559 872 785 791 379 621 119 265 245 432 -188 455 506
3848E06k78J3l9q5l71l59Q20pq0l68J46R9j39n88M51k1o90L26M60l48J11j71M11
3871b01k46n59M55R9m14J47J61L79m01m8l18N86n27p5J86K54n44L67L38j45l8
3892e44J14K12l64o26M12O57j22k40M0M54n0q03L66J97J79n54K07N58r4k02k45
3913d48Q68k61m74J9L86l83P9M76K42j95n86M75L01q00J31N03K73k68l49L44N4
3934C87rl11L52Q5o05j00N82J01l05n5Q07nj103J40M34K59o28K75L20j94o04M04
3956B27K36j60k76j00O21q40q7L11N40l46m91M48k1p34m64J057L90n27j69M05
3976B0l02p57L12N09J72n86k62M57N6p94K50Q69k96o28k59O86O3q83Q14M58k25
3997c26q55J40P25m27n13Q98N97r70o34Q05L60l80o65J209M68j483k30Q23K62
$$ plain form
3848 506 228 241 202 117 -254 -613 207 200 120 -248 -102 -3 -142 -730 -279 -300 -990 -664 -204 -552 -441 -612 -201
3871 -201 -447 -1006 -551 -452 -866 -719 -558 -179 -580 -628 -946 -360 -887 -962 -776 -522 -1066 -699 -361 -506 -544
3892 -544 -430 -218 -582 -1208 -796 -139 -261 -501 -461 -7 -57 -860 -494 -297 -118 -672 -465 93 -1 -203 -448
3913 -448 420 159 -315 -296 90 -293 -214 262 504 309 -277 198 499 -301 -170 333 606 338 -11 333 387
3934 387 378 67 419 504 -101 -201 381 482 177 122 929 924 -179 -39 395 654 26 301 621 427 -177 227
3956 227 463 303 27 -73 548 -292 -379 -68 472 126 -365 83 62 -672 -1136 -79 311 -216 -385 20
3976 20 -282 -1039 -727 -218 -46 -632 -894 -437 -381 -1175 -925 -56 -352 -980 -1239 -553 -490 -1373 -559 -101 -326
3997 -326 -1181 -1041 -316 -743 -1256 -358 239 -731 -1365 -560 -200 -580 -1245 -36 432 -1051 -1281 -458 -196
4016a96n52J82P45k20r62J03J121j33m14J75O19n29r30L38J259k13o47M84M64
4035F94q53m22M62J095k10l88M03j11p90j10P83K72J38o80L84Nr1o74J076O16
4055A599n27n86K18J93o47J25J382K18j227o33J015J28p81M3J160j49j419N2J003
4074A167P0j101O05J251n92j634N03O01k0j020J103N28j107p61L79J143p17n19
4092a21P05N95j353p61J440N64j462L01Q54l33j269k02J438J08r86K72N01n59
4110b68r69N13J200k26p34J72M40l61j007Q05J020n21j013K38M39m62q06R81O07
4129D8k96p51K02K45k93j18P32N49r10p07M97N16k91j73P25L20j133m00O52N11
4149g5m88m8J243k03j416j65J289k72l42L30O06j84j242L58J296n84p06O41P18
$$ plain form
4016 -196 -748 -566 179 -41 -1003 -900 221 88 -326 -151 468 -61 -991 -653 606 393 -254 230 694
4035 694 -159 -581 -119 976 766 378 781 670 -120 -230 553 825 963 283 667 672 581 -93 983 1599
4055 1599 1072 486 704 897 250 375 1757 1975 748 115 1130 1258 477 520 1680 1531 112 164 1167
4074 1167 1237 136 741 1992 1400 -234 269 870 850 -170 933 1461 354 -407 -28 1115 398 -121
4092 -121 584 1179 -174 -935 505 1069 -393 -92 762 429 -840 -1042 396 504 -482 -210 291 -268
4110 -268 -1237 -724 476 250 -484 -312 128 -233 -1240 -435 585 64 -949 -711 -272 -734 -1540 -559 48
4129 48 -248 -999 -797 -552 -845 -963 -231 318 -592 -1299 -802 -286 -577 -750 -25 295 -838 -1238 -586 -75
4149 -75 -563 -611 632 429 -987 -1152 137 -135 -477 -147 459 275 -967 -609 687 103 -603 38 756
4168G56o80j095J171P77p67r11J306N10j140n98Q26J021p18m86N93J10r94J9J159
4187H59j73n97r9P77J6j221O58Q87k06q13P8N90n03r37O85J171q59n35K36P09
4207G23q17m24O99M03l46n75J85M46k98k03L16K81n78l63L33L22n27J29N00l21
4227a15n02O5P20o23k0n07P97J23j156Q2Q75L15m98m84N01j22q50L75Q75q0n74
4248h03K42L50m55m53L44N03k23o43O62J35k94k85O54L61n60o37N16k8j46p7Q19
4269a8K28q73L27J74m49L1j0R30n0r28L41M00l11l1N0M77m1l54J70K78l69J13
4291H5K16O29o49j95L9O69m23q5N29O4p17M09K55j71l59M08L23m01o6j62N14J2
4313I24l97l4L15J0l30K48K94k21o5m8K50k41j09j84N46k14l74O7K12J95l04j90
$$ plain form
4168 756 76 -1019 152 929 162 -749 557 1067 -73 -671 155 1176 458 -28 565 675 -319 -300 859
4187 859 686 89 -10 767 783 -438 220 1107 901 88 166 756 253 -684 1 1172 313 -222 14 723
4207 723 -94 -518 181 584 238 -337 -152 294 -4 -207 109 390 -188 -551 -218 104 -423 -294 206 -115
4227 -115 -617 -552 168 -455 -475 -982 -185 -62 -1218 -1136 -261 54 -444 -928 -427 -549 -1399 -1024 -149 -229 -803
4248 -803 -561 -211 -666 -1119 -775 -272 -495 -1138 -476 -341 -635 -920 -266 95 -465 -1102 -586 -614 -760 -837 -18
4269 -18 210 -663 -336 -162 -611 -580 -590 340 290 -638 -297 103 -208 -239 -189 288 247 -107 63 341 -28 85
4291 85 301 930 281 86 125 794 371 286 815 879 162 571 826 655 296 704 1027 626 560 398 912 924
4313 924 527 493 808 818 488 736 1030 809 744 696 946 705 596 412 958 744 370 437 649 844 540 350
4335C50L10m8m27J87J15k3l34K68N7j58l69L55N0k23j62N2M27m65j7K56N8l74
4357a15j35J49j69j49j22N84n9k54J53L5r9m69M1L69l33P7J14L08m49m1q6K1J05
4380e24k8J52j8j90j96P43m27k39J99J11Prj82J25K37J11k71K18P9k54j18L26
4402a48J31k93j70N9N72k03J70k53J3l28M51J89J66n00N23k02j20l8qK57l67k0
4424a19L36K46k83n5K44R1k46J11J10k17J74k43K82J88m35J12J35K28l58Q7lk28
4446A57N7K75J67k51r1j73J58J7k37L24L3l64J38J07k83m5k20L29K36m12N7J15
4468I4n8m66K6L35n0k79M95l21l0L03o12N88k52n15K82K78Q1k70k94M11Ml54K78
4491c26m5J01k84K11M6j65o5J0q0M2J12PK1k41j29J36M64k94j72N6R2n3j70M57
$$ plain form
4335 350 660 612 185 372 487 464 130 398 455 297 -72 283 333 110 -52 0 427 -38 -55 201 259 -115
4357 -115 -250 -101 -270 -419 -541 43 -16 -270 -117 -82 -181 -650 -609 -240 -573 -496 -382 -74 -523 -564 -650 -629 -524
4380 -524 -552 -400 -418 -608 -804 -61 -488 -727 -528 -417 -410 -419 -601 -476 -239 -128 -399 -181 -102 -356 -474 -148
4402 -148 -17 -310 -480 -421 151 -52 118 -135 -122 -450 1 190 356 -144 379 177 57 19 11 268 -99 -119
4424 -119 217 463 180 125 369 460 214 325 435 218 392 149 431 619 184 296 431 659 301 388 385 157
4446 157 214 489 656 405 314 141 299 316 79 403 436 72 210 317 34 -11 -231 98 334 -78 -21 94
4468 94 36 -430 -404 -69 -119 -398 97 -224 -254 49 -563 25 -227 -742 -460 -182 -101 -371 -665 -254 -250 -604 -326
4491 -326 -371 -270 -554 -343 -297 -462 -527 -517 -597 -555 -443 -436 -415 -656 -785 -649 -185 -479 -651 -595 -503 -556 -726 -269
4515b69r1p7j07J24L86p56J41M98o8j16j61M39j06r8k4K46j22J34j70M77k92k08
4537b20L15J26l16K8M98n9m30J0M40K79k82m32L21K2L9j77N12j22o24L71M26J48
4559H73m37M3L94o5n05j03N74J09n16j1N20m3o46M05K92m76J88j76M12l12l05
4580B15O38j05m11kL74J1m39j07L31K60k83m44N03j02n20k66O88p5m47J39M21
4601C79j4j057P00K10J33o66J40J34R4r01O13M11l36k34J13O90q52j09M20K27
4621I5m06k39L54j76j79k90Q33P6o88j29M39M1o96M3R72j44n92j2N18K61j206
4642a125Q22L10P9o31q4P52k37l13K83M26l67p58N61N61k50l90O70K88o69m66
4662e38N02N87n48l94J040L7q43r5N41O10o75K10J08J34q93L1R95m24o07M44P25
$$ plain form
4515 -269 -360 -437 -544 -420 -34 -790 -649 -151 -219 -335 -496 -57 -163 -261 -285 -39 -161 -27 -197 280 -12 -220
4537 -220 95 221 -95 -67 431 372 -58 -48 392 671 389 -43 278 300 339 162 674 552 -72 299 725 873
4559 873 436 479 873 808 303 200 774 883 367 356 876 833 187 592 884 408 596 420 832 520 215
4580 215 853 748 337 335 709 720 281 174 505 765 482 38 541 439 -81 -347 341 266 -181 -42 379
4601 379 365 -692 8 218 351 -315 -175 -41 53 -848 -235 176 -160 -394 -281 409 -443 -552 -132 95
4621 95 -311 -550 -196 -372 -551 -841 -8 68 -620 -749 -310 -269 -965 -922 50 -94 -686 -698 -180 81 -1125
4642 -1125 -303 7 86 -545 -629 123 -114 -427 -144 282 -85 -843 -282 279 29 -361 309 597 -72 -538
4662 -538 -36 551 3 -391 649 686 -157 -252 289 899 224 434 542 676 -217 -186 809 385 -222 222 947
4683I47p78l40L84N25l15l78M01O32o48p72P74O60q77l76N88N12p17l96O02N06
4703I34p36n50P05N2l85k58P18M12r75q7N60J16q85j1Q82j98m99l16Q46r8j081
4724h54L81J101m98j043J69R32j91q09N12R23o90j267J079M72p35o4K50M34o91
4743e89l66N12P88r74n55Q51M94j255j64J096K87j223K49R08m10r86K65J057J
4762a4o98J25O00n83n15M46R14o24n18L51R16o31r78J059K86l89n07M53O55p44
4782c96l48Q41P49r43n97O79N89q79j54J091K42j041QP09Pn01l50Q23K10j090
4802c51J26R42j26n97L6J222l27j195O06M75j53r74R64O81m48j113N69Q03o44
4821D96l13N42L06n13n06M77P29q71m48P97L6q53j12Q55N73j422M65N67k27o94
$$ plain form
4683 947 169 -171 213 738 423 45 446 1078 430 -342 432 1092 215 -161 427 939 222 -174 428 934
4703 934 198 -352 353 405 20 -238 480 892 -83 -170 390 506 -379 -390 492 294 -205 -521 325 227 -854
4724 -854 -473 628 130 -913 -744 188 -3 -812 -300 623 -67 -1334 -255 217 -518 -582 -332 102 -589
4743 -589 -955 -443 345 -629 -1184 -333 161 -1094 -1258 -162 125 -1098 -849 59 -351 -1337 -1072 -15 -14
4762 -14 -712 -587 13 -570 -1085 -639 275 -349 -867 -516 400 -231 -1209 -150 136 -253 -760 -307 348 -396
4782 -396 -744 97 846 -97 -694 -15 574 -305 -459 632 874 -167 -159 550 557 56 -294 529 739 -351
4802 -351 -225 717 591 -6 30 1252 925 -270 336 811 658 -316 648 1329 881 -232 337 1140 496
4821 496 183 725 1031 518 12 489 1218 347 -101 696 732 -121 -233 622 1195 -227 238 805 578 -116
4841a16l16J407l11q14P2Q21n74j130R53P39p08n27N93K74m72p35P96M95l67o98
4861f18N90J75q80J10M10O30r44k33N07J03l05k10O67j65p36j35J045k84l99J61
4881e11M95j48n07j46O81l17k67N9R49m38l79K99K54j41l02L23L79o97m56M44
4901d26O45m34j12J09P31q82R0M53k54N1J4K37J01o06M7O63O0o56K90N45r4p82
4923b10J78M55K73m98m52J064m85l24N7O84k86l54L11M40n70j92L40L67o76j87
4943f5J66O74k83l69M50K84m80k51N23J05o08Q1K57l7l79o4M36J34m58p5L27j06
4965B62l76J67M80l89r4L32jk16k34k43O43m91K48j88K16n26J13K39p2k17J06
4986b41n4k22O0r8L6M33k26n02N30j23J1j96K24K4l81r8O26k36o20N82P9K27n34
$$ plain form
4841 -116 -432 975 664 -150 -78 743 169 -961 -8 731 23 -504 89 363 -109 -844 -48 447 80 -618
4861 -618 -28 147 -733 -623 -213 417 -527 -760 -253 -150 -455 -665 2 -163 -899 -1034 11 -273 -672 -511
4881 -511 -16 -164 -671 -817 -136 -453 -720 -661 288 -150 -529 -230 24 -117 -419 -96 283 -414 -870 -426
4901 -426 219 -215 -327 -218 513 -369 -279 174 -80 -29 -15 222 323 -283 -236 427 487 -169 121 666 572 -210
4923 -210 -32 423 696 198 -254 810 325 1 58 742 456 102 413 853 283 91 431 798 122 -65
4943 -65 101 775 492 123 573 857 377 126 649 754 146 227 484 447 68 4 440 574 116 41 368 262
4965 262 -114 53 533 144 50 382 381 165 -69 -312 331 -160 88 -100 116 -410 -297 -58 -130 -347 -241
4986 -241 -295 -517 -457 -555 -519 -86 -312 -814 -284 -407 -396 -592 -368 -344 -725 -823 -197 -433 -1053 -471 -392 -165 -699
5009f99K28n3J25m15R9N72L4o98L75q6L00l54J05L70m48j14J61N07j62l43M68
5030b8K8m10J12K54J50l93J29K47Q8j73q5O8J28m39K12N24Q4o78L19L05j85K62
5052E19k22J4m1k3O9J94j27o2P4J10j65j39J60K49j30J4j4m6k29J08K37j98l8
5075C14j89P4L33o3O0l35J96j03J68k53L2j97J44j49N33o2m45l11N03o9k06J43
5097A18J54pj85l4q5k88N98P1k65k73J07nL6k90Q2K73k87j1L6p6M5j66K09J36
5121a07k07k40K23J23N1k52O4j19m4L27N9j18n8q1J6J0J7L20k00l38K21j30K75
5144a88k87J78J51M4l38m5J56K62J28J30j79M6Ok76K4K44k14M3J92rM3l8K31j91
5168A13j71K90QJ79n01L24J9j3p%Q6m0J63r8m0m40N48j04K61m93J28J5K92k26
$$ plain form
5009 -699 -471 -524 -399 -814 -715 -143 -109 -807 -432 -518 -218 -572 -467 -97 -545 -659 -498 9 -153 -496 -28
5030 -28 0 -410 -298 -44 106 -287 -158 89 177 4 -81 -13 115 -324 -112 412 496 -182 137 442 257 519
5052 519 297 311 270 247 316 510 383 321 395 505 340 201 361 610 480 494 480 434 205 313 550 352 314
5075 314 125 199 532 469 529 194 390 287 455 202 234 37 181 32 565 503 58 -253 250 181 -25 118
5097 118 272 265 80 46 -39 -327 271 342 77 -196 -89 -94 -58 -348 -266 7 -280 -291 -255 -331 -286 -452 -243 -107
5121 -107 -314 -554 -331 -208 -157 -409 -345 -464 -508 -181 -122 -240 -298 -379 -363 -353 -336 -16 -216 -554 -333 -463 -188
5144 -188 -475 -297 -146 -102 -440 -485 -329 -67 61 191 12 58 64 -212 -188 56 -158 -115 77 68 111 73 304 113
5168 113 -58 232 240 419 -82 242 261 248 241 241 327 287 450 352 312 -128 420 316 577 84 212 227 519 293
5192B93j08J02J89l51K51M3n2M2j10L28j07j93l21J86K11j39k6r8L52n77L07L45
5214E67r4o13Q0M27j28m13K5J54r1N1K83j40l24L3pK97m59p5M76n2j25n35L83
5237b80L80l29J11r7M5m58p4L20N9k65K16K74l82j92O5J88j38l60N20L54l01j35
5259d79j75L65j01j80M89L9k68n29N80P5l68J24kK94m24j64N88m0j44J6M93k35
5281d6N9l16K76J90l33J32J07j1m78M49P8q1j96M9L38k22j25L77oK16m50K72K45
5304E24j86k12K04J91k48j7J28P7j27k24N67j7l94r7N62k79l77J32Q05l38o04
5325G0j04N21P3l98J11K86q9m86L71L45l92k93P3M21k70m70K11N76n74P5L38n3
5347C42l16l92N27P5k47k54J55J95j98l59L93M51m20n62N14ll35k74R81N0o01
$$ plain form
5192 293 185 287 476 125 376 419 367 409 299 627 520 327 6 192 403 264 238 140 492 -85 222 567
5214 567 473 -140 -60 367 239 -174 -149 5 -86 -35 248 108 -216 -183 -190 107 -352 -427 49 -3 -128 -663 -280
5237 -280 100 -229 -118 -215 -170 -628 -702 -382 -323 -588 -372 -98 -480 -672 -607 -419 -557 -917 -397 -43 -344 -479
5259 -479 -654 -289 -390 -570 -81 -42 -310 -839 -259 -184 -552 -428 -430 -136 -560 -724 -136 -176 -320 -304 189 -46
5281 -46 13 -303 -27 163 -170 -38 69 58 -420 29 107 26 -170 -121 217 -5 -130 247 241 457 7 279 524
5304 524 338 126 330 521 273 256 384 461 334 110 677 660 266 169 731 452 75 207 1012 674 70
5325 70 -34 487 560 162 273 559 470 -16 355 700 308 15 88 509 239 -231 -20 556 -18 57 395 342
5347 342 26 -366 161 236 -11 -265 -110 85 -113 -472 -79 372 -48 -610 -96 -99 -434 -708 273 323 -278
5368b78j19L78k54j85J37L92j7p70M28L98o08J58K13K19l75j67J17QR9k29K86
5389a69O60p20k41L0K97j95k63Q55Q5p06j87O55J14o71K34K56Kn05J28M38o4m01
5411c68M06M36k73m94J78M32K0o16L07Q50j044o5K48M48K5n68L72L42n82j69M63
5432C48N23n80m23N69m0m98M1P64j97k80j86M60j6l08J22L29J21r09K29L91k95
5453A65j5L04L83k0j033M03L57k26m45M12J06k82l95L23K61j81j23J66K46j030
5473f24K33M47K60n23J47L86r6m64m05N64L72o44K49J11j65m07j14P36j10m91
5493e38k01N06ll27K80K94o1o02M53P2l45l87N39K70l63n06L67L18l03N1J47M01
5515F2p05M9K41Q8j55p4N19n4l86l91P55q4l08k47R34j80m96m5O96m06Q2J34J25
$$ plain form
5368 -278 -397 -19 -273 -458 -321 71 54 -716 -288 110 -498 -340 -127 92 -283 -450 -333 -325 -226 -455 -169
5389 -169 491 -229 -470 -440 -143 -338 -601 254 339 -367 -554 101 215 -456 -222 34 36 -469 -341 97 33 -368
5411 -368 38 474 201 -293 -115 317 337 -279 28 878 -166 -231 17 465 490 -78 294 636 54 -115 348
5432 348 871 291 -132 437 397 -101 -60 704 507 227 41 501 485 177 299 628 749 -160 69 460 165
5453 165 150 454 837 817 -216 187 544 318 -127 285 391 109 -286 37 298 117 -6 160 406 -624
5473 -624 -391 56 316 -207 -60 326 230 -234 -639 -75 297 -347 -98 13 -152 -559 -673 63 -47 -538
5493 -538 -739 -233 -236 -563 -283 11 -50 -652 -199 -127 -472 -859 -320 -50 -413 -919 -552 -234 -537 -486 -339 62
5515 62 -643 -594 -353 -265 -420 -494 25 -29 -415 -806 -51 -135 -443 -690 244 64 -432 -477 219 -187 -105 29 154
5538A54k84k44J89L66k44J15L8K02k65j65K35J45O1j40Q4J05m5l09K47J68j69
5559B44k42M26j24j27Q2K97L5l58k62L49j50N3j45M52j36r1k90L25R0l39N0M74
5581F13l40o33M36M70m71m6L41R5j90j32oL30l40o4M27j53r7k61J74J3l18K92
5603A40Kn4n43K57K55P1l63j76O65m10m13L88J85k64OJ37K79j02o54L16J08J55
5625a5l60L55J2l72l9L36k15M6k22L3L5J07O2l6J53j15O7p6K90l51J01N3P9j66
5649b38k8N00k49l18KM06p4l59J65Q7K03l10O6J19J6J01l4K56N3l35J55J16K28
5672E28l84q6J39j27l5M51P5l31M0n9j0N5n7mM04k64l6l54L95r8k80N69j18j48
5696B65N2l3K59j50k11K40j55R6l2j76M33k77K8j67l22P7K81J01L2J23m30pK94
$$ plain form
5538 154 -130 -374 -185 181 -63 52 90 292 27 -138 97 242 303 163 247 352 307 -2 245 413 244
5559 244 2 428 304 177 259 556 591 233 -29 320 170 223 78 530 394 303 13 338 428 89 139 613
5581 613 273 -360 76 546 75 29 370 465 275 143 137 467 127 63 490 337 240 -21 153 166 -152 140
5603 140 142 88 -455 -198 57 128 -235 -411 254 -156 -569 -181 4 -260 -254 -117 162 60 -594 -278 -170 -15
5625 -15 -375 -20 -8 -380 -419 -83 -298 -252 -474 -441 -406 -299 -237 -273 -120 -235 -168 -244 46 -305 -204 -151 -72 -238
5649 -238 -266 234 -15 -333 -331 75 1 -358 -193 -106 97 -213 -147 -28 -12 89 55 311 364 29 184 300 528
5672 528 144 58 197 70 35 486 561 230 270 211 201 256 199 195 599 335 299 -55 340 242 -38 531 413 265
5696 265 317 284 543 393 182 422 267 363 331 155 588 311 339 172 -150 -73 208 309 341 464 34 27 321
5719C21r4j04J09l76J65j1l3l57L23L7J9j45J93k67k8M0l84M74j39K48j45k67
5741d21K32r9j6q6K31j37P5K27l08j31J56l23Q4l8K58j11j05oJ0O4N7j2K13k98
5765d84K06J0K0p3l4j76J06J89J03k32K73l33N9K17L5M3m65K75Q0m8R1Q9J97k93
5789a45P0jK66k50j19N3J82N6L6l88K31K63j55J83m2m2j57J38p1m7Q3o9L42l20
5813I7nm6K01k04K4K57l3J8k9p2m0K97k19JJ54m01M4J02K25jn3rk25O9L1n3J95
5840C25k14K41m8j45Lm4J26j83J32M8j01k98J44N5N20m88j38Q8n38M20L34m18
5862a79L00l99M9J84L8j52j71K10m3p6K17M0k68J49r1K02k88k09K44k3j37r6L21
5885a78j0j69J90P9KJ1k85J83M0k60M8N10j33j46K1j28l3K84l48M32k95n3L58
$$ plain form
5719 321 227 123 232 -144 21 10 -23 -380 -57 -20 -1 -146 47 -220 -248 -208 -592 -118 -257 -9 -154 -421
5741 -421 -189 -288 -304 -390 -159 -296 -221 6 -302 -433 -277 -600 -516 -554 -296 -407 -512 -518 -508 -444 -387 -399 -186 -484
5765 -484 -278 -268 -248 -321 -355 -531 -425 -236 -133 -365 -92 -425 -366 -149 -114 -71 -536 -261 -181 -229 -138 -49 148 -145
5789 -145 -75 -76 190 -60 -179 -126 56 112 148 -240 -9 254 99 282 240 198 41 179 108 61 144 75 417 97
5813 97 92 46 247 43 67 324 291 309 280 208 168 465 246 247 401 0 44 146 371 370 317 308 83 152 183 130 325
5840 325 111 352 304 159 162 118 244 61 193 241 140 -158 -14 41 561 73 -65 23 -515 -95 239 -179
5862 -179 121 -278 -229 -45 -7 -159 -330 -120 -163 -239 -22 18 -250 -101 -192 10 -278 -487 -243 -266 -403 -499 -178
5885 -178 -188 -357 -167 -88 -86 -75 -360 -177 -137 -397 -349 161 28 -118 -97 -225 -258 26 -322 110 -185 -238 120
5908A20n7k6r0R8j2N5l86J94K29Q1j50K17j56K35j94o0K60K20l42o8J0K37l66
5931D9N89l30Q3k19J0K75m19P2L18n4MNj9O2j86l41K73M0j55K65K18k42l1Oj9
5956B54M2k83M22P4q4l11J39J24j62p2J29j20N1q2O8l65j11K1N14j11k29o7K86
5979A27ml36J35J45l90JJ64K78m2n11L91j49Kq3J3q3Qj29L80l91K96j56M2r0K8
6004c54o6J34n3N9k3k37L13m7k41Q6L73m20J10o1J85j97J90J62r8j80j46K02K38
6027g1m80M83M30m08k63o7M51n07K18L43p0k03j36J05L67l00m0QL73j93l46M22
6049A16j2m4p0n4M78l74J74J11j32p5O1K40k39j96Q8J14K88n70L40L8K32n97J17
6072C4J22K23j26J45j52q7q4L87R5o04K58p0K04J6o67O06Q1p11Q4O11K48q00J99
$$ plain form
5908 120 63 37 -53 45 33 88 -298 -104 125 206 56 273 117 352 158 98 358 578 236 168 178 415 49
5931 49 638 308 391 172 182 457 38 110 428 374 378 383 364 426 240 -101 172 212 57 322 540 298 267 273 254
5956 254 296 13 435 509 425 114 253 377 215 143 272 152 203 121 189 -176 -287 -266 248 137 -92 -159 127
5979 127 123 -213 -78 67 -323 -322 -158 120 78 -433 -42 -191 -189 -272 -259 -342 -334 -463 -83 -474 -178 -334 -292 -382 -354
6004 -354 -420 -286 -339 -280 -303 -540 -227 -274 -515 -429 -56 -476 -366 -427 -242 -439 -249 -87 -185 -365 -511 -309 -71
6027 -71 -551 -68 362 -46 -309 -376 75 -432 -214 129 59 -144 -280 -175 192 -108 -148 -140 233 40 -306 116
6049 116 104 60 -10 -64 414 40 214 325 193 118 179 419 180 -16 72 186 474 -96 244 282 514 -83 34
6072 34 156 379 253 398 246 159 75 462 557 -47 211 141 345 361 -306 300 381 -330 -246 365 613 -187 12
6095A2L76k35l6k15K14j09p4j30J27J51k71o4M86j25l58J90J3o4j07L0J61j29
6117a57j62o2L46j87K2J72j85Jr9L69K5j20k33O1J59k11j11R8M11l91J59p6k9
6140b00o4p1K08J89k76O7J16p3Rk58K68J90n44O2L19J59j54l5R6j96J77j25J97
6163F1k08K0J80k1lm7J58J24p2l53K66M07n07M59j45o9O0j96M4J84j35J36P2q0
6187C35j65j58M23n42K99J52J97m57J78n03O93m12J53j12K46J28k42J53K47m42
6207A71P1l9K02j04Lj31J50q9j88K28J21l58j23L90j03l09K57j07j79P8J37J10
6229A88j74r3L7J90o6j27R9j35K1l09O2J19J7j41M4J91l0k00p9L20l49J02n9M67
6253I5m97n0K47Rj7k43M57j73j56l57O59n6k50o3K83J6j41j93n0j7M37j07R0L3
$$ plain form
6095 12 388 153 117 -98 116 7 -67 -197 -70 81 -190 -254 232 107 -251 -61 -48 -112 -219 -189 -28 -157
6117 -157 -319 -381 -35 -222 -200 -28 -213 -212 -311 58 83 -37 -270 -209 -50 -261 -372 -274 137 -254 -95 -171 -200
6140 -200 -264 -335 -127 62 -214 -147 -31 -104 -95 -353 -85 105 -439 -377 -58 101 -53 -88 8 -188 -11 -136 61
6163 61 -147 -127 53 32 29 -18 140 264 192 -161 105 512 5 464 319 250 310 114 158 342 207 343 415 335
6187 335 170 12 435 -107 192 344 541 84 262 -241 452 40 193 81 327 455 213 366 613 171
6207 171 242 203 405 301 304 173 323 234 46 274 395 37 -86 304 201 -108 149 42 -137 -59 78 188
6229 188 14 -79 -42 148 82 -45 54 -81 -60 -369 -307 -188 -171 -312 -268 -77 -107 -307 -386 -66 -415 -313 -372 95
6253 95 -402 -452 -205 -196 -213 -456 1 -172 -328 -685 -26 -82 -332 -395 -112 -96 -237 -430 -480 -497 -60 -167 -77 -44
6277d4m23J36L10j24K23j85Q3n4k93K36J74J45j80J53k45k2p3l3J18L72l99M0
6299h5M52k56r7m8K50J09m71K99o9k8j27L5L99k34J69j69j89K33M0J8J30m5n6
6322B60k35K74p8j69J54j35p6P0M2m3m6p1L72p8n4O8Q2r7j99Q2J19K4l45K35M2
6347A98j56J63j56J86l40R0P6r3k38K28j03L2J9J9J04j3q4J62n12N29m47N7L81
6370A02l96p1K07M9k22R5R5M6l3k71K49k28k9M13J67k70j92k19L19P9j19j77N06
6393A00l40k5K34j46P2M8m0p1R2j73K74j43R2J8L6M7Jr2J42k4J32j75k02J21k0
6418d2J02J1OJ45M5l56L01k12K20%q4J2k14L29J34k20m7L43m64J59N9k15K54L13
6442E79r2J0q8r2L9l7k54K46JJ43j98K4J53j77K45m14K4L89p2l81K34j24K05l89
$$ plain form
6277 -44 -467 -331 -21 -145 78 -107 -24 -78 -371 -135 39 184 4 157 -88 -110 -183 -216 -98 274 -125 -85
6299 -85 367 111 14 -34 216 325 -146 153 84 56 -71 -36 363 129 298 129 -60 173 213 231 361 316 260
6322 260 25 299 221 52 206 71 -5 65 107 64 18 -53 319 241 187 255 337 240 41 123 242 266 -79 156 198
6347 198 42 205 49 235 -105 -15 61 -32 -270 -42 -145 -113 -94 -75 29 16 -68 94 -418 111 -336 -279 102
6370 102 -294 -365 -158 -109 -331 -236 -141 -95 -128 -399 -150 -378 -407 6 173 -97 -289 -508 -189 -110 -229 -406 100
6393 100 -240 -265 -31 -177 -105 -57 -97 -168 -76 -249 25 -118 -26 -8 28 75 76 -16 126 102 234 59 -143 -22 -42
6418 -42 60 71 77 222 267 -89 212 0 220 220 136 148 -66 263 397 177 130 473 9 168 227 12 266 579
6442 579 487 497 409 317 356 319 65 311 312 455 257 281 434 257 502 88 112 501 429 48 282 158 363 -26
6466b6J32O0J13j36O5j57J94j02k7L8j01j6K9J05m56K61n2K11k63j23K58j84l28
6489e05M49J51k82K7K57o2o8k76K24j04O7j06j5j7J48k53K04j09K58k81k5K85
6511c3m81L40p6J57L8j29Pk57L10j18J70J75k27j9J13pl46J68K38jj53J13j60
6534a78J81p9O1K3K13k20j48Q1j08Q2J42J14q0j77K98K09j81k07NK52j78r6L91
6557D00k10l4k29L75k10J59m39N64k58o7J64k55J91j08j34K04J6L5o6nN0j12K16
6580B47L8o9Q4j44n9l29K42K2J68P3k61J86l30J66k24L46j80Q3K20J79m76p1j59
6603b48K32K1k60k96Q30l78l32L85J21j92j23N2K06p69N36K91j50k5l34K53J88
6624Hj90L2l6j12j80L06l0O4j69k72M25KJ64k87O3J19l38L6K50J21K9k19K46j61
$$ plain form
6466 -26 106 166 279 143 208 51 245 143 116 154 53 37 66 171 -285 -24 -76 135 -128 -251 7 -177 -505
6489 -505 -56 95 -187 -160 97 35 -33 -309 -85 -189 -122 -228 -243 -260 -112 -365 -161 -270 -12 -293 -318 -33
6511 -33 -514 -174 -250 -93 -55 -184 -177 -434 -124 -242 -72 103 -124 -143 -30 -37 -383 -215 23 22 -131 -18 -178
6534 -178 3 -76 -15 8 221 1 -147 -66 -174 -92 50 164 84 -93 205 414 233 26 31 283 105 9 400
6557 400 190 156 -73 302 92 251 -188 376 118 51 215 -40 151 43 -91 113 129 164 98 93 143 31 247
6580 247 285 216 300 156 97 -232 10 32 200 273 12 198 -132 34 -190 156 -24 59 279 458 -18 -89 -248
6603 -248 -16 5 -255 -551 279 -99 -431 -46 75 -117 -240 -188 18 -751 -215 76 -74 -99 -433 -180 8
6624 8 -182 -150 -186 -298 -478 -172 -202 -138 -307 -579 -154 -152 12 -275 -212 -93 -431 -395 -145 -24 5 -214 32 -129
6648a29J57k21n3N4l27M58j33rq7J49K52k14l7J56Q5j51j46L33k75J08j94O07
6670C83j55k44j97J35K44J15k08NL3k3J96KJ6k49j54L03q8k3P8M2o4l4J17Q1O
6695C17K22k37R9j22j64K30Q8j97k51L93j86J01j65J94j79R8k65M15j41j89o3
6716b%M23j85k05K53R2k88j13j10J22l6K93j25J45j24K44k69Q9o23O43n3j58k03
6739a90MR5j36J79J68j31J39l83J53o9k0l4K48k9j82k45K78J76n88K42L02j6j57
6762a96m0J64l02J7J87M8J42l90K26k5k89L31m4J44K4j40j06J16J35o08P74k93
6784a25N9k64J35J98J26l96L81m7j67j05L32o5k88K17J49L18l96Jl7K08k73J26
6806H7k79N19l49L63Pm46K13j83N20k64m6pJ82j96R0J05p5j49k71M69k07LL9l48
$$ plain form
6648 -129 28 -193 -246 -192 -519 -61 -194 -203 -290 -141 111 -103 -140 16 101 -50 -196 137 -138 -30 -224 383
6670 383 228 -16 -213 -78 166 281 73 78 111 88 284 286 302 53 -101 202 114 91 169 211 147 113 230 311 317
6695 317 539 302 401 279 115 345 433 236 -15 378 192 293 128 322 143 241 -24 391 250 61 -2
6716 -2 -2 421 236 31 284 376 88 -25 -135 -13 -49 244 119 264 140 384 115 204 -419 224 171 13 -190
6739 -190 -186 -91 -227 -48 120 -11 128 -255 -102 -171 -191 -225 23 -6 -188 -433 -155 21 -567 -325 -23 -39 -196
6762 -196 -236 -72 -374 -357 -170 -122 20 -370 -144 -169 -458 -127 -171 -27 -3 -143 -249 -133 2 -606 168 -125
6784 -125 -66 -330 -195 3 129 -267 114 67 -100 -205 127 62 -226 -9 140 458 62 63 26 234 -39 87
6806 87 -192 327 -22 341 348 -98 115 -68 452 188 142 135 317 121 211 316 241 92 -179 290 83 86 125 -223
6830b23N22k31j93K97J07l45L5J2j45K31o1K04J82o19K2M30j91j06J13K8k2m34
6852c87N80P0n54J88L52k81J35k44j6M22l56k58N65l40j56J29J66k69J89k45K70
6873d0k86M1q9J70J39k15k27J40L39j65q8K55k16k9k36P21j39k29JJ10j75J43
6895g5j21r6k1K98k83K66k46n4K13j13J90r1K86J1l20J48j38K60m01J98L78k51
6917C8K16k68Q2p2R1k94K93j37J77k44J61L85j51K9j98J53k64J0L58o3j65l1L43
6940D49L9l86J66J29p2j57l9j78L50k8j2q4m8p4J21J57k44k66K55K33j16l6K37
6963C96k49M9M6R4j74j89J79N5Pj95q3J48J47l50K04j82J0j9K03k32pK55k43K13
6987H3P0m02K61L3r1k1p7j33J90k80L51o7jJ26l30J90j31J02j65O0j26K90j75
$$ plain form
6830 -223 299 68 -125 172 279 -66 -31 -19 -164 67 6 210 392 -227 -205 225 34 -72 41 69 47 -387
6852 -387 193 263 -291 -103 249 -32 103 -141 -157 265 -91 -349 216 -124 -280 -151 15 -254 -65 -310 -40
6873 -40 -326 -285 -374 -204 -65 -280 -507 -367 -28 -193 -281 -26 -242 -271 -507 214 75 -154 -153 -43 -218 -75
6895 -75 -196 -292 -313 -15 -298 -32 -278 -332 -119 -232 -42 -133 153 164 -156 -8 -146 114 -287 -89 289 38
6917 38 254 -14 68 -4 87 -207 86 -51 126 -118 43 428 277 306 108 261 -3 7 365 302 137 106 449
6940 449 488 102 268 397 325 168 129 -49 301 273 261 177 129 55 176 333 89 -177 78 311 195 159 396
6963 396 147 196 242 336 162 -27 152 207 214 19 -64 84 231 -119 85 -97 -87 -106 97 -135 -142 113 -130 83
6987 83 153 -249 12 45 -46 -67 -144 -277 -87 -367 -16 -83 -84 42 -288 -98 -229 -127 -292 -232 -358 -68 -243
7010b43K64l15%Q4o5R5n5J22j37Q4J40q9j40j24j2N60j73l75L91J9k83j66K40
7033a78J86M7n2p9k52J67K05k27r7K81k54L70K04l67J09j25L3o2K14j08l06M54
7055A63p4j24J30j52P0J23J19j26j12J77k62K07P0k4J04j37K61j45k03k06P7N11
7077D47l79J89j57j95K62j61J99o1pj40n0J63J30j12k6o8l4j01L63l68J39L09
7099C42m31n3j11M32J90m61P8L14p7m65J11Q4L1k40K62j40j18K75J1j82P3k0o1
7122a56K9k5L7m4J32o4j49q3K39k98J14J22KN8Pj16m5j7J84m8l%k63Q4J05M6j08
7149b60J20p3J8m1J10R6l21O8O1J47m4K1M5l45M05l5N3j32N9J47n13M24P5l2k88
7174b35J93k09K48o9L54k01n2M02l38J81j78L69l74K63K2k62M74l87j67L69j10
$$ plain form
7010 -243 21 -294 -294 -210 -275 -180 -235 -113 -250 -166 -26 -115 -255 -379 -391 169 -4 -379 12 31 -252 -418 -178
7033 -178 8 55 3 -76 -328 -161 44 -183 -280 1 -253 117 321 -46 63 -62 -29 -91 123 15 -291 163
7055 163 89 -35 95 -57 13 136 255 129 17 194 -68 139 209 185 289 152 413 268 65 -141 -64 447
7077 447 68 257 100 -95 167 6 205 144 137 -3 -53 110 240 128 102 34 0 -101 262 -106 33 342
7099 342 -89 -142 -253 179 369 -92 -14 300 223 -242 -131 -47 -16 -256 6 -134 -252 23 34 -148 -75 -95 -156
7122 -156 -127 -152 -115 -159 -27 -91 -240 -323 -84 -382 -268 -146 -144 -86 -79 -195 -240 -257 -73 -121 -124 -124 -387 -303 -198 -152 -260
7149 -260 -140 -213 -195 -236 -126 -30 -351 -283 -222 -75 -119 -98 -53 -398 7 -28 25 -107 -48 99 -414 10 85 53 -235
7174 -235 -42 -251 -3 -72 282 81 29 431 93 274 96 465 91 354 376 114 588 201 34 403 293
7195B93J71m12K59L3j90K13o8j13J15j63M5k3j19Q4L4k33M16j31l31j9K52j58
7217d5K40R8l93O5K71o00N45l25K73q6J3J98m77J81j76M17o6j21o3l94L81N9j11
7240a16J16j62J0o2J52j06j19K88o7m33J18K45M6Mk13L66k4j46Q2j28J8k16M01
7263E4k72j17J81k97M24j60k76L77J63j79j76M07l30P8j13o6Q8J26RK1k9R0j6
7286a3N0j9N7j11j21J04L00l80K19j27J38J33M2n53P7M55k16J12J4j44K44k46
7308A5j52L75J4j75l31O75k54j17k3P3K65j80j44K62k4k09j68M64j7l77N5Q0K32
7331C39l30J29L44m13j18L37r3l77K45J60N8k53O9L2J55q0k33Q7N01m23j17J29
7353A48k65nj21M40k29J22q2k2O3k77L08l05K88j23l67N80k54k33K48j52M5j98
$$ plain form
7195 293 464 52 311 344 154 367 299 186 301 138 183 160 41 125 159 -74 342 211 -120 -139 113 -45
7217 -45 195 293 -100 -35 236 -364 181 -144 129 43 56 254 -223 -42 -218 199 133 12 -51 -445 -64 -5 -116
7240 -116 0 -162 -152 -214 -62 -168 -287 1 -66 -499 -381 -136 -90 -86 -299 67 43 -103 -21 -149 -131 -347 54
7263 54 -218 -335 -154 -451 -27 -187 -463 -86 77 -102 -278 129 -201 -123 -236 -302 -214 -88 -79 -58 -87 3 -13
7286 -13 37 18 75 -36 -157 -53 247 -133 86 -41 97 230 272 -281 -204 251 35 147 161 17 261 15
7308 15 -137 238 252 77 -254 421 167 50 27 100 365 185 41 303 279 70 -98 366 349 -28 27 107 339
7331 339 9 138 482 69 -49 288 195 -182 63 223 281 28 97 129 284 204 -29 58 559 136 19 148
7353 148 -117 -122 -243 197 -32 90 8 -14 49 -228 80 -225 63 -60 -427 153 -101 -334 -86 -238 -193 -391
7375c91J45L2k4ln1J45J4j33J2K01J6j45J37NL4m51Q1K76K9K8r6J75o0k93J43
7400a74m0r1K76L71m50J70j84J53m7j87M12k3l07j01J16K89l74L88k58j74L28
7421I3j80l92O14j05k27M27n6j45r2J33L7J25j14Q0Rj19k79J61L00q3l6l8o8K41
7445B86j75K69k41p1R4J18J5k22o7K78m13k95Q18j60o0n5O5K67k96o7K91m96L59
7468B42k65K83J35m64K05k41M16m36L23K70k18k84J13Q9l62J53j0m0K3j36K73
7489F9R1k13k3k77J51jj48N6L03Ml24P6L81l27k9J83J2r8lL0J5k9j5k7L91m35
7515a87J43k40pK82M7m6m3m50K35M8p6M23k61L05k98l80M15P6j85j20N13j85N
7538A4l09M64j21j93J74l21M75m49L43J02L5j19L5k56O1o0K85J21j31k90q9M14
$$ plain form
7375 -391 -246 -214 -238 -241 -292 -147 -133 -266 -254 -53 -37 -182 -45 -40 -6 -457 -376 -100 -71 -43 -139 36 -24 -317 -174
7400 -174 -214 -305 -29 342 -108 62 -122 31 -16 -203 209 186 -121 -222 -106 183 -191 197 -61 -235 93
7421 93 -87 -479 135 30 -197 230 174 29 -63 70 107 232 118 198 207 88 -191 -30 270 187 151 113 45 286
7445 286 111 380 139 68 162 280 295 73 6 284 -129 -424 394 234 174 119 184 451 155 88 379 -117 242
7468 242 -23 260 395 -69 136 -105 311 -125 198 468 250 -34 79 168 -194 -41 -51 -91 -68 -204 69
7489 69 160 -53 -76 -353 -202 -203 -351 -295 8 12 -312 -236 145 -182 -211 -28 -16 -114 -117 -87 -72 -101 -116 -143 248 -187
7515 -187 -44 -284 -291 -9 38 -8 -51 -501 -266 -218 -294 129 -132 173 -125 -505 -90 -14 -199 -319 194 9 14
7538 14 -295 169 48 -145 29 -292 183 -266 77 179 214 95 130 -126 -65 -125 160 281 150 -140 -229 185
7560A85j38j32OJ90J05j34k0K94k64M2J90k75j13N1n8J92R7o8M9J04m13J14K03
7583B07Q4j48j19K08j3k57J07K7j04J5q4J45m1m0J3J40k12O1QK5K51k34J16m72
7607c17N73m85J63L03k65kj49M49J61n73p4J76J01k02Q7p5q8L5j47M04j86j28
7629b39K75k62J22n2k72K83J70k75J36R3m42L99k35k7m3L07P6J41k94j98J44K9
7651a64J5j65K32q3K41q4k28o8K10j99K96J41j21m3q4R0j68J45O4M3m51J84K4
7674a73L68J07k4J29l91J41j0Q7J48j6k09kRj02P9r5L85k29J3k32M33l2j10p2
7698B02n9K3l5N4l39M00k%L2k48L71j88J44O5n13M76k96J7J59j36K5j76K54Q4
7722C14k02K44l14m0M1K18k78p2J74j17O1N6k69L38k72J00j76M19k76L19j2j56
$$ plain form
7560 185 47 -85 -79 111 216 82 62 356 92 134 324 49 -64 -13 -71 121 218 150 199 303 -110 4 207
7583 207 291 143 24 232 219 -38 69 96 -8 7 -77 68 27 -13 0 140 -72 -11 -3 22 273 39 155 -317
7607 -317 256 -229 -66 237 -28 -30 -179 270 431 -142 -216 -40 61 -141 -54 -129 -217 -182 -329 75 -111 -239
7629 -239 36 -226 -104 -156 -428 -145 25 -250 -114 -21 -463 -64 -299 -326 -369 -62 14 155 -139 -337 -193 -164
7651 -164 -149 -314 -82 -165 76 -8 -236 -304 -94 -293 3 144 23 -20 -104 -14 -182 -37 27 70 -381 -197 -173
7674 -173 195 302 278 407 16 157 147 234 382 366 157 155 164 62 141 46 431 202 215 -17 416 384 274 202
7698 202 143 166 131 185 -154 246 244 244 276 28 399 211 355 420 -93 383 87 104 263 127 152 -24 230 314
7722 314 112 356 42 2 43 261 -17 -89 85 -32 29 85 -184 154 -118 -18 -194 225 -51 268 256 100
7744A00k85p3L19k11L34l53K15O4j02k63J47j44K13j32M4j16O5j43K43J43m36
7765c71L69k89J79N8j33K98j7J8l32J22j07k27K44J45j57K39k80N4q8O1J61l93
7787d46K97n5L9r0J79l5J76o3J29k98K81k36O7J51k49K77K79m38L4k12L25N2k29
7810f5J88L4j71l2K65k25K78J37l74K73l18K56j72m9K75J02k66k01L18m4N8j74
7832I3n5j1J41k92K30j01j7L29k49j74R2j9J84K13j80j67L24k42k09M3K72m54
7854b49j53L93J27j63j80M39j8j95L42n71N8J71j02J99j1R7l82J73j91K60l22
7875b78N4k5n4r1L72j88J42J34m06oJ41J64j02L7r4J09R6j42K92j18j35K19l38
7898b17p6J58j06R6k12L77o2J3k94N70l15k07P0K22l37M54j93j87k0r2J84l0K98
$$ plain form
7744 100 -185 -258 61 -150 184 -169 46 110 8 -255 -108 -252 -39 -171 -127 -243 -178 -321 -78 65 -371
7765 -371 -2 -291 -112 -54 -187 111 94 112 -220 -98 -205 -432 -188 -43 -200 39 -241 -187 -275 -214 -53 -446
7787 -446 -149 -204 -165 -255 -76 -111 65 2 131 -167 114 -122 -55 96 -153 124 403 -35 -1 -213 112 164 -65
7810 -65 123 157 -14 -46 219 -6 272 409 35 308 -10 246 74 25 300 402 136 -65 253 209 267 93
7832 93 38 27 168 -124 106 5 -12 317 68 -106 -14 -33 151 364 184 17 341 99 -110 -67 205 -249
7854 -249 -402 -9 118 -45 -225 214 196 1 343 -228 -170 1 -101 98 87 184 -198 -25 -216 44 -278
7875 -278 -224 -249 -303 -394 -22 -210 -68 66 -340 -346 -205 -41 -143 -106 -200 -91 5 -137 155 37 -98 121 -217
7898 -217 -293 -135 -241 -145 -357 20 -42 -29 -323 247 -68 -275 -205 17 -320 134 -59 -246 -266 -358 -174 -204 94
7921I4k7JR0k67J59J17j39J19k54M3L43q3J53l32J52l08J4K51K35n2o7p1l49J21
7945e7L5J51M1K01m09M66k91R3q0J18P7p5L15m11k81K60L12j20k92P7k00J80o5
7968D5j75K21J31k11j61K23K8k5P8J5j92kK88k6j14k77J31J90m2l87Q4L32k45
7991i1JL4K5j26L13k66R2j82j63M21k94L5J02k64%J34K84j90K3L0K66l42N5j80
8015b83L55j99K7k36L94j0J51l18l19J12o8L97k64L41l4q8k6K42j25j88j4P8j42
8038b17K98l02K65j74NL35k35J51k28L71l3k26R5j81R4J87j89N78l29l43LJ81
8060A06pJ55j14R8j09l24L46k12L27j76N3J78m6O0k33K5K35k79L93j77k54Q0j23
8083BL22l30J36J20m0l65J30L31j79j8k30M61k41m48M21k4j09O0M6L11m00J93
$$ plain form
7921 94 67 68 158 -109 50 167 28 147 -107 -64 279 196 349 17 169 -139 -125 126 361 309 242 171 -178 -57
7945 -57 -22 129 170 371 -38 428 137 230 150 268 345 270 585 174 -107 153 465 345 53 130 -70 110 45
7968 45 -130 91 222 11 -150 73 101 76 154 169 -23 -25 263 237 123 -154 -23 167 125 -262 -178 154 -91
7991 -91 -90 -56 -31 -157 156 -110 -18 -200 -363 58 -236 -201 -99 -363 -363 -229 55 -135 -112 -82 184 -158 -103 -283
8015 -283 72 -127 -100 -336 58 48 199 -119 -438 -326 -394 3 -261 80 46 -42 -68 174 49 -139 -153 -75 -217
8038 -217 81 -221 44 -130 -125 210 -25 126 -102 269 236 10 105 -76 18 205 16 594 265 -78 -75 106
8060 106 99 254 140 238 129 -195 151 -61 266 90 143 321 275 335 102 127 362 83 476 299 45 125 2
8083 2 324 -6 130 250 210 -155 -25 306 127 109 -121 340 99 -349 72 48 -61 -1 45 356 -44 149
8105A49j43J76j09j73k18M92N8j01j48m1R7j30Q7L5Jj98j32L78k88K4LK20n1k32
8129b44K27l7Kj97k0K85M8k18J04O8J39o50M35J65n33K26L90l73j44J58J37l42
8151c74K99r7j66L15J22j3P7m86K76N3j60K51k03R9R3j46J40r2j51Q7K3K25k96
8174a24J83l5J63l07q9K36p3M9Mj90K78q8Q2L9j8J43k97
$$ plain form
8105 149 6 182 73 -100 -318 174 232 131 -17 -58 39 -91 -4 31 32 -166 -298 80 -208 -184 -181 39 -12 -244
8129 -244 -17 -54 -52 -249 -269 16 64 -154 -50 18 157 -493 -58 107 -426 -200 190 -183 -327 -169 -32 -374
8151 -374 -75 -172 -338 -23 99 86 163 -323 -47 6 -154 97 -106 -7 86 -60 80 -12 -163 -76 -53 172 -124
8174 -124 59 24 187 -120 -209 27 -46 3 7 -183 95 7 89 128 110 253 -44
8191d4
$$ Imaginary data points
##PAGE= N=2
##DATA TABLE= (X++(I..I)), XYDATA
0@%%%%%%jRj6J6j8K6l3M1m8N6p2Q8j03J19j42J66j87K14k50K88l28L70m18M75
30B52n33N96o70P50q36R33j038J153j279J414j567J737j923K129k357K615k908
47a532L239l619M064m591N224o000O980q268J0035j2618J6769k4501M3601j68788
61a40005k79818M43986K24552l25005k28023K39854J16741j42430L2081J74303
71A16236j37162k21654J04787J55558j55954p2331K69346J19839k87529j63241
81b72105J85410P3865j63366L0338K06052n2187k22078M4658J97233k5860j33214
92a31254K5903L4910j04029l9402J06539L9711k7208Q5523P0100j53714j59217
103b52138R9555J51516n1649q9407M6693L4591n5346J0072P2572j9770n2226L7278
$$ plain form
0 0 0 0 0 0 0 0 -1 8 -8 8 -10 16 -17 24 -24 32 -40 48 -55 64 -78 88 -99 115 -135 153 -175 195 -223 252
30 252 -281 315 -355 395 -441 492 -546 607 -672 742 -825 912 -1011 1118 -1239 1376 -1532
47 -1532 1707 -1912 2152 -2439 2785 -3215 3765 -4503 5532 -7086 9683 -14818 28783 -140005
61 -140005 -419823 24163 248715 -76290 -304313 -64459 52282 -90148 -58067 116236
71 116236 -20926 -242580 -137793 17765 -138189 -210520 58826 178665 -108864 -272105
81 -272105 -86695 -12830 -176196 -145858 60194 8007 -214071 -169413 27820 1960 -131254
92 -131254 -105351 -70441 -174470 -213872 -107333 -67622 -94830 -9307 60793 -92921 -252138
103 -252138 -152583 -1067 -52716 -142123 -95430 -60839 -116185 -106113 -33541 -53311 -105537 -68259
115f8259l50j14792j2681J63392P9121q4118k9025L0070r3870r3639J20792J32281
127B8922r7482r3412J23684P0625j43427l7399J85638M8625j79425n9653J00656
138e2648l1342q2546J45923J67454j34358j82284R1282J02057j36069n4552K12212
149D5129Q7216k03604r0026J60759M1002j34518L5964J58002p7415k00818M5055
160a33254J71786j1987n5566J07683M4206j76329j02133J27543P1123q7042J7876
171b6094J30839m4744j72641J5870J57445J3231q4848K1892L7183q7906n5606
182i5379J03221Q8994l5841k4596K5068n8590r8680L6706J20252K5262m0216J0555
194E6756J689o6217k4139O9822M5064k9512k0527o159m3699j5920P3425O2941
$$ plain form
115 -68259 -68609 -183401 -196082 -32690 46431 -37687 -66712 -36642 -130512 -224151 -103359 28922
127 28922 -68560 -161972 -38288 32337 -111090 -148489 37149 85774 -93651 -153304 -52648
138 -52648 -83990 -166536 -20613 146841 12483 -169801 -78519 23538 -112531 -167083 45129
149 45129 132345 -71259 -161285 -526 40476 -94042 -58078 99924 22509 -178309 -133254
160 -133254 38532 26545 -29021 78662 122868 -53461 -155594 -28051 43072 -43970 -26094
171 -26094 104745 60001 -112640 -96770 60675 73906 -10942 10950 48133 -39773 -95379
182 -95379 7842 96836 60995 36399 61467 2877 -95803 -59097 61155 86417 46201 56756
194 56756 58445 -7772 -31911 37911 82975 53463 32936 26777 -16922 -32842 40583 103524
206A03524k2667k7007K913m4621n9163M6456R6449M835m3507J1750k320p5057
218h415j6454R6171M5594o6851k5668M4909k1333n8830N6591R8953l5540r1293
230A7834J2818K9433o1464j3908J13921N6263r0115n3638N3194j760o7434L6679
242C1823J01042k4905r8607J3698O3682l3536l8269P1701M5705q6372o5274N4444
254C5132L7739l8203J7322P3827k4211r8783n671O3866p560l6255M3739M3914
266A04856n5508n4648L8016L8465k7301p021L4644j8291o1743O128N9343Q744
278F5684k5547J0343O861m5600l1056L1485K9712r882L525J7593k4701m0600J1977
291b06L5013n690j9881O682k247k6110K554L7288P777k3975l679J253l2324k3216
$$ plain form
206 103524 80857 53850 56763 12142 -47021 -565 95884 100719 57212 68962 66642 -8415
218 -8415 -24869 71302 116896 50045 24377 69286 47953 -10877 45714 144667 109127 17834
230 17834 30652 60085 -1379 -15287 98634 154897 64782 11144 64338 62578 -4856 31823
242 31823 132865 107960 9353 23051 86733 53197 14928 86629 132334 45962 -19312 35132
254 35132 72871 34668 51990 125817 101606 2823 -2848 61018 53458 17203 60942 104856
266 104856 49348 -5300 32716 71181 43880 36859 71503 53212 -8531 -2403 56940 65684
278 65684 40137 50480 57341 11741 -19315 12170 41882 32000 35525 53118 28417 -12183 -206
291 -206 34807 29117 9236 15918 13671 -12439 -9885 27403 35180 11205 7526 8779 -23545 -46761
305d6761L3645L6826j0853j4873J0117j1272l4819M717L6233j863l1306L110J8697
318h402j5290j4611K8453K1922k7642k8118M885j855j5161J9671M1697l055l6241
331c3747p870J0455j6260j5921K2674K1317j6839j5649J5625Q815j0847O871J8037
344a3339j7857l7386j458K3878M414o52K2232J1700k7322k6762N693Q996o236
357e4099O172K0676r43j9688J143J7851M50j3262k195q17j5167p121K0525K5513
371b0962P509o76k121j3965k1329n218J0190Q490N003P037J841o146p81Q970J246
386b0912j0445p402j191j539K136J5984J8895M367r100j1999j2661j1110K42J4024
400c0711J5229O690K228L652N92o000n710j499m094r381n664O964J4785J2452
$$ plain form
305 -46761 -13116 23710 12857 -2016 8101 -3171 -37990 -33273 2960 1097 -30209 -27099 -8402
318 -8402 -23692 -38303 -9850 12072 -15570 -43688 -38803 -40658 -55819 -36148 5549 2494 -33747
331 -33747 -41617 -31162 -47422 -63343 -40669 -19352 -36191 -51840 -36215 -27400 -38247 -31376 -13339
344 -13339 -31196 -68582 -70040 -46162 -41748 -42400 -20168 -8468 -35790 -62552 -56859 -47863 -54099
357 -54099 -47927 -27251 -28194 -47882 -46739 -28888 -28438 -41700 -43895 -44712 -59879 -67000 -46475 -20962
371 -20962 -13453 -14129 -16250 -30215 -51544 -56762 -46572 -38082 -33079 -26042 -24201 -30347 -31128 -22158 -20912
386 -20912 -31357 -38759 -39950 -41489 -39353 -23369 -4474 -107 -9207 -21206 -33867 -44977 -44735 -30711
400 -30711 -15482 -8792 -6564 -2912 -2320 -8320 -14030 -15529 -19623 -29004 -34668 -27704 -12919 -467
414d67O246J321n623j3877j4331k038R613J0773P927P300L972m246p709l878j923
429f940n054l534K501P088P871J0815R884K688q622j4314j4478p945J997P952
443a0091J0741J1699J0873l26q950o582k73l669p201K067J0148M897J182R453
457B3968R086p696j5780n285j725p581R23K0056J7941O95k909K222q484j9130
471F301o564P198M03l559J0960J7275K498m292N961K588j6122j5391K675O352
485A6283Q36Q372J7138L604j1287p160k744j0331q041R376J2220j43J68J2828
499D1119P419j0308j1649j730m681j2765l094J2252J5304Q804N690l90p229r115
513B9627o998o525q41N584O144J557J986N681n16o829o153o295r499j061J1114
$$ plain form
414 -467 5779 7100 1477 -12400 -26731 -28769 -19156 -8383 -456 6844 10816 6570 -1139 -5017 -6940
429 -6940 -11994 -15528 -13027 -5939 1932 12747 22631 25319 16697 2383 -12095 -20040 -18043 -10091
443 -10091 650 12349 23222 22896 13946 7364 7091 3422 -3779 -1712 8436 13333 14515 23968
457 23968 33054 25358 9578 4293 2568 -5013 -4090 15966 33907 34602 31693 33915 25431 6301
471 6301 -263 6935 7338 3779 14739 32014 34512 30220 36181 38769 22647 7256 9931 16283
485 16283 17119 25491 42629 46233 34946 27786 25042 14711 6670 16046 28266 28123 28291 41119
499 41119 48538 38230 26581 24851 20170 7405 4311 16563 31867 40671 46361 45971 38742 29627
513 29627 22629 16104 15263 20847 26991 28548 30534 36215 35699 28870 22717 16422 6923 5862 16976
528A6976Q442J930P890R022j3275k5483k864J2775n546j3861J1553K2750k198
541B8111j3185P803J1435j5385j9461K424J329j3000M076K5773P487j8671m970
554C766R963j3024k3071Q710K3514m898j5128J2957J7486j4664j8682J0540J0163
567G632k1690j9975J3028J7856j09J991J2954j795k0401r461L101n782p710J2029
581a8332J6859m588j4864K545J1999l273j1761j313M622m536o239Q189J6868M085
595B61j1025q067K082n989j6171j900K2583J7171q020j0618N422M090j0642m394
609b5217P145l271j2478O027J6145n690j2170J6976K1876j9480l1070P489K2767
622a0951p634r661K1782J5529k3351j6394J8436N559k6201l423L3097P037k8523
$$ plain form
528 16976 25418 27348 35238 44260 30985 5502 2638 15413 9867 -3994 7559 30309 28111
541 28111 14926 22729 34164 18779 -682 1742 3071 -9929 -5853 19920 27407 8736 3766
554 3766 13729 705 -22366 -13656 9858 4960 -10168 2789 20275 5611 -13071 -2531 7632
567 7632 -14058 -34033 -21005 -3149 -3258 -1267 11687 9892 -10509 -19970 -16869 -22651 -30361 -18332
581 -18332 -1473 -6061 -20925 -18380 -6381 -9654 -21415 -22728 -18106 -22642 -28881 -20692 -3824 261
595 261 -10764 -18831 -16749 -22738 -38909 -40809 -18226 -1055 -9075 -19693 -14271 -10181 -20823 -25217
609 -25217 -18072 -21343 -33821 -27794 -11649 -17339 -29509 -12533 9343 -10137 -41207 -33718 -10951
622 -10951 -18585 -28246 -6464 9065 -14286 -30680 -12244 -6685 -32886 -36309 -3212 3825 -24698
635b4698m224K7877L605j9490L022J3015j8352k0413K1780K3933j7690j4037K8360
648B688J7129l1972k5069K1451J9544j3706n520J8451Q34k0313K192K0664o375
661bk3561N773K3825m752k1880M552K3482M930j2783o667L02n144k385Q302Q119
676B111k317k894O046N166q833j4601K458J7526O777j4472r104J2524R318r723
690a8n982J0955L97j6795q07J9495q54j8064J0446K8918q720l6206q23K6559j636
705F865j8648J2090K0704j3810j5245J7816Q332k7454p121L4667P543l7617p783
718a9661L9496R260l2052j344K8650j0631l3168J2196L1010j3105k0048K7186
730A7789K3495l2487k8334K4748J9632k4246q618L0177O339k9070K66L0101n420
$$ plain form
635 -24698 -28922 -1045 2560 -16930 -13908 -893 -19245 -39658 -17878 6055 -11635 -25672 2688
648 2688 19817 -12155 -37224 -15773 3771 -9935 -15455 2996 3830 -16483 -14291 6373 -2
661 -2 -23563 -17790 6035 1283 -20597 -16045 7437 12367 -416 -7083 -6781 -11925 -14310 -6008 2111
676 2111 -206 -3100 2946 8112 -721 -15322 -12864 4662 11439 -3033 -12137 387 9705 -18
690 -18 -6000 4955 5352 -11443 -12250 7245 6391 -11673 -1227 27691 18971 -17235 -18058 8501 6865
705 6865 -11783 307 21011 7201 -8044 9772 18104 -9350 -16471 18196 25739 -11878 -19661
718 -19661 19835 29095 -2957 -4301 24349 13718 -19450 -7254 23756 10651 -9397 17789
730 17789 41284 8797 -19537 5211 24843 597 -8021 22156 28495 -575 -309 29792 24372
743B4372l0553P779K6983j3236k9320J4973L1709m374j8860O927Q338j6867j2940
756e069J1075J0539k432K612P894l840j0131l05L176k232p28J803j886j923O076
771A4629N220j209J613J033j2478j2151O545Q562n989K140K1296L790k6535j0183
785c717J8844R96k3922J903K7853j852k5984O249K4894q118k1004R207R824k3104
799g931j1933K7320J3554k2759K98L1048q893m4934j255L7051l260l0541J3755
812h480L3611j4354k9227J6002K0388k3324j9950K1309R973k7901l436L5381P771
825A7763k7355j447J9807j5211l0637J3984K9636q795j7838J9140J7113k3232
837g072k0652J4980J2099j5747p270J2847L993p092Q180J2240q698j3333L204
$$ plain form
743 24372 -6181 1598 28581 15345 -13975 998 32707 28333 9473 16400 24738 7871 -5069
756 -5069 6006 16545 14113 16725 24619 20779 10648 10343 13519 11287 10559 12362 10476 8553 14629
771 14629 19849 18640 20253 21286 8808 -3343 3202 11764 5775 7915 29211 33001 6466 -3717
785 -3717 15127 16123 -7799 -5896 21957 20105 -5879 370 25264 17146 -3858 5349 15173 -7931
799 -7931 -19864 7456 21010 -1749 -1451 29597 20704 -24230 -25485 11566 8306 -22235 -8480
812 -8480 25131 10777 -18450 -2448 17940 -5384 -25334 -4025 5948 -21953 -25389 9992 17763
825 17763 -9592 -11039 8768 -6443 -37080 -23096 6540 -2255 -20093 -953 16160 -7072
837 -7072 -27724 -12744 -645 -16392 -23662 -10815 -6822 -13914 -5734 6506 -2192 -15525 -12321
850a2321Q86j4011k040J7401R893m633J538L544r635r706N615M593o703j89J0281
865e487J334m901O603O260j2125r551R525J447j7693M83K7925R731j8027l841
879h317J3906o263k1041L480J5056o169p081J7862J1732j7064p233J9403J417
892I688k6756n017K3003J305j8295J0572K5056q930k4023P797J4333j7029j7005
905b5301J8362J8290j1810n018J7773K312k0908k660J4293q088j8768J1561K3115
918A3153o283j4726J2255J4397j4289j5909P804N025j0939n72J5968L395r992
931g13L416R291r898j4813M266R551m697j556J1943N441r215j571O888n536j2643
946i846J403Q716k369l105J0055P734n530k739L581o880j1709K919J1037k355
$$ plain form
850 -12321 -11435 -25446 -27486 -10085 -192 -4825 -3287 257 -9378 -19084 -13469 -8876 -15579 -15768 -5487
865 -5487 -4153 -9054 -2451 3809 -8316 -17867 -8342 -6895 -24588 -24105 3820 13551 -4476 -8317
879 -8317 5589 -674 -21715 -18235 -3179 -9348 -16429 1433 13165 -3899 -11132 8271 9688
892 9688 -17068 -22085 918 2223 -16072 -5500 19556 10626 -13397 -5600 8733 -8296 -25301
905 -25301 -6939 11351 -459 -5477 12296 14608 -6300 -8960 5333 -2755 -21523 -9962 13153
918 13153 6870 -7856 4399 18796 4507 -11402 -3598 1427 -9512 -10084 5884 9279 -713
931 -713 2703 11994 2096 -12717 -8451 1100 -3597 -5153 6790 12231 3016 1445 8333 2797 -9846
946 -9846 -8443 273 -2096 -5201 4854 12588 7058 4319 7900 1020 -10689 -7770 3267 912
960I12m715R790Q151q635q057N648J067r910K32J0740j96n860P360J0817p373
975I971j1477L910K985j0919l661J4669P381p994R20J1071l893j5246L03R898
989G918m029q780P217J0462m483m451R020K897j2745n392Q908Q19q752M555J4312
1004A7476k41j0509K83M436n991p894N204O416m080j39Q145J487o618J39M012
1019A2126n434r197L137O951j573j312P826L204p881n040L414r06n368K275O744
1034H966j013m230L532M203n618n520K352R01o068j579P953M196k855j40J665
1049F745m275n975N05K430j510l87L840J133k806R2K862k210n229m49J523j514
1065e225n94N150K716l597l251J172k167n133R35N803J79k843J721L125j747m111
$$ plain form
960 912 -3803 5987 14138 5503 -2554 3094 4161 -5749 -5517 5223 5027 -833 6527 17344 9971
975 9971 -1506 2404 5389 -5530 -9191 5478 12859 4865 5785 16856 12963 -2283 -1980 7918
989 7918 3889 -4891 2326 12788 8305 3854 12874 15771 3026 -2366 6542 7361 -1391 3164 17476
1004 17476 17235 6726 7009 11445 5454 -2440 2764 9180 5100 4961 13106 14593 7975 8114 12126
1019 12126 6692 -2505 632 7583 6010 4698 12524 15728 7847 2807 6221 5315 -53 2222 8966
1034 8966 7953 3723 7255 11458 5840 320 2672 3573 -2495 -4074 3879 8075 5220 5080 6745
1049 6745 2470 -3505 -3000 -570 -2080 -2467 1373 2506 -300 -208 2654 444 -4785 -5234 -3711 -5225
1065 -5225 -5819 -669 2047 -1550 -4801 -3629 -5796 -10929 -9994 -4191 -4012 -6855 -5134 -2009 -3756 -7867
1081g867J519R53m270l149L192L620n67L69K256n97m551k367J292J152o16J473
1097h158K301n08j276l05N09j267j320K3p1L11J967K639J237o07j368j319k556
1114i768o31J050K434J944L13O01j43l88j513n48P47m81m79J391K744N26p05J152
1132a754M26k903l705J717L594k88m30L337L381k808l703R74J509k804j652L809
1148a300K395j116P41L717j154m808p98K231j089k495K820N572p34j841R83P35
1164C859l366k930J361O48j91K488L768oj600l86j065l240j261K105P43n31K286
1181B682L423r04k334R51l25l863k232K016J216J31L487M593j939m555p62L02
1197A887m264j326N332L144k696J003M616j922n953J085M333n071o263N020P691
$$ plain form
1081 -7867 -6348 -5395 -9665 -12814 -9622 -6002 -6569 -6200 -3944 -4541 -9092 -11459 -10167 -9015 -9631 -8158
1097 -8158 -5857 -6365 -7641 -7946 -7437 -8704 -10024 -10001 -10072 -9761 -7794 -5155 -3918 -4525 -5893 -7212 -9768
1114 -9768 -10399 -9349 -6915 -4971 -4658 -4057 -4200 -4588 -6101 -6649 -5902 -6383 -6862 -5471 -2727 -2201 -2906 -1754
1132 -1754 -1328 -4231 -7936 -6219 -2625 -2913 -3343 -6 3375 567 -3136 -2162 -653 -3457 -5109 -1300
1148 -1300 1095 -21 720 4437 3283 -1525 -2323 -92 -1181 -3676 -856 4716 3982 2141 3124 3859
1164 3859 493 -2437 -1076 -428 -619 1869 5637 5631 4031 3645 2580 -660 -1921 184 927 396 2682
1181 2682 6105 5201 2867 3818 3493 -370 -2602 -586 630 761 4248 8841 6902 2347 1585 1887
1197 1887 -2377 -3703 1629 4773 2077 3080 7696 5774 -179 906 5239 168 -6095 -1075 6616
1212F616k060k544O523K133q984n173M533mn285M813J0701j231q685K468O067
1227I888n889q600N406O530o487l626R522N876o600k352O562k205j1399j461Q744
1242C909J623k393N935O478o739q239L778K680p011k179Q568M413o185j125O723
1257A0236J877n194j993M3m267l323M803N455J80J814L576l065p974k661J653
1272A160j02J013N341K089l828j028K602r10l826M4P84n065j536O235L686k833
1288C826K696O805o215j4512j214R268l43m620P169R186o803r809M081M275q203
1303d413k963Q809O34j1136Q93J2986J453r188J873N835j1128j3449P987J4442
1317B635l537n879R678N792j4429j1593Q761O807o894j818Q104j108p953M619
$$ plain form
1212 6616 4556 2012 8535 10668 1684 -3489 1044 1040 -4245 568 11269 10038 1353 3821 9888
1227 9888 3999 -4601 805 7335 848 -2778 6744 12620 6020 3668 10230 8025 -3374 -4835 3909
1242 3909 5532 3139 9074 15552 8813 574 4352 7032 21 -2158 6410 10823 4638 3513 10236
1257 10236 12113 6919 4926 4969 702 -2621 2182 7637 7817 9631 13207 10142 2168 -493 1160
1272 1160 1058 2071 7412 9501 5673 4645 7247 6337 2511 2555 3339 -1726 -3262 2973 6659 3826
1288 3826 6522 13327 7112 -7400 -8614 654 311 -4309 2860 12046 5243 -4566 -485 3790 -4413
1303 -4413 -7376 1433 2067 -9069 -8176 4810 6263 -2925 -1052 4783 -6345 -19794 -11807 2635
1317 2635 -902 -6781 2897 8689 -5740 -17333 -8572 -1765 -8659 -10477 -2373 -3481 -11434 -6815
1331f815R650m367r144L167L259j1395n826J3986J1641n425n989M587j796j1479
1345a5946k424R794M930l299l15L231k764k484L913K264m059l152J057k336k462
1360a4052N609R240J806m417l178l875m799N96N262L059K077L500j130p456j742
1375i500O655J277n414N66N885m171p416P492J2563k958r170J972K536j0602n456
1390a5741J2739J0209n545j854P313l886j3838K011J3924q92j1020L846R579o816
1404B9q022J0741J1109j0205j0143O694K557j1080J54J7791O282j2288n306N375
1418C688l507r012O750J1324l925p291N758M106q889l286J2050M785j2295p378
1432g122O420K756k939M050Q373k029q407j940Q96l258j00R202L927m628m195
$$ plain form
1331 -6815 2835 -1532 -10676 -7509 -4250 -15645 -21471 -7485 4156 -1269 -7258 -2671 -4467 -15946
1345 -15946 -18370 -8576 -3646 -6945 -7260 -4029 -6793 -9277 -5364 -3100 -7159 -10311 -9254 -11590 -14052
1360 -14052 -8443 797 2603 -1814 -4992 -8867 -13666 -13070 -7808 -4749 -2672 828 -302 -7758 -9500
1375 -9500 -2845 -1568 -6982 -6416 -531 -4702 -12118 -4626 7937 4979 -4191 -2219 317 -10285 -15741
1390 -15741 -3002 7207 1662 -192 7121 3235 -10603 -8592 5332 4440 -6580 -2734 6845 29
1404 29 -7993 2748 13857 3652 -6491 203 2760 -8320 -8166 9625 15907 3619 -1687 3688
1418 3688 181 -8831 -2081 9243 5318 -1973 3785 7891 -998 -4284 7766 12551 256 -7122
1432 -7122 -702 2054 -885 3165 11538 9509 1102 -838 58 -3200 -3300 5902 9829 5201 1006
1447A006Q83n43r56L172K248l698k928R76O52L56M489L725l537m345k85k028m217
1464e030M062J0349Q52q142q85M040l001n258N376O323n531m951O386K450p776
1479g36L7J1665Q70j3623l542J0246P85p197M741J0228m508r527L610M242p919
1494f28k983J1778N126j0704m349R640K211r523K08R392j768r758J533P958k058
1509F075m518N543N220p009p279M543L390m427J326P589l54q033r18N507j765
1524D890n356L416M996k225m814R54K808l47J56J060k435l676P20J785l75P99
1540B356L085L35l901k534k24r27O44L791J160k965j562J843o53k868J273L367
1556B220l408m627L149L549l115j649N479J554p538m721M625K261l972J334O055
$$ plain form
1447 1006 1889 1346 390 3562 5810 2112 -816 160 812 1168 5657 9382 5845 1500 1215 -813 -5030
1464 -5030 -968 9381 10233 2091 1206 5246 2245 -3013 2363 8686 3155 -1796 4590 7040 -736
1479 -736 -699 10966 11836 -1787 -5329 4917 5702 -1495 3246 13474 8966 -561 3049 7291 -628
1494 -628 -3611 8167 13293 2589 -1760 7880 10091 568 776 10168 8400 -1358 175 8133 6075
1509 6075 1557 7100 12320 5311 -1968 2575 5965 1538 2864 10453 10099 2066 1148 6655 4890
1524 4890 -466 2950 7946 5721 907 1861 4669 4322 4478 5538 3103 -573 147 1932 1557 2356
1540 2356 5441 5776 1875 -659 -883 -1810 -1166 2625 3785 820 -742 1101 448 -2420 -1147 2220
1556 2220 -1188 -5815 -2666 883 -2232 -3881 1598 3152 -4386 -9107 -4482 -2221 -6193 -4859 1196
1571A196j495o113M72L889l365m060M418L923n136l068N399L329n220k149M485
1586c495l83p384k62O868J147l840J603M610l374n480J062K953j517j234L845
1601d881J459l235k25L789p66m432k68K984m17k660K003M122J13j458J51p08j946
1618f375j246P30J059J171K409R00j285r38J181j006k499L50J689N18m37K339
1634a440K099r63q48M10j752k964Q77K898N42m73K762K361k531k943N05O96k243
1651c007o30L310K151j553R22K545j095l679K46P79j870j015L483K680p07m55
1667B105K103o22m583j043K045j7j789K267L742J48k012N95N54l320k513J643
1683f97J232o12J055L123J078j973j184r0j885k278O73K223O85N86J923J013j559
$$ plain form
1571 1196 -299 -6412 -5940 -2051 -5416 -9476 -5058 -1135 -6271 -9339 -3940 -611 -5831 -7980 -3495
1586 -3495 -3878 -11262 -11524 -4656 -3509 -7349 -5746 -1136 -4510 -9990 -8928 -5975 -7492 -8726 -4881
1601 -4881 -3422 -6657 -6882 -3093 -3859 -8291 -8559 -5575 -5992 -8652 -6649 -2527 -2414 -3872 -3721 -4429 -6375
1618 -6375 -7621 -6891 -5832 -4661 -2252 -1352 -2637 -3575 -2394 -3400 -5899 -5549 -3860 -3342 -3779 -1440
1634 -1440 659 -304 -1152 -742 -2494 -5458 -4581 -1683 -1141 -1614 1148 3509 978 -1965 -1460 -764 -3007
1651 -3007 -3637 -327 1824 271 1193 3738 2643 -1036 -790 -11 -1881 -2896 587 3267 2560 2105
1667 2105 4208 3586 -997 -2040 5 -12 -1801 466 4208 4356 2344 2939 3493 173 -2340 -697
1683 -697 535 -77 978 4101 5179 3206 2022 1932 47 -2231 -1558 665 1350 1936 3859 4872 3313
1700C313j977k76j153j103K96J550P22J674J779j50j893j088l54j313j455J184
1716b44K499Q63R9J466L73j908k421p6r1j114P82L459P02n27J001O63j961k881
1734F84J16R9o7P96K778J357j26l44p3j578k141o81J204J7P43K627J261p52o59
1753E261J37j524k546m50J925O94M32J804J971r17k271p11M0k320n50J678J928
1770D581M12K60J343j67j865j917l68j100k61Q54J849J262P6J40m61j551j851
1787A236j071M24L94J35J256J391N22j252j084q49p87j650n95J004J446R62M48
1804A930J99q06j061j830j058m95k21J249J331N03l20K24n8k051j697k60M29k72
1822d264N11J403J440p15p74o74j008j785m82J291J28N16J044J211n58j460o75
$$ plain form
1700 3313 1336 1060 -93 -1196 -900 650 1372 3046 4825 4675 2782 1694 1340 27 -1428 -244
1716 -244 2255 3118 3217 4683 5056 3148 727 651 560 -554 228 3687 4389 3862 4863 5526 3565 684
1734 684 800 899 832 1628 4406 5763 5637 5293 5220 3642 1501 820 2024 2041 2784 5411 6672 5920 5261
1753 5261 5398 3874 1328 878 2803 3497 3929 5733 7704 6787 4516 3805 3845 1525 975 2653 4581
1770 4581 4993 5253 6596 6429 4564 2647 2279 1179 918 1772 3621 4883 4959 5099 4638 3087 1236
1787 1236 165 589 983 1118 2374 3765 4287 3035 1951 1102 315 -1335 -1930 -926 520 1482 1930
1804 1930 2129 1323 262 -1568 -2626 -3121 -3342 -2093 -762 -259 -579 -355 -413 -2464 -4161 -4421 -3992 -4264
1822 -4264 -3753 -2350 -910 -1625 -2399 -3073 -4081 -5866 -6348 -5057 -4929 -4413 -3369 -2158 -2716 -4176 -4851
1839d851M9j497o15P03J472M49j91P61R39r30k054q93J026p87j87J402K237L29
$$ plain form
1839 -4851 -4802 -6299 -6914 -6211 -4739 -4290 -4481 -3720 -2781 -3711 -5765 -6658 -5632 -6419 -6606 -5204 -2967 -2638
$$ [...]
8191H0
##END NTUPLES=NMR FID
##END=
