##TITLE=1H_LR-688A-C1
 CDCl3, 8 sc, 
 18.9.2019
##JCAMPDX= 6.0         $$ Bruker NMR JCAMP-DX V2.0
##DATA TYPE= NMR FID
##DATA CLASS= NTUPLES
##ORIGIN= UXNMR, Bruker Analytische Messtechnik GmbH
##OWNER= root
$$ XWIN-NMR		Version 3.5
$$ Wed Sep 18 14:42:41 2019 Russian Standard Time (UT+4h)  she@DPX200
##.OBSERVE FREQUENCY= 200.1315
##.OBSERVE NUCLEUS= ^1H
##.DELAY= (6, 6)
##.ACQUISITION MODE= SIMULTANEOUS
##.ACQUISITION SCHEME= undefined
##.AVERAGES= 8
##.DIGITISER RES= 18
##SPECTROMETER/DATA SYSTEM= spect
##.PULSE SEQUENCE= zg30
##.SOLVENT NAME= D2O
##.SHIFT REFERENCE= (INTERNAL, D2O, 0, 15.7039)
##AUDIT TRAIL= $$ (NUMBER, WHEN, WHO, WHERE, WHAT)
$$ ##TITLE= Audit trail, XWIN-NMR		Version 3.5
$$ ##JCAMPDX= 5.01
$$ ##ORIGIN= Bruker BioSpin GmbH
$$ ##OWNER= she
$$ F:/spectra/data/she/nmr/H-F/1/audita.txt
$$ ##AUDIT TRAIL=  $$ (NUMBER, WHEN, WHO, WHERE, WHAT)
(   1,<2019-09-18 14:41:42.48 +0400>,<she>,<DPX200>,
      <created by zg, POWCHK disabled, PULCHK disabled
       configuration hash MD5:
       00 E9 B6 7A A2 85 ED C7 34 08 36 98 17 FE 4E 26
       data hash MD5: 16K
       2C 85 AD 58 9C 5E 6B 25 07 F2 BD 4F E0 E5 BB A7>)
$$ ##END=
$$ 
$$ hash MD5
$$ 1C EC 83 EE D6 39 D4 37 86 BE 88 A0 C7 CA E3 D4
##$RELAX= 
##$RELAX= 
##$RELAX= 
##$RELAX= 
##$RELAX= 
##$RELAX= 
$$ Bruker specific parameters
$$ --------------------------
##$DU= <F:/spectra>
##$EXPNO= 1
##$NAME= <H-F>
##$PROCNO= 1
##$TYPE= <nmr>
##$USER= <she>
##$AMP= (0..31)
100 100 100 100 100 100 100 100 100 100 100 100 100 100 100 100 100 100 
100 100 100 100 100 100 100 100 100 100 100 100 100 100 
##$AQSEQ= 0
##$AQ_mod= 1
##$AUNM= <au_zg>
##$AUTOPOS= <>
##$BF1= 200.13
##$BF2= 200.13
##$BF3= 200.13
##$BF4= 200.13
##$BF5= 200.13
##$BF6= 200.13
##$BF7= 200.13
##$BF8= 200.13
##$BYTORDA= 1
##$CFDGTYP= 0
##$CFRGTYP= 5
##$CHEMSTR= <none>
##$CNST= (0..31)
1 1 145 1 1 1 1 1 1 1 1 1 1 1 1 1 1 1 1 1 1 1 1 1 1 1 1 1 1 1 1 1 
##$CPDPRG= <>
##$CPDPRG1= <>
##$CPDPRG2= <>
##$CPDPRG3= <>
##$CPDPRG4= <mlev>
##$CPDPRG5= <mlev>
##$CPDPRG6= <mlev>
##$CPDPRG7= <mlev>
##$CPDPRG8= <mlev>
##$CPDPRGB= <>
##$CPDPRGT= <>
##$D= (0..31)
0 1.2 0 0 0 0 0 0 0 0 0 0.03 0 0 0 0 0 0 0 0 0 0 0 0 0 0 0 0 0 0 0 0 
##$DATE= 1568803301
##$DBL= (0..7)
120 120 120 120 120 120 120 120 
##$DBP= (0..7)
150 150 150 150 150 150 150 150 
##$DBP07= 0
##$DBPNAM0= <>
##$DBPNAM1= <>
##$DBPNAM2= <>
##$DBPNAM3= <>
##$DBPNAM4= <>
##$DBPNAM5= <>
##$DBPNAM6= <>
##$DBPNAM7= <>
##$DBPOAL= (0..7)
0.5 0.5 0.5 0.5 0.5 0.5 0.5 0.5 
##$DBPOFFS= (0..7)
0 0 0 0 0 0 0 0 
##$DE= 6
##$DECBNUC= <off>
##$DECIM= 24
##$DECNUC= <off>
##$DECSTAT= 4
##$DIGMOD= 1
##$DIGTYP= 9
##$DL= (0..7)
0 120 120 120 120 120 120 120 
##$DP= (0..7)
150 150 150 150 150 150 150 150 
##$DP07= 0
##$DPNAME0= <>
##$DPNAME1= <>
##$DPNAME2= <>
##$DPNAME3= <>
##$DPNAME4= <>
##$DPNAME5= <>
##$DPNAME6= <>
##$DPNAME7= <>
##$DPOAL= (0..7)
0.5 0.5 0.5 0.5 0.5 0.5 0.5 0.5 
##$DPOFFS= (0..7)
0 0 0 0 0 0 0 0 
##$DQDMODE= 0
##$DR= 18
##$DS= 0
##$DSLIST= <SSSSSSSSSSSSSSS>
##$DSPFIRM= 0
$$ [...]
##$SUBNAM2= <"">
##$SUBNAM3= <"">
##$SUBNAM4= <"">
##$SUBNAM5= <"">
##$SUBNAM6= <"">
##$SUBNAM7= <"">
##$SUBNAM8= <"">
##$SUBNAM9= <"">
##$SW= 24.0689530833862
##$SWIBOX= (0..15)
0 0 2 0 0 0 0 0 0 0 0 0 0 0 0 0 
##$SW_h= 4816.95568400771
##$TD= 16384
##$TD0= 1
##$TE= 0
##$TE2= 300
##$TE3= 300
##$TEG= 300
##$TL= (0..7)
0 120 120 120 120 120 120 120 
##$TP= (0..7)
150 150 150 150 150 150 150 150 
##$TP07= 0
##$TPNAME0= <>
##$TPNAME1= <>
##$TPNAME2= <>
##$TPNAME3= <>
##$TPNAME4= <>
##$TPNAME5= <>
##$TPNAME6= <>
##$TPNAME7= <>
##$TPOAL= (0..7)
0.5 0.5 0.5 0.5 0.5 0.5 0.5 0.5 
##$TPOFFS= (0..7)
0 0 0 0 0 0 0 0 
##$TUNHIN= 0
##$TUNHOUT= 0
##$TUNXOUT= 0
##$USERA1= <user>
##$USERA2= <user>
##$USERA3= <user>
##$USERA4= <user>
##$USERA5= <user>
##$V9= 5
##$VALIST= <valist>
##$VCLIST= <CCCCCCCCCCCCCCC>
##$VD= 0
##$VDLIST= <DDDDDDDDDDDDDDD>
##$VPLIST= <PPPPPPPPPPPPPPP>
##$VTLIST= <TTTTTTTTTTTTTTT>
##$WBST= 1024
##$WBSW= 4
##$XGAIN= (0..3)
0 0 0 0 
##$XL= 0
##$YL= 0
##$YMAX_a= 207482
##$YMIN_a= -349270
##$ZGOPTNS= <>
##$ZL1= 120
##$ZL2= 120
##$ZL3= 120
##$ZL4= 120
##$ABSF1= 10
##$ABSF2= 0
##$ABSG= 5
##$ABSL= 3
##$ALPHA= 0
##$AQORDER= 0
##$ASSFAC= 0
##$ASSFACI= 0
##$ASSFACX= 0
##$ASSWID= 0
##$AUNMP= <proc_1d>
##$AZFE= 0.1
##$AZFW= 0.1
##$BCFW= 1
##$BC_mod= 2
##$BYTORDP= 1
##$COROFFS= 0
##$CY= 11.3945322036743
##$DATMOD= 1
##$DC= 2
##$DFILT= <>
##$DTYPP= 0
##$F1P= 20.1720416913024
##$F2P= 0.152960286110954
##$FCOR= 0.5
##$FTSIZE= 0
##$FT_mod= 4
##$GAMMA= 1
##$GB= 0.15
##$INTBC= 1
##$INTSCL= 1
##$ISEN= 128
##$LB= 0.24
##$LEV0= 0
##$LPBIN= 0
##$MAXI= 10000
##$MC2= 0
##$MEAN= 0
##$ME_mod= 0
##$MI= 1.114404
##$NCOEF= 0
##$NC_proc= 0
##$NLEV= 6
##$NOISF1= 3.799351
##$NOISF2= 2.8
##$NSP= 1
##$NTH_PI= 0
##$NZP= 0
##$OFFSET= 15.70392
##$PC= 1
##$PHC0= -9571.659
##$PHC1= 10.60096
##$PH_mod= 1
##$PKNL= yes
##$PPARMOD= 0
##$PSCAL= 0
##$PSIGN= 0
##$REVERSE= no
##$SF= 200.130013532006
##$SI= 16384
##$SIGF1= 3
##$SIGF2= 2
##$SINO= 400
##$SIOLD= 16384
##$SREGLST= <1H.CDCl3>
##$SSB= 0
##$STSI= 0
##$STSR= 0
##$SW_p= 3612.71676300578
##$SYMM= 0
##$S_DEV= 0
##$TDeff= 0
##$TDoff= 0
##$TI= <>
##$TILT= no
##$TM1= 0
##$TM2= 0
##$TOPLEV= 0
##$USERP1= <user>
##$USERP2= <user>
##$USERP3= <user>
##$USERP4= <user>
##$USERP5= <user>
##$WDW= 1
##$XDIM= 8192
##$YMAX_p= 0
##$YMIN_p= 0
$$ End of Bruker specific parameters
$$ ---------------------------------
##NTUPLES= NMR FID
##VAR_NAME=  TIME,          FID/REAL,        FID/IMAG
##SYMBOL=    X,             R,               I
##VAR_TYPE=  INDEPENDENT,   DEPENDENT,       DEPENDENT
##VAR_FORM=  AFFN,          ASDF,            ASDF
##VAR_DIM=   8192,          8192,            8192
##UNITS=     SECONDS,       ARBITRARY UNITS, ARBITRARY UNITS
##FACTOR=    0.0002076,     1,               1
##FIRST=     0,             0,               0
##LAST=      1.7004516,     0,               0
##MIN=       0,             -349270,         0
##MAX=       1.7004516,     207482,          0
$$ Real data points
##PAGE= N=1
##DATA TABLE= (X++(R..R)), XYDATA
0 0 0 0 0 0 8 -8 8 -8 16 -16 16 -24 32 -40 48 -56 64 -80 95 -110 128 -151 175 -199 231 -264 302 -342
28 -342 388 -439 494 -557 625 -699 780 -868 967 -1074 1193 -1321 1464 -1621 1795 -1988
44 -1988 2202 -2442 2713 -3023 3374 -3785 4266 -4846 5555 -6444 7604 -9180 11465 -15089
58 -15089 21751 -38085 163027 124927 -149338 105201 207482 42143 -38539 160791 188778
69 188778 64346 67883 165151 77425 16788 136571 172453 -33360 -87806 113175 190602
80 190602 32434 14096 146947 104776 -66246 -32968 96490 47194 -43990 48562 123505
91 123505 10736 -70372 19424 63453 -18277 -41229 10587 -14869 -53473 14647 54016 -38786
103 -38786 -79222 11531 19427 -108403 -130014 -3923 38259 -38774 -55389 -14310 -43073 -92220
115 -92220 -70162 -56804 -91697 -69058 -1235 -23750 -93018 -66469 -12446 -58357 -106410 -63951
127 -63951 -54220 -121170 -102906 1023 -3652 -91462 -64578 12435 -57504 -167486 -113140 -12548
139 -12548 -42715 -83625 -22464 -5129 -83720 -82826 -2001 -35128 -130806 -81198 17560 -45068
151 -45068 -133394 -38079 70543 -10797 -110422 -53898 -7684 -84973 -102575 769 26895 -51478
163 -51478 -46925 19446 -22209 -98542 -45212 28351 -29840 -89383 -23618 26073 -30648 -45741
175 -45741 27873 25016 -66346 -73997 -1827 -6311 -54427 -11423 52825 9760 -54746 -25880 11573
188 11573 -23440 -40393 5887 17411 -24237 -20419 25021 16596 -22960 -11970 11625 -15907
200 -15907 -38364 -3798 26720 12961 7900 24320 12534 -18588 -16323 1071 -4281 -5759 19372
213 19372 31055 15500 13278 23345 10150 -6669 5495 13249 -5275 -2421 33857 42935 19236
226 19236 21877 42935 20871 -16197 -2538 27457 18357 11504 44569 57560 23989 12423 38642
239 38642 32007 -4006 6646 44429 34300 9029 37241 69040 40170 10376 32436 42963
251 42963 6407 -1175 42968 57925 28539 31815 61764 44760 4591 15468 44528 28207
263 28207 9283 37842 60801 35847 21699 46535 47649 11797 5328 32634 32655 13593 29884
276 29884 57905 44697 18446 24484 32541 11149 -257 21552 33990 22541 23955 39797 33682
289 33682 12095 10936 17675 6509 -3054 11030 24504 18674 16906 25343 21367 2423 -4365 -884
303 -884 -3786 -5445 6309 15749 11103 7038 9555 2417 -13030 -15283 -8896 -10791 -12394 -1447 7730
318 7730 1570 -5425 -5368 -12309 -24927 -26308 -18583 -16214 -15195 -6305 -297 -8562 -17862 -18466 -23739 -34927
334 -34927 -34483 -21370 -15570 -18449 -13239 -6525 -15106 -28896 -30920 -29504 -36189 -36863 -24609 -15927 -17665
349 -17665 -16548 -13035 -19958 -34439 -37532 -33175 -34366 -34251 -22807 -11700 -14208 -20277 -20211 -22349 -33168
364 -33168 -39389 -33598 -27225 -25378 -20099 -12331 -10571 -15943 -20888 -25801 -31559 -32949 -27261 -21376 -16510
379 -16510 -11647 -7425 -9801 -16398 -20518 -21506 -22980 -22790 -17872 -12318 -7483 -4184 -3626 -7595 -13125 -16351
395 -16351 -16581 -15229 -11405 -3746 1702 2296 -830 -2791 -5314 -9784 -11086 -8586 -3844 454 5373
410 5373 10190 12372 8326 1160 -4378 -6617 -5659 -1996 5293 13030 17761 16932 13851 10530 6280 1952
426 1952 -226 503 4883 11287 18799 23776 23545 19092 13858 7609 2213 1865 8248 15479 19400 21092
442 21092 22860 23215 19983 13965 9218 7971 8734 10512 14491 21067 25715 24823 20460 14726 11436 9891
458 9891 10547 13724 16049 18343 19389 20544 18043 15299 12884 11612 9804 10040 13915 17873 18630 18791
474 18791 18019 12205 5615 5160 9314 10698 10226 13402 18141 17370 12585 10226 7762 3389 1238 3191
490 3191 5960 7820 14156 18994 14272 4313 2085 4706 712 -5588 -1195 7823 8972 5779 8913
505 8913 11009 4992 -3094 -4383 -4653 -7572 -4252 6588 10721 4778 1029 2369 -377 -8267 -9707
520 -9707 -5534 -4225 -5225 -1134 4186 3043 -494 -275 -2357 -12167 -18618 -10669 -1100 -1641 -4711 -1230
536 -1230 2777 -3515 -12014 -12168 -7519 -8938 -11204 -8058 -5166 -5691 -4679 -734 -3695 -13050 -16163 -10547
552 -10547 -8795 -12674 -9167 271 162 -10028 -12698 -8936 -11401 -16109 -10041 -2365 -7647 -13674 -6116
567 -6116 600 -8967 -18743 -11218 -4489 -13475 -19156 -7633 1570 -4032 -7820 -4076 -9020 -19829 -17566
582 -17566 -6909 -8416 -13654 -3267 6992 -3530 -16379 -9721 -1553 -10917 -19991 -11194 -2730 -7565
596 -7565 -8418 3280 5691 -6109 -11537 -6787 -9634 -18704 -13591 1572 4895 -1900 -2110 1592 -3240
611 -3240 -10649 -8156 -3620 -5635 -7612 -2002 2428 -447 -1259 4714 5641 -4095 -12421 -7977 635 1946
627 1946 1006 6265 10853 3495 -7138 -5807 1833 2133 306 5332 9219 2373 -1356 7433 12735
642 12735 2472 -4275 3415 6285 -1880 706 16672 19740 6159 1715 8057 2536 -7875 2731
656 2731 19552 13045 1392 11341 20389 5522 -5819 9561 18445 1456 -6161 11609 19655
669 19655 6026 6799 23712 18133 -4578 -5043 11044 7698 -2343 12748 28498 14623 -2658
682 -2658 6465 15326 1881 -3916 12765 17277 -330 -1704 17240 19815 3704 2959 14440 5586
696 5586 -11738 -4254 15340 15273 5555 9639 13188 1346 -8096 482 7482 2540 1060 8623 8135
711 8135 -408 448 9038 6864 -3838 -5671 -287 -872 -3419 2596 10968 9195 -384 -5825 -5514 -5817
727 -5817 -7011 -3493 4303 6505 91 -5315 -2386 35 -5013 -7918 -2534 -1534 -9060 -9622 931
742 931 5671 -1444 -4130 -935 -8568 -19334 -12000 3001 985 -6915 -310 5697 -8910 -19995
756 -19995 -6454 5118 -7726 -17078 -2909 4575 -9556 -11932 5270 6215 -13750 -17383 -3514
769 -3514 -4654 -15230 -4552 11755 2224 -13852 -6494 1281 -12511 -18810 -398 8748 -7763
782 -7763 -13108 3774 6483 -11576 -11774 4596 341 -17578 -13074 3985 2465 -6380 2068 9796
796 9796 -4518 -16928 -7106 255 -7432 -6663 7664 8114 -6678 -7913 3932 2368 -8758 -6608
810 -6608 2149 -2889 -9435 -1300 9304 4800 -2071 -659 -750 -8023 -9439 -1119 4414 2688 1955 2736
826 2736 514 -2726 -2431 -1433 -1229 -1181 -444 -248 892 2971 3170 1624 1108 -846 -5529 -5060 1295 4198
844 4198 1469 3345 8050 2635 -6770 -5063 2539 37 -4143 2630 8787 1936 -3773 3639 7268
859 7268 -2349 -6073 1775 2842 -5199 -1207 11426 8557 -1824 493 6212 -3717 -11398 656
873 656 11518 2071 -3319 7606 11310 -1813 -5870 4835 5155 -5980 -3380 7897 5577 -1343
887 -1343 5735 13298 2677 -7602 11 5763 -2683 -4229 8907 13576 2734 84 7184 4534
901 4534 -4586 -1181 7135 3197 -2362 4267 10961 5529 542 5226 5933 -1938 -3819 2666 5184
916 5184 3477 6510 9982 4672 -1387 1288 3949 849 -992 3914 6000 3901 3309 5792 4249
931 4249 1633 1464 665 -1761 355 5523 6478 3275 3218 4460 944 -2295 -457 874 -581 1471
947 1471 5345 4387 529 1698 3674 -1188 -5875 -2963 995 -169 -157 4309 4499 -1043 -1867 923
963 923 -2680 -7971 -4571 1924 -42 -3303 1488 5492 -161 -5699 -4033 -3264 -6859 -5346 159 536
979 536 -3068 -1004 2493 -2072 -8101 -5549 -1790 -5492 -7853 -2859 1642 -1020 -2683 -584 -3324
994 -3324 -8293 -7451 -3023 -3581 -5622 -1894 1060 -2057 -5213 -3348 -2556 -5939 -6857 -3669 -2714 -4222
1010 -4222 -1433 1885 -1107 -5837 -5339 -3296 -5157 -6030 -2049 554 -358 -1703 -985 -1985 -3962 -3481
1026 -3481 -3139 -4383 -4731 -977 2336 1236 -345 51 -816 -4105 -4793 -2503 -1223 -480 1527 2271 707
1043 707 220 1235 154 -3289 -3655 -1247 2 356 2937 4435 2595 28 -202 -652 -2180 -1839 1031
1060 1031 3048 2179 1746 3393 3289 1176 -87 -507 -947 -693 1683 3418 3644 3832 3210 1788 -826
1077 -826 -1414 601 1026 650 1864 3236 3337 3007 2249 1319 -323 -789 -410 195 1378 3256 4157 2907
1095 2907 1219 572 297 -883 -749 647 1798 1389 1717 3323 2909 780 -1110 -441 -169 -786 -161
1112 -161 2103 3225 2658 1496 810 154 -969 -1210 -975 -263 798 2136 2956 2291 902 1011 282 -1748
1130 -1748 -2136 -97 1684 1751 1406 2375 2741 716 -1412 -882 83 -404 -577 1370 2827 2621 2376 1671
1148 1671 464 -787 -986 -376 -283 1058 2772 3435 1397 1021 1676 945 -1235 -1666 831 1899 761
1165 761 1443 3741 3485 712 -532 36 124 -566 302 1880 2846 2718 1905 1453 458 -91 -428 -173 -519
1184 -519 508 2458 2879 1634 1263 1620 751 -1815 -2629 -772 1425 1283 320 1350 2581 76 -2291
1201 -2291 -2025 -236 -379 -1788 -846 1234 1109 -519 -116 349 -1460 -3233 -2575 -2124 -2024 -733 1909
1218 1909 994 -1844 -2384 -1426 -3092 -5335 -2370 1041 -672 -4211 -1370 1820 -1319 -4805 -2965 -841
1234 -841 -3675 -5781 -2303 468 -1035 -1828 -71 -1518 -5429 -4975 -2133 -2645 -4185 -875 2282 -1443
1250 -1443 -4882 -2121 260 -3562 -5987 -2249 -57 -3427 -4179 561 2664 -1838 -3893 -1785 -2000
1265 -2000 -5016 -3824 757 1412 -677 -682 361 -2117 -3633 -1113 639 -1858 -3066 95 1911 -192
1281 -192 -1250 1974 2256 -1831 -3998 -1411 748 362 569 3137 3749 361 -2023 -446 396 37 218
1298 218 2541 2882 485 528 2687 2967 888 437 1903 268 -1820 972 5259 4797 1648 1629 3120
1315 3120 -200 -3430 630 5327 3785 610 2461 4171 1009 -896 2819 4640 2 -1607 2153
1330 2153 3511 743 1981 6486 4598 -2022 -2698 2270 1210 -1060 2543 6544 3132 -1406 255
1345 255 3373 231 -2271 2053 3851 -595 -1926 2834 4292 792 -87 2845 1194 -3976 -3279 2090
1361 2090 3158 1132 1975 3778 266 -4187 -2408 1675 1317 -927 1314 2481 -526 -2349 1064
1376 1064 3798 301 -3010 -1158 -127 -2364 -1064 3838 5297 363 -2922 -1544 -1185 -3130 -950
1391 -950 3680 3208 -1317 -2281 1549 1134 -1921 -623 2454 -577 -4786 -2366 2997 2804 -55 1296
1407 1296 2161 -2380 -5394 -1363 2353 610 -762 2831 3001 -2643 -3449 1614 2265 -2302 -2454 2214
1423 2214 937 -2675 -744 4325 2743 -2157 -2202 -455 -2696 -3566 1365 4837 1689 -1386 0 201
1439 201 -3449 -3140 1204 2184 -1858 -2000 1065 1110 -1711 -792 1596 -530 -4240 -3974 -591 234 -430
1456 -430 701 1986 -278 -4091 -3699 -1660 -2227 -1797 184 1692 -959 -3302 -1705 123 -1821 -3762
1472 -3762 -1689 -675 -2903 -4131 15 2925 -78 -2488 -2053 -2399 -5878 -5043 462 1872 -1003 -2147
1488 -2147 18 -1467 -5085 -2976 1153 -586 -4592 -3344 397 -309 -2026 804 2021 -2533 -6423
1503 -6423 -3026 -373 -2012 -1420 3027 2636 -2916 -3955 -287 -6 -3248 -1591 1645 442 -2765 -245
1519 -245 3022 754 -1855 -416 576 -2359 -3106 1400 3665 1533 947 2137 1586 -2008 -2200 1172
1535 1172 1642 591 1757 3421 2646 621 1394 2399 1073 -482 531 2142 1263 1933 4002 4716
1551 4716 2807 1020 206 712 878 1458 3275 4389 3738 2507 1893 2399 1749 770 1456 2317 2404 2035
1569 2035 3130 4452 3452 1918 1884 1869 -19 -273 2580 4133 2780 2257 3708 3240 -433 -586 1938
1586 1938 2167 -35 1309 3714 2791 752 1604 3218 749 -1444 70 1596 -54 381 3460 3770
1602 3770 208 -837 878 128 -2540 -1104 2339 1707 -613 586 2258 109 -2026 -911 172
1617 172 -1900 -2046 195 1141 -75 -321 1080 -507 -3244 -2797 -810 -1422 -2127 40 1264 -484 -1702
1634 -1702 -1266 -1030 -2559 -2995 -1236 -969 -1456 -565 427 -244 -1559 -1665 -1844 -2969 -2866 -1460 -451 -604
1652 -604 -515 335 -890 -1982 -2484 -2238 -2369 -2183 -611 -525 -210 -200 -230 -1334 -2229 -1932 -2140 -2308 -1760 128
1672 128 384 -182 -295 -253 -1674 -2976 -1956 -1173 -1478 -1236 720 700 -875 -870 -273 -1334 -3008 -1963 -530
1691 -530 -616 -900 662 896 -223 -1379 -1309 -1120 -2454 -1831 -38 261 -427 419 996 -356 -2046 -1741
1709 -1741 -876 -1851 -1780 53 823 -175 -393 245 -589 -2214 -2160 -1125 -963 -986 126 1055 133 -345 -204
1728 -204 -663 -2226 -2110 -198 136 -392 453 1236 471 -529 -954 -771 -1172 -1246 -331 535 503 992 1005 224
1748 224 -515 -1017 -519 -1107 -682 731 1520 1340 1039 1037 651 -94 -527 -501 243 891 1565 2210 1860 1669 1224
1769 1224 466 -17 158 730 1062 1276 2414 2862 2231 1751 1383 909 486 439 1390 2055 2313 2824 2547 1955
1789 1955 1711 1428 1211 705 1515 2620 2818 2380 2739 3145 2145 1385 890 1203 1456 1568 2372 3290 2982
1808 2982 2749 2442 1898 1202 789 1376 1529 1795 2552 2854 2388 1354 1174 1586 558 28 727 1677 1912
1827 1912 1713 2052 2139 951 -39 -293 38 -93 289 1139 1722 1074 612 668 -6 -1316 -1147 -616 -263 -649
1847 -649 176 1260 659 -630 -670 -654 -1999 -2784 -1863 -261 -596 -997 -219 -184 -1944 -2787 -2080 -1774 -2639
1866 -2639 -2497 -919 -556 -1864 -1361 -876 -1701 -3249 -3084 -2074 -2329 -2797 -1492 -441 -1618 -2584 -2262
1883 -2262 -2343 -3634 -3521 -1913 -1132 -1768 -2132 -1262 -1365 -2292 -2572 -2169 -2108 -2480 -2528 -1368 -753 -1018 -768 -953
1903 -953 -1893 -3227 -3199 -2022 -1270 -1299 -976 -138 -677 -1540 -1954 -1098 -1010 -2104 -1692 -361 -532 -1030 454
1922 454 1017 -418 -1797 -1154 -443 -1511 -1514 964 2240 1029 -639 325 770 -1617 -1628 931 1022 -436
1940 -436 -368 2222 1287 -528 686 2168 187 -2398 -443 1912 1023 353 2740 2858 -572 -1789 725
1957 725 1409 -388 29 2760 2327 -437 -11 2391 1397 -697 345 1827 62 -724 1592 3529 1557
1974 1557 298 1247 1180 -950 -1524 1481 2860 1186 541 1761 1431 -592 -280 1632 1110 -203 96
1991 96 1816 1086 711 1459 2562 1326 -758 -874 399 289 288 2132 3026 1480 -498 -203 719 285
2009 285 -235 1485 2088 659 -635 1010 2717 1559 -21 734 739 -1153 -1229 1735 3220 1554 361
2026 361 2087 681 -1786 -853 2663 2278 -221 318 2579 1050 -1027 654 3050 1112 -1655 32
2042 32 2160 262 -644 2944 3792 71 -1812 371 724 -1468 -244 3524 2817 -719 -470 1794 457
2059 457 -1539 558 2981 156 -2609 -83 2690 930 -569 1574 1438 -2007 -3159 -82 1597
2074 1597 -129 120 1621 405 -2507 -2099 835 277 -1703 -934 505 -681 -2060 -453 1502 -73
2090 -73 -2366 -1656 -906 -2057 -2756 -167 1350 -206 -2024 -1830 -1167 -2421 -2917 -607 532 -1105 -2155
2107 -2155 -1152 -771 -2093 -2110 -369 -845 -3128 -3769 -1410 -331 -1509 -1242 194 -1029 -4323 -4120 -955
2124 -955 -359 -1983 -1060 282 -1289 -3593 -1882 293 -1235 -3208 -1587 -403 -2585 -3010 369 1356
2140 1356 -1452 -2510 -1005 -1083 -3391 -2494 1313 1165 -1761 -1404 791 -611 -3120 -1265 1152 -327
2156 -327 -2165 -106 1000 -571 -1195 1173 1488 -1212 -2085 549 1068 -771 227 2859 1995 -700 -978
2173 -978 731 603 -742 765 2240 1081 -768 788 2157 1319 338 1127 1411 -328 -667 1756 2931
2190 2931 2117 1159 1643 1194 -39 -280 1485 2348 1574 1065 1874 1883 437 831 1897 1644 354 96 1558
2209 1558 1975 1278 1612 2786 1617 -162 -143 1083 1453 265 1650 2950 1835 243 1094 1719 338
2226 338 -100 1185 1912 189 39 1983 2256 518 50 1236 356 -1697 -945 1947 1657 48 750
2243 750 1708 365 -1276 -123 1184 100 -715 714 1373 63 -464 1055 1123 -886 -1304 53 83
2260 83 -237 397 1677 1074 -672 -538 152 -845 -1365 -121 815 178 -305 378 632 -464 -1044 -460 -252
2279 -252 -694 -303 458 500 227 93 -79 18 -956 -1430 -706 -367 -21 358 624 303 131 -266 -493 -555 -798
2300 -798 -565 250 343 -117 -158 711 181 -1101 -1363 -734 -418 -821 -43 737 736 -203 -541 -629 -1207 -1563 -976
2321 -976 -146 -534 -633 428 205 -989 -1139 -702 -773 -1824 -1539 -203 -183 -790 -543 6 -646 -1868 -1353
2340 -1353 -646 -1090 -1243 3 -15 -711 -1162 -783 -1052 -1757 -1383 -836 -563 -1234 -697 48 -426 -1287 -1148 -885
2360 -885 -1700 -1852 -872 -495 -647 -539 -252 -727 -1289 -1275 -1333 -1250 -1123 -594 -68 -521 -530 -135 -681 -1125 -1523 -942
2382 -942 -789 -636 -493 -72 213 -104 -251 -454 -773 -705 -362 -476 71 614 918 573 525 219 -189 -386 -17
2403 -17 471 443 530 1184 982 749 646 553 364 -135 417 983 1460 1442 1357 1567 1105 696 784 922 532 711
2425 711 1518 1607 1339 1678 1592 1344 899 949 942 1266 1323 1866 2321 1700 1368 1378 1442 497 983 1478 1347 1275 1656
2448 1656 2060 1520 1116 1272 1056 779 637 1041 1415 1472 1555 1438 1382 884 259 614 618 549 756 665 1484 1225
2470 1225 979 899 360 -153 39 10 96 -5 504 583 711 -122 -189 -748 -606 -636 -520 -83 -487 -146 51 243
2492 243 -566 -1037 -1105 -1283 -1350 -733 -435 -174 -501 -523 -800 -1038 -1602 -1573 -1071 -977 -1040 -892 -295 -582 -1028 -1503
2514 -1503 -1313 -1408 -1852 -1013 -811 -815 -942 -524 -706 -1390 -2126 -1743 -1272 -1523 -1456 -794 -230 -1601 -946 -355 -846
2535 -846 -1700 -1892 -1015 -899 -1246 -607 -25 -178 -1276 -1226 -619 -1367 -1505 -829 -211 -206 -383 69 -57 -1034 -1240
2556 -1240 -628 -1 -968 -778 351 406 -115 -35 424 -288 -1045 -1058 119 377 -106 224 740 386 -733 -267
2576 -267 184 -276 -394 249 601 -84 91 875 1089 -236 -518 290 193 -617 -322 1109 1287 210 -177
2595 -177 666 1 -782 53 607 535 -528 565 1241 510 -46 321 1024 -377 -853 552 1063 154 250
2614 250 1425 1199 -398 -704 585 262 -115 347 1579 960 2 160 1183 757 -616 176 757 382
2632 382 -249 480 1967 1084 237 467 889 -392 -694 1176 2068 1038 174 1067 1200 -161 -508 1084
2650 1084 1605 -162 16 1236 1086 124 505 2094 1149 -637 -572 1251 1266 242 1351 2431 936
2667 936 -587 349 1516 462 -39 1243 2267 324 -221 1380 1935 -130 -120 1145 1269 -730 -553
2684 -553 1712 1818 570 514 1837 -43 -1625 -276 1703 714 -653 595 1522 -253 -1238 505 1694
2701 1694 -461 -1039 470 621 -807 -599 1194 1145 -1209 -1386 -225 -318 -1555 -449 1611 304 -1547
2718 -1547 -943 14 -670 -2022 -708 190 -887 -1759 -889 94 -985 -1825 -318 -98 -1895 -2389 -724
2735 -724 -13 -1046 -1363 -93 -651 -2691 -2570 -864 -366 -2137 -1579 -308 -729 -2417 -1809 185 -589
2752 -589 -2261 -1712 -714 -1577 -2458 -591 880 -606 -2370 -1607 -730 -1949 -2145 -47 747 -1211 -2030
2769 -2030 -338 -375 -1770 -1278 620 -438 -2298 -1266 425 214 -1346 -241 1016 -763 -2207 -1093
2785 -1093 766 -518 -1064 541 1322 -444 -1702 426 984 -546 -585 1008 900 -693 -603 1207 1600
2802 1600 48 339 1432 328 -711 400 2093 1867 138 793 1460 64 -534 818 2255 972
2818 972 -102 1083 1762 528 272 1901 1928 139 -437 1356 1809 586 872 2161 1692 290 20
2835 20 1549 1266 193 814 2076 1341 -40 913 1895 1052 111 778 1403 553 -409 1161 2082 742
2853 742 202 974 1308 -339 -526 1204 1516 262 145 1156 829 -511 -284 1165 765 -237 -90 952
2871 952 444 -645 660 1375 539 -1086 -237 580 -416 -689 910 1302 -342 -918 219 430 -938 -1049
2889 -1049 419 321 -964 -780 346 233 -777 -614 786 -160 -1203 -211 364 57 -735 228 447 -508
2907 -508 -1316 -366 343 -617 -446 239 302 -856 -715 57 475 -561 -839 206 -207 -792 -556 667 96
2926 96 -759 -364 48 -372 -981 -303 82 -8 -790 -553 168 -358 -984 -391 2 -687 -1152 -245 339 -413 -379
2947 -379 -83 -92 -662 -919 -200 -152 -545 -483 -22 -48 -1089 -836 -336 -536 -952 -558 -26 -500 -765 -265 73
2968 73 -794 -1201 -693 -216 -832 -878 -283 73 -626 -646 -201 -481 -1062 -977 -107 -441 -894 -497 -123 -178 -977 -652
2990 -652 -38 -596 -759 -671 -222 -530 -546 -51 -35 -732 -1025 -521 -344 -584 -451 389 -111 -230 48 -178 -22
3011 -22 -663 -542 112 -160 -502 -106 146 341 -150 -301 321 -6 -211 -100 300 450 12 533 518 -55 162
3032 162 279 483 468 492 855 931 951 479 611 662 359 438 606 731 1047 719 1088 759 877 764 999 1176
3054 1176 582 1115 977 1180 1029 987 1287 769 731 982 1080 667 783 1337 1065 734 581 1339 1020 182 446
3075 446 1089 954 586 676 1279 998 457 557 569 491 357 643 957 439 659 847 667 223 558 319 310 37
3097 37 433 316 428 176 391 121 -8 -300 -28 -156 -107 -249 -70 151 75 -190 -512 -766 -679 -591 -247 -339
3119 -339 -84 -257 -266 -255 -374 -561 -447 -545 -626 -612 -477 -299 -624 -691 -651 -784 -920 -917 -960 -1077 -651 -873 -337 -169
3143 -169 -831 -676 -867 -975 -1025 -517 -653 -659 -568 -471 -715 -557 -1111 -900 -679 -806 -471 -284 -15 -443 -599 -56
3165 -56 -236 -746 -828 -426 -220 -686 -78 -159 -301 -598 -593 -299 -345 -1021 -86 185 347 -256 13 199 -354 -443
3187 -443 -137 -101 -240 130 366 -63 245 288 307 50 -354 -57 185 158 -254 379 613 152 -93 -9 294 66
3209 66 -294 -184 488 319 80 391 304 -90 -323 337 99 -272 11 354 160 -16 379 414 49 -434 -188
3230 -188 159 110 164 332 458 303 -269 -123 -12 -358 -419 291 589 2 -311 578 416 -447 -440 226 109 -111
3252 -111 -278 730 944 -109 -14 370 -53 -424 -252 389 145 -114 10 563 326 -398 -78 524 34 -257
3272 -257 -146 227 279 60 697 577 -278 -427 232 429 -31 130 842 573 -22 145 699 481 -146 336
3292 336 592 78 -329 719 1017 562 185 421 707 -80 -444 670 965 380 379 959 331 -82 -501 946
3312 946 878 -214 -33 981 889 -240 529 788 417 -242 -93 460 309 38 739 1180 67 -551 152
3331 152 61 -637 -231 578 397 -366 -714 444 722 -385 -261 67 9 -683 -436 733 408 -571 -220 52
3351 52 -840 -1207 -440 380 -52 -585 -14 15 -877 -1159 -70 24 -665 -998 -13 -70 -831 -868 18 -27 -1112
3372 -1112 -1221 -463 -619 -980 -571 537 61 -1050 -790 -681 -818 -1177 -461 57 -673 -1361 -145 22 -676
3391 -676 -997 46 -255 -1085 -1502 -191 282 -718 -303 136 -354 -1052 -1134 65 76 -697 -437 554 -362
3410 -362 -743 -57 587 275 -560 -392 335 -370 -632 451 846 -139 -531 141 237 -508 -329 761 811 235
3430 235 -33 773 354 -453 326 1130 669 -310 -15 869 394 87 417 1048 268 -532 370 887 389 211
3450 211 1240 1120 -327 -170 652 853 393 397 741 722 23 284 971 800 -98 90 712 191 -80 312
3470 312 927 637 -71 442 774 -69 -252 615 787 313 -13 425 547 -146 -442 415 401 -341 -634 349
3490 349 82 -223 160 679 517 -718 -412 203 147 -484 308 589 19 -688 -619 334 -69 -608 145 307
3510 307 -397 -625 314 360 -368 -564 -133 70 -819 -748 398 319 -437 -318 121 12 -319 -350 410 -59 -702
3531 -702 -230 473 187 -423 181 210 -234 -567 -38 133 -215 -98 370 660 -315 79 232 137 -112 8 626
3552 626 93 -369 -15 235 344 -170 185 290 115 -411 -244 383 299 280 234 613 -280 39 134 131 -10 140
3574 140 325 209 -146 -102 351 425 -148 -72 364 346 -206 9 286 152 -270 -334 304 -105 -310 2 264 -104
3596 -104 -544 -321 357 -98 -267 321 120 -413 -304 111 55 -62 -133 -241 -166 -792 -790 -67 138 -312 -241 238
3618 238 -517 -917 -449 -183 -528 -509 -380 -205 -355 -492 -63 -51 -550 -468 -346 -481 -785 -453 78 -189 -551
3639 -551 -677 -190 -276 -339 -197 -89 -40 -267 -185 -123 -33 -169 -231 -240 36 -441 -68 66 59 -218 -143 325 -258 -443
3663 -443 -125 32 257 -57 326 324 163 59 93 40 -120 21 523 319 198 271 579 352 119 239 238 34
3685 34 257 330 699 307 212 426 385 189 257 371 284 410 272 488 498 127 194 344 -18 97 327 293 655
3708 655 141 548 707 103 124 276 280 349 133 397 330 67 268 441 117 60 -149 108 -46 106 190 374
3730 374 92 -270 -33 -31 5 -76 91 -146 -211 -157 137 105 -347 -93 -128 -333 -383 -449 -271 -114 -58 -130 -72 -244
3754 -244 -255 -620 -240 -31 -98 -226 -81 -354 -262 -427 -314 -396 -730 -329 -302 -259 -213 33 -71 -72 -365 -247 -168
3777 -168 293 -301 -497 -114 -209 -113 -15 -187 -82 -297 -64 180 -114 6 59 39 -33 -13 161 169 153 -54 134
3800 134 86 244 121 573 207 -116 30 270 16 -232 142 375 515 270 357 16 14 5 223 227 157 226 522
3823 522 222 122 219 456 -220 14 365 115 412 -106 278 0 301 -26 -35 96 0 -52 194 171 -173 35
3845 35 308 257 92 178 200 301 -78 -60 62 -28 -249 -143 258 -142 -286 -459 -82 -130 -266 -14 -27 -67 -309
3868 -309 -89 185 -371 -572 -194 -338 -100 -645 59 -266 -543 -462 -42 -293 -538 -485 111 -95 -279 -27 -184
3889 -184 -401 -574 -379 -33 -374 -336 -1 -61 -297 -320 129 61 -328 -175 -111 214 94 -259 32 -23 -156 -89
3911 -89 -170 12 -109 -124 412 242 62 84 210 446 225 -21 86 299 -24 273 92 -177 202 287 382 84
3933 84 -259 147 608 -94 213 157 356 71 152 610 413 41 287 660 516 2 340 772 267 -90 223
3954 223 703 131 60 524 593 425 145 293 539 -284 -418 233 182 447 1 391 87 -45 -336 243 366
3975 366 -301 -270 512 -76 -103 -224 283 -25 -412 -467 225 -166 -503 -154 133 -314 -401 -203 -242 -339 -344 -64 188
3998 188 -336 -413 147 -67 -76 -723 4 -87 -651 -486 81 -148 -312 -155 -52 -511 -897 -161 -21 -103 -341 -47
4020 -47 155 -416 -142 -54 93 -343 -384 -290 -169 -227 -192 339 -67 -514 -412 36 63 -303 40 273 111 -449
4042 -449 82 132 -130 -388 -137 364 -219 -525 99 519 252 1 -73 95 -175 -127 297 115 -291 274 392
4063 392 497 -288 -228 421 303 66 350 505 114 -434 -10 553 299 -172 -40 250 16 94 382 429 351
4084 351 -10 39 28 -80 199 457 412 -172 -62 106 347 -32 -107 505 7 -50 -285 146 187 -436 154 191
4106 191 100 -553 -139 92 -17 -42 31 385 -369 -484 62 173 -174 -211 65 272 -419 -571 109 215 -255
4127 -255 -655 48 -239 -550 -479 478 -20 -510 -57 -59 -233 -497 -134 439 -103 -595 13 213 -264 -139 215
4148 215 165 -463 -587 -62 297 -218 -363 235 -84 -163 -389 -47 85 -146 93 532 140 -165 8 406 -71
4169 -71 -188 216 168 76 23 391 780 416 34 406 274 -89 -12 452 393 218 151 574 164 172 -28 741 541
4192 541 291 523 343 431 180 568 415 84 -187 181 358 -118 -73 570 737 -19 -250 183 134 269 90
4213 90 255 302 54 98 156 338 9 9 125 -78 -436 44 302 326 -178 -55 208 -128 -126 -115 66 -281 -179
4236 -179 98 -78 -246 -606 -61 -52 -300 -657 -166 -97 -503 -149 92 -263 -506 -67 -348 -274 -302 -278 -294 -488
4258 -488 -470 -339 -144 -488 -405 -415 -293 -745 -542 -40 -94 -216 -574 -64 -102 -541 -469 -403 -328 -444 -279 -196 -336
4281 -336 -350 -641 -139 -24 -520 -171 26 -145 -317 -57 -170 -350 -146 19 77 -8 -76 53 391 24 122 -17
4303 -17 38 -54 21 51 398 329 299 204 377 28 231 353 227 -290 3 262 436 216 206 350 -51 -278 119
4326 119 692 79 230 459 382 482 346 504 298 121 -1 403 316 338 35 132 200 26 237 156 320 111
4348 111 -60 237 247 -16 185 521 292 116 188 -81 -68 383 85 152 256 14 199 143 142 -136 -25 39 94
4371 94 10 -121 106 -125 -12 128 281 -329 57 -215 -14 -169 -187 123 -219 -106 -99 260 -128 -51 -224 315
4393 315 -77 -92 -12 -243 -80 -152 -209 14 -146 -68 -28 -96 42 -310 -316 -120 -160 -166 132 34 109 -141 66 209 79
4418 79 193 0 153 339 88 55 187 10 66 -72 387 58 371 20 51 355 317 -48 33 120 18 200
4440 200 -139 212 197 -58 -38 -176 191 154 -65 -206 18 237 216 130 -71 20 197 248 -27 -129 205 -281
4462 -281 81 222 -145 59 -300 28 -121 16 45 7 -203 -84 91 118 37 147 -434 -312 41 -267 -174 -233
4484 -233 -376 -150 -288 98 254 -241 -243 -120 -321 -68 -434 -215 -285 -95 -560 -311 -487 -465 -613 -200 -108 -298
4506 -298 -746 -432 91 -222 -377 -189 -123 -180 -120 -306 20 -325 -240 -336 -276 -271 -293 -49 -302 -280 257 -41 -70 -256
4530 -256 -58 -103 -72 -30 239 128 -79 -29 41 60 -123 -172 294 240 147 62 56 154 132 207 43 91 1 -52 322 100
4556 100 221 43 462 425 248 444 467 78 587 287 57 244 354 140 588 279 520 514 89 161 4 510
4578 510 298 195 292 425 446 428 166 136 88 83 83 453 41 51 529 299 329 16 263 587 239 -275 392 434
4602 434 306 -45 101 484 -59 181 269 52 -13 149 242 -309 -78 145 154 -173 -282 156 242 -130 188 108
4624 108 180 -214 -163 77 237 132 -376 -69 -180 -228 -387 -52 -24 -511 -406 306 57 -309 126 226 24
4645 24 -579 -159 -63 -427 -126 -208 134 -114 -198 38 -8 -267 -419 9 -307 -304 -423 32 62 -264 -219 -1 18
4668 18 -103 3 -1 -127 -308 127 81 -89 -382 3 253 128 -240 184 352 92 -147 275 261 -55 -128 -86
4690 -86 108 -223 -184 148 119 -89 -311 218 111 -151 84 112 -57 -155 98 322 -30 -212 -48 342 -160 -184
4712 -184 58 583 137 -63 263 232 25 -729 101 247 184 182 66 67 -16 -378 344 50 -266 11 -191 115
4734 115 -179 276 380 -94 -140 -37 67 -315 -341 82 146 -186 -462 -89 -16 -290 -476 152 242 -221 -597 -31
4756 -31 -209 -181 17 110 -182 -470 -373 27 102 -479 -3 241 32 -413 -324 246 224 -150 -64 77 -159 -383 134
4779 134 420 -76 -198 239 113 -289 -247 456 316 -100 -194 -43 -80 -393 124 690 266 -92 193 511 94
4800 94 37 143 452 -80 -75 348 124 92 12 510 484 -128 -237 313 263 50 192 521 332 153 -22 76 384
4823 384 -67 182 545 420 54 535 372 186 126 228 332 -12 -144 161 247 -38 -112 64 155 35 -209
4844 -209 172 363 46 -80 85 319 -348 -109 235 64 -242 -143 215 188 -477 55 272 250 -345 -220 -190
4865 -190 -71 -448 27 256 -265 -73 -54 40 -316 -367 53 111 -605 -354 46 53 -355 -417 84 -73 -572 -200
4887 -200 -204 -56 -410 -123 162 -174 -402 -161 111 -412 -531 99 -91 -148 -428 -35 183 -260 -188 -177 -88 -469
4909 -469 -536 176 -190 -317 39 127 -81 -208 -26 16 43 -388 24 132 -174 -66 -152 192 -220 -65 119 -123
4931 -123 -92 -10 276 66 96 -194 57 125 -62 119 303 165 -9 98 338 433 -44 254 362 126 -70 56
4953 56 399 489 212 129 34 -235 205 328 343 69 -64 396 228 5 -201 -58 102 118 325 282 8 122
4975 122 83 126 26 -167 -270 398 69 -130 53 -14 -186 1 263 -308 -62 -34 380 43 -456 -175 -72
4996 -72 -184 -368 -65 77 40 -55 -98 140 112 -128 -224 146 -355 59 -10 65 -99 -592 44 122 -21 -311 32
5019 32 -100 -96 -286 -322 192 -281 42 -37 -126 59 -99 -94 -147 -403 45 128 110 -68 -115 -37 -57 -187 -101 254 24
5044 24 2 -308 -72 41 9 -183 134 238 115 52 170 151 15 266 178 -18 166 -49 265 33 206 483
5066 483 410 100 83 97 22 258 75 186 54 99 -32 -200 -89 31 154 301 100 130 261 111 165 166 -193
5089 -193 -153 68 -117 104 103 145 26 5 327 -58 75 -93 -47 -218 180 121 -101 -106 86 45 76 5 -273 -39
5113 -39 -4 -273 -136 -309 26 10 -169 -58 -293 72 -108 -145 -194 -299 -57 11 -171 -293 -260 -62 -171 -382
5135 -382 250 -107 -152 -140 60 89 -127 -340 -437 54 -296 -419 -222 -370 -220 -51 -340 -289 72 -260 -209 -285
5157 -285 38 90 -133 -1 -125 -205 -1 -362 -103 -247 -186 217 -114 -90 -74 -218 120 415 69 -51 302 -44
5179 -44 -62 -86 102 117 -71 215 98 272 241 254 320 321 -120 201 -61 209 104 -15 213 368 264 -29 43
5202 43 274 133 -94 307 71 -45 327 162 132 291 96 119 162 191 249 9 53 -7 501 152 346 136 162
5225 162 170 247 78 201 113 174 45 259 7 -139 237 65 -6 -177 114 -28 8 -43 -80 73 -400 -58 8
5248 8 18 -239 -312 -56 -226 -101 -115 -123 -186 -524 -10 78 34 -62 -143 -85 -236 -193 -42 108 -130 -186 414 -48 -288
5273 -288 -222 -132 -70 -218 204 -137 -126 -145 -183 121 96 -132 -51 142 -88 -357 132 -36 -207 -6 -88 -63 -222
5296 -222 -70 39 15 -104 248 19 18 45 159 146 -45 33 236 -33 -12 208 -183 195 -107 -223 139 -70
5318 -70 -58 47 235 262 10 233 -184 80 126 339 383 157 -377 -14 154 96 -175 276 165 6 -255 41
5340 41 399 53 -189 -30 174 -133 -265 -185 206 75 -110 57 181 -258 -52 -14 67 -140 -15 -146 71
5361 71 -139 -204 345 11 -371 -79 242 -61 -155 -48 35 114 -172 -175 111 -212 -315 104 156 -31 -219 -277 -297
5384 -297 -92 -220 -2 -120 -175 -228 -119 -30 -19 -436 -80 67 -452 -50 168 -94 -265 -19 76 -376 -373 -28
5406 -28 123 -241 -135 -24 349 56 -259 -54 -71 137 9 -26 -162 -127 164 381 5 -207 -87 219 337
5427 337 -111 -23 202 -126 -112 208 456 34 -82 298 102 198 -72 200 126 -72 -229 188 216 7 495 397
5449 397 184 17 -322 -38 208 -38 270 367 86 66 281 245 4 88 120 438 -242 -158 273 28 286 -2
5471 -2 112 99 -35 170 10 244 325 -414 108 143 -135 -38 2 192 -14 158 86 95 -235 -293 164 -192 -203 -117
5495 -117 38 -148 -233 47 -103 -21 -244 -165 -51 -119 -81 231 78 48 -324 40 -271 -418 5 201 131 -50
5517 -50 -297 71 -460 -96 -91 229 -196 -34 -96 263 -176 44 -79 26 -154 -221 209 6 7 -23 83 179 -168
5540 -168 94 0 -65 -361 -37 281 -42 -542 -113 -73 -113 -42 -213 159 -193 -84 20 115 104 210 75 9 39
5563 39 -356 381 264 123 4 125 264 89 228 237 269 -28 18 109 17 29 215 358 0 -103 351 272 269 -150
5587 -150 78 178 -111 25 406 13 -232 -33 303 -40 157 -104 -19 -10 -442 66 26 208 -286 -29 5 -124
5609 -124 -181 -124 201 61 -39 -106 39 -25 -114 -57 138 -280 -15 73 151 -301 -83 67 105 -133 85 122 -80
5632 -80 -467 -34 -102 -19 -64 -317 31 -173 -371 -374 -36 -183 -97 43 -181 -279 24 141 -174 -182 -183 -170 -121 -215 -174
5657 -174 -200 -14 -330 -238 88 24 -219 -86 72 97 -172 -45 -84 -115 -260 128 17 -238 148 26 127 -117
5679 -117 44 200 -45 30 -174 41 210 -11 14 93 35 -130 240 253 342 141 -37 144 308 44 97 53 232
5702 232 24 133 161 182 -107 233 -123 223 99 191 23 -224 212 11 13 183 -64 -84 -33 -9 65 309 171
5725 171 118 -104 83 -119 -170 52 -41 140 -50 -50 -12 125 60 161 26 -294 -313 -112 -265 -271 -248 -165 93 206
5749 206 38 313 -128 -233 -70 201 -123 -377 -157 -237 -191 -193 -133 -132 -78 -443 34 -87 98 -175 -112 -197 -289 -117
5773 -117 -201 -120 -247 81 41 104 -111 -103 70 -152 -254 -25 3 -124 -412 -129 -148 -127 -94 145 -5 96 269
5796 269 236 -27 74 40 -21 -214 -165 68 4 -27 55 -132 223 -71 -303 -11 105 26 8 198 227 46 250
5819 250 217 177 35 -218 428 -79 92 40 -38 167 168 384 -234 126 160 231 69 224 55 104 68 2 92 -32
5843 -32 134 -162 118 195 193 93 108 289 144 -97 92 233 39 38 -88 -108 394 -244 91 -106 -195 78 47
5866 47 117 98 -61 102 68 -179 -119 198 -16 -235 -198 248 65 7 -126 -72 -25 -315 -240 -24 -137 -180 -198 -39
5890 -39 13 -149 16 -31 -259 -44 41 -58 -127 -86 -220 65 -257 73 -295 -249 156 -389 39 25 22 -128 -132 -308
5914 -308 -303 -84 -28 166 -269 -175 -91 -103 -225 -28 -39 -74 -61 101 -24 63 26 -87 364 154 127 329 186 183 -195
5939 -195 158 214 120 9 53 67 61 413 234 117 56 65 120 407 84 78 263 116 90 95 71 77 121 3 168 -46
5965 -46 146 -35 244 -44 -121 -174 227 136 256 185 126 -24 -15 260 -166 197 -56 15 -86 30 -14 -63 72 -238
5989 -238 -145 -170 240 -147 -218 97 0 -129 -85 -112 -153 -87 -95 -163 -250 -302 103 -66 -25 -202 19 63 -198 -399 9
6014 9 -412 -475 -229 -8 174 -289 -15 -32 -188 -76 87 35 117 -297 -161 67 -72 -241 178 111 -244 -238 -3
6037 -3 -80 132 -181 61 -140 5 165 -251 93 20 24 21 16 109 -267 138 -164 -121 -211 6 79 7 165 108 -32
6062 -32 231 -26 173 59 -242 -47 190 -23 118 222 119 -158 239 93 -33 -111 -99 307 237 281 296 379
6084 379 40 330 81 247 193 127 139 140 -126 -161 29 169 41 -95 198 -30 98 -127 -34 124 -29 -85 -131
6107 -131 178 -82 -88 46 196 -182 29 305 14 -267 -34 -75 -181 -15 -163 100 -217 -55 -180 137 -118
6128 -118 -165 274 -137 -463 111 -65 65 -165 -515 137 49 -193 -45 87 -62 -142 -224 -190 49 -32 -140 -139 -450
6151 -450 -289 78 302 -178 -128 -219 66 -117 -136 127 170 -299 -308 33 -144 -25 -370 124 -281 -160 -278 -142
6173 -142 166 -16 36 61 9 41 30 63 164 -65 -28 227 -93 -309 -126 108 167 -156 332 244 -1 12 83 2
6197 2 -234 -84 176 126 20 210 199 -30 -155 6 149 -139 -269 85 27 186 105 283 -102 -204 49 -85
6219 -85 207 181 -94 -182 91 -181 -129 -113 459 -62 107 55 319 -249 116 -38 285 60 6 208 150 179 -82
6242 -82 314 170 -57 -127 -80 56 116 -69 -66 -177 30 -8 -151 -102 -39 -73 -130 -238 -159 120 208 30 -262 -170 130
6267 130 -92 -158 71 -121 -290 53 -223 -13 62 -106 -67 -78 -109 -442 176 -134 23 -54 -192 94 -95 -28
6289 -28 136 115 -43 -91 -99 -65 17 25 -85 195 -196 -14 54 -53 -49 -102 246 86 -152 -128 89 -55 -57 244 0
6314 0 93 23 83 -84 45 357 -70 214 9 169 323 187 14 55 307 218 39 118 232 348 382 302 438
6337 438 255 3 376 -15 -98 54 359 42 407 200 -36 -172 -118 180 292 29 151 410 45 30 -94
6358 -94 176 237 271 235 -18 -284 -298 14 284 -261 -273 -35 131 102 -18 348 57 1 -33 103 92 -124 130
6381 130 -65 -89 26 15 52 -158 -5 -193 164 -106 -335 -48 -41 -111 36 -26 45 109 -421 26 88 -462 -30
6404 -30 93 -239 -5 -348 -151 -42 57 -107 -97 -225 -62 50 -44 26 -316 59 -127 -109 -144 11 -80 -203 -220
6427 -220 -206 -139 -288 25 28 149 90 -244 -200 124 169 -281 -221 210 62 59 128 273 -11 14 1 73 107 244 -102
6452 -102 68 -69 255 154 37 -81 117 -117 39 -179 300 246 -32 123 102 64 -47 204 -21 35 110 -6
6474 -6 19 96 -246 -110 -9 129 107 215 -38 6 241 92 -217 154 172 -63 37 26 -28 -42 -131 -144 29 -300
6498 -300 14 -11 113 -107 63 -171 104 -14 46 -191 37 65 66 -210 27 34 -194 -31 16 76 -247 42 -142
6521 -142 -121 -7 108 -49 65 50 4 -15 12 -166 49 -96 -16 129 -113 122 228 101 -59 148 -196 -216
6543 -216 -248 151 -265 -158 -209 -107 -285 -55 -40 124 -149 -456 -184 108 80 166 134 -154 -82 -22 -10 11 -74 89
6567 89 124 235 -8 134 399 123 -169 -132 62 -227 125 441 58 417 97 28 40 70 -10 39 -96 131 -76
6590 -76 72 -51 -68 169 273 -86 52 219 160 258 -419 203 270 -150 -157 202 259 127 -60 212 118 -77 60
6613 60 -238 -93 311 -153 -191 363 -146 141 -187 -181 45 -28 111 -303 -18 139 -217 -26 -230 -81 -96 -123
6635 -123 -213 -38 17 -36 84 161 -304 5 -144 87 154 -264 -263 -68 -33 -260 -124 -3 -200 23 -10 234 -109
6658 -109 -349 -332 -40 3 -20 29 -50 -122 146 121 -22 -267 -7 238 212 195 72 66 81 -34 105 10 12 249 -22
6683 -22 392 -68 -66 201 20 141 192 -83 303 -327 -139 206 -92 -24 91 13 -146 123 18 -87 288 -26
6705 -26 225 -59 -17 158 72 330 255 -8 57 326 -33 131 148 201 69 20 -103 -36 57 228 129 39 33 -1 36
6730 36 210 -22 99 -100 169 108 87 173 157 349 138 110 210 288 -183 -310 67 -25 -69 -28 -139 -28 -64 -33
6754 -33 30 -355 -74 -51 -134 -269 -178 -133 -249 -123 -69 -88 -92 -91 -283 -12 -275 -129 -184 -129 -67 -189 -95 -112 -131 39
6780 39 79 -2 -81 -62 -53 -205 -336 9 166 65 9 132 184 50 -127 -38 138 -10 -207 -146 -47 -111 -136 134 127
6805 127 148 -128 -50 58 -232 -336 31 198 -318 -136 257 -16 282 177 -2 -55 -90 -81 92 41 -59 29 215
6828 215 21 116 79 -235 233 -71 112 53 -204 -25 38 -161 111 391 139 -66 2 201 35 147 154 106 31
6851 31 352 258 165 -94 -177 123 84 254 -4 6 319 -234 54 -112 -40 59 412 -98 58 -111 109 -186 53
6874 53 127 -229 200 -64 -49 -414 -82 -104 105 -352 143 -402 -57 -222 -153 10 -126 -299 -334 -223 -204 -224 -92
6897 -92 29 -59 -177 -181 -313 -192 -61 197 46 -12 110 16 -353 -147 -66 -19 8 -319 10 -131 -106 15 175
6920 175 -14 -193 374 368 -27 -277 -142 122 -19 -397 17 -80 -154 -75 167 60 -24 42 202 88 -31 -410
6942 -410 115 356 -82 -50 187 66 20 -292 -92 -33 -53 162 218 189 -71 151 21 43 -34 148 -64 165 -90
6965 -90 -1 225 -198 324 -126 207 -27 20 298 -76 42 -157 -25 266 -92 7 45 99 152 -109 -24 -407 -97
6988 -97 66 24 86 30 -57 -131 -92 142 -55 -115 -138 -60 -170 -53 -275 31 -21 -31 -120 -13 -69 144 -183 -194 -139
7013 -139 -13 -177 -331 27 -85 7 -222 -205 -94 164 -247 -99 -107 -28 -67 41 53 -362 46 144 -90 -134 21
7036 21 -76 -23 -73 -104 -6 -252 -137 -36 74 75 -259 -178 -42 -144 -32 -121 -131 -238 -166 -156 -52 -123 -4 -201 -191
7061 -191 139 104 -18 211 -231 150 -289 -355 -15 73 70 164 -94 314 96 -90 9 198 311 169 -28 106
7083 106 -28 -48 176 140 14 44 216 -87 45 108 324 57 178 -177 41 190 -150 -239 107 115 -10 -144
7105 -144 147 37 220 -209 115 -12 110 268 188 -184 24 194 92 -225 -201 -47 59 -181 -217 -246 -189 108
7127 108 136 -121 -12 -53 -67 42 338 233 24 -297 19 131 -195 45 -86 -66 -183 190 -6 0 -44 79
7149 79 -256 -98 113 -41 -285 -76 192 -109 -179 -82 -84 19 -157 -250 -8 -103 172 104 -246 49 393 270 -50
7172 -50 29 -21 -26 -14 -165 -232 32 -42 -36 -75 -87 111 -86 38 76 -160 19 151 116 45 79 -80 49 91 88 119 62
7199 62 49 -207 -59 -27 197 -91 87 200 127 218 428 63 -111 213 16 353 316 -254 87 78 203 -6 220
7222 220 207 47 -16 -216 105 91 71 82 -132 20 116 -98 -84 -43 -3 -69 18 346 -28 227 -15 51 59 135 -119
7247 -119 -223 325 46 63 -37 -54 141 28 -116 -23 -133 -45 -101 80 -11 133 -169 -187 -70 -97 119 -404 12
7270 12 -55 -381 -320 -179 -366 -79 -145 -157 -55 -31 -69 -284 -82 -111 -173 -256 -388 -20 -279 -73 -212 -107 98
7293 98 -163 -54 -221 21 -25 -324 -170 -128 -47 -33 72 -61 -127 352 -68 144 126 255 4 52 -102 -26 150
7316 150 8 59 287 167 -77 5 185 32 -132 -133 -153 79 215 180 83 102 32 -27 157 211 44 37 40 9 -103
7341 -103 59 120 198 83 59 -39 56 -19 85 274 -128 156 293 -13 46 49 223 -51 -124 212 114 27 322 -91
7365 -91 102 5 -235 192 5 235 -220 220 33 252 40 -427 -75 16 -187 61 -87 -55 171 -182 80
7386 80 -158 105 116 -268 60 -7 -132 -17 -339 18 21 166 -6 258 38 -54 -15 -88 -42 -296 102 50 -16 -177
7410 -177 -83 -180 -128 -277 86 -69 47 71 -328 -304 -254 -289 -102 91 -65 -228 64 106 -23 -279 -124 -134 124
7433 124 -59 -231 -238 0 -75 138 156 305 -241 -53 83 -144 49 -68 120 62 98 105 333 -22 -42 144 196
7456 196 -56 151 60 66 59 -233 -205 50 -6 33 64 128 43 370 -139 80 31 122 103 0 31 -53 109 -247 82
7481 82 232 21 52 134 -4 -202 -111 80 44 354 -387 -47 -205 -87 203 -143 -2 29 58 29 9 -32 -106 19
7505 19 -140 6 -55 87 -62 58 -99 -56 -73 -404 -193 -110 -370 -149 -111 97 -272 93 -61 -32 -247 27
7527 27 65 -363 -126 -346 41 -109 -9 -23 31 61 -228 -194 59 -8 62 -291 13 0 -175 -52 -65 -171 74
7550 74 241 6 -6 -177 -11 184 100 113 161 102 48 -82 70 -123 88 -333 -90 39 154 -48 -101 197 -86
7573 -86 -45 -47 -229 0 72 102 25 -57 -70 170 3 201 -96 -194 -16 248 212 159 6 279 409 -70 -7 41 25
7598 25 17 -172 232 88 -118 237 67 234 -100 55 218 -5 96 161 -29 125 92 40 163 344 306 130
7620 130 249 -118 -164 -33 100 54 155 18 33 -121 -73 -301 296 -340 45 -171 28 175 -145 -95 19 -209
7642 -209 21 21 -159 179 64 -425 -350 41 -133 63 -117 -188 93 -246 -59 126 43 143 186 73 -4 221
7664 221 -204 -80 -165 -39 17 125 113 -172 -24 82 -2 -13 183 232 -122 255 28 40 71 -237 149 157 107 216
7688 216 85 -76 -27 105 -326 15 -35 -166 86 104 62 -220 -134 130 -6 -17 75 -38 106 34 -36 -31 -173 43
7712 43 85 227 48 90 -140 292 37 -168 -151 78 -146 34 99 20 83 144 47 167 -96 -11 209 31 -172
7735 -172 -102 266 39 -171 -68 115 -254 -64 67 228 4 -8 -90 34 -5 32 140 -140 20 -246 -184 119
7757 119 -1 -172 10 157 400 45 20 -193 -65 68 154 -93 -23 185 73 -14 41 137 -111 -89 -46 29 -279
7780 -279 -261 -181 192 -97 68 39 24 -244 97 142 -121 -265 173 88 -118 -210 -289 245 172 149 -239 -320 -85 -5
7804 -5 70 -214 -77 -311 -77 -158 29 341 70 126 129 -50 -22 -107 4 -107 -59 35 153 203 220 23 27 112 136 94
7830 94 154 -135 71 260 -212 91 131 90 216 -52 184 -2 -126 -204 -124 29 46 -59 -104 -76 72 152 -164
7853 -164 304 -46 311 -23 53 156 22 -23 47 38 -296 -115 -97 -252 108 170 -143 -119 183 262 -35 -75 -65 -30
7877 -30 247 -160 -260 107 167 -137 190 149 -141 5 220 121 -110 -158 109 -22 -79 195 28 20 -152 -359 282
7900 282 -94 -200 -92 89 131 330 -280 29 -135 110 32 82 -2 -4 -280 -158 101 -32 -28 217 -386 -102 -86
7923 -86 -29 -191 11 46 -189 -153 -32 -190 126 -113 -91 12 -182 84 82 -36 -114 162 104 291 -194 213 125
7946 125 -57 0 -97 56 56 -64 -162 -46 124 126 -80 28 212 -10 3 15 -39 -263 164 128 18 -77 -303 142
7970 142 95 173 73 191 148 69 241 -323 231 338 77 3 216 184 140 83 127 88 -78 195 284 -208 -106 -239
7994 -239 -63 38 85 -72 87 13 -167 -50 -151 30 -66 -77 93 161 -193 -24 24 -46 90 73 5 111 -106
8017 -106 71 -55 -82 -132 -34 -88 -17 -25 -111 -252 151 304 -33 -165 -200 47 -101 -236 -158 -72 -201 -102 188 -106
8041 -106 -7 -171 142 159 60 110 -123 36 -527 -50 -210 -151 202 113 -262 -141 -65 67 209 -180 163 -210
8063 -210 -136 279 157 243 90 -303 291 56 -103 83 55 322 -333 -228 123 -141 -148 18 326 -145 64 118
8085 118 -29 -189 -159 175 101 -37 -214 -54 -43 16 295 -14 320 128 34 12 1 -114 -178 303 213 6 -210
8108 -210 -176 -29 -28 -56 171 -169 -75 -189 -68 -106 -70 -129 -128 -27 -59 -165 -8 -354 36 193 146 100 86 -77 -160
8133 -160 -177 403 300 -195 255 -373 185 -184 -183 -89 216 -177 200 296 -122 -130 -241 70 -14 68 16 -1 149 -93
8157 -93 -145 -79 -317 94 -26 137 -409 -109 155 -108 55 184 -115 425 94 -67 -78 209 8 223 208 194
8179 194 27 -31 98 -138 4 -16 327 282 134 0 -170 -17
8191a7
$$ Imaginary data points
##PAGE= N=2
##DATA TABLE= (X++(I..I)), XYDATA
0 0 0 0 0 0 0 0 0 8 -8 8 -8 8 -16 16 -16 24 -32 32 -40 48 -56 64 -72 85 -96 110 -126 142 -161 182 -205
31 -205 228 -257 287 -319 356 -394 439 -485 539 -596 659 -731 809 -897 995 -1108 1236 -1385
49 -1385 1559 -1766 2015 -2329 2732 -3268 4020 -5160 7072 -10880 21352 -108282 -349270 -60971
63 -60971 109657 -68458 -160503 37451 85734 -73018 -95366 15954 -36402 -113669 -13388
74 -13388 34443 -130610 -165648 48590 124659 -57899 -112321 21975 4005 -151657 -108316
85 -108316 49120 15776 -91737 -20386 57475 -51085 -133805 -31645 32115 -53831 -88037
96 -88037 -19657 -18962 -61476 -14262 22204 -64050 -108741 -19961 2758 -105077 -113713 21260
108 21260 56834 -49007 -86733 -35178 -46450 -92753 -63651 -26904 -49603 -40729 11900 -14095
120 -14095 -88402 -67301 -7701 -45249 -97608 -52793 -19428 -67503 -56528 33498 21623 -79812
132 -79812 -70621 5711 -46107 -137422 -65697 50668 15891 -53235 -10200 15315 -57942 -67787
144 -67787 12623 -2980 -88412 -42252 61093 9943 -79768 2777 101340 8015 -102163 -34977
156 -34977 41428 -17481 -39862 57861 82139 -10265 -24298 44871 20455 -48821 3252 82833
168 82833 30549 -33121 32031 90215 30626 -1826 60547 62959 -21563 -21648 65836 74377 19828
181 19828 46107 100416 52679 -15513 19346 72269 43916 20163 63199 78180 33944 29971
193 29971 73036 64786 20055 28419 59677 41567 21936 57186 85765 60992 39442 49272 40735
206 40735 14387 22275 49932 49628 43033 59303 64302 40267 28630 37543 29057 14557 27764
219 27764 41542 29156 28520 56825 58746 24531 16122 33240 17190 -12665 7048 44362 36398
232 36398 19088 38264 44416 6054 -10678 16133 17346 -13268 -2529 36330 27074 -4310 13324
245 13324 38557 6200 -29179 -6148 13002 -15002 -21163 21906 34025 -3978 -13374 11870
257 11870 -2164 -39217 -25225 10611 -889 -23244 73 20256 -9168 -30474 -8461 -3375
269 -3375 -35027 -38732 -5194 724 -20331 -12360 9767 -8254 -39172 -32666 -16582 -29920 -37039
282 -37039 -12842 1208 -15029 -21999 -10397 -17614 -38956 -38423 -24430 -27840 -33739 -18468 -5331
295 -5331 -15300 -24587 -20514 -24784 -41201 -43001 -30694 -25811 -25760 -16001 -9639 -19615 -28940 -28238 -31957
310 -31957 -41850 -38330 -25196 -21966 -23859 -16009 -10668 -21465 -32289 -31242 -32567 -38329 -33783 -19878
324 -19878 -14755 -16665 -13234 -11821 -22796 -33526 -30700 -28451 -31673 -25530 -10064 -4561 -11225 -12403
338 -12403 -9900 -19209 -31019 -28133 -18778 -18342 -15568 -2809 3647 -3253 -8316 -7860 -14108 -24137 -20787
353 -20787 -8897 -4335 -2636 6287 12366 5125 -5590 -6410 -5669 -10899 -10636 839 10362 11618 12476
368 12476 15427 12518 3693 -1206 -1499 -701 3693 12868 19893 20929 20852 19301 14115 7365 6091 9152
384 9152 11875 15082 20767 24896 26209 24375 20714 15243 11224 11733 15835 20499 24992 29520 30216 25499
400 25499 19421 16427 15399 14728 16450 21999 26832 28941 29465 29116 25192 18299 11324 9420 12740 18455
416 18455 23782 29256 32080 29683 22634 15623 11919 9514 8519 10644 15806 21288 25389 27075 24855
431 24855 18130 9926 4440 2325 2654 7309 15150 21048 20567 16297 12961 9684 4705 -496 -2055
446 -2055 620 5112 7844 10923 13424 12585 6635 -1021 -5438 -5645 -3496 -521 3025 4480 3431 2120
462 2120 127 -3030 -6350 -7355 -6986 -6340 -4601 -843 1134 -1297 -4807 -7813 -12084 -15347 -12614 -5857
478 -5857 -3642 -5149 -4360 -2589 -6229 -12666 -15212 -14610 -15250 -14624 -9547 -5584 -4779 -2777 -2916 -10865 -20681
495 -20681 -20063 -13683 -13891 -16702 -10935 -1978 -3105 -9933 -9992 -8815 -15219 -21602 -18647 -13917 -12632 -8291
511 -8291 -597 -434 -10228 -16110 -13809 -14059 -18554 -17066 -9696 -6305 -7941 -5660 -2604 -6142 -11996 -13068
527 -13068 -13419 -18615 -19305 -8228 2209 -733 -7309 -6318 -4218 -10457 -17451 -13866 -6581 -6027 -8067
542 -8067 -5281 -2170 -3285 -4936 -3365 -6224 -13428 -13367 -4683 -1173 -4263 -2525 4099 1538 -9812
557 -9812 -11735 -4532 -3287 -6516 -1267 5872 561 -6960 -433 5536 -3729 -11994 -2861 5864 -1263
572 -1263 -6126 5088 13016 4188 -3551 -515 -1831 -8452 -3455 8908 9081 2210 8404 14951 3147
587 3147 -9634 -1671 9275 1721 -5604 4999 15116 9271 5142 13026 12853 -239 -5676 2715
601 2715 4733 -303 6287 20175 19709 7779 4108 8192 5232 -436 3648 10569 9801 7382 11763
616 11763 15309 10261 7555 11344 10795 1883 -2736 5935 16012 15839 11339 12674 13669 5517 -2128
631 -2128 2073 12156 12884 8919 11374 13939 7453 3030 10403 14265 4019 -1902 6740 12683 5918
646 5918 6755 18512 17457 729 -4535 4492 4242 -2836 6901 21250 12322 -2630 3669 13256 -161
661 -161 -11182 4210 14802 -1080 -9224 8787 17043 1214 -3508 9848 4933 -16284 -14186
674 -14186 6892 7191 -4513 4801 16851 28 -18766 -7558 5313 -5698 -12667 3046 8621
687 8621 -8542 -12009 6469 7823 -11141 -14177 -1502 -6020 -19052 -9214 10966 7323 -8563
700 -8563 -8662 -3606 -12829 -19319 -7719 1406 -4546 -8636 -2322 -2791 -11116 -10847 -2594 -5356 -15268 -15033
716 -15033 -6157 -4186 -6739 -2896 1832 -3215 -14148 -17279 -11935 -8547 -7367 -3956 1055 226 -7816
731 -7816 -12954 -8630 -4813 -8418 -10725 -5151 -2677 -7924 -8241 1237 4431 -5800 -10803 -6858 -9261
746 -9261 -14955 -5758 8729 5279 -6291 -3467 2357 -9348 -17698 -2411 9935 -3202 -12373 1095
760 1095 9756 -3992 -9196 6160 7165 -12203 -14703 3239 5976 -4684 2459 15463 4207
773 4207 -13537 -6123 5974 -3527 -9451 8273 16601 -1248 -8529 7556 11201 -6921 -8351 8479
787 8479 7340 -9303 -4326 14277 12245 -1199 2873 10143 -2846 -13323 -627 11090 3793
800 3793 1300 12564 11485 -4338 -6175 7232 6930 -4276 -2041 8312 5556 -1671 5163 13753
814 13753 6917 -3177 -1627 1739 -2704 -1804 6975 11526 6848 2736 2655 949 -1397 131 2881
829 2881 2923 2986 3844 4184 4272 4845 3825 1641 546 -214 -2117 14 6635 8764 4363 3225 5313 962
847 962 -6539 -2588 6549 5309 -269 4621 10023 2387 -4292 2727 7001 -1875 -5520 3842 6914
862 6914 -422 1808 11741 7786 -4703 -3203 4370 -1860 -7436 4488 14710 4574 -4063 5354
876 5354 8803 -4077 -8095 3900 6403 -3421 -2005 9580 7743 -1731 2321 8625 -1305 -10666
890 -10666 -1427 7022 160 -2692 8669 11787 -1469 -6332 1785 1796 -6315 -2811 6361 3352 -3408
905 -3408 1909 7511 1173 -5453 -1092 767 -5190 -6251 1947 5368 1342 1156 2546 -2599 -7850
920 -7850 -4235 443 -1696 -3847 591 2789 -965 -3300 -1336 -2088 -5176 -4918 -3818 -4123 -2128 1953
936 1953 1327 -3116 -4511 -3828 -5181 -7221 -4449 -2161 -2855 -1890 681 -1111 -5820 -5594 -3409 -6225
952 -6225 -9367 -4890 605 -965 -3267 -252 -920 -6846 -7518 -4112 -5478 -8797 -4532 2243 220 -4749
968 -4749 -1821 1191 -4911 -10212 -7089 -3048 -4584 -3345 1904 1765 -3548 -2989 -40 -3988 -8624 -5099
984 -5099 386 -2026 -4306 956 4244 71 -3318 -1655 -2740 -5966 -3812 1827 1540 -871 1243
999 1243 3627 -192 -3773 -1045 1106 -1498 -1935 1926 3190 1395 2459 4568 923 -3613 -2199
1014 -2199 2144 1272 562 4081 6400 3677 913 1678 1496 -280 506 2233 1845 2073 5090 7179 4521
1031 4521 1241 977 1199 -376 -297 3260 5060 4704 5202 4764 2464 1276 2034 1768 -411 507 3613
1048 3613 5032 4604 4970 5355 2099 -511 -222 716 666 1641 4432 5244 3365 1666 2571 2084 -111 -1366
1066 -1366 25 844 1699 3753 4210 3295 1340 858 -642 -2205 -1344 1309 2152 1368 1586 2528 1878 298
1084 298 -782 -1054 -1532 -1234 410 1407 1840 2593 2183 99 -1799 -2237 -1086 -1471 -513 1057 1948 1034
1102 1034 380 1156 98 -1965 -2955 -1510 -471 -108 692 2156 2418 594 -1432 -1825 -1603 -1867 -1541
1119 -1541 32 1192 1492 1748 1367 -39 -1518 -1669 -1379 -2117 -1687 1036 2678 2172 280 596 458
1136 458 -1641 -2989 -1372 348 121 294 1478 2364 1074 -478 -1083 -1623 -2166 -1141 -39 761 1463
1153 1463 2138 1025 -732 -1666 -1039 -1002 -2301 -1931 1001 1660 60 -360 939 188 -2529 -3489 -1625
1170 -1625 -769 -832 -178 926 1201 -361 -1438 -2153 -2771 -2248 -1393 -1540 -1094 -436 725 135 -1665 -2598
1188 -2598 -2072 -2225 -3702 -3847 -1126 956 99 -1422 -1434 -1114 -2982 -5023 -3974 -936 -1245 -2122 -1168
1205 -1168 201 -540 -2689 -2585 -1858 -3024 -4208 -2664 -1028 -596 -297 756 -876 -3560 -3634 -1728 -2717
1222 -2717 -3585 -907 2301 342 -3180 -1091 1553 -1081 -4766 -2013 662 -968 -2786 646 3327
1237 3327 715 -1223 -26 -763 -3685 -2119 1726 1791 -105 1831 3605 155 -3089 -110 3018 -92
1253 -92 -2272 1834 4140 957 -484 3949 4749 94 -2505 535 1937 -176 1504 5359 5166 1873
1269 1873 1133 1885 770 -588 2163 4461 2209 468 3390 5127 2279 803 3079 3490 -212 -1838
1285 -1838 2214 5309 4006 2770 4056 3516 252 -1609 744 2896 2069 2006 3847 3622 1019 669
1301 669 2619 2337 420 -217 1904 1387 61 2301 5476 3578 -868 -947 924 -867 -2633 1161
1317 1161 5712 3108 -1354 82 2302 -518 -2738 1088 2673 -1831 -3103 1388 3020 -86 -398
1332 -398 2687 397 -5439 -4606 1099 1379 -1433 847 3791 -69 -5021 -2883 1057 -1208 -3435 212
1348 212 1971 -2016 -3463 998 2560 -1917 -3596 -327 -979 -4891 -3190 2403 3017 -686 -1352 16
1364 16 -2805 -5809 -2738 1847 1079 -1960 -537 707 -1794 -3374 228 2107 -1553 -4564 -2612 278
1380 278 -931 -522 3475 2893 -2631 -5770 -2680 -404 -1343 127 3248 2119 -3483 -3813 989 785
1396 785 -2592 -1756 1167 -686 -4504 -1152 4242 2713 -2440 -1607 -206 -3191 -5173 100 3891 1066
1412 1066 -1264 1030 997 -4026 -4200 1293 2060 -2505 -3067 1544 1149 -2577 -1016 3227 1030 -4737
1428 -4737 -3838 -475 -1098 -1956 1926 4195 -230 -3911 -2224 -910 -3083 -2371 1417 2309 -1661 -3070
1444 -3070 497 1042 -2273 -2139 366 -1118 -4460 -2861 1335 2196 177 -296 813 -1977 -4918 -2966
1460 -2966 235 518 -331 1096 1627 -918 -3095 -1033 948 -981 -2377 -307 1103 -843 -1578 1940
1476 1940 3856 205 -3039 -1576 -528 -2267 -592 4163 4964 236 -1309 768 333 -2305 -59
1491 -59 3996 2397 -2017 -544 3974 3225 307 2225 3209 -950 -3388 890 4807 2853 2216 4706
1507 4706 3518 -1572 -2075 2552 3811 660 1498 4745 3316 39 2209 5256 2589 -484 1131
1522 1131 2824 1508 826 4842 6208 2600 740 2743 1996 -583 211 3790 4400 2067 2251 3769
1538 3769 2098 -8 893 2323 1147 -1 1293 2913 2748 2128 3015 2586 129 -1614 -767 583
1554 583 1166 1644 2468 2573 1228 -519 -791 -221 -280 -755 -553 738 656 316 811 1137 -126 -1864 -1789
1573 -1789 -1272 -2061 -1703 789 1964 -52 -1465 -596 -1330 -3779 -3581 -238 386 -1861 -1436 545 -500
1590 -500 -3179 -2291 -1042 -2601 -4325 -1998 -256 -1669 -1990 535 -142 -3713 -4596 -2446 -1966 -3846
1606 -3846 -2152 845 -4 -2919 -2367 -313 -2531 -4681 -2920 -1204 -2153 -2891 -58 673 -1628 -2353
1622 -2353 -1205 -2409 -4464 -3068 -438 -470 -1615 -498 799 -1329 -3287 -1953 -1432 -2380 -2346 -322
1638 -322 401 -408 -267 213 -793 -2310 -2035 -1504 -1614 -1017 319 1263 167 135 220 -1230 -2054 -1424 -665
1657 -665 -431 282 1254 1106 457 86 53 -1104 -1496 -670 65 88 966 1853 1704 49 -274 340 -669 -1535
1677 -1535 -140 1353 1133 1048 1951 1551 -244 -845 109 -127 -855 -118 1661 2147 936 1395 1516 7
1695 7 -1395 -236 383 -434 251 2127 2275 406 905 1096 -77 -1427 -443 1052 798 618 1900 2350
1713 2350 913 -92 602 91 -882 -201 1328 1333 946 1970 2358 719 -295 265 287 -181 127 1878
1731 1878 2142 1787 1571 2065 880 -460 100 713 755 1022 2164 2823 2304 1854 1448 628 55 525 1110
1750 1110 1176 1601 2668 3099 1999 1416 1204 878 240 373 1333 1873 2270 2606 2568 1698 930 575 9 128
1770 128 849 1871 1995 1769 2398 2060 975 250 296 526 -133 192 1564 1886 1419 1419 767 15 -281 17
1790 17 -112 -273 565 1475 1269 447 230 411 -595 -1566 -1191 -344 -297 372 451 396 -356 -954 -1438 -1798 -2092
1811 -2092 -1496 -601 -779 -438 -368 -270 -1251 -2291 -2338 -1723 -2100 -2672 -1624 -441 -705 -1363 -1814 -1771 -2943 -3690
1831 -3690 -3150 -2268 -1723 -1767 -1110 -937 -2211 -2846 -2751 -3008 -3515 -2970 -2007 -1657 -1882 -1550 -834 -1688 -3362 -3166
1851 -3166 -2444 -2939 -3146 -2057 -332 -1085 -1936 -1420 -1392 -2612 -3262 -2188 -1269 -1754 -1703 -209 -298 -1774 -1831
1870 -1831 -750 -1354 -2644 -1822 -569 -316 -807 236 867 -698 -2020 -1156 -519 -1198 -604 925 1582
1887 1582 461 -89 589 714 -521 -431 477 721 88 1097 1979 1659 1036 790 1199 186 -668 58 1703
1906 1703 2286 1661 1727 1962 1225 274 315 1271 1328 660 1274 2203 2400 1716 1758 2510 1007 -455 393 2063
1926 2063 2004 1475 3050 3928 1924 115 1054 1636 120 390 2713 2798 487 1173 2954 2167 161 570
1944 570 2100 606 -1243 1289 3414 2222 573 1963 2132 -805 -1613 1197 2896 660 555 2678
1960 2678 2198 -1008 -415 2189 1108 -865 -137 1564 630 -318 1528 2983 979 -1565 -227 630
1976 630 -1139 -1138 1940 2701 366 -937 360 393 -1437 -695 1036 1039 -558 -289 941 742 -222 -16 997
1995 997 -188 -2018 -1312 539 932 575 1449 1779 -401 -2141 -1592 321 225 -797 789 1354 -516
2012 -516 -1595 144 1568 215 -2010 -943 57 -1178 -1121 1710 2626 221 -1657 -612 -686 -2547
2028 -2547 -1364 1915 1415 -1581 -1194 914 -227 -2395 -861 1473 -554 -3354 -1051 1368 -310
2043 -310 -1704 1069 1516 -2210 -3929 -1125 756 -1660 -1050 1768 880 -2835 -2864 77 -514 -3044 -1182
2060 -1182 1159 -1279 -4048 -1107 1730 -538 -2739 -981 -583 -3548 -3792 -223 1427 -688 -1823
2075 -1823 -211 -1456 -3601 -2705 133 244 -2358 -1938 -327 -1097 -2611 -1048 641 -1154 -3486 -2370
2091 -2370 -522 -1114 -1501 518 1129 -854 -3199 -2056 -743 -1229 -1635 440 1069 -828 -1792 -611 219
2108 219 -1109 -1106 136 138 -1969 -1773 1066 1842 88 -66 866 -143 -2640 -1778 1683 2192 221 389
2126 389 2010 244 -1969 229 2652 1057 -784 68 2081 622 -6 2581 3332 98 -1425 1247
2142 1247 1578 -305 1022 4040 3326 22 275 2484 1771 -591 910 3430 1915 161 1615 3493
2158 3493 1787 526 2153 2811 304 -901 1829 3004 1234 1747 3545 2491 -445 -629 2295 2198
2174 2198 899 1919 3155 1612 -322 1135 2409 1435 -101 1044 1586 200 -130 2020 2957 1335
2190 1335 -87 142 194 -524 -126 1582 2160 950 -215 479 624 -393 -580 691 553 -624 -432 1212
2208 1212 1114 -55 -399 586 -312 -1917 -1503 238 615 -319 60 1285 -228 -2197 -1326 -320 -980 -1580
2226 -1580 -343 620 -635 -1481 77 587 -1355 -1899 -349 -486 -2323 -1564 1283 581 -1226 -1207 -85
2243 -85 -1547 -2671 -978 496 -360 -1376 -249 456 -1105 -2020 -474 -544 -2063 -1857 -213 195 -966
2260 -966 -436 461 -449 -2251 -1415 -542 -886 -1127 -243 562 -7 -1071 -562 -436 -1370 -1410 -727 -19 -630 -492
2280 -492 -51 470 -329 -645 -692 -914 -1195 -987 -473 203 325 -126 -59 -529 -1286 -1176 -819 -394 -779 -442 82
2301 82 398 -465 -639 -454 -215 -1444 -1670 -316 53 -170 -232 475 -127 -1018 -1233 -645 -932 -1147 -336 672
2321 672 249 -377 -10 98 -1131 -1547 11 -141 -912 -852 462 726 -495 -384 15 -382 -1415 -789 290
2340 290 -113 -275 845 582 -364 -929 -246 -161 -853 -528 733 618 -55 511 753 299 -541 -443 345 -154
2360 -154 -2 812 1685 829 470 347 632 -16 111 350 579 633 1154 1561 1159 1054 880 393 14 255
2380 255 907 1412 1485 1724 1701 1390 1044 638 845 644 878 981 1428 1932 2121 1993 1714 888 925 758 886
2401 886 1250 1675 1494 1256 1601 1467 1051 669 916 760 731 1165 1145 1520 1282 1149 1372 364 186 466
2421 466 794 832 1105 1377 1134 843 672 523 38 -740 -110 154 397 492 959 635 170 -268 -440 -572 -797
2442 -797 -151 -128 127 -24 -214 35 -499 -921 -898 -1116 -1255 -1063 -647 115 -381 -708 -747 -1162 -1399 -1985 -1331
2463 -1331 -958 -1113 -893 -753 -884 -1296 -1554 -1536 -1602 -1929 -1711 -1290 -955 -1020 -945 -1170 -1587 -2035 -1778 -1643 -1845
2484 -1845 -1623 -1251 -806 -1209 -1090 -1260 -1676 -1661 -1945 -1858 -1233 -1186 -890 -404 -702 -867 -1321 -1166 -1197 -1171 -1144 -405
2506 -405 -602 -625 -472 -392 -609 -1216 -999 -695 -979 -458 126 573 541 -349 42 -76 -454 -916 7 385 145
2527 145 210 615 792 100 -178 366 263 -612 91 889 758 699 869 1241 540 -413 13 706 350 384 1188
2548 1188 1468 911 154 1110 974 265 115 1115 1088 517 483 1655 1579 832 498 825 799 -408 609 1512
2568 1512 1487 1043 1134 1443 348 -331 470 1068 486 205 931 1669 595 420 953 1289 178 -573 615
2587 615 905 570 639 1675 1465 -151 -371 553 367 -142 479 1262 790 -153 541 1246 142 -409 441
2606 441 781 -166 -431 628 1255 703 -127 848 441 -552 -655 365 1016 38 398 1504 1028 -388 -243
2625 -243 996 495 -518 -387 964 581 -314 450 1506 436 -578 -100 113 -299 -542 1063 2070
2642 2070 448 -484 210 549 -609 -521 769 803 -467 -881 604 1122 -494 -248 756 -59 -1498 -1035
2660 -1035 780 974 -321 173 1009 -330 -1944 -759 216 -169 -831 357 850 -847 -1588 -17 747
2677 747 -1377 -1613 -326 -159 -1841 -1380 611 762 -1497 -1718 -211 -1345 -2267 -935 752 -160 -1733
2694 -1733 -836 -219 -1667 -2153 -764 -206 -1445 -2356 -666 -15 -1669 -1752 133 -363 -2647 -2490 -674
2711 -674 -284 -1646 -1084 150 -637 -2572 -1755 -150 -1021 -1571 -770 300 -726 -1874 -705 -69 -803
2728 -803 -1550 -612 -206 -1520 -1807 61 932 -549 -630 -379 -124 -1719 -1503 516 660 -498 -546 837
2746 837 419 -1208 -351 1430 650 -801 -578 1094 197 -432 781 2060 244 -1092 99 1381 251
2763 251 174 1816 2609 296 -755 1279 1566 286 315 1978 1562 -309 226 2386 1894 181 939 2404
2781 2404 631 -679 1023 2587 1787 453 1629 2325 638 -276 1611 2264 1122 605 1947 1940 410
2798 410 405 2236 1971 324 130 1420 1020 -76 1089 2571 1592 -170 324 1303 629 -455 1215 2244
2816 2244 823 -426 656 1234 417 -209 1126 1471 -394 -967 1077 1601 196 57 890 563 -972
2833 -972 -883 559 858 -489 -54 607 76 -1355 -785 600 -4 -922 -265 459 -530 -1392 -142 567 -269
2852 -269 -1508 -588 -185 -1466 -1283 9 280 -1049 -1103 -404 -365 -1715 -1017 174 -178 -1638 -1346 17
2870 17 -372 -1185 -529 394 -892 -2107 -1071 188 -734 -1244 -120 110 -785 -2097 -598 -224 -945 -1104
2888 -1104 27 -43 -1034 -710 326 -89 -1264 -1134 -69 -506 -1444 -320 330 88 -879 -439 -282 -705
2906 -705 -1269 -246 277 -141 -686 130 26 -949 -1265 -47 259 -520 -668 -20 -5 -357 -225 276 -14 -904
2926 -904 -1112 -59 -93 -638 -58 490 27 -1017 -208 55 7 -637 -398 365 -378 -624 166 595 -200 -575
2946 -575 -135 290 -501 -709 336 594 -231 -427 0 78 -775 -519 56 -246 -428 -225 581 -67 -236 87
2966 87 629 -42 -912 -230 286 -205 -219 501 611 -241 -246 162 -32 -306 197 1063 351 -153 152 590 382
2987 382 -105 349 491 451 -343 550 1026 711 613 1015 737 381 87 644 748 594 671 931 1105 557 696
3008 696 927 572 442 920 1194 1314 1003 985 861 950 425 458 891 901 519 927 1183 937 889 619 720 759
3030 759 617 711 1063 1057 757 819 504 678 373 338 746 732 500 810 651 606 658 836 362 -57 57 392 273
3053 273 16 246 458 604 40 -78 276 -54 -192 -160 665 -11 54 506 250 -587 -444 -206 -548 -796 -601
3074 -601 -136 -351 -623 -384 -362 -578 -964 -858 -711 -596 -1029 -458 -477 -587 -687 -511 -825 -1314 -1027 -1017 -989
3095 -989 -1039 -1108 -754 -780 -919 -1120 -866 -838 -927 -934 -597 -711 -955 -483 -805 -706 -890 -1012 -1295 -1018 -761 -462 -766
3118 -766 -550 -454 -515 -608 -826 -539 -783 -485 -450 -310 -427 -175 -317 -622 -610 -669 -505 -167 -255 226 -209 -236 -88
3141 -88 -41 -260 -319 -197 -101 -39 130 601 -91 262 91 324 -243 -194 137 411 397 33 785 914 330 8
3163 8 200 257 -40 292 714 662 570 497 915 541 110 105 332 452 340 607 886 681 605 502 710 166 -116
3186 -116 549 726 483 301 808 611 297 61 469 632 -82 159 307 596 620 471 362 374 -9 32 -16
3207 -16 42 75 268 935 260 108 82 356 -136 -747 33 317 2 -21 454 507 -32 -320 49 -185 -444 -123
3229 -123 695 196 74 216 548 -168 -607 -32 325 -122 -60 370 766 2 -108 274 270 -423 -287 190 250
3250 250 -224 120 787 581 -153 -528 75 -46 -204 112 621 215 -315 208 871 162 -270 232 424 -255
3270 -255 -420 517 819 42 -65 352 6 -77 -119 315 462 92 312 761 380 -289 -671 181 278 -333 -109
3291 -109 452 260 -207 203 846 211 -685 -248 112 -291 -480 456 866 -316 -549 -60 317 -653 -627 412
3311 412 409 -397 -354 388 -315 -442 -478 280 -461 -1279 -746 142 -235 -304 -103 92 -927 -1353 -637 -146 -828
3332 -828 -848 294 -12 -846 -950 -100 -427 -1202 -1121 -293 -544 -1020 -815 349 -237 -780 -876 -473 -713 -1214
3352 -1214 -739 390 -192 -829 -434 -46 -534 -918 -361 -144 -657 -843 -94 -19 -527 -558 328 76 -1046 -974
3372 -974 -13 133 -373 75 614 78 -579 -469 343 216 -310 362 607 -61 -483 361 919 167 -157 311
3392 311 593 -672 -341 763 1174 433 -227 710 493 -272 -198 1300 860 60 308 936 647 -40 349
3411 349 1428 379 -174 482 1260 626 381 1236 1606 -35 -52 559 698 -89 328 1040 1339 114 -64
3430 -64 759 847 -31 165 1216 481 -35 123 833 520 262 574 981 4 -546 117 836 337 173 341
3450 341 348 -552 -609 346 239 -184 -325 186 330 -741 -267 386 295 -619 -676 43 -150 -597 -116 732 135
3471 135 -692 -519 -52 -471 -534 61 465 -356 -900 -341 -54 -658 -604 7 275 -813 -953 102 109 -378 -263
3492 -263 272 -94 -968 -467 -84 156 -556 -135 133 -211 -848 -358 139 100 -517 -363 30 -361 -423 83 525
3513 525 -234 -578 -330 106 -417 -367 628 697 -66 -287 -16 156 -731 169 440 165 -362 239 617 15 -238
3534 -238 164 372 -193 -398 86 475 97 -127 457 901 -263 -441 115 503 -249 -240 455 121 -456 -119
3554 -119 522 -46 -316 -282 394 125 -38 -24 453 -102 -301 -77 161 -326 -426 487 305 -305 -506 237 67
3575 67 -257 -278 294 -70 -80 -285 -26 51 -762 -131 227 -121 -236 -558 118 -19 -506 41 148 -215 -453
3596 -453 -299 -303 -475 -479 -58 -60 -40 -128 127 9 -115 -537 -85 148 -500 -543 363 191 -204 117 147 -335 -444
3619 -444 -120 80 126 62 -8 354 -219 -464 106 45 -458 -232 263 216 -132 93 687 327 391 246 251 197 189 508
3643 508 595 378 645 335 288 377 245 107 497 341 561 289 554 177 223 521 538 428 269 808 530 343
3665 343 91 393 752 39 208 685 423 409 240 367 461 60 218 391 237 281 163 526 103 82 87 72
3687 72 460 384 -206 194 -261 -146 668 184 226 -102 103 196 -157 -325 -129 -167 -110 214 -67 -160 -116 -292 -162
3710 -162 -210 -421 -557 -128 -73 -211 -270 -314 -285 -404 -268 -274 -339 -483 -213 -234 -203 -416 -205 -504 -376 -484 -117
3733 -117 -348 -412 -474 -150 -188 -411 -212 -31 -330 -164 -386 -299 -338 -340 -196 -102 -238 -194 -276 -129 -211 -214 -353 -68
3757 -68 -65 -146 196 127 -304 -215 73 -59 -1 -61 386 238 360 116 -58 306 236 -218 312 140 -18 116 296
3780 296 6 210 284 64 145 -43 -131 197 420 281 79 193 -1 335 254 80 -102 77 255 344 -169 212
3802 212 130 191 82 102 157 -31 95 204 422 139 123 241 160 93 285 25 212 -26 22 149 245 -242 -360
3825 -360 -118 -128 -93 41 -467 238 -8 -325 -216 82 -68 -213 -317 -339 -381 -187 -27 -358 -299 -177 -124 -253
3847 -253 -370 -378 -151 -190 -260 327 251 -111 -399 -1 -146 -579 -268 -88 -22 -110 -252 144 -58 -91 -151 -396 -209
3870 -209 -341 50 276 -18 -70 134 175 -135 -214 164 87 -322 -141 108 175 -70 232 54 -223 -132 -47 22 302
3893 302 -10 277 235 88 -3 148 288 198 -245 343 620 254 205 383 484 121 73 540 777 338 226 583
3915 583 677 55 276 459 358 -33 93 316 159 225 262 444 530 -196 369 177 -207 -70 105 277 307 -21
3937 -21 154 33 -229 -217 256 160 45 -50 322 345 -257 -22 -10 -183 -581 3 -55 -90 -552 -165 328 -63 -471
3960 -471 -174 24 -432 -371 11 -11 -341 -407 -190 -248 -350 -505 -98 -97 -166 -437 -191 -201 -891 -161 -86 -448 -956
3983 -956 -373 -85 -326 -374 -111 -221 -411 -639 -244 -87 -475 -218 76 -154 -446 -302 71 -160 -252 -367 98
4004 98 -83 -324 -221 295 -96 -529 -167 -255 -87 -451 84 523 156 -115 -26 438 -266 -262 222 322 54 -382
4026 -382 98 672 -199 -95 239 792 -91 -154 450 296 -50 49 839 251 16 -65 439 85 -353 153 554
4047 554 55 -62 398 900 73 -250 581 467 166 -108 437 452 249 150 325 326 -422 -176 357 178 -158
4068 -158 -10 510 -7 -297 99 542 29 -9 4 239 250 -208 476 -28 -228 -682 -15 164 -371 -419 300
4089 300 196 -529 -157 -159 170 -485 -260 -43 -215 -300 -228 167 56 -423 -96 27 -453 -648 -79 252 -76
4110 -76 -253 -99 -102 -384 -581 137 152 -93 -289 244 52 -335 -356 516 204 -245 -425 -141 -304 -556 80 619
4132 619 214 -548 2 106 223 -76 328 415 100 -320 377 295 47 -53 288 450 -73 129 424 436 100
4153 100 1 376 265 -20 130 591 446 38 412 632 285 45 156 359 372 -128 -141 440 139 -271 305
4174 305 309 117 -171 318 418 -189 -42 356 688 -41 -319 147 22 -311 -379 146 202 -239 232 99 0 58
4196 58 -97 -138 -12 -407 -216 333 -274 -368 -85 156 -291 -220 48 86 -137 -440 -67 -313 -859 -335 -150 -190
4218 -190 -274 -217 -256 -312 -592 -736 -82 13 -165 -177 -189 -471 -471 -121 204 -236 -624 -232 209 -758 -630 -94 148
4241 148 -401 -270 153 -8 -263 -359 -162 -70 -256 -249 -60 75 -295 -287 243 -27 -593 -57 -7 -48 -265 106 244
4264 244 -37 -256 58 165 -93 -84 229 6 59 -108 230 491 164 102 309 122 218 135 264 299 284 420 254
4287 254 326 140 99 414 409 85 47 462 129 246 236 711 499 31 181 264 142 207 212 388 313 35 256 433
4311 433 396 420 249 27 18 201 486 108 291 229 57 117 7 129 209 138 192 121 -97 -12 -395 -69 -138 -254
4335 -254 87 -28 201 -319 -341 -230 -215 -32 -54 -230 -132 8 -222 113 -224 -29 -85 -94 -263 -273 178 -140 -344
4358 -344 -260 171 -268 -221 -315 -13 -109 -391 -192 -192 -172 -172 150 -130 -448 -28 5 -240 -118 -59 -135 -291 173 -5
4382 -5 -59 -19 26 -223 -175 -73 -15 -211 -28 15 -220 -111 101 121 29 -98 130 16 -40 -371 76 248 84 44
4406 44 15 47 -366 223 93 222 73 97 -174 -154 -153 -8 173 189 134 58 -21 29 -334 -73 -312 -78 -156 294
4430 294 199 -91 89 -213 -220 -227 -130 -125 -21 -85 -89 200 -290 -102 -190 295 -17 44 -245 -110 47 -235 -68 -139 -102
4455 -102 -236 -87 -282 27 -147 -273 -163 -110 -312 -494 -379 -400 -93 -57 -292 -416 -79 -209 -232 59 28 -183
4477 -183 -245 -296 -279 9 -493 -156 -251 -323 92 -167 -296 -115 -267 -302 -105 -72 -94 -105 142 -211 -164 -110 -9 -189
4501 -189 -99 -162 0 -131 62 23 -43 -141 60 -20 48 120 -111 112 25 22 180 283 199 -100 85 169 72 256 -10
4526 -10 170 408 84 187 335 176 213 313 661 -3 286 296 472 279 146 580 321 229 495 32 352
4547 352 156 410 518 58 -59 205 231 138 311 605 210 317 46 110 156 53 100 289 49 73 13 158
4569 158 80 -216 -196 -22 126 54 -266 -9 -130 -269 166 72 47 -499 -147 -206 -57 -248 -237 28 -373 -507
4591 -507 33 132 -561 -163 -226 65 -430 -160 -72 -8 -372 -466 -402 -123 -383 -418 -153 -412 -516 -276 -127 -284
4613 -284 -318 -511 68 -46 -549 -175 101 -228 -248 -454 -205 -338 -333 -95 9 -21 -295 -34 -51 -487 -287 -11
4635 -11 -24 -295 -509 287 -18 -302 -149 -80 136 -335 -282 -61 -237 -75 130 169 -272 -40 -61 424 -33 12
4657 12 236 215 -240 -211 286 196 -54 -231 227 316 80 -139 151 389 -9 137 94 -316 -30 183 568 89
4679 89 -145 -27 250 166 -268 149 175 -85 -135 444 22 -10 11 67 277 -303 -298 191 180 2 -412 411 121
4702 121 -424 48 250 257 -54 -100 184 -230 -235 -240 -19 -17 -374 -59 -98 -356 -662 98 156 14 -289 -170 117 -409
4726 -409 -381 188 257 -457 -413 64 -96 -485 -166 336 59 -276 -41 74 69 -245 -116 341 72 -606 -9 268
4748 268 -56 -103 305 362 -133 13 -169 -280 -71 -185 361 -102 -179 -169 614 265 -106 13 124 97 -230 412
4770 412 534 407 -48 401 311 182 46 337 -17 38 -123 295 210 56 72 278 399 -64 -179 309 211 -87
4792 -87 206 492 285 164 164 369 -39 -395 213 390 152 -273 90 442 380 -173 369 381 -110 -129 239 573
4814 573 -148 52 505 187 -62 -119 -54 -71 -109 -61 -88 86 -356 -160 465 -167 -417 41 -71 -113 -379 -134
4836 -134 189 -131 -568 -287 -38 -301 -412 -126 -257 -319 -331 -296 -126 -691 -536 154 357 -244 -276 -44 -180
4857 -180 -549 -54 241 -206 -507 -295 -236 -246 -308 16 -131 -430 -462 -88 -141 -408 -107 276 -51 -241 -108 110
4879 110 -84 -90 -195 209 91 -436 -132 3 -129 -210 -115 20 -111 -124 204 170 -115 -124 -141 394 47 -260 548
4902 548 67 -72 -387 255 169 88 361 374 151 -234 138 248 243 48 227 231 328 120 362 235 59 128 320
4925 320 426 20 -7 100 417 315 40 197 268 90 14 621 515 193 -162 381 312 100 392 86 255
4946 255 -7 -203 269 135 -55 50 113 -18 -188 238 -149 135 -69 182 307 -12 -144 -97 173 -338 -100
4967 -100 340 -20 -457 -190 108 11 94 -71 61 -194 -63 -442 222 -5 13 -3 18 -162 -512 -184 46 -303
4989 -303 -265 181 147 -124 -194 -176 31 -207 -176 36 37 49 32 68 188 -119 -148 23 -6 -205 254 -100 -166 -180 39
5014 39 67 0 260 -176 376 47 35 402 244 -33 177 -13 164 180 -1 168 153 -68 5 213 -104 122
5036 122 41 160 51 188 278 329 201 139 241 151 68 -114 283 78 146 -160 -67 241 145 21 70 142 -225 -45
5060 -45 82 192 253 150 -20 105 71 85 102 256 4 75 180 -96 143 -26 170 49 -217 -149 -111 -100 -157
5083 -157 -161 185 78 24 -252 -45 -232 -155 29 -104 -102 -354 -95 -184 -343 -239 -103 -191 -127 -317 -53 -359 -394
5106 -394 -24 143 -16 -370 -134 -6 -102 0 -19 -295 -37 -300 -9 -157 -93 -75 -281 79 -168 -254 -67 -66
5128 -66 -43 -299 -241 -241 -310 133 -11 117 183 276 108 -157 -127 133 -24 -120 166 -292 152 -16 -23 95 -34 -8
5152 -8 92 291 138 -6 197 119 507 62 128 144 -8 193 10 175 81 189 185 236 -11 188 160 102 15 93
5176 93 123 481 85 -45 129 37 65 31 342 174 -62 352 -22 -32 -29 71 550 258 -30 204 80 -10 154
5199 154 200 184 116 251 -62 397 -225 -113 13 -63 -193 -37 94 -191 -59 46 -122 -264 263 -110 -335
5220 -335 -131 -678 -140 -195 -81 -365 -287 -194 -222 -97 8 -203 -446 -284 -456 -288 43 -60 -176 -273 -85 -15
5242 -15 -216 -51 -303 -329 -3 -60 -241 -203 -68 -254 -314 -66 -149 -44 -388 -31 37 -280 11 -241 -107 -126 -399
5265 -399 -206 -55 -439 -235 -98 -34 -113 -254 -8 -131 110 220 39 -110 273 169 301 190 -117 177 42
5286 42 -317 37 293 297 107 -62 211 310 -60 3 154 356 323 -190 227 90 104 -15 198 252 214 -173 227
5309 227 69 62 53 92 65 -164 319 146 -109 -36 63 212 -50 -148 65 354 -15 7 239 202 -195 -48 120 183
5333 183 -96 142 -216 -101 -461 -192 -151 -254 -171 -89 122 -260 -289 -36 239 -144 -311 -191 127 -245 -225 246
5355 246 -6 -81 -82 8 31 -15 -142 -155 39 -347 -490 105 31 -67 270 221 -179 -125 171 160 -122 179 -187 102
5379 102 -375 -145 -30 28 -24 -21 3 -92 -229 -180 -41 362 -104 -10 73 150 -43 -251 189 228 -297 285 491 -285
5403 -285 -14 182 447 -173 -49 253 405 -225 -102 209 471 -9 -83 381 -135 -143 -45 240 185 181 124 61 368
5426 368 1 -3 576 103 39 219 219 -72 -28 163 139 -290 20 215 196 130 108 -203 64 -193 196 323 284 -106
5450 -106 -68 -200 160 -252 -54 400 15 -41 -169 188 93 -101 345 335 -91 -311 105 200 -5 -338 -59 123
5472 123 -276 -384 -146 -237 -201 -223 -94 -122 -300 -286 10 -238 -11 -292 164 -115 -295 -273 185 -147 -239 36
5494 36 -81 -309 -562 -156 229 -342 -160 -144 -5 -208 -263 -88 102 -34 -242 143 61 138 14 435 34 -161
5516 -161 100 219 44 6 96 -177 -357 -199 -9 135 66 -107 120 91 -52 -171 -80 110 208 57 164 79
5538 79 56 -39 312 30 -26 217 296 -82 -184 -105 244 336 97 337 157 235 5 126 145 17 192 649 74
5561 74 68 -307 -26 121 48 -99 376 321 -42 -58 -50 -40 -361 231 151 372 -251 206 420 -41 -443 9 180
5584 180 -235 64 -9 253 -18 -256 -151 111 -42 -252 -195 257 -315 -150 -20 -221 -222 -144 -76 -209 -114 -100 66
5607 66 -325 -296 55 42 126 -298 33 -68 65 -219 -325 -42 15 -362 -54 -111 -193 -114 93 51 -362 -83 20
5630 20 23 -145 -116 -66 -76 -10 130 220 -235 -99 269 330 137 -21 159 141 -38 -292 164 173 -60 -138 -17 -81 112
5655 112 -221 95 43 18 -184 22 125 -49 196 210 374 169 111 177 259 210 304 256 108 149 25 256 -12
5678 -12 190 225 335 46 58 30 168 -16 96 256 64 16 118 -111 -66 41 -203 200 18 -107 -115 247 -59
5701 -59 93 -80 -91 107 32 33 126 -264 -114 -267 115 -179 -2 -97 85 -63 -238 -159 -8 -176 -249 -132 -396
5724 -396 -238 -12 -273 -221 -186 -11 -278 47 -376 -339 -137 167 0 -152 -58 -481 -233 102 80 -286 -74 61
5746 61 98 -101 -140 -226 100 18 -128 -331 69 15 -146 -116 -32 -193 -429 -185 -162 70 20 -144 -280 -81 -239
5769 -239 -33 -363 39 67 31 -313 -86 212 -60 -217 2 164 209 39 235 109 -350 -96 125 175 6
5790 6 169 209 103 246 169 225 173 217 37 -5 99 253 -67 23 265 188 147 212 57 222 46 396 -11 28
5814 28 91 178 209 71 144 162 67 124 97 194 205 -89 22 -138 18 200 16 182 -170 -255 -215 39 -176 -39
5838 -39 264 36 -50 -25 -151 45 -57 33 -242 396 164 -71 -143 75 -330 -62 -318 144 69 -190 111 -407
5860 -407 -90 -128 -12 -34 -301 -151 -99 -322 -43 -134 94 -249 -44 -156 -181 -470 48 99 86 65 -148 287 -154
5883 -154 44 70 -85 -146 77 -167 -23 -140 203 150 35 -303 -19 -79 270 -120 0 -191 317 -152 203
5904 203 318 -122 -185 59 36 276 50 249 316 50 153 94 -110 -41 235 396 176 -138 -19 -74 115 88
5926 88 289 14 -195 113 299 86 331 9 16 222 204 140 -117 236 77 -204 176 162 -6 34 -31 -182 61
5949 61 87 -118 333 -38 15 227 210 107 -79 -198 145 -316 -31 1 -64 -210 -207 -4 223 -70 -312 -155 72
5972 72 -91 -170 -269 -92 -237 -191 155 -183 -473 -228 -97 -127 -102 -113 30 -161 -54 20 -170 -244 49 43 -205 -160
5996 -160 -153 178 36 -26 -217 86 -126 -60 -93 -301 31 -14 -60 93 41 -6 -9 -28 107 215 29 38 -144 59 64
6021 64 -259 32 -87 137 -32 -146 -138 29 -156 -98 91 326 68 -49 186 65 -72 45 148 325 -47
6042 -47 11 435 186 -117 -11 250 347 -67 71 7 201 109 4 168 -104 254 184 119 135 -102 23 -8 99
6065 99 81 118 340 160 -170 -85 243 -177 130 229 1 195 50 165 98 -110 -47 123 -178 -201 54 38 117
6088 117 -36 168 -22 29 -172 27 131 285 -350 -248 -11 49 -141 125 21 -154 -182 -115 -301 -472 5
6109 5 -134 -247 -17 -147 -225 -475 -162 -335 -443 -197 -249 -152 -263 -25 -93 -16 -235 59 -276 -132 -27 109
6131 109 103 -20 -187 -38 53 -187 64 -254 37 52 319 -297 -248 169 66 3 -244 -24 -188 -38 -159 172
6153 172 -30 130 -239 -23 -197 153 -110 77 190 -202 -124 -38 117 107 274 110 -169 144 279 138 97
6174 97 -56 268 107 28 -98 237 176 -213 126 252 237 39 -24 321 -55 12 129 36 118 -151 -30 130 90
6197 90 73 -74 139 -102 -35 -65 -181 -44 -61 405 -100 -30 -25 18 -7 -1 -110 100 -141 41 91 99 10 -125 58
6222 58 316 -71 -38 -12 -19 -16 -155 126 -266 -13 -301 -77 -205 -227 -21 -15 236 -159 -133 5 132 -50 69 -114
6246 -114 -205 -77 -5 232 71 -152 60 -55 -93 -156 110 -79 -167 -396 135 160 11 -87 221 -265 -41 76
6268 76 84 166 -78 -30 145 -30 143 237 19 84 -146 -61 137 15 -146 -9 38 -10 141 -75 53 186 52
6291 52 -3 232 215 71 146 188 -199 201 201 277 145 -83 -150 75 -17 9 -21 -19 -73 203 -105 12 -234 264 13
6316 13 -42 -121 231 -115 4 74 226 21 213 130 -57 -159 -169 143 -230 -21 -43 80 -214 -224 -192 -66 -328
6339 -328 -320 -233 -30 8 157 -118 117 -392 -18 135 105 87 -261 -204 -12 91 -161 9 -203 11 -325 66
6361 66 139 -24 -393 -69 24 -153 -340 58 59 51 -40 97 -325 -263 -71 -193 35 -202 -159 -6 -40 50 -135 46
6385 46 -57 44 120 22 -119 -132 -117 -132 176 94 -116 176 -21 153 -23 -119 -58 61 -92 -55 247 -6 75 344
6409 344 -97 -89 196 -104 165 220 151 53 189 376 57 -8 116 69 119 141 206 -76 129 319 -82 265 30
6432 30 167 265 158 -14 213 231 404 139 112 93 151 -25 -41 79 -130 -67 109 105 -173 201 189 -108 -27 -60
6456 -60 93 180 118 -217 72 130 -59 -295 197 77 -37 -249 -69 -7 -87 -77 76 209 -20 -105 64 -65 -68
6479 -68 -92 266 -180 -275 -248 46 -7 -134 58 -326 -189 77 -74 -225 -250 -94 -139 -418 -41 51 -130 -156 -121
6502 -121 -33 3 -114 -110 -177 -75 -114 -76 -186 -174 -95 -12 47 -178 52 -539 35 51 163 -109 -216 -178 204 -155
6526 -155 -170 -3 84 -91 -102 10 12 190 59 -36 138 -48 309 30 -44 150 140 20 -23 -18 -25 199 105 71 122
6551 122 118 6 -128 158 205 304 57 3 322 148 64 181 -18 58 252 135 -173 18 120 39 155 119 289
6574 289 250 190 -74 -166 101 -61 -199 -242 -248 -312 49 -21 -136 -105 -238 -113 126 -86 -191 -82 -124 -342 -8
6597 -8 230 213 -168 -221 69 -9 -180 9 206 -16 168 -41 -22 -227 -210 -27 -137 -312 -119 -77 74 72 -102
6620 -102 13 -357 -137 -187 -161 -24 -265 160 -108 -212 -275 95 83 -277 45 -4 454 -163 -56 191 300 -73
6642 -73 211 166 298 -43 -83 248 -116 -206 32 33 -19 -57 99 163 -40 -43 -42 -114 92 43 110 184 -48 99 65 191
6668 191 141 181 -150 301 144 18 215 125 44 -3 207 29 55 40 183 85 126 111 149 152 123 -30 -43 54 31 218
6694 218 155 45 -188 -67 254 21 47 -293 122 -300 -39 288 169 141 -44 130 106 -16 -189 -209 353 -316
6716 -316 -48 -62 119 -234 -73 -264 -79 -151 -165 222 -13 134 217 16 48 -207 -447 -47 -38 56 -132 -148 0
6739 0 -48 62 -62 -452 -338 -310 -274 84 -13 240 -375 -17 -13 362 -212 -146 -36 -127 108 -158 -58 262 -40
6762 -40 95 100 -98 -84 -218 -299 220 120 -142 83 -129 54 5 -83 98 -11 45 -38 201 -104 92 55 170
6785 170 21 341 120 -83 146 137 408 104 -228 147 1 -410 -29 195 71 162 342 325 -156 -138 200 249
6807 249 358 276 -66 -52 -51 -106 9 210 -155 88 -70 377 79 -15 101 16 118 131 -87 172 316 -137 292
6830 292 159 125 252 -170 112 106 24 -206 327 -244 -405 -56 -63 -19 -127 292 -21 -34 -100 106 -454 25 213
6853 213 -328 -184 -221 45 71 15 -88 -153 -77 -149 59 -32 -121 -65 -155 -256 87 -275 -9 254 -190 -20 104
6876 104 228 -245 -292 27 -159 -63 32 58 -129 55 -7 -132 117 -21 -81 -3 13 -28 -170 156 -36 -97 186
6899 186 133 19 72 -246 79 23 170 -85 -136 19 -144 -11 135 189 11 -103 429 143 85 -130 -17 -148
6921 -148 382 -98 46 -30 -31 288 159 76 67 -53 -202 -179 51 240 83 -28 283 257 -33 -324 -21 33 113
6944 113 181 201 62 24 215 -16 51 12 -33 525 -89 -37 -13 150 352 32 12 203 63 -37 296 -88 147
6967 147 179 46 34 199 -283 -235 4 -259 -294 39 31 175 -144 -72 166 202 -133 -32 207 -424 -22 14 -223
6990 -223 -107 -66 -87 -227 -236 -35 -160 68 255 -22 -173 111 -113 -8 -448 -295 -204 -355 148 117 -115 101
7012 101 -340 -262 -196 134 -15 -295 -55 -41 -9 89 312 -166 -185 -48 49 -309 18 -29 74 -59 146 -156 -6
7035 -6 44 -2 169 86 -56 197 26 62 418 -35 246 93 9 103 198 233 97 -62 -219 14 -42 -200 -86 65
7059 65 224 -138 -41 338 160 87 -102 275 114 -250 -109 -137 -218 -233 143 -124 -43 170 286 -30 -36 -171 -163 185
7083 185 -37 24 244 85 -34 201 137 -61 -34 356 -57 262 -4 261 -16 95 -64 -246 75 -13 -48 -203
7105 -203 23 147 72 92 15 -46 236 -6 13 -419 52 -21 -95 196 66 163 104 -23 -202 -249 17 282 94
7128 94 4 -178 -58 213 -282 -73 -102 -4 -27 -276 38 -282 -226 -53 -177 -150 -23 -390 98 -80 245 -130
7150 -130 114 346 -251 151 65 -3 68 22 94 52 320 79 79 -256 196 -41 88 170 83 129 298 133 -81 163
7174 163 123 145 71 217 77 300 127 -41 45 -424 94 -14 154 -43 174 -280 134 -21 -48 305 -328 219
7196 219 -161 73 5 100 -177 105 -3 76 143 -185 -70 -45 157 -88 86 -139 231 86 -95 -258 80 339
7218 339 -332 65 -122 7 146 -280 237 -116 -125 -153 38 58 -177 -331 128 85 -68 -195 -24 -198 -211 -305
7240 -305 -161 -99 -98 39 -118 -142 -251 -61 -81 -110 9 -136 59 4 -42 97 -120 -47 -189 186 -102 -65 287
7263 287 -334 18 149 -52 161 -167 -221 -89 -112 24 -7 181 332 -40 90 -118 -46 146 -101 100 72 25
7285 25 -44 328 302 11 360 244 6 6 -116 60 44 160 464 -47 2 47 228 337 70 42 146 74 -244
7308 -244 100 50 -103 -28 -16 -141 234 -82 -410 298 139 26 278 63 244 -59 -312 -96 21 -45 -48 -111
7330 -111 183 -69 89 54 89 54 99 -82 287 88 308 239 -182 -190 209 -145 -169 129 42 69 71 -48 -102 54
7354 54 -138 38 -32 -28 -64 14 -294 -250 186 65 -209 37 -301 58 130 170 40 -168 -238 -223 -100 -202 196 -8
7378 -8 -180 43 -251 -42 64 -21 -2 1 58 4 -235 -67 -268 -8 -258 -28 183 -98 4 -106 -79 9 47 -130
7402 -130 103 188 -143 172 22 70 30 173 -21 14 -258 31 -54 -131 -51 -37 280 -113 60 -42 192 47 40
7425 40 165 -120 -132 -148 -219 -210 60 180 193 153 124 417 194 49 108 -101 228 -94 85 15 -56 -60 -191 115 -42
7450 -42 12 -172 317 189 214 121 -78 191 244 47 105 18 -134 109 -37 137 -57 -33 4 95 -53 305 -28
7473 -28 19 -23 13 -23 -200 -221 72 -80 -39 100 -77 47 -445 -12 52 -177 -245 -226 303 -123 1 -26 -270 264
7497 264 -326 -250 121 -108 -75 -140 196 -194 -117 336 80 23 -113 -47 67 27 15 145 -162 -39 10 77 -114
7520 -114 124 15 77 239 122 -4 -86 19 -79 33 325 162 -130 -120 267 107 30 224 520 -59 -45 -6
7542 -6 235 80 247 394 -88 -118 2 18 102 -222 -46 243 343 -11 168 120 365 349 249 -67 121 82 97
7565 97 80 185 -5 -214 -128 3 316 -23 206 -177 -25 101 303 87 83 272 323 20 -218 6 6 49 156
7588 156 -149 169 183 64 -76 -211 -264 -226 193 1 215 -203 91 78 -536 83 -156 35 -260 -34 136
7609 136 -292 -127 89 110 -232 -7 40 -128 -41 -86 -84 -124 0 231 88 -248 -50 -50 -123 -87 -287 -47 260 -262
7633 -262 -217 -50 -271 -56 63 -28 -141 10 190 -190 -8 -61 95 72 -111 -110 115 15 -28 72 -116 18
7655 18 -215 -53 101 102 165 48 -121 207 64 -12 339 -8 -74 -7 -249 -47 243 206 -88 57 15 91 -104
7678 -104 -83 -26 -77 -9 -16 26 127 45 -77 -194 164 187 -57 8 110 185 15 -6 -72 143 227 -181 -173 -123 87 305
7704 305 -189 109 -159 -87 78 -96 55 187 -242 -55 158 -38 131 233 35 32 -35 -206 93 -125 -16
7725 -16 95 -375 -27 -61 -62 -268 -81 49 -87 0 186 201 -222 94 -348 -144 -97 170 -137 35 -171 -59
7747 -59 -188 -192 -13 -15 24 -1 -80 -136 -138 37 323 38 168 -153 230 -137 223 22 -89 66 -220 131 -25 -12
7771 -12 -73 -222 -11 232 -4 37 182 -59 14 -54 166 80 16 407 230 128 148 102 267 -86 36 8 285
7794 285 59 -8 -448 -125 132 -66 17 -94 82 43 111 -17 -131 301 195 178 -172 105 -5 172 426 175
7816 175 317 -11 79 -50 -27 21 -70 155 76 -47 -53 -67 -34 25 194 -166 355 61 -142 134 -70 -215 -93
7839 -93 42 135 -165 159 111 -72 -116 -20 -45 225 -14 -37 -212 -182 209 -165 -94 -94 -205 99 -521 -42 -233 -146
7863 -146 45 -199 139 -110 -113 -70 -202 7 92 -267 -204 19 -235 -111 49 -41 -91 -238 137 -117 9 -186
7885 -186 -54 144 50 15 176 312 -206 64 176 28 -192 57 14 -181 -171 -131 139 -182 -113 -29 -13 -39 -331
7908 -331 146 157 75 -165 67 45 230 73 -21 159 -42 189 11 -43 -7 125 -189 256 -36 78 -112 2
7930 2 -102 75 82 74 -7 74 141 -291 -38 75 -61 -82 99 134 61 26 -193 -114 119 90 -114 -180 74 -18 1 216
7956 216 223 -174 -93 -185 156 77 -178 205 -204 -133 102 70 -153 -17 -27 -154 -33 -183 127 209 -59 5 -116
7979 -116 -78 -82 -188 116 -136 12 58 -192 -48 245 53 -301 12 -178 -342 -95 -325 -17 -218 -222 25 10
8001 10 -86 -7 45 -305 54 7 -48 -245 -334 102 285 -70 -187 60 -278 -218 -139 -175 -42 82 60 -49 -24 94
8025 94 -56 38 161 -248 431 -93 165 -80 -247 322 -1 -14 -5 95 48 138 26 60 -103 136 -32 -94 328
8048 328 116 86 11 -272 343 222 174 -157 4 17 206 68 288 120 -80 96 96 118 40 101 39 140 265
8071 265 -1 165 123 -1 18 72 205 -234 -44 121 233 -168 -112 -147 -91 -294 -76 21 28 -67 90 133 -119 139
8095 139 256 -384 -179 -119 -166 -37 -125 76 172 -171 -326 -50 -104 -45 -60 -7 -77 40 11 -192 -24 -80 44 311
8119 311 -265 -113 -115 -210 -267 17 -90 84 -125 -71 199 198 -121 66 -204 -275 11 152 -224 160 62 -171 -286
8142 -286 -191 118 -37 -173 293 58 -56 -5 213 -8 -56 162 181 22 -46 143 -116 100 2 -182 -144 -80 -157
8165 -157 -80 -164 -54 34 201 56 -31 26 79 -238 16 119 9 -160 -2 222 82 -11 91 -11 214 235 40
8188 40 -197 20 -154
8191a54
##END NTUPLES=NMR FID
##END=
