##TITLE=1H_LR-688-C4-AK
 D2O, 8 sc, 
 3.6.2020
##JCAMPDX= 6.0         $$ Bruker NMR JCAMP-DX V2.0
##DATA TYPE= NMR FID
##DATA CLASS= NTUPLES
##ORIGIN= UXNMR, Bruker Analytische Messtechnik GmbH
##OWNER= root
$$ XWIN-NMR		Version 3.5
$$ Wed Jun  3 10:35:48 2020 Russian Standard Time (UT+4h)  she@DPX200
##.OBSERVE FREQUENCY= 200.1315
##.OBSERVE NUCLEUS= ^1H
##.DELAY= (6, 6)
##.ACQUISITION MODE= SIMULTANEOUS
##.ACQUISITION SCHEME= undefined
##.AVERAGES= 8
##.DIGITISER RES= 18
##SPECTROMETER/DATA SYSTEM= spect
##.PULSE SEQUENCE= zg30
##.SOLVENT NAME= D2O
##.SHIFT REFERENCE= (INTERNAL, D2O, 0, 15.7039)
##AUDIT TRAIL= $$ (NUMBER, WHEN, WHO, WHERE, WHAT)
$$ ##TITLE= Audit trail, XWIN-NMR		Version 3.5
$$ ##JCAMPDX= 5.01
$$ ##ORIGIN= Bruker BioSpin GmbH
$$ ##OWNER= she
$$ F:/spectra/data/she/nmr/H-F/1/audita.txt
$$ ##AUDIT TRAIL=  $$ (NUMBER, WHEN, WHO, WHERE, WHAT)
(   1,<2020-06-03 10:34:44.04 +0400>,<she>,<DPX200>,
      <created by zg, POWCHK disabled, PULCHK disabled
       configuration hash MD5:
       00 E9 B6 7A A2 85 ED C7 34 08 36 98 17 FE 4E 26
       data hash MD5: 16K
       0B BA 7B 88 F0 86 C0 EB 2C 0A E4 B2 DE 6A 17 6B>)
$$ ##END=
$$ 
$$ hash MD5
$$ FB DE EC FD B3 FB 68 00 1A D5 81 17 86 02 7C 1A
##$RELAX= 
##$RELAX= 
##$RELAX= 
##$RELAX= 
##$RELAX= 
##$RELAX= 
$$ Bruker specific parameters
$$ --------------------------
##$DU= <F:/spectra>
##$EXPNO= 1
##$NAME= <H-F>
##$PROCNO= 1
##$TYPE= <nmr>
##$USER= <she>
##$AMP= (0..31)
100 100 100 100 100 100 100 100 100 100 100 100 100 100 100 100 100 100 
100 100 100 100 100 100 100 100 100 100 100 100 100 100 
##$AQSEQ= 0
##$AQ_mod= 1
##$AUNM= <au_zg>
##$AUTOPOS= <>
##$BF1= 200.13
##$BF2= 200.13
##$BF3= 200.13
##$BF4= 200.13
##$BF5= 200.13
##$BF6= 200.13
##$BF7= 200.13
##$BF8= 200.13
##$BYTORDA= 1
##$CFDGTYP= 0
##$CFRGTYP= 5
##$CHEMSTR= <none>
##$CNST= (0..31)
1 1 145 1 1 1 1 1 1 1 1 1 1 1 1 1 1 1 1 1 1 1 1 1 1 1 1 1 1 1 1 1 
##$CPDPRG= <>
##$CPDPRG1= <>
##$CPDPRG2= <>
##$CPDPRG3= <>
##$CPDPRG4= <mlev>
##$CPDPRG5= <mlev>
##$CPDPRG6= <mlev>
##$CPDPRG7= <mlev>
##$CPDPRG8= <mlev>
##$CPDPRGB= <>
##$CPDPRGT= <>
##$D= (0..31)
0 1.2 0 0 0 0 0 0 0 0.06 0 0.03 0 0 0 0 0.0002 0 0 0 0 0 0 0 0 0 0 0 0 
0 0 0 
##$DATE= 1591166083
##$DBL= (0..7)
120 120 120 120 120 120 120 120 
##$DBP= (0..7)
150 150 150 150 150 150 150 150 
##$DBP07= 0
##$DBPNAM0= <>
##$DBPNAM1= <>
##$DBPNAM2= <>
##$DBPNAM3= <>
##$DBPNAM4= <>
##$DBPNAM5= <>
##$DBPNAM6= <>
##$DBPNAM7= <>
##$DBPOAL= (0..7)
0.5 0.5 0.5 0.5 0.5 0.5 0.5 0.5 
##$DBPOFFS= (0..7)
0 0 0 0 0 0 0 0 
##$DE= 6
##$DECBNUC= <off>
##$DECIM= 24
##$DECNUC= <off>
##$DECSTAT= 4
##$DIGMOD= 1
##$DIGTYP= 9
##$DL= (0..7)
0 120 120 120 120 120 120 120 
##$DP= (0..7)
150 150 150 150 150 150 150 150 
##$DP07= 0
##$DPNAME0= <>
##$DPNAME1= <>
##$DPNAME2= <>
##$DPNAME3= <>
##$DPNAME4= <>
##$DPNAME5= <>
##$DPNAME6= <>
##$DPNAME7= <>
##$DPOAL= (0..7)
0.5 0.5 0.5 0.5 0.5 0.5 0.5 0.5 
##$DPOFFS= (0..7)
0 0 0 0 0 0 0 0 
##$DQDMODE= 0
##$DR= 18
##$DS= 0
##$DSLIST= <SSSSSSSSSSSSSSS>
$$ [...]
##$SUBNAM2= <"">
##$SUBNAM3= <"">
##$SUBNAM4= <"">
##$SUBNAM5= <"">
##$SUBNAM6= <"">
##$SUBNAM7= <"">
##$SUBNAM8= <"">
##$SUBNAM9= <"">
##$SW= 24.9337058887773
##$SWIBOX= (0..15)
0 0 2 0 0 0 0 0 0 0 0 0 0 0 0 0 
##$SW_h= 4990.01996007984
##$TD= 16384
##$TD0= 1
##$TE= 0
##$TE2= 300
##$TE3= 300
##$TEG= 300
##$TL= (0..7)
0 120 120 120 120 120 120 120 
##$TP= (0..7)
150 150 150 150 150 150 150 150 
##$TP07= 0
##$TPNAME0= <>
##$TPNAME1= <>
##$TPNAME2= <>
##$TPNAME3= <>
##$TPNAME4= <>
##$TPNAME5= <>
##$TPNAME6= <>
##$TPNAME7= <>
##$TPOAL= (0..7)
0.5 0.5 0.5 0.5 0.5 0.5 0.5 0.5 
##$TPOFFS= (0..7)
0 0 0 0 0 0 0 0 
##$TUNHIN= 0
##$TUNHOUT= 0
##$TUNXOUT= 0
##$USERA1= <user>
##$USERA2= <user>
##$USERA3= <user>
##$USERA4= <user>
##$USERA5= <user>
##$V9= 5
##$VALIST= <valist>
##$VCLIST= <CCCCCCCCCCCCCCC>
##$VD= 0
##$VDLIST= <DDDDDDDDDDDDDDD>
##$VPLIST= <PPPPPPPPPPPPPPP>
##$VTLIST= <TTTTTTTTTTTTTTT>
##$WBST= 1024
##$WBSW= 4
##$XGAIN= (0..3)
0 0 0 0 
##$XL= 0
##$YL= 0
##$YMAX_a= 240465
##$YMIN_a= -187559
##$ZGOPTNS= <>
##$ZL1= 120
##$ZL2= 120
##$ZL3= 120
##$ZL4= 120
##$ABSF1= 10
##$ABSF2= 0
##$ABSG= 5
##$ABSL= 3
##$ALPHA= 0
##$AQORDER= 0
##$ASSFAC= 0
##$ASSFACI= 0
##$ASSFACX= 0
##$ASSWID= 0
##$AUNMP= <proc_1d>
##$AZFE= 0.1
##$AZFW= 0.1
##$BCFW= 1
##$BC_mod= 2
##$BYTORDP= 1
##$COROFFS= 0
##$CY= 11.3945322036743
##$DATMOD= 1
##$DC= 2
##$DFILT= <>
##$DTYPP= 0
##$F1P= 16.9975609425685
##$F2P= -3.02152046262296
##$FCOR= 0.5
##$FTSIZE= 0
##$FT_mod= 4
##$GAMMA= 1
##$GB= 0.15
##$INTBC= 1
##$INTSCL= 1
##$ISEN= 128
##$LB= 0.24
##$LEV0= 0
##$LPBIN= 0
##$MAXI= 10000
##$MC2= 0
##$MEAN= 0
##$ME_mod= 0
##$MI= 1.114404
##$NCOEF= 0
##$NC_proc= 0
##$NLEV= 6
##$NOISF1= 3.799351
##$NOISF2= 2.8
##$NSP= 1
##$NTH_PI= 0
##$NZP= 0
##$OFFSET= 15.70392
##$PC= 1
##$PHC0= -9789.274
##$PHC1= 11.60082
##$PH_mod= 1
##$PKNL= yes
##$PPARMOD= 0
##$PSCAL= 0
##$PSIGN= 0
##$REVERSE= no
##$SF= 200.130013532006
##$SI= 16384
##$SIGF1= 3
##$SIGF2= 2
##$SINO= 400
##$SIOLD= 16384
##$SREGLST= <1H.CDCl3>
##$SSB= 0
##$STSI= 0
##$STSR= 0
##$SW_p= 3612.71676300578
##$SYMM= 0
##$S_DEV= 0
##$TDeff= 0
##$TDoff= 0
##$TI= <>
##$TILT= no
##$TM1= 0
##$TM2= 0
##$TOPLEV= 0
##$USERP1= <user>
##$USERP2= <user>
##$USERP3= <user>
##$USERP4= <user>
##$USERP5= <user>
##$WDW= 1
##$XDIM= 8192
##$YMAX_p= 0
##$YMIN_p= 0
$$ End of Bruker specific parameters
$$ ---------------------------------
##NTUPLES= NMR FID
##VAR_NAME=  TIME,          FID/REAL,        FID/IMAG
##SYMBOL=    X,             R,               I
##VAR_TYPE=  INDEPENDENT,   DEPENDENT,       DEPENDENT
##VAR_FORM=  AFFN,          ASDF,            ASDF
##VAR_DIM=   8192,          8192,            8192
##UNITS=     SECONDS,       ARBITRARY UNITS, ARBITRARY UNITS
##FACTOR=    0.0002004,     1,               1
##FIRST=     0,             0,               0
##LAST=      1.6414764,     0,               0
##MIN=       0,             -187559,         0
##MAX=       1.6414764,     240465,          0
$$ Real data points
##PAGE= N=1
##DATA TABLE= (X++(R..R)), XYDATA
0@%%%%%%%%%Qj6J6j6J6k4L2l3M1n1N9p2Q6j02J18j34J53j72J96k25K55k88L23
32A70l62M08m56N10n67O28o99P75q59R53j055J169j295J434j591J768j971K203
50A163k474K797l183L663m273N075o196P877j0713J6727n3105R7564J26860m4651
64A37131l3231n0512j06761j22842L438R4281J04293Q7122O9669l4131j33945
75A4512j20499l2584J737L6234J14193J36677K5885p7433q3790p3240r0856k8948
87a78112J01998J40937N9519L455p219p0317j44548q7848M8267R7657O7089O6668
99I7546O0366k8900j21068j07132l8314M609N6693J20633J01592l663o8616o2486
111A1260p1443q3127j0143J00266J15211N2786J4422j8954r5785j26657l9481
$$ y = [0, 0, 0, 0, 0, 0, 0, 0, 0, 0, 8, -8, 8, -8, 8, -16, 16, -17, 24, -27, 32, -40, 46, -56, 62, -72, 81, -91, 105, -120, 135, -153, 170, -192, 216, -240, 270, -297, 331, -368, 407, -452, 501, -554, 615, -680, 754, -837, 931, -1040, 1163, -1311, 1486, -1697, 1966, -2307, 2768, -3428, 4449, -6264, 10463, -42642, 54922, 181782, 137131, 103900, 53388, -53373, -176215, -172777, -78496, 25797, 112919, 182588, 148457, 14512, -105987, -138571, -136834, -100600, 13593, 150270, 176155, 98722, 14932, -58308, -149164, -178112, -76114, 64823, 124342, 127797, 120578, 50261, -94287, -182135, -133868, -36211, 30878, 97546, 157912, 129012, 7944, -99188, -137502, -132893, -76200, 44433, 146025, 142362, 73746, 11260, -60183, -143310, -153453, -53187, 62024, 114810, 129232, 110278, 14493, -112164, -151645]
122a51645N7318O2775M9187Q0792O2793n0482j28770q8454j6116J5635N3266J00456
134D6755P9802k00n2007o7518q6119o7719K5272J00548Q2453L3301K1023j4803
146A00788r5440j15799k9843N2492O2755O1287P2138K7648o2405r6924n9702k7069
158a10074j94O2135J10345O7586j8261n8009o1595o9761m8812K5051Q1147P3759
170E3317M5379J9359l7228r9969q6997r920M1201M9317O5057P0820J2858o6782
182E6412q4111n2144k6774P662O8911R7060M7990j8850m6566n9014p2114m0522
194a22060L4453P8682O5893L7645J0386m2249q7280o9821j0734L0509N2290P3815
206E1529O1152o708o7156o8352m3851k5996J0338O8633Q7136M0562j7007m5984
$$ y = [-151645, -94327, -31552, 17635, 98427, 161220, 110738, -18032, -106486, -122602, -106967, -53701, 46755, 126557, 126357, 74350, 6832, -79287, -147006, -121734, -21186, 61267, 94568, 115591, 100788, 5348, -110451, -140294, -87802, -25047, 36240, 108378, 136026, 73621, -23303, -83005, -110074, -110268, -48133, 62212, 129798, 111537, 53528, -8067, -77828, -126640, -101589, -20442, 53317, 98696, 118055, 80827, -19142, -106139, -116059, -74858, -25541, 39516, 110336, 123194, 56412, -27699, -79843, -106617, -98955, -30044, 67016, 115006, 96156, 49590, -9424, -81538, -122060, -87607, -8925, 56968, 94613, 104999, 62750, -24530, -94351, -105085, -74576, -22286, 51529, 112681, 105973, 38817, -29535, -73386, -99382, -89044, -20411, 66725, 107287, 90280, 44296]
218D4296o3805o6422k4093L9209O7682N6139L8342P860m6845q3274n9899o741
230i7551L0926N3823O9065M7831j2060n8272o2097m7063k3163K2041P0649P2146
242F6275K9551j3450m2339o4428o1276j6103M0519O2586N4378L4799j618n0260
254C8634p3437m9004o351K8408N5457O6568L8338j6886n4677n8889m4446j6227
266i2512K8447O5620O1799K6417j2638m4049o4309n3418p444L9037N7812N2558
278E7320L0784q044n1806o5376m3080n013L0385N6282O1154K9095j9212n0713
290B1776n6479m2173r988L3538O1525N4194K2885j4385m5975o1272m4894k719
302h3967L7438N5363N1302K5377j4483n1298n8956l8001k685L2492N6145N4245
$$ y = [44296, -19509, -85931, -110024, -70815, -3133, 53006, 91348, 99208, 52363, -30911, -90810, -97551, -66625, -12802, 56263, 104094, 92034, 33762, -28335, -75398, -98561, -76520, -5871, 66275, 95826, 82376, 40037, -24391, -85667, -101770, -61251, 1335, 55713, 90512, 88894, 38634, -34803, -83807, -90158, -61750, -6293, 60275, 98613, 81727, 27050, -31839, -76285, -92512, -64065, 1555, 63354, 89771, 77133, 33084, -31225, -84643, -92087, -53050, 4762, 57320, 88104, 80060, 28254, -37122, -80202, -85215, -54830, 1452, 62606, 91701, 72489, 21776, -34703, -76876, -86864, -53326, 8199, 62393, 85278, 70893, 24918, -36354, -81248, -83967, -46529, 8834, 60136, 85513, 71030, 19732, -39224, -77225, -79910, -47418, 8727, 62972]
314F2972K2607j9989m8948n4698l8765l455L6192N7702M8742J9104j7185m7604
326A6675n6946l7474P52L6805N3991M8000J9557j8999m9593n4382l3972J068L5459
339c9059N4747M7421J6637k0702m8289n2704l3355K399L6973N3591M4924J5456
351G8039k0968m8194n2612l1144M236L6910N2605M3918J4059k2234m8257n0416
363d4058k9849N373L7193N2095M1840J2403k2905m7276m9661k8020O740L7041
375b9084N1008M0955J1030k4023m7783m7723k6105O727L7852N0882L9119R027
387G1882k4721m6314m6613k5366Q522L8113M9346L7197Q858k5702m6882m5225
399d6905k2523R069L6954M8853L7246P211k7244m6071m3362k2136R947L8343M8094
$$ y = [62972, 85579, 65590, 16642, -38056, -76821, -80276, -44084, 13618, 62360, 81464, 64279, 16675, -40271, -77745, -76993, -40188, 13803, 61803, 81360, 62361, 12768, -41614, -75586, -74518, -39059, 15688, 63109, 79746, 59044, 10755, -41949, -75304, -72905, -35932, 17659, 62583, 78039, 57071, 8877, -43735, -74879, -70643, -33733, 18872, 62790, 76849, 54615, 6358, -44058, -73907, -68534, -31341, 20754, 62594, 74997, 52092, 4816, -44845, -72865, -66125, -29084, 21924, 62879, 73909, 49886, 2103, -45620, -71725, -64998, -27146, 23736, 62855, 71882, 47161, 847, -45766, -71132, -62610, -24497, 24849, 62046, 70904, 45202, -1680, -46905, -69428, -60359, -23405, 25448, 62694, 69905, 42661, -3410, -46772, -68908, -58961, -20618, 27476]
412B7476L4567M894k6235m4483m3605k1104J1533L8907M6324L3381L867k6545
424C8977m4924m2234j9051J2394L8220M5925L2112L179k7479m4896m0456j7864
436f6097J3095L7955M5441L0896J650k8594m3040l9540j6670J3548L8019M5037
448C1700K9239m58k7478m3355l8658j5434J5473L8263M2318K8152K11k8166m4440
461a2633l6738j3081J5825L6886M2053K7964j961k9917m1885l5197j3114J5527
473d6271L8599M2472K3678k964k7411m1828l6419j1570J8569L8097L8315K4541
485E7808j981l0072m2519l3153q584J6407L5973M1454K4338o993l1096l7959l0801
498d7178j2612J7267M0324M0207J8871o769k7270l9575l3705p851K1355L5955
$$ y = [27476, 62043, 66937, 40702, -3781, -47386, -68490, -56957, -18050, 28274, 61655, 65522, 38977, -5947, -48181, -67232, -54838, -16618, 29307, 61419, 64598, 37119, -7777, -48233, -66097, -53002, -15047, 30394, 61290, 62940, 34346, -8694, -48234, -64904, -51356, -13337, 31700, 60939, 60481, 33003, -10352, -49010, -64444, -48971, -10708, 31610, 59762, 59973, 31807, -12633, -49371, -62452, -46627, -9741, 32312, 60276, 58315, 28398, -13487, -48684, -61798, -46271, -7672, 34800, 58478, 55514, 28103, -13725, -50144, -61714, -43145, -5048, 33267, 57808, 55827, 25755, -16764, -49917, -58501, -42094, -6121, 35333, 59671, 52678, 21582, -16377, -47178, -59790, -42523, -2199, 38008, 56879, 50110, 22840, -16735, -50440, -58291, -36936, -981]
510i81L5588K2273m028l2567m2186k7655m307J6846L4769L9611K0682j0394l0695
523A6956l5487k9347j0061K0964M1515L4757J3162p153k5220l9400l2548l790
535e5652K4672L4606L2180J9113o809l3471l8694k3403l556J6563L6810L8705
547D1064J4858j4867k9515l1008k7747p972K3352M0825L0651J0614p479k7230
559A5546m0212k7891L306K4631K9232L0181J9353q658l5980l7497j8863m85J8543
572b8794L5744L4880R889j5223k6374l0696k8655m513K8647L9416K4549P419o810
585C9479k7231l9769k3700O324K3509K8517K9930J6916j4225l7158l1266j4561
597d3235j238J7432L7487L3867N278j8041k5608k9288k5215J01K9127L5139K0584
$$ y = [-981, 34607, 56880, 52852, 20285, -21901, -49556, -53863, -37017, -2248, 37363, 58045, 47651, 16956, -18531, -47878, -57939, -36975, 4540, 39297, 52459, 45306, 20086, -19314, -51862, -55652, -30980, 3626, 35806, 54919, 48110, 14639, -24055, -47458, -51014, -34451, 2359, 41064, 55922, 41055, 11540, -19468, -47215, -55187, -31835, 8990, 39641, 50255, 42776, 15546, -24666, -52557, -49251, -24620, 4612, 34793, 54146, 45488, 9508, -27989, -46852, -47337, -28794, 6950, 41830, 51719, 36496, 10122, -20574, -49229, -53742, -25095, 14321, 38870, 46289, 39479, 12248, -27521, -51221, -44897, -21388, 7129, 37059, 53975, 39750, 2592, -28674, -43235, -44473, -27041, 10446, 44313, 49591, 31550, 5942, -23346, -48561, -48460, -19333, 15806, 36390]
610C6390R461o634l2538m0033j6851J2012K1724K4875K8843J4924j7502l5574
622i03k7804j4399p13K1431L9317K7858q02j7353k2049k9098k4610L697L1653
635a3775L1887J8814P484j0013l3608l5595j0907J1114J8891K6439L0287R902
647E0920k3524l3558k2062j2254j328K3407L9232K3170l277j6560k2899k9789
659b8522k0601J0432L0685K6259J6288R054j1194l5957l4047o084J2744J8307
671a2636K7206K7517L897k4904k8355j9545j4182K94K7824L8021J7866o603j4615
684B1785k2697l0535j6168J4224K8995K2065J7235Q715j5871l7262k8101j336
696c8951J0722J6864K8442K6125j061k5322k5878j8576j3132M045K9786L3151
$$ y = [36390, 45851, 39217, 6679, -33354, -50205, -38193, -16469, 8406, 37249, 52173, 34671, -903, -28707, -43106, -43819, -22388, 16929, 44787, 43985, 26632, 4583, -24515, -49125, -45428, -13775, 18112, 36926, 44410, 34397, 789, -34806, -45713, -34599, -15708, 10731, 41018, 50920, 27396, -6162, -28224, -40478, -41806, -18399, 20833, 44003, 40726, 24166, 1267, -28522, -49123, -38691, -8006, 18253, 34541, 43595, 32401, -3556, -37603, -43687, -30943, -12636, 14570, 42087, 45984, 21080, -7275, -26820, -41002, -40708, -12884, 25137, 43003, 36400, 21785, -912, -31447, -47615, -33391, -4396, 17669, 34904, 43619, 27748, -9514, -37615, -38951, -28229, -11365, 17077, 43202, 42141, 16819, -9059, -27635, -40767, -36722, -6936, 26215]
708B6215J2514m156j2823k5753l1298j0643J9177K5955J8928J6437O995j8538
720B3010l5527k3353j109R694J9046K9790K1997o493k4275k2629j7585j3428P416
733c3446L1250K9371R804m453j3221k7114k9067n356J8972K3238J8749J7366L207
746C9300k2584l2451j7575j197P454K0977L1447J7484j0677k3144j9263j8121
758b8350j1594J0466L0874K6151P599l901j4873k8182k4949j312J7670K1175J9836
771B0610J7072j552k5271k8598j3540j261O598K3242L0579J3278j2827k1197j8900
784a1767j7892q877J4191K9205K1651O948l464j6768k8599k0895J603J7276J9486
797B098K0542J4968n606k5083k5090j1789k014Q945K4694K7271Q703j2193j9296
$$ y = [26215, 38729, 34573, 21750, -4003, -35301, -45944, -26767, -812, 18116, 34553, 41548, 23010, -12517, -35870, -36979, -27285, -8239, 21551, 43548, 37055, 12780, -9849, -27434, -40862, -33446, -2196, 27175, 36979, 32526, 19305, -7809, -36876, -42232, -23260, -22, 18727, 36093, 39300, 16716, -15735, -33310, -34507, -27053, -6076, 25371, 42855, 32178, 9034, -10229, -28350, -39944, -29478, 1396, 27547, 35146, 31245, 16372, -11810, -36759, -38071, -20401, 774, 20610, 37682, 36130, 10859, -17739, -31279, -32540, -25942, -2700, 27879, 41157, 28330, 7133, -11767, -29659, -38536, -24345, 4860, 26511, 33459, 29995, 13227, -15372, -36267, -34664, -17388, 2098, 22640, 37608, 32002, 6919, -18171, -29960, -31974, -23029, 1665, 28936, 37639, 25446, 6150]
810F150j9971j8103m361J7753K6209J7833O650l567j8346k8280j7982M211J6877
823a4927J9406K0022J1691q348k3928k2538j0994j374J1532K5711K3386M917j1555
836B3001j7760k0783j7625n75J9541K4030J5567N665m730k0034k6039j4017M503
849b9256J5925K0314J9378Q314j1094k2529j9993j0887j32J4210K5096K0206K636
862C2188j1270j7877k1137j4861K793J9228K2035J4875M977p946k1005k3339j0463
875c1802M967J5369K0363J8907N366j3040k1685j8159r802J554J6035K3455J6826
888B8354J573j1009j8466k0546j1907M825J8403K0942J4071M028j0337k1223k0587
901b1879q602N484J5726K0514J6777K974j3881k0065j7437r528L921J7304K2297
$$ y = [6150, -13821, -31924, -36285, -18532, 7677, 25510, 32160, 28593, 10247, -18033, -36015, -31804, -14927, 4479, 24501, 36192, 27844, 3916, -18622, -29616, -30990, -19458, 6253, 29639, 34556, 23001, 5241, -15542, -33167, -33742, -14201, 9829, 25396, 31061, 26331, 6297, -19742, -33759, -29256, -13331, 6983, 26361, 34675, 23581, 1052, -18941, -29828, -29960, -15750, 9346, 29552, 32188, 20918, 3041, -18096, -32957, -30164, -10936, 11099, 25974, 30951, 23005, 2000, -21339, -31802, -26835, -11466, 8897, 27804, 33170, 20130, -1555, -19714, -29516, -27962, -11927, 11528, 28354, 29927, 18918, 452, -20094, -32001, -27176, -8773, 12169, 26240, 30268, 19931, -1292, -21879, -30481, -24997, -9271, 11243, 28020, 30994, 17113, -2952, -20389, -29917, -25996, -8692, 13605]
914A3605J4225O82j1842j9008j8801r525O074J7747J9846J4139J746j2179k0194
927c485j8817p037N759J6882K0309J3705J109j2887j9709j7407p945O553J7800
940e170J9459J2707k1j1934j9305j7849p205P166J7769J9133J2076k27j2553j9165
954e119j7057o795P073J7834J9511J1417q34j2602j9416j6056o113P249J7010
967c898J8967J2107j130j3702j9484j5389m735P635J6869J8165J1387j684j2940
980A2168j8837j6080n102Q775J7590J7300J0040j245j2928j9509j5391l725Q791
993a8153J6436J7291J0924k549j4099j8382j3857l906P972J7529J8217Q738l477
1006B2684j3520j7178j4738l740R210J7788J6407Q667k948j3761j8756j3447j270
$$ y = [13605, 27830, 28512, 16670, -2338, -21139, -30664, -24590, -6843, 13003, 27142, 28888, 16709, -3485, -22302, -29339, -23580, -6698, 13611, 27316, 28425, 15538, -4171, -21578, -29523, -22970, -5170, 14289, 26996, 26975, 15041, -4264, -22113, -29318, -22152, -4383, 14750, 26826, 26599, 14046, -5119, -22176, -28971, -21898, -4064, 15447, 26864, 26030, 13428, -5988, -22044, -28157, -20908, -3898, 15069, 27176, 26046, 12344, -7140, -22529, -27264, -19629, -2760, 15405, 26792, 25108, 12168, -6669, -22749, -27851, -19076, -1486, 15814, 25854, 24609, 11681, -7828, -23219, -26944, -18153, -1717, 15574, 26498, 23949, 9850, -8532, -22389, -26295, -18323, -794, 17423, 26161, 22684, 9164, -8014, -22752, -26492, -17282, 506, 16913, 25580, 22632, 8871, -9885, -23332, -24602]
1019b4602Q936J5834J6518R840l829j5360j7980j2328k078R610J7332J6255O741
1032B4889m331j2950j7337j3742k069J1609J6939J4848O909l965j4423j7990j1520
1045b3133r7R702J5929J5941P467o223j4909j6034j0953j922J0660J7752J5291
1058A9471M779n473j4041j6273j1984pJ1493J6387J3929O592n637j6123j6663
1071a3550r347J451J0117J5620J4799N636o997j4930j5572j0078L43J1630J7362
1084F484J2976L398o570j3538j5808j0288J698J2097J5889J2726M589o878j5427
1097A348j5841p827K051J0970J5977J3202L383p818j4749j4349q959J686J2370
1110h556J6365J2016K430p512j4143j4871q089K878J2161J4541J2359K862p470
$$ y = [-24602, -15666, 168, 16686, 26526, 22697, 7337, -10643, -22971, -25049, -15439, 1893, 18148, 24889, 20558, 7608, -9729, -23471, -25540, -13931, 3008, 17856, 24765, 20800, 6377, -11613, -23133, -23230, -13528, 2401, 18342, 25809, 19586, 4677, -11357, -22310, -24232, -13572, 4180, 19471, 24250, 18777, 4736, -11537, -23521, -23528, -12035, 4352, 18281, 24873, 19236, 3113, -13550, -22897, -21446, -11329, 4291, 19090, 24726, 17729, 2799, -12773, -22851, -22508, -10878, 6484, 19460, 22858, 16288, 2750, -13058, -23346, -21648, -9551, 6338, 19064, 23653, 16775, 1348, -14493, -22320, -20269, -9299, 6678, 19880, 23263, 15445, 696, -13653, -22612, -20926, -8556, 7809, 19825, 22255, 14743, 600, -14271, -22360, -19482, -7321, 7220, 19579, 22441, 14971]
1123A4971j5223j5140o913L398J1823J5335J1489K025q441j3791j4261p496K777
1136a9447J2982J5553J0878J316q150j4745j3729o658L879J2017J4964J0778J653
1149B1291q192j5050j3812n792M019J2438J4465J0146J314q752j4727j2736n766
1162b1154L970J2463J4523J0007N69r180j4188j2645n590M515J2153J4632Q971
1175A9046P72q839j4055j3477m752N724J2217J3414R191O32r518j4402j2182m113
1189b0342M825J2000J3979R732r66r819j3749j1399m810N347J2957J3555P783
1202A9093r74q980j3414j2234l995O384J2073J3191P989l35j0193j4382j0275
1215a6052k883M863J1833J3538Q997k617j0688j2588j0514l801N889J3245J3051
$$ y = [14971, -252, -15392, -22305, -18907, -7084, 8251, 19740, 21765, 13324, -467, -14728, -22224, -19447, -6465, 9088, 19966, 21282, 13132, -1613, -15342, -22000, -18121, -6104, 8860, 19638, 21291, 13099, -1951, -15763, -21555, -17536, -5098, 9367, 19513, 20827, 12075, -2652, -15388, -21154, -17184, -4721, 9802, 19809, 20378, 11198, -2990, -15635, -21225, -16710, -4557, 10075, 19046, 19818, 10979, -3076, -16553, -21305, -15581, -3364, 10050, 19241, 19873, 10355, -4047, -16229, -20342, -15517, -3517, 10462, 20194, 19228, 9409, -4340, -15739, -20549, -15202, -2245, 11310, 19093, 18119, 9139, -4275, -16509, -20504, -14120, -2047, 11144, 19133, 18798, 8605, -5777, -16052, -18935, -14072, -2239, 11299, 20296, 17679, 6991, -5597, -16111, -19912, -14023, -778, 12273]
1228A2273O610j732r210j3905j1082k688P436J1874J1877P443j147j1216j3791
1241g258r031j737N493J1879J3486O889l810j0417j1620j0057l200P126J3550
1254A293J1609M963k330q810j3845j0586k39P572J1353J1269P003k908j1924j3031
1268h611p196j307N198J3005J3092M675n210r298j1418r262k263Q132J3660J0280
1282A3477L545k608r376j3587r217Q31Q183J0918J0850N620l984j2470j1643o549
1296a6010o91O447J2751J2224L072n321r637j0526r504o83R886J2757Q814K657
1310A6236k469r924j3967p783K511Q177J0295J0525M573n543j1967j0284n931
1323a5551k86P216J3360J0717J225n946r208j0362q403Q67J0442J1494P596K856
$$ y = [12273, 18883, 17151, 7941, -5964, -17046, -19734, -12298, -424, 11453, 18896, 17749, 6533, -7258, -16289, -18026, -12533, -654, 12832, 19721, 15911, 5494, -6126, -16183, -19383, -12257, 1293, 12902, 17865, 15535, 6725, -7120, -17706, -17945, -10373, 980, 12249, 19252, 16344, 4420, -8611, -15807, -17114, -11916, 1089, 14181, 18856, 13646, 4348, -7070, -16332, -18595, -10463, 3197, 13477, 17022, 14414, 5038, -8549, -17766, -16935, -8752, 2166, 13016, 18636, 14652, 2182, -9461, -16010, -16701, -10254, 2497, 14721, 17793, 12472, 2835, -7691, -17195, -17878, -7992, 4765, 13579, 16236, 13767, 3843, -10124, -17907, -15396, -7219, 3076, 13601, 18174, 12631, 664, -9620, -15551, -15837, -8621, 4739, 15456, 16681, 10735, 1527, -8835, -17238, -16371, -5929, 5565, 13161, 16017]
1337A6017l301j1298j3166n087L042Q071R754J0112M019o953j2026r270n251J83
1351a5154Q017J3335R016M03n824q558j1157p606K981J0529J0289O844K610m303
1365A1422j1753j1703l630K810P589J0515R496K199p980j1304q069m518P60R131
1379e035J2480P580m57n724r494j0327n918M143R993R173O817K356n623j2055
1393b091j0517k344L053P634J0752Q508M78q069j0378p486m738K180R671J2097
1407H750O003j307n604r197j0813m150M886R660R121O043J494o769j1725r089
1421a2697j499L387P615J0822P338p88q186r326q046l329L135R987J0394N291
1435A4098j099n925r593j0030k836N023R562Q602N905L10p535j0976p725j554
$$ y = [16017, 12716, 1418, -11748, -16835, -13793, -5722, 4032, 14144, 18163, 11210, -816, -10086, -15337, -15154, -7137, 6198, 15214, 15617, 9793, 1235, -9922, -17528, -14547, -4018, 6271, 13115, 15725, 11422, -331, -12034, -15664, -12854, -5265, 5250, 14746, 16945, 8965, -2339, -10408, -14926, -14166, -5035, 7445, 15025, 14568, 8844, -650, -10977, -16895, -12752, -2759, 6414, 13231, 15587, 9964, -2091, -12608, -14952, -11899, -4265, 6487, 14995, 15473, 7404, -2974, -10460, -15198, -13018, -3347, 8750, 14753, 13446, 7842, -1355, -12168, -16318, -11432, -1772, 7349, 13392, 14886, 8117, -3608, -12697, -14196, -10809, -3194, 7628, 14966, 14178, 5992, -3334, -11380, -14709, -11574, -1587, 8807, 14098, 12999, 7074, -2519, -12549, -15385, -10362, -800, 7802, 13707, 14017, 6482, -4494, -12219, -13773]
1449a3773L600Q451J0441O133j657q373q814p707l090M603R968R775M039j522
1463A2074o191j0108q893j486N492R024Q547N228n79q249j0370o533j595M521
1477i118Q657R478N135k302p872q746p238k229N390R756Q806L900j978p104r572
1492e037p715o01N604Q842P834N149k343q114r728o060p87M712R192R098L869
1507A3915l043p505r089o540r30N749R502P863L161k297p641r495o354LO002Q610
1523A911P973L462k795q031r210n836J41N507R340P888K758l184p738r146n482
1538a2442R3O263Q999P468K489l287p846r166n000P74O144Q343P318K927l954
1553I123p801q820m641N76O328Q748O873K115l418q224q816m509J484N861Q583
$$ y = [-13773, -10173, -1722, 8719, 14852, 13195, 4822, -3992, -11699, -14789, -10186, -218, 9557, 13596, 12074, 5883, -4225, -13118, -14604, -9112, -88, 8459, 13687, 13108, 4859, -5511, -12044, -13639, -9118, -461, 9017, 14152, 11850, 3978, -4768, -12006, -14235, -8845, 911, 9717, 13617, 11639, 4535, -5037, -12752, -13353, -7749, 1093, 8927, 14076, 11733, 3619, -6109, -12169, -12956, -8244, 948, 10046, 13915, 10872, 3367, -5722, -12262, -13192, -7443, 2059, 9922, 13083, 10786, 3145, -6350, -12704, -12701, -6699, 1911, 9884, 13346, 10551, 2520, -6690, -12526, -12385, -6878, 2462, 10350, 13108, 9924, 2186, -6960, -12442, -12349, -6086, 2913, 10381, 12870, 9583, 1737, -7429, -12429, -11655, -5511, 2832, 10150, 13077, 9123, 1322, -7498, -12139, -11563, -5235, 3513, 10386, 12501, 9083, 859, -7957, -12466, -10982, -5121, 3462]
1568C462O880K210l979q136q009m741J015O661Q552O863J375m327p706p856m559
1583a2295J880O166Q356O692J942m746q467p740l559J748N888Q310P188Q74n187
1598G050p664p270m310J884O970Q480N517O41l947p969p808l382J858O774P438
1613D262O592R26m861q426p176k619J623O213Q735O115j95n077p704o635l971
1628a2198K176P547Q462M505L63m259q248p292k816L130O560P064N974M43n801
1643E610q342n829k601K224O737Q471N142j049n616o782o590l095K789P590P445
1658F104M264j27m799q103o796j458L308O011P152N355p1o238q084n560j704K590
1674h156O914Q261M219k048m682p019o441k380L587P734O671L518j84n584q129
$$ y = [3462, 10342, 12552, 8573, 437, -7572, -12313, -11298, -4637, 3915, 10778, 12153, 7826, 120, -7736, -12295, -10415, -4249, 4107, 10799, 12741, 7995, -472, -8212, -11771, -10023, -4135, 4175, 11363, 12237, 7050, -614, -7884, -12194, -10310, -3340, 5140, 10657, 11298, 7351, -618, -8426, -11808, -9950, -3176, 4262, 10854, 11780, 6919, -1507, -8683, -11302, -9679, -3466, 5269, 11384, 11189, 6112, -1592, -8227, -12198, -10022, -2475, 5987, 10492, 10855, 6596, -1652, -8944, -11760, -8630, -2070, 4994, 10968, 11411, 5610, -2732, -8561, -11162, -8938, -2201, 6270, 11412, 10363, 4747, -2035, -8625, -11720, -8931, -1341, 6104, 10368, 10241, 5442, -2661, -9457, -10915, -7607, -1596, 5556, 10911, 10840, 4602, -3482, -9042, -10746, -8156, -1242, 7019, 11238, 9190, 4508, -2511, -8952, -11332, -7745, -11, 6660, 10178, 9994, 4410, -3719]
1689c719o302p60M281N709P095M628r91o242p892m896j549L068P765P566K991
1704A0752k237n186o746n792j770M558P348O228L005n21n802q212n510p7M043
1719e919O334O626L731j975o322o664m858j149L340Q087O977K313k708n222o692
1734d101n610m98M678O953N761K675r66o307p863m652N21M147O330O233L341k700
1750G942o848n913m503n16L992P767O204J738k673n092o952n141N73N320O422
1765B320M717K926k031o537p206l971J021M202O685N595K513l443o137n802m275
1780i423L11M753P190N307J488k818n939o588l933O56N526N829N636J993l118
1795F870o459o544l362J084M674O505N604J189l502o019n693l361K71N208O775
$$ y = [-3719, -10021, -10781, -6500, -791, 6304, 10932, 9941, 3699, -4193, -9089, -10638, -7570, 195, 7761, 10752, 8515, 3329, -3417, -9209, -10979, -6421, 927, 7155, 10160, 9639, 3837, -4375, -9885, -9962, -5919, 415, 7041, 10772, 8797, 2475, -4189, -9047, -10196, -6856, 1231, 8208, 10521, 7813, 2591, -4101, -9711, -10209, -5531, 1422, 7183, 9858, 8892, 2585, -5278, -9930, -9409, -5262, 1068, 7301, 10642, 7942, 1094, -4819, -9322, -9838, -5846, 1921, 8125, 9863, 7190, 2098, -4854, -9995, -9422, -4102, 2320, 7037, 9963, 7932, 1395, -5811, -9782, -8761, -4559, 2126, 7721, 10234, 6791, 654, -5148, -9423, -9112, -4359, 2831, 8138, 9626, 6808, 869, -5719, -9652, -8996, -3470, 2359, 7995, 9988, 6870, 411, -6133, -9495, -8411, -3737, 2768, 8372, 9561, 6059, 40, -5653, -9014, -8743, -3535, 3240]
1810C240M995Q58k834o240o270l259J403N341N879M798J422k962o676o010k761
1825i076J075M939O491N191L14l638n745n927k983J443N325O188M555O19l165
1840E606o081o229k640J728N612O170L898O57l639o312n209k324J491N056O454
1855D238M244L15m204o017n221k564K355M764O291M007J29l745n927n466k259
1870i060K367N313N699L917r4l779n627n338k159K194N217O170L863o64l782n895
1886a658n404j712K384N278N946L458j80m329n905m654k139K711N530N843L209
1901H378p34m263n814m581j532K605N311N527L328l56m494o181m398j027K774
1916e457N002N417L354q26m372n760m530j568L130N797N483K517j052m488n799
$$ y = [3240, 8235, 9093, 6259, 19, -6251, -9510, -8107, -2766, 3113, 7911, 9333, 6371, -305, -6315, -9076, -8001, -3062, 3429, 8620, 8934, 5296, -449, -6376, -9359, -7916, -2591, 3597, 8152, 8771, 5606, -475, -6704, -9344, -7616, -2004, 4166, 8064, 8721, 5082, -1230, -6439, -8763, -7272, -2216, 4238, 8482, 8797, 4593, -1424, -6645, -9209, -6854, -2090, 4201, 8208, 8337, 4592, -1335, -6801, -9060, -6693, -1380, 4319, 8236, 8142, 4363, -1264, -6602, -8761, -6567, -1350, 4820, 8683, 8019, 4237, -1658, -7062, -8774, -6390, -1112, 4834, 8292, 8112, 3783, -2122, -6776, -8915, -6204, -674, 5169, 8378, 7644, 3381, -2433, -7014, -8546, -5941, -630, 4897, 8225, 7869, 3375, -2806, -7204, -8231, -5457, -455, 4962, 8316, 7490, 3118, -2642, -7172, -8740, -5610, 187, 5670, 8187, 7135, 2647, -3152]
1931c152m265p79K979N235N246L106j296m415n977m012o71K817N438N443K637
1946H334j557m523n653l568r91K873N253N630K025j254m196n622m418l47L927
1961d087M580M975K615j264m825n578l945j09L027N149N434K131k081m373m885
1976c236m013p65L706N714M441J838j169m794n572l536K08L237M744M730K331
1991G864j567n277n183k830j85L127N582M968J287k383m221m928l403m8L654N484
2007A941M080J520j658m730n287l393J152L107N071L839J883k181m640n030k627
2022f953P2L597N348M341J093k543m421m966k754J74M349N087L789J016k086m570
2038E73n241k661J271L573M635M342Q73k647m446m822k500Q99L614N348L747L75
$$ y = [-3152, -7417, -8196, -5217, 18, 5264, 8370, 7074, 2659, -3318, -7330, -8001, -5184, 254, 5697, 8334, 6777, 2254, -3399, -6967, -7958, -5085, 168, 5798, 7823, 6569, 2373, -3249, -7667, -8014, -4087, 493, 5468, 8083, 6819, 1994, -3584, -7529, -7638, -4611, 538, 5972, 8103, 6022, 1649, -3236, -7249, -8014, -4308, 1406, 5847, 7685, 6516, 1722, -3850, -7386, -7178, -3941, 803, 5533, 7864, 6297, 1020, -4163, -6993, -7178, -4051, 1531, 6499, 7786, 5403, 1182, -3746, -7149, -7197, -3543, 1941, 6021, 7541, 5883, 1153, -4134, -7527, -6375, -3268, 1803, 5642, 7525, 5344, 704, -4326, -6953, -6881, -3284, 2064, 6405, 7498, 4955, 534, -4432, -7186, -7012, -2663, 2424, 6213, 7229, 5143, 573, -4668, -7329, -6058, -2485, 2150, 6492, 7365, 4718, 272, -4550, -7050, -6151, -2537, 2811, 6558, 6933]
2054F933k375m549m826k438J112M261M716L391O98k218n124m517j936J205L514
2069b153M529L942M88k637m891m146k151J103M077M864L340K78k503m702m335
2084d897k073J244M281M381L262M08k658m520m384j935J548L738M784L372P0k956
2100C665m932l923j892J591M082M878K881j10k635m421m061j969J514M383M295
2115C346L074J3l187m642l719j698J860L799M850K493K00l252m550l879j456J840
2131d908M147M601K533l99l141m274l924j254J716M238M384K856q10k850m730
2146a815l874n62J592M483M177K113n04k906m479l859q07J913M456L938K417n63
2162E720l560m096l416j240K024M725M012K146q17l321m190l325j002K310M212
$$ y = [6933, 4558, 9, -4817, -7255, -6143, -1882, 2834, 6225, 6923, 4705, -419, -4936, -6872, -5667, -2153, 2376, 6318, 6806, 4169, -722, -4868, -7019, -5916, -1839, 3025, 6365, 6643, 4140, -562, -4897, -6970, -5726, -1445, 2936, 6198, 6606, 3948, -572, -4956, -6891, -5343, -1605, 3179, 6551, 6621, 3665, -1267, -5190, -7082, -5491, -1409, 3469, 6350, 6240, 3605, -816, -4877, -6846, -5332, -949, 3346, 6420, 6433, 3246, -1396, -5115, -6813, -4953, -1154, 3696, 6189, 6389, 3137, -1413, -5292, -6748, -4908, -761, 3840, 6373, 5974, 2833, -1441, -5365, -6619, -4903, -665, 3719, 6575, 5765, 2915, -1815, -5689, -6251, -4659, -176, 4001, 6114, 5610, 2704, -1775, -5634, -6441, -4528, -72, 3866, 6283, 5720, 2160, -1936, -5352, -6592, -4568, 157, 4169, 6315, 5498, 2177, -2013, -5338, -6340, -4030, 182]
2177A82M086J794n30l363m676l157l55K189M291L824K253j359l357m228k989o67
2193f062K374M076M052J645j164k864m611l087m51K917M028L505J453p22l731
2208A358m023l053J07K254L943L831J930j580l610m027k419o48K606M175L951
2223D795J150j084l507m192k829j18K879M073L335J470j336l741m267k325K48
2238e449K356M309L572J223j667l807l432k537j74K686M512L140P66j291l121
2253A086m003l128O80L040L670L066J490j494l999l853k109P70K194M008L747
2268E165P49k118l507l403k151J09K755M159L194M03j363l397l966k345R88L302
2284a426L078K938J089j502m114l626j700O90K419L930L277O51k343l507l398
$$ y = [182, 4268, 6062, 5532, 2169, -2507, -5664, -6019, -3830, 461, 4285, 6538, 5179, 1822, -2406, -5395, -6062, -3688, 388, 4440, 6085, 4921, 2057, -2554, -5641, -6092, -3175, 853, 4358, 5811, 5089, 1358, -2665, -5718, -5611, -3357, 586, 4417, 6347, 4767, 1157, -2870, -5289, -5937, -3331, 844, 4795, 5945, 4861, 1354, -2838, -5667, -5785, -2906, 1167, 4502, 5972, 4636, 895, -3372, -5697, -5449, -3093, 1216, 4788, 6011, 4344, 537, -2895, -5432, -5606, -2920, 1592, 4732, 5498, 4207, 1086, -2917, -6045, -5365, -2325, 1345, 4411, 5901, 4407, 408, -3445, -5554, -4784, -2590, 1418, 5165, 5914, 3796, 289, -3114, -5265, -5156, -2401, 1758, 4952, 5355, 3992, 595, -3371, -5716, -4728, -1426, 1652, 4590, 5679, 4177, 63, -3563, -5263, -4573, -2154, 1776, 5053, 5704, 3361, -146, -3544]
2299c544j771K65L427M161K273K90j673l245m364j420J423K765L385K595Q87k009
2315C445m308l007j192N28K733M460K479Q4k568l517k785j634O69L747L484J937
2331D555M16j831l737l877j015J418L534K877K448P75k816l968k782q85N85L060
2347a243M175K485l53k794k953k977j617R72L644L517J941K1j753m157l378q10
2363e280J491L272K751K487M54l100l421k538p59Q43L134L713K261j086k550l233
2379a561k520j163J649L684K641J803K48k433l848k795n32J600K753L233K556
2394E315p25k855l306k415p33J127L168L830J680q96k376l097k953r67K042L252
2410I1L065J490j89k609l502k978J0J578K845L463K131j203k962l417j645n80
$$ y = [-3544, -5315, -5050, -1623, 2538, 4811, 5101, 3428, 183, -4181, -5601, -4178, -1413, 1972, 4567, 5454, 3445, -863, -3870, -5062, -4534, -1801, 2659, 5138, 5222, 2654, -863, -3648, -5282, -4613, -866, 2618, 4555, 4971, 3140, -597, -4474, -5489, -4071, -537, 2340, 4788, 5563, 2747, -1221, -4003, -4888, -4303, -1243, 2932, 5417, 5064, 2270, -683, -3660, -5277, -4305, -661, 2856, 4797, 4818, 3065, -1092, -4470, -5280, -3789, -517, 2234, 4721, 5175, 2075, -1346, -3884, -4643, -3800, -666, 3047, 5308, 4222, 1672, -1561, -4081, -5244, -3595, 89, 2730, 4533, 4781, 2348, -1500, -4295, -4827, -3227, -474, 2759, 5315, 4590, 1735, -1571, -3986, -4719, -3592, -424, 3406, 5086, 4190, 1814, -1283, -4236, -5203, -3161, 91, 3156, 4646, 4457, 1848, -1654, -4632, -4622, -3044, -199, 3264, 5395, 4192, 1230, -2187, -3832, -4412]
2426d412J197L097L666J402j047k627k911k559q63K453L480K438J232n31k609
2441A406l949j784J53J360L172K871J766j086l333l002j703k77J710L495K927
2456C726R57j077k400l391k569m7K644L182K566Q57n77l150l218j839K35J609
2472b492K990L252R83j386k791l203j421k57K216L261K507O62j021k454l774j644
2488d572K75K454L227J935R95j023l171l094j292L96K050K765L067Q10j856k847
2504A19k574j753K78K143L451K275J60q58k879k987j908P64K519K642K255P94
2520D441j850k706k971j086N70K082L083K129P62j621l041k675j335L24K543L214
2536A863J912K00j303k715k381j775N52K248L121J936Q17k122k646k393j551N50
$$ y = [-4412, -3215, -118, 3548, 4950, 3903, 1276, -1635, -4194, -5057, -2604, 876, 3314, 4546, 4015, 1406, -2543, -4327, -4174, -2814, 358, 3229, 4995, 3909, 576, -2426, -4129, -4406, -2696, 799, 3726, 4683, 3606, 1206, -2185, -4754, -4801, -2157, 1025, 3591, 4448, 3871, 721, -2497, -4336, -4101, -2492, 498, 3750, 4733, 3347, 556, -2647, -4068, -4325, -2109, 1152, 3659, 4321, 3300, 846, -2928, -4572, -4297, -1843, 1384, 3319, 4314, 3291, 120, -2974, -4266, -3870, -1820, 945, 4012, 4822, 2966, 119, -2455, -4208, -3930, -1787, 1664, 3939, 4099, 3241, 362, -2625, -4533, -3769, -1250, 1392, 3647, 4441, 2591, -115, -3086, -4172, -3602, -1520, 1563, 3692, 4454, 2833, -208, -2883, -4218, -3894, -1351, 1863, 3775, 3975, 2672, -43, -2424, -4199, -3647, -1399, 1722, 3658, 4475, 2353, -293, -2686, -4237, -3687]
2552c687K344L119J974N72k082k827k160j477R50K124L091K000J14j863k983k260
2568c051j246J116K557K756J945nj929l075k422o54R38K341K705J899Q2j609l137
2585g89k475r32J067K479K251K276k14j831k631k215j211J065K572K723J908k46
2601C797j622l092k344p80J134K467K857J127K03k073k736k055q83R75K448K828
2617B251J792k40k349k298k332o85J291K638K115J598M0k192k711k117o23J197
2633b625K523K560J435p37j560l234j606n93J039K817K204J738o24k221k583j778
2649c245o81J678K557K480Q51k20k470k515j779l91J398K789K136J065n65k081
2665A007k657j775k35J492K270K508J351j170j973k292j733p08J605K687K255
$$ y = [-3687, -1343, 1776, 3750, 4322, 2240, -587, -2747, -4224, -3274, -1150, 1941, 3941, 4055, 2192, -791, -3051, -4297, -3181, -624, 2132, 4077, 4072, 2143, -932, -3354, -4008, -3070, -729, 1976, 3875, 3957, 2348, -789, -3264, -4196, -3129, -650, 1601, 3877, 3663, 1832, -799, -3014, -4225, -3160, -588, 2135, 4043, 3797, 2175, -917, -3261, -4041, -2907, -440, 2417, 3544, 3747, 1674, -1062, -3117, -4000, -3025, -577, 2251, 4043, 3803, 1454, -844, -3176, -3861, -2570, 68, 2183, 3781, 3821, 1629, -1082, -3199, -3822, -2625, -102, 2458, 3893, 3156, 1596, -1638, -3244, -3837, -2798, 19, 2223, 3961, 3337, 1116, -1467, -3245, -3926, -2248, 309, 2789, 3640, 3420, 950, -1565, -3344, -3735, -2337, 452, 2588, 3653, 3088, 1007, -1650, -3425, -3660, -2168, 102, 2610, 3961, 2791, 818, -1474, -3207, -3915, -2310, 377, 2632]
2680B632J041q10j850k574j753j05J521K549K241Q97r99k187k418j655o7J553
2696a984K473K196J115j249k041k403j517k23J830K831J960N35n78k410k319j604
2712c388J7J694K135K490P54j018k325k583j104q9J859K422K038P09j225j999
2728C87k458j373K94J500K485K128P40j190k337k305j660P51J775K376J645O41
2744C399r15k020k588j366m5K097K449K156P8r45k049k769n70j25J777K578J824
2761B966L70j118k339k200j140L68K023K290J818M93j520k173k179j077M75K198
2777g45K057J787M46j515k368j987j006N49J754K454J626O1j199k121j991j148
2793c346O91J943K248J375N0j071k197k008r30K49K287K012J856P3j540k218j963
$$ y = [2632, 3673, 2863, 1013, -1561, -3314, -3419, -1898, 651, 2892, 3789, 2790, 603, -1815, -3470, -3537, -1984, 489, 2685, 3800, 2551, 510, -1893, -3410, -3633, -1803, 1028, 2988, 3523, 2945, 535, -1784, -3388, -3371, -1677, 458, 2948, 3702, 2684, 359, -2224, -3328, -3417, -1558, 864, 2902, 3611, 2386, 387, -2071, -3444, -3150, -1650, 835, 2963, 3703, 2513, 176, -2129, -3789, -3038, -1263, 1113, 2758, 3399, 2484, 464, -2124, -3490, -3535, -1438, 1011, 3167, 3245, 2300, 251, -2518, -3088, -3213, -1436, 1142, 2966, 3336, 2218, -121, -2321, -3461, -3093, -1070, 1220, 3038, 3531, 2011, -162, -2341, -3418, -2943, -745, 1312, 3099, 3545, 2030, -338, -2325, -3331, -2782, -1028, 1426, 3052, 3113, 1914, -207, -2198, -3346, -2655, -712, 1536, 2911, 2961, 1890, -307, -2315, -3245, -2996, -709, 1303, 3159, 3232, 1692, -526, -2489]
2810b489q20N97J890K547J351k09j365k030j864j091P01K355K052J162K75j434
2826A628j898k105n67P51J396K199J709Lj487k359j898m54L94K076K600O08R7
2843B693j154k237j628r97R50J912K517R42j49j591j943j891n14J191J656J855
2859A612J568j99j867k019j726n40P84K090K442R23o30j292j988j934m14J236
2875a954K031J821J025k28j612k038j766k17R59J849K078J019j15j917k195j453
2891b713k40P38K585J450J130l13j765j819j984j38J506J764J967P52m11j576
2907I33k330j361%J345J360K101R75n34j974j720j370j75P24K565J981M86p43
2924B263j570j897j668o7J530K022J172R19j13k100k099j177J0J179J859K124
$$ y = [-2489, -3309, -2712, -822, 1725, 3076, 2867, 1502, -528, -2392, -3483, -2782, -427, 1625, 2787, 3062, 1628, -270, -2375, -2942, -2191, -795, 1404, 3113, 3116, 1629, -730, -2628, -3082, -2688, -612, 1988, 2596, 2693, 1539, -698, -2326, -3323, -2373, -461, 2056, 2998, 2849, 1258, -685, -2576, -3090, -1899, -243, 1612, 3180, 2981, 1114, -905, -2631, -3171, -2387, -297, 2145, 3068, 2438, 1146, -842, -2776, -3190, -1954, 77, 1898, 2923, 2695, 1083, -955, -2721, -2938, -1979, -130, 1948, 2967, 2852, 935, -1260, -2713, -2953, -2215, 370, 1820, 2950, 2637, 872, -947, -2931, -3069, -1563, 201, 2168, 2920, 2509, 933, -1397, -2758, -2758, -1413, -53, 2048, 3023, 2489, 515, -1205, -2575, -2750, -2026, 539, 2520, 3006, 2263, 693, -1204, -2872, -2939, -1409, 613, 1785, 2704, 2591, 491, -1608, -2785, -2775, -1596, 263, 2387]
2940B387N77r46j865j601j011q4R72K095J716K37q91j124j896j188j46J754J676
2957F62J365P86m63k252j611r91O5J152K238J466N80q07k057j784j032M13Q91
2974a379K207J235M13q64j000k349q87J02J373J986J041J213j127k012j585n93
2990b226j09J324J716J771J03p96j992j630q35K84J688J782J186J25o37j393j940
3007a579j256O00J355J643J476Q49j229j754k127m95M90J048K079J329N61j727
3023A263j443j338j201N01J464J909J235N1p68j955j868p01Q85J547J601J239
3039B421K08j031j996j173j027M47J595J695J487j68j342j471j236j090M44J912
3055c25J496J009K08r71j811j717m91Q36J314J725J186K95j965j254j364n65M33
$$ y = [2387, 2964, 2018, 153, -1448, -2459, -2543, -1571, 524, 2240, 2477, 1586, 462, -1434, -2622, -2768, -1014, 662, 2027, 2813, 2350, 98, -1513, -2504, -2439, -1287, 951, 2417, 2997, 2190, 133, -1651, -2683, -2270, -1379, 828, 2063, 2476, 1612, 612, -1737, -2624, -2522, -1149, 837, 1878, 3091, 1964, -48, -1633, -2226, -2335, -1011, 705, 2476, 2579, 1783, -209, -1839, -2674, -2390, -702, 1080, 2266, 2391, 1754, 361, -1579, -2835, -2235, -880, 763, 2239, 3088, 1859, 105, -2022, -2517, -2027, -979, 1100, 2429, 2990, 1263, -180, -1518, -2719, -2218, -754, 1155, 2390, 2441, 1673, -282, -2150, -2851, -1966, -419, 1182, 2421, 2629, 1598, -398, -1571, -2598, -2151, -556, 1139, 2626, 2458, 1116, -355, -1591, -2681, -2237, -325, 1171, 2180, 2388, 1417, -394, -2111, -2602, -1766, -452, 1273, 2459, 2754, 789, -465, -1829, -2394, -1961]
3072a961J439J828J079j2j312j376j657m35L78J731J851O27k94p78j857j217m84
3089b450N03J325J971R16R9j438j599j299j77L18J743J834O90m81p63j732j457
3106a997k95R89J273J681M58n4r80j755j715M7R34J305J811P84n14j126j817q94
3124a865n04R38J329J790R36p94j025j584j278o1Q33J467J485N71k18j524j620
3141a124r30j81Q93J429J690P03o04j435j695o35k75J247J464J232O13l92j452
3158E48j333j493J45J050J478J613N24o17j495j744r49K01J050J383J427O27o37
3175A778j579j136j307P5J202J413J485J78n95j423j195j036r2J101J430J316
3191A615Q00o52j608j448p46J50J008J347J411M72m48j626j606o69n9J434J294
$$ y = [-1961, -522, 1306, 2385, 2373, 1061, -315, -1972, -2407, -2029, -298, 1553, 2180, 1886, 1108, -749, -1966, -2450, -1947, -622, 1349, 2265, 2364, 926, -673, -1972, -2149, -1831, -88, 1746, 2436, 1955, 1192, -540, -1997, -2292, -1303, -30, 1651, 2109, 2055, 1075, -680, -2395, -2348, -1414, -109, 1702, 2486, 1972, 846, -971, -1865, -2369, -1431, -102, 1688, 2624, 1830, 805, -779, -2057, -2118, -1285, 182, 1667, 2238, 2020, 496, -1124, -2054, -2235, -1342, 87, 1777, 2480, 1876, 441, -1254, -1889, -2164, -917, 547, 1779, 2392, 2000, 548, -785, -2278, -2133, -1083, 395, 2008, 2532, 1915, 420, -1324, -2273, -2072, -1022, 361, 1788, 2415, 1778, 199, -937, -2244, -2169, -967, 446, 1931, 2109, 1514, 91, -1104, -2140, -2232, -1131, 299, 1615, 2415, 1763, 155, -1293, -2039, -1889, -881, 466, 1877, 2349, 1901, 275, -1331, -2000, -2059, -625, 669]
3208F69J225r3k41j396j633q23K05J382J123J414K47n68j557j260p28L25J143
3225e66J423J020L26r24j509r65p56J48J281J309J311J70r26j422j540m94K67
3242a847J487Q97J492J53r23j278j356p55J92J510Q77J475p2o84j362j341m00
3259a935N40R81J421Q64j9o49j243j478q70R27J182J184R71J87j155j265j200
3276a557p10M96J445J405P08P8j216p81j511l55J43J494J420R99o5j235j063j204
3294a509o82P33R35J632R10m95k52j932r36l24M31Q99J450R55k27o22j373j199
3312a606k95O01J185J155N30N75j421j375o60m03M43J190R12R80r3q79j401r77
3330a539m31Q89J119J003P81k88j040j061j186n82J145R92J433N73o0r49j437
$$ y = [669, 1894, 1801, 1560, 164, -1469, -2292, -2087, -705, 418, 1832, 2079, 1511, -46, -1306, -2034, -1709, -566, 857, 1877, 2203, 1279, -230, -1195, -1951, -1803, -522, 787, 2098, 2268, 1342, -80, -1620, -2114, -1847, -360, 537, 2029, 2182, 1259, -19, -1375, -2130, -1938, -428, 449, 1924, 1852, 1168, -194, -1535, -1935, -1395, -414, 1007, 1871, 1852, 1203, -40, -1518, -2388, -1461, -279, 905, 1876, 2063, 908, -357, -1557, -2267, -1771, -326, 1079, 1787, 1865, 649, -132, -1643, -1998, -1855, -361, 1059, 2058, 1993, 758, -305, -1509, -2191, -1458, -523, 1109, 2019, 1524, 1272, -660, -1596, -1920, -1489, -590, 860, 1815, 1588, 966, -407, -1606, -1901, -1300, -115, 1040, 1570, 2145, 724, -651, -1311, -1714, -1271, -81, 831, 1811, 1718, 839, -562, -1539, -1970, -1081, 38, 1041, 1822, 1534, 494, -567, -1753, -2335, -1190, -198, 1235, 1808, 1748, 799, -638]
3347f38r42n22P59J500J107R31l81j359j165q63k36O27J173J074R63o56q08j187
3365f23j056J55L19J334J117P78l75j232j329p38j86Q12J404P51J072r42p70j387
3383h96r31J07N45J489J060O23p16q39j551l89m36P41J709R06L22l15j310q24
3401g05q79O1N97J006J190K90j23j266j205q17L35P15J155J054J71k35j155j217
3419a028o67J41N84J010J149P58r41j043r88n57k54P60J324J442M15q02j002j450
3437a149n18J26R24J147Q02N10l60j431j129m54r9J188J241O97L27o04j037j046
3455h65j006K39J164J038R29Q1p28q85j147m53M7J112J125P74J89n23j060q97
3473h66j015K17Q95J257R25R8m38j315j029k19k2J160Q57J043j94m54j049q34
$$ y = [-638, -1580, -2102, -1343, 157, 1264, 2195, 1814, 455, -710, -1573, -1809, -1182, -9, 1065, 2028, 1372, 564, -623, -1679, -1524, -1205, 129, 1246, 2024, 1649, 417, -912, -1650, -1836, -1024, 380, 1131, 2203, 1261, 491, -896, -1827, -1720, -1175, 314, 1374, 1997, 1281, 442, -1109, -1498, -1934, -1193, 516, 1422, 1744, 1429, 119, -705, -1584, -1523, -926, 80, 1270, 1560, 1437, 171, -1034, -1851, -1516, -801, 354, 1408, 1579, 1344, 189, -1028, -1695, -1554, -970, 40, 1189, 1947, 1006, -37, -1025, -1582, -1836, -1076, 248, 1690, 2105, 1303, 301, -1149, -1667, -1541, -617, 530, 1332, 1842, 1482, 51, -1078, -1532, -1631, -443, 798, 1495, 1822, 1218, 181, -865, -1871, -1632, -468, 570, 1499, 1580, 852, -33, -1180, -1633, -1586, -474, 651, 1425, 1614, 1091, 31, -866, -1881, -1664, -769, 488, 1413, 1511, 1073, -242, -1271, -1490, -1512, -352, 505, 1548, 1354, 900, -149, -983]
3491i83p11J49J041J388Q12k00l71j526o59n85J41J159J015P92M6n95j207r20
3509a214j17j39J116J110O82K01q16r33r43m54kJ103J101Q34J17o07j098r58m09
3528a426K70J139Q42K80N76r52r56q65k27p2J198Q41Q79j55o75j036q42l97N04
3547a074J062R95N93m01m86r56j101l09O99Q41R62Q76n03m03j059q75j69K47R90
3566g1J050Q32l60o19j076r61l96O98R65R69M01k32m97j362l63k81L97Q49J082
3585A025M15k27j037p58n73j06J45Q60J231M95j64q24o51j303O0M63J252P77L38
3604A418r8q50j187n31o1O00Q41P54P74o93n53j061o90m13Q86J087P13L43p02
3623E77m23o77r77K92M80R93P03M61k5j362r53k62J95J11J094Q11N08n56q40q55
$$ y = [-983, -1694, -1545, -504, 884, 1696, 1496, 1125, -401, -1060, -1645, -1504, -345, 670, 1462, 1508, 913, -294, -1214, -1331, -1470, -354, 756, 1438, 1639, 823, -110, -1053, -1507, -1509, -406, 695, 1529, 1646, 1039, -59, -1017, -1426, -1156, -17, 825, 1105, 1681, 729, -227, -1092, -1319, -1391, -193, 648, 1527, 1372, 697, -339, -1181, -1578, -1074, -12, 983, 1576, 1175, 689, -267, -1368, -1677, -978, -137, 825, 1701, 1198, 795, -264, -1139, -1308, -1061, -71, 979, 1811, 1451, 832, -244, -1205, -1601, -903, 62, 1031, 1432, 1200, 703, -659, -1022, -1303, -906, -57, 1025, 1440, 1213, 176, -582, -1155, -1261, -1116, -256, 975, 1470, 1306, 482, -169, -1472, -1412, -949, 303, 1080, 1418, 1320, 470, -717, -1248, -1309, -709, 132, 886, 1660, 967, 414, -647, -1337, -1750, -864, 223, 936, 1279, 577, 154, -523, -1500, -1208, -728, 265, 968, 1429, 1404, 42, -911, -1173, -978, -867, 227, 1038, 1546, 990, 150, -705]
3643g05m57m83N75J380R54L22o53p14j083q49L04O43J003P77O14n15p90j382l38
3662a397L34O50N15J170R6n74o85p45q79L53M80J119Q39k80j66o08q17j027L25
3681a297R91M88R42M06p03r40r23m56K55N40J190O00L0l55j123m44o20M42N30
3700d47P69J204l71l16p23r98n41mJ140R86L04L38m36j110p25l20K67N21J066
3719F04Q33l02k07r39q74k76j79P77R89R47J0m04r69j303l83Q86M77R41N23K60
3739A411n82j123k53j003M54P39Q56O83J93p31r42p10m45N16O10P18M58L65o25
3758E89r09r10k33M88O88J147L27j18o32o16q84m38L29Q33J179N12l99l45q77
3777b69n63o25P82L60Q48N09R3m72j034o72j30M03M70P49R45m55n82q21m69k53
$$ y = [-705, -1162, -1645, -1070, 310, 1264, 1586, 933, 219, -864, -1713, -1409, -766, 237, 1014, 1628, 1113, 323, -1059, -1397, -1063, -413, 102, 1272, 1368, 794, 109, -636, -1515, -1162, -682, 437, 1276, 996, 830, 222, -595, -1622, -1297, -306, 182, 1124, 1530, 827, -113, -1036, -1492, -1237, -697, 493, 1093, 1123, 768, -355, -799, -1419, -977, -447, 322, 1526, 1155, 839, 116, -882, -1423, -1427, -287, 699, 1003, 1341, 905, -205, -930, -1250, -983, -462, 604, 1437, 1135, 928, -11, -885, -1161, -1340, -563, 426, 1373, 1383, 979, 10, -1293, -1676, -790, -313, 628, 1151, 1411, 829, -294, -547, -1550, -1096, -357, 499, 1182, 1375, 644, -298, -1008, -1453, -937, -327, 391, 849, 1214, 589, -320, -1230, -1463, -975, -287, 860, 1187, 1069, 437, -179, -1063, -1501, -1172, -339, 840, 1352, 953, 608, -269, -832, -1457, -675, -315, 533, 1042, 1135, 663, -371, -1043, -1173, -770, -300, 449, 1394, 939, 357, -464, -933, -1186]
3797a186L29P87O52P60K3p47q19r03p4K85Q95N81P99l71o82q15o47K01Q6R04O73
3818G31L33J62r77n79q08J26J20R25P06M45m94l67p43p79r7N82O99N69P40m69
3838H25l50q95n04j88K96P81Q37N55m00o16r34m69k58O65Q22M29N87l29p36r47
3858h29k37k10L11J186P53L73l41o02r88l48k73M94R17Q46r0k44m11j004j19k68
3878a084M30J012K88L38j82n74q88l59m3N87O63J101m37m9m11r59o47J48N60R31
3898D25M36L78n38n46r31j42k14O80O99M88M08k20q56o70l79O2L95J004N53j28
3918I04j2o94q54l99l4Q23O13O35Q3l60m61r61k84K72J26J030R11m47j1p07r03
3939g30l70R3L52J059M03L48m57p33l86q72K55N77Q08Q51r1m09o99p80l36K31
$$ y = [-1186, -857, -70, 582, 1342, 1365, 618, -201, -1104, -1178, -893, 2, 583, 1382, 1011, 329, -486, -1133, -932, -846, 58, 731, 1064, 1226, 249, -330, -1138, -1012, -892, 33, 739, 1184, 690, 323, -420, -1199, -1296, -714, -15, 554, 1294, 825, 475, -420, -924, -1112, -816, -35, 802, 1357, 957, 341, -593, -1062, -1320, -655, 167, 596, 1183, 854, 118, -829, -1066, -1276, -965, 221, 974, 1347, 1006, 404, -584, -932, -1205, -711, 206, 1052, 962, 718, 307, -697, -816, -1084, -654, 358, 646, 984, 802, 228, -660, -1019, -1062, -475, 188, 1289, 852, 803, 392, -567, -1214, -1066, -506, 425, 861, 1239, 701, 155, -776, -918, -1132, -452, 247, 735, 1143, 923, 67, -603, -982, -920, -525, 479, 1032, 904, 892, 198, -656, -1055, -1089, -266, 347, 982, 1065, 705, 244, -717, -1001, -729, -603, 427, 1338, 891, 880, 173, -730, -1100, -1007, -655, 404, 807, 1155, 698, -35, -421, -1293, -1038, -461, 347, 1198, 1107, 698, -1, -781, -1117, -886]
3959h86N31N19R89L6m58p51p37l36L98J66R23N92n0l00p82p56l01M26M72J062
3979G57K6K91l32r02o36l34M22M37O68N46P1p04m01p02n00N08L61R85M24j31n18
4000C36m65o17m16N34M81N82K98q5l62j42j173R6J25Q94M62J75J24m64o01n53
4020g71l17L65N41P88N18j96m68q10n53p5N68L25P82J85J6n05m89r80J19K80L97
4041b80R00K29J89q59o45k86k64K00Q32M14M30l28l59n02n62R2L50K27P29L12
4061H19Q7m66j067l03L9L52M02Q09L70l66k28r80m10O6M65J94P14L55M7m19r56
4082d76l02j51K61N86O87M74j98n22o77k02m08M85O13O04M8j67l16p30m83J43
4102g31o5Q79M71N14m31o69o17k76J50M97L83O26j51M14p90p29k12P6L2R67M67
$$ y = [-886, -355, 164, 1153, 1189, 731, -20, -757, -1093, -695, -529, 394, 986, 936, 636, -146, -902, -1203, -777, -305, 757, 783, 1074, 742, -160, -796, -1130, -708, -271, 397, 943, 1014, 310, -91, -793, -1293, -785, -424, 561, 985, 854, 336, -129, -746, -1162, -628, -147, 435, 733, 648, 286, 144, -1029, -933, -808, 86, 548, 723, 847, 383, -218, -771, -1088, -723, -182, 606, 1124, 928, 460, -350, -903, -978, -410, -85, 697, 882, 898, 393, -96, -1076, -957, -677, -280, 620, 849, 1038, 179, -466, -752, -1016, -816, 16, 430, 860, 532, 173, -329, -891, -799, -449, -222, 507, 819, 906, 440, -627, -930, -891, -539, -137, 672, 1042, 676, 448, -532, -942, -876, -411, -217, 497, 852, 899, 480, -476, -778, -929, -668, -82, 605, 1079, 881, 359, -318, -520, -928, -443, 170, 774, 822, 655, 339, -391, -874, -731, -796, 83, 554, 1068, 637, -32, -649, -925, -775, -278, 105, 731, 580, 994, 204, -525, -737, -661, -629, 338, 805]
4123H05Q9k74o74k17p05n8O50L66N35L51l52k23r03k59l7N46O60N17K03l85n45
4144I0p48n24M65J05Q30M35M3k3m96j011N8J03K62O64M59L64n62l73o94l56j09
4165a018M63P93Q65l16j28p51m53j66J49K38M97M88j2k14n66l81m42J95L30P92
4185C63M77k65j64k33q18k11k38P29O49L99q3j38n15m94n41O85M22R3P60K94l42
4206H29r96m21k95L22K33O10N49j55m39m24l29o63N00M01N06M35r4k01o58l95
4226f85j16J6N72P28K58k27R7n69o10m60M24N0R79L56l6m66n73k36m09K87M12
4247b08O85L21P2l90o24n07k47J04P80M14K48o2k43o67q6k69L70M33L90M06k06
4268G14l55m67o29n3K62L10M29N03r4l80p49q3k06R4N49N62Q05l72n38r24j7M2
$$ y = [805, 894, 620, -54, -271, -976, -1034, -384, -18, 517, 868, 516, 293, -610, -869, -906, -360, 300, 817, 1020, 635, 90, -658, -1182, -717, -612, 218, 653, 696, 673, 177, -834, -776, -673, -411, 253, 712, 1076, 514, 141, -553, -909, -1018, -555, 238, 1103, 787, 659, -92, -545, -711, -562, -324, 173, 661, 649, 435, -131, -512, -954, -759, -429, 363, 840, 575, 411, 178, -640, -851, -1089, -360, 289, 688, 605, 467, -48, -542, -1083, -398, 24, 117, 877, 1171, 829, -167, -588, -883, -561, -328, 282, 831, 676, 237, -187, -516, -1179, -679, -278, 228, 663, 569, 368, -290, -685, -801, -785, -213, 515, 773, 546, 643, 74, -536, -996, -572, -522, 457, 813, 777, 311, -262, -498, -907, -620, -208, 477, 798, 870, 480, -144, -651, -898, -794, -14, 400, 648, 586, 343, -324, -410, -679, -309, 124, 514, 920, 714, 359, -108, -737, -790, -528, -218, 211, 714, 620, 240, -509, -592, -798, -704, -155, 407, 1212, 840, 302, -622, -639, -597]
4290e97J58O05K08N47l40j64p23l14m91K65J046M86M9k6o31j15n39l05L99N55
4310G3O56J38p9l55o03r08K67M15M57L19N74l73l70m54j51n59O25M69N79M37m53
4331G04n96j62m47l17M72L33M60K22k56l59n04j54j11L66M24P28q0j98n2o58n
4352a90m21K90M86J14K36K27o03m80k08j11L34M87M66J24j98l60m11l59j69N33
4372b13M30N06q9k6m49n15k44l31P00M78K16L89l95o20J11n64P1L76N12Q0K48
4393F71j88m91m53j24n3O65L27K62L8l29j87m09k83k98O24L81L31n7L00r09l14
4414d96j02j5L40N05M19J36j74l80n23m49N19j8N79L31Q5m95k77p82p2O3P96M25
4436D15J00N17n34n87l48l83JN20N30M29O3q08J67q28k3L57M62L40K28k36L7l14
$$ y = [-597, -439, 166, 374, 921, 581, 417, -306, -620, -1111, -846, 200, 686, 735, 709, 78, -37, -576, -881, -482, 73, 729, 867, 788, 433, -170, -1078, -811, -396, 61, 380, 954, 581, 211, -243, -394, -953, -328, 141, 720, 1157, 704, 108, -54, -501, -818, -346, -13, 447, 669, 413, 54, -450, -604, -715, -349, 75, 803, 723, 525, 473, -185, -190, -611, -321, 165, 279, 515, 742, 139, -341, -549, -660, -326, 161, 627, 751, 553, 193, -218, -577, -746, -213, 217, 723, 634, 608, 159, -356, -600, -931, -231, 247, 463, 852, 457, -163, -52, -616, -545, -169, 343, 423, 671, 483, -8, -461, -585, -638, 27, 354, 616, 654, 325, 138, -271, -554, -852, -228, 153, 484, 427, 727, -182, -496, -598, -613, -273, 232, 651, 787, 613, 233, -290, -739, -220, -238, 341, 672, 757, 262, -15, -797, -869, -806, -10, 415, 515, 1032, 498, -89, -437, -820, -819, -299, 231, 660, 723, -85, 82, -746, -769, -412, 50, 390, 618, 382, 419, 105]
4458A05o39M6o7N81L34M97j95j95o79m92j41J42N78M89J82K65l28n74m27k10N24
4479b04O1L11L65L46m65o12m96R3K41K58N98J09p5j06m71n73J42k63N98M95M51
4500H03o5n58k42l38N5o6K70N32K65j11l76p9o66k11K77M60M35M16m12l54Ko19
4522e82l9J23N72M33K24l36k58j92n99M9L59K22J20O81l60l69l70j82k82K45M70
4543g1M41J47p9l45l98j64n56O09L44L32J78K5n87k70p2m8M62k16O95J44j36l04
4565A31k33m03l04M26N48K26R9n9k50n14l08M8k9P85L35M18o39o1m56q5o2o8O79
4588B24M34j58J0p08j03k03J29K5N93M17j55p9k6j069K13k17O9Q84K43L10l10
4609E23n10p0m89j3L76M31K74k57J14j60o04j02J70R2O19J50j63J08l99k12n40
$$ y = [105, -534, -488, -555, 26, 360, 857, 662, 467, -212, -704, -845, -703, -125, 364, 546, 811, 483, -91, -518, -728, -204, -143, 168, 533, 879, 414, -198, -694, -601, -360, -102, 496, 605, 530, 424, -47, -620, -478, -741, -143, 352, 803, 738, 180, -62, -400, -345, -411, -141, 391, 656, 545, 169, 90, -576, -787, -510, -50, 385, 801, 389, 35, 37, -582, -621, -498, 74, 507, 731, 395, 137, -55, -654, -605, -246, -24, 96, 777, 417, 48, -322, -504, -786, -541, -71, 370, 517, 438, 93, -305, -469, -1025, -416, -72, 260, 438, 463, -124, -394, -466, -514, -52, -268, 427, 571, 435, 131, -102, -505, -809, -383, 165, 391, 490, 431, 181, -333, -641, -593, -622, 163, 498, 916, 277, 216, -240, -325, -387, -455, 224, 658, 500, 510, -198, -301, -504, -375, -350, 243, 660, 505, 426, 400, -669, -456, -673, -604, 280, 523, 833, 523, 13, -57, -546, -559, -183, 248, 522, 265, 379, 219, -385, -487, -317, -225, 394, 544, 381, 489, 90, -122, -662]
4630f62J63K67M73j54N52o43M46o69n20N14J39N15N5R5k63j54p14j05K88K49L53
4651B25O8M7J9j83m79j42j81M85K75J47M45m98k50k20k54N6J67L76M53k80J77
4672D53p56k23J51j02M03L49J86K32m49m84j03j91J25M04K41M03k56p2l40k55
4692b84l80J04O4Q64P9K6j99k71l54m0L6L20J37O02j75O5o00n00j7J65M61K93
4714C96l7R9j11l43k20m51K30K24L67K68q7l32j16k16p5j77O72L32J52l12pm27
4736a71l94K15K08J8L21K97L4m08k36n73J22J34L81K78K93k3m05m7n45KL66J03
4758c0L57m6L67m56m54o7K75k99N35J75L37o38K4n83m4J79m0M44M22K90m14j16
4780B18m42k13J3K28J64N81q5J81j97p30k00JJ81N68J85p9k2k3m25k27l64M77
$$ y = [-662, -499, -232, 241, 87, 639, -4, 442, -227, -747, -233, -94, 421, 476, 571, 308, 154, -560, -665, -377, -128, 225, 293, 340, 359, 176, -303, -445, -626, -141, 134, 281, 726, 228, -22, -242, -496, -440, -273, 103, 556, 276, 453, -303, -526, -375, -477, -74, 275, 461, 693, 244, -240, -343, -534, -409, -5, 236, 639, 383, 311, -29, -284, -664, -560, -496, 368, 447, 473, 274, 3, -351, -391, -355, -35, 102, 704, 529, 594, -6, -506, -523, -358, 103, 396, 359, 458, 347, 4, -216, -667, -437, -213, 154, 422, 335, 3, -113, -329, -404, -581, 91, 423, 575, 263, 256, -171, -565, -350, -142, -124, 197, 494, 528, 120, -116, -689, -567, -433, -52, 226, 519, 496, 91, 44, -501, -499, -133, -30, 327, 281, 648, 192, -262, -329, -54, -353, 182, 357, 694, 56, 80, -503, -547, -368, -408, 36, 458, 748, 334, 218, -224, -437, -424, -196, -32, 549, 464, 645, 448, -282, -482, -481, -300, 268, 453, 374, 352, 329, -96, -323, -687, -210]
4802b10m9O46p0K73l10o37p8L4R1K99N8J95K9j62k86l80ML30K99K97O7J71o75
4825f4k46k21J12J84K2N13j4O2n08Lm89K15N77k06L89M21l86l51m70j57R2J73
4847c49L26J04L14p3J5n78n01K73m6O10M13K53k89n20j67m82L66K13R6O37k44
4868C71N6k47r25N5M87l7M74j62L86j02k37k49l86J11K16Q7O87K7l76j25m88J42
4890b35k50K67J30N35N8k77k41m11p3J37K14L81N1J49o8j53l82k77K24pL89J84
4912C45lQ6k95k91m66L91m8O71J05L2l24k57m96O8Q4K42O11K0p2m30p5q7k15j20
4936e24M65L29K38r5l30N5k30n39J03N67L49L01m32J72n44on29M29L29K26j47
4957A87J94l81R5m32J07k25L35L46K64K08o77j66k25J1qK82J25L06k2n3k20n87
$$ y = [-210, -259, 387, 317, 590, 280, -357, -435, -401, -310, -11, 47, 242, 271, 109, -177, -557, -553, -223, 76, 373, 440, 611, -64, -310, -531, -419, -235, -213, 300, 286, 348, -160, -157, -646, -431, 146, -60, 329, 750, 364, 13, -457, -614, -522, -349, -23, 81, 395, 322, 337, -241, -742, -469, -515, 95, 508, 761, 472, -48, -215, -697, -331, -118, -22, 615, 371, 427, 180, -745, -690, -203, -240, 234, 72, 458, 356, 119, -130, -516, -405, -189, -102, 585, 612, 236, 111, -377, -235, -485, -218, -88, 447, 505, 228, -13, -424, -497, -360, -146, 235, 286, 435, 367, 214, -168, -445, -221, -228, 161, 345, 342, 428, 133, -158, -624, -233, -281, 390, 495, 527, 203, -54, -550, -482, -398, -156, 455, 475, 403, -27, -102, -189, -404, -524, -59, 270, 508, 413, 83, 138, -92, -631, -528, 39, 388, 689, 257, 429, -115, -121, -650, -221, 108, 334, 187, 381, 0, 95, -337, -230, -455, -120, 226, 490, 698, 21, -145, -370, -359, -367, -85, 40, 346, 324, 271, 51, -536]
4979e36p7N21J98K54j2R8n3n48k61J8K46M79J07j86m8j70j0l29k23J79L94J57
5001A98K27k56J21k53o82K72kL81L35q8J11l65j64j53k76L83O1K52L92l36l10
5022a52L58n86J31J38J44J82N6n3j63l49l80L98O7l6O83j86J79l52j80j37P5j66
5044c29J10N06J47J70m10k38l60n2K1N16K95O1l26k9j83l77K89j71L19N53o7l22
5066A23k24l53j50L72K09K66L05j58o7k33k83j32N7J3N48j58K23Kl75o7m80K11
5088c51K78J32j6J96o0j42k45J48j25K2K30K56K7L1n06k93K02p5K26L71j90K32
5110C48k05j73j30m68M18J41J79J52k89K61j34n30J9J19K29J80P9J86J80o79l17
5131d34k43N50J96J55L56k50j25j04K5m62j78L95P17k46K07Ro18j58o8K14pN10
$$ y = [-536, -613, -92, 106, 360, 348, 446, 393, -155, -416, -398, -152, 327, 434, 248, 200, 30, 20, -309, -532, -353, 41, 198, 425, 169, 290, 37, -645, -373, -375, 6, 341, 253, 364, -1, -165, -318, -594, -211, -150, 102, 494, 158, -152, 206, -380, -249, -111, 33, 215, 271, 218, 55, -294, -674, -276, -209, -245, 438, 252, 431, 79, -101, -238, -163, -329, -219, 287, 434, 604, 194, -44, -404, -456, -435, 81, 376, 437, 111, 82, -101, -478, -189, -360, -41, 512, 445, 123, -101, -454, -604, -232, -23, 243, 548, 390, 323, 90, -193, -325, -268, -255, 293, 135, 358, 360, -15, -82, -562, -351, -73, 59, 43, 239, 179, 37, -208, -60, -185, -163, 67, 323, 350, 381, -125, -418, -216, -291, -65, 306, 116, 348, 143, -30, -160, -628, -210, -69, 110, 262, -27, 234, 100, -430, -411, -292, -63, 117, 196, 382, 562, -117, -434, -677, -127, 69, 224, 580, 330, 205, 101, 126, -336, -514, -119, 598, 352, 559, 568, -50, -208, -276, -62, -69, 441]
5153D41J09j21k08l08Mj87j42N87j10J96j03Q6j22l12j37j21M06Q3L02K14m70
5174H7kj01l27J77O3M81L8L45m86n31l5k8J98J45J22o1K39N5k31l18p8j67K22
5197a93N41R0O0l39k86j37J44l04L30L42J60r3O9m05j89k47M4M12K10N1p5q9j02
5220fJ5m80K60J86K90m9R3l02j80j0m7K79k14K82J52m6k78j00j67pL6O6P22p1
5244D24j3j50j71n09J81K05J19K51K19l01q4j15m63K04r6L22K46J00k39k40K54
5265A44l11j66J29L46J02j02L41n21k29lJ54r1J77M58k8l12k9k80r4J84k52N22
5287A39R9q5R6n6o26J71k83M77K09L6j6j83J33k39j96K48r0P0L06n6L04l66L8
5310A30n15P8j96Q04k13L74j05jl15n49Q6K28K51J54K07n4l31k83j43l00M54M52
$$ y = [441, 550, 429, 221, -87, -83, -270, -412, 175, 65, 261, 158, 244, 122, -190, -327, -448, -42, 41, 343, 557, 87, 85, -16, -343, -166, -103, 378, 416, 761, 275, -256, -291, -319, -121, 24, 146, 85, 324, 379, 148, -170, -248, -415, -193, 348, 438, 498, 159, -127, -264, -120, -424, -94, 248, 408, 315, 384, -21, -210, -457, -413, -1, 209, 260, 185, 96, -6, 9, -471, -211, -25, 265, 216, 309, 7, -173, -183, -230, 49, -165, 117, 269, 223, -55, -155, -322, -329, -293, -227, 495, 424, 411, 261, 90, -419, -238, -33, 86, 337, 556, 255, 171, 56, -407, -203, -299, 23, 269, 369, 130, -110, 144, -167, -333, -204, 142, 244, 142, 483, -38, -267, -270, -116, -207, -30, 428, 400, 88, 59, -221, -315, -131, -383, 139, 238, 153, 249, 193, -433, -262, -545, -68, 141, 177, 161, -22, 111, -128, -324, -76, -166, -96, 210, 154, 458, 92, 130, -385, -307, -503, 301, 88, 462, 357, 356, 41, -508, -422, -194, 57, 211, 418, 364, 33, -250, -393, -693, -239, 213]
5332B13J61q6L2m62j01m4P9J70N3MK75J08l59j59m71K11M15qM62l67j04K60l46
5355f4k46J4K85J43K00p8k27R1k73j69J9M13L99k90L39m89j55k38J30R0M61Q2
5377D37k63j7k93K65k26k34L2K29M79L4l30K52n42lo2j13L21K91O7J63j86n43
5399b42Q1p6j52K77M8K57N3k24k53J2R5j65K28L22m9O4M8k10k36r6M2l0M85L1
5423C10J33j84k38j54k81M34K46k53L75j02J71p71o7N4O6N01N9J11j43j44m55
5444c32r7L7J60J04N1K45j41k62K50l39j77K31K85J34J68k92q9j85j5l1j0J24
5466a81L76K31p3l19K8m83O1J20J15M37J44j36j24j97l62j0J37J52L44K03l81
5487H2j2m42J66k23L15k0J76K85j91J34o40J00j20J40J86l5L19j62r0j42P1j57
$$ y = [213, 374, 288, 320, -142, -243, -287, -208, -38, 15, 19, 294, 402, 43, -116, -587, -376, 39, 31, 493, 126, 22, 282, -64, -310, -296, -11, 132, 332, 254, 27, 118, -155, -324, -305, 108, 507, 217, 556, 67, -88, -326, -196, -106, 355, 437, 174, 157, -136, 129, -97, -331, -299, -70, 409, 443, 113, 365, -177, -180, -242, -355, -34, 257, 324, 487, 301, -242, -161, -237, -389, -112, -64, 193, 246, 22, -231, -219, -124, -289, -61, 261, 212, 276, 324, 114, -122, -218, -176, -206, 279, 310, 443, 259, 21, -133, -414, 20, 266, 13, 388, 286, 457, -314, -381, -327, -261, 240, 299, 410, 267, 123, -332, -429, -392, -232, -128, -77, 168, 27, -235, 15, -324, -501, -270, 15, 149, 317, 25, -64, -249, -264, -295, -305, -181, 195, 426, 353, 34, 62, -421, -360, -240, -125, 312, 456, 320, 196, -1, -363, -373, -236, -84, 260, 463, 82, 70, -372, -206, -429, -114, -134, 42, 327, 136, 270, -370, -270, -390, -250, -64, -99, 220, 58, -32, -174, -103, -260]
5509b60N03k55Q6J50M6k36j73n0l44L63L71J06j66J87j69K5m11R1p8M10N5n4m7
5532A50n7m46J68j1K34K9L08j88j44j08k46j26J6N35J99K6r2o1m15J19j41l6J00
5555a87N68Mj92n7o6j55Ok06J40J17N98n03J57q7l10o5j90K72J63J06M69l72j08
5578A02l49L4L74m33L25N7K9P9p8J5n07j91N11J35J24rj13l23j9k76O8L17L06
5601A78R3K53l98k37j38R9j32K53n7L35n4j59Lj08j10l62N38kN61j29l41l33M
5624b43L28l97P59n67N27n6k37J40n86N8j60M25J11K29k23r4j82O8k30L67j45
5645a08M03j30J11L9n11N6j63L63K19r2j34J72k4j99l30J0K31J82J84l2O6J47
5667D60n57j20j49J22L48K24K6o9k74j96k26L77k23K31J46pJ95k24k67K2l29O40
$$ y = [-260, 243, -12, 74, 224, 270, 34, -139, -189, -533, -170, 201, 307, 141, 328, 159, 184, -227, -136, -214, 196, 251, 197, 150, 93, -353, -185, -196, 38, 67, 375, 187, 43, -65, -311, -437, -421, 114, 313, 339, 247, 186, -229, -110, -251, -287, -187, 381, 385, 193, 136, 70, -85, -79, -285, -145, -28, 570, 67, 224, 137, -173, -238, -428, -156, 7, 113, 582, 210, 102, -247, -213, 161, -272, 53, 110, 139, 218, 140, 155, -352, -543, -32, 103, 227, 218, 105, -218, -237, -513, -445, -128, 178, 271, 524, 126, -111, -249, -150, -282, -29, -86, 249, 195, 36, 39, -69, -179, -541, -3, -5, 556, 427, 86, -247, -243, 85, -312, 447, -120, 407, 351, 114, 254, -332, -274, -434, -9, 102, 331, 108, 14, -168, -100, -330, 37, -108, 295, 165, 276, 315, -196, -140, -303, 60, 279, 187, 53, 225, 201, 2, -328, -318, -87, 95, 279, 247, 313, 460, -97, -217, -366, -244, 104, 328, 354, 285, 11, -185, -411, -34, -257, -26, 120, 113, 308, 84, -183, -161, -490, 150]
5689A50j79L82l38L03L3q46M26j02j49J61L43j07K84l39k17J68l26K08J66J45
5709A66oMJ94k68q3l28K14J24L9J11m6J1Q8o64L12K52J89O1j95L2J33n63j62K25
5733a60j01L62j97J64p8Nk07J5K01k7R0k3J05j72N4j5k72J00j67L44K51M8J7j38
5757A99k34k93J20J43L3K6J55j44K44l68j52L0K50o5J35K44l25L5j46k48L07J71
5779A17O7J71k35J6j61M2j49K93l40L05j24O48o48J06N6j70j96J98K12j03M60
5800E65k32n25L67o16J84L30J28Q8n8J2k72j33j62M5K88J33j95M8J78j17l32M38
5822A62l64J35J20L1k3K9q5m8j56O8K01j57K29Nj19Q7k69J16K2n7L63J91k43j90
5846D8jN1P0m55K81k9J80n3%qk61k2L14l1o6K44J33l25l67J66j6j14K41J13k77
$$ y = [150, -29, 353, 15, 318, 351, -495, -69, -171, -320, -159, 184, 77, 361, 22, -195, -27, -353, -145, 21, 166, 160, 164, 358, 90, 7, -321, -107, 17, 56, 167, 121, 132, 220, -444, -132, 120, 309, 370, 175, 207, 340, -223, -385, -160, -261, 101, -96, 68, -10, -5, -212, -197, 4, -23, 67, 44, 149, -23, 31, 16, -256, -156, -323, 21, 272, 320, 337, 199, -35, -328, -208, -65, -32, -6, 149, 5, 249, -119, -271, -241, 9, -56, 79, 323, -2, 33, -113, -361, -54, 117, 184, 355, 120, 136, -25, 17, -132, 161, -179, 126, 2, 650, 2, 108, 164, -6, -202, -4, 208, 105, 565, 333, -192, 175, -441, -257, 73, 201, 289, 231, 243, -29, -162, -324, -279, 9, 142, -53, -5, 173, 56, -276, 162, -202, -67, 53, 84, 61, 90, 5, -43, -199, -131, 70, -87, 142, 147, 28, 115, -154, -38, -16, -73, 290, 481, 238, 48, 47, 98, 168, -287, -6, -35, 145, 92, 92, 84, -177, -199, 115, 84, 18, 262, 395, 70, -297, -131, -147, -261, -20, 93, -184]
5871a84M53j33Q1j68j96j77M90k17K74j30l8j3j61J55k27M95j47pqK9n18K34k6
5894a39J09j7K5J47K11k01r3m69J57J48O6R0L9k11K80j93J05l49L26J54q1P9L45
5917E28k95nk55K1p8j7K59k43J10J68k88j49J34K21N1q9K87j91r6J47l77j07J05
5940a59J81j38N46l06Nl9o06K21QK52M1l5J06J96l88k52K82j10L40J76j60k39
5962g8K31k72q4P9pK82j1P0M9j6o46K86j92K18o7N32p5n6k37j21P7k2k73K95k1
5987e9R3L64k70j54j34J89j60o6J6N75l13nk16j69R7j01K95MK66j20o0l28J57
6010i9k2j46N56j12j26J27m22J61o1k2nJ89J82qk48K17j66l16J39K61j1J60K21
6033D49l02k21n0j9K51k83J67L28l43K63k14j21l49J94O28o20L77J05k08N0l25
$$ y = [-184, 269, 136, 217, 49, -147, -324, 166, -51, 223, 93, 55, 42, -119, 36, -191, 304, 157, 150, 142, 171, -347, -113, -139, -30, -47, -22, 125, 336, 135, 42, -427, -270, -122, -56, 34, 73, -138, 142, -51, 54, -295, 31, 185, 104, 183, 528, 233, 228, -27, -6, -84, -101, 158, -85, 25, 193, -95, -244, -110, 111, 162, 73, 360, 169, 73, 220, -157, -264, -159, 22, -116, 430, 124, 129, 90, -516, -295, -287, -35, 6, -29, 77, 273, -115, -367, -85, -195, 145, 321, 161, -78, 153, -119, -203, -124, -131, 151, 140, 210, 259, 243, -403, -117, -309, -91, -158, 374, 299, 243, 6, -115, -38, -60, -333, -38, -59, 34, 398, 128, -26, -160, 29, -131, -197, -181, 394, 81, 76, -140, -309, -212, -313, -18, -14, 252, 132, 72, -256, -99, -121, -267, 289, 177, 51, 178, -244, -83, -144, -166, -171, 18, 200, 192, -56, 161, -5, -321, -182, 79, 68, 228, 449, 147, -74, -124, -143, 108, -175, -8, 320, -23, 240, 26, -95, -444, -250, 378, -242, 135, 240, 32, 82, -243]
6054b43l4L2K93k8n2K56lj23P9n12M05k25K26J59j67n4j27l30M56%p6M76j57k87
6078c6K40N7l80k65L23j09K28K29L0K64n73M31m76m9J35M8P0J09k77k31R4J34
6100do3k5K3K79k01K16J1o61Q7K66J24Q3R9k40L87n17q3P2Q5rJ44J3K13j08K3
6125B14j44m5l79L73J85K00r6j2j59k32k18N3L15K24R1l61j12K87n90K56J0p3
6147b13R2J03K15k38%o6l2J46L8K88j23M8k70j62J28j6j59p1%O61k79q5O5m39
6171c69L11K74L2o26M47J6O7l43K62l50L43K50m70J70L8m4r6J60m07M50j06K43
6193B52j09P8p5n48O65o8j14L3J56r3lk51L11k99k07J21m3K04L81l69M10l69m78
6216d15J18N21k67R6Q9J87j46l86J36r3L10k19K2K31k5P9m88L25J09l67L19k01
$$ y = [-243, -277, -245, 48, 20, -32, 224, 221, 98, 177, -335, 70, -155, 71, 230, 63, 9, -118, -448, 8, 8, -68, 408, 251, -36, 204, 261, -119, -384, -61, -170, 58, 287, 317, 581, 8, 439, -37, -86, 49, 97, 167, 276, -1, -232, -138, -4, -67, -92, -69, 210, 9, 225, 236, -425, -338, -72, 52, 135, 234, -6, 381, -136, -219, -147, -62, -71, 73, 86, 299, 191, 214, 70, 25, -354, 19, 204, 404, 308, 296, 137, -95, -313, -260, 55, 279, 370, 9, -103, 184, -406, -150, -140, -213, -121, -18, 197, -41, -41, -107, -139, 7, 45, 333, 210, 258, -12, -174, -46, -62, -221, -292, -292, 369, 90, 5, 70, -369, -58, 216, 248, -378, 69, 85, 152, -191, 71, -279, 64, 314, -156, 14, 52, 8, -88, 72, -335, 115, 9, 252, 143, 221, 146, -402, 263, 195, 81, 114, 270, 177, 174, -77, 234, -65, -272, -151, -194, 10, 391, 22, 432, 63, -415, -297, 224, -43, 53, 142, 329, 183, -203, -67, -160, 150, -69, -47, 184, 159, 238, -250, 75, 184, -183, 136, -65]
6238f5J42LKq3pm73L00N2N16l12j32K29m84K77M6j10P4J67m9J21k25j29Q4p8J48
6263A4J09%R5k17k6K81m96M5J78k6R0J76j70j01l67N34l17R8K60R7j43j49K23
6286A88m12Q8J37k01M46J00l36N9J5k77J34j68L4M76j15j36Ko0J81k41l6j07J92
6309c7K40J1k42M1k35N4J51q7K20J64l00J4l2k00K34j91p0L42J01K71m49o4j92
6332b56j45L52o5K10k27K1K38k47j32K50K9m7J91l36L18j72j49L9L4j50L20k01
6354a25L37J07j78Kj62j11r6L64K00k40N06l35q3m21J06pL50j63j43q8M77l18
6376b1l6j7j64K2L02J09l52L58k95K87n30K28J22R3l8R4Kr7m11K42j00J28M5M13
6400C84n57N60m63j51K84k15K94MK9J25l39K34l25l51M93P0j65L20n9k63J87k64
$$ y = [-65, 77, 80, 82, -1, -8, -481, -181, -129, 387, 75, -57, 172, -312, -35, 11, -99, -25, 142, 93, 214, -11, -140, -56, -134, 14, 123, 123, 218, 1, -25, 256, -240, -195, -17, -43, 47, 223, 53, -48, -415, 119, -198, -100, 160, 257, 114, -35, 188, -224, -136, 1, -200, 246, 346, 10, 69, 84, -193, -59, -227, -193, 283, 168, 32, 34, -26, 155, -86, -122, -229, -37, 203, 214, -28, 13, -222, -168, -17, -104, 116, 280, -20, -6, -38, -238, -4, -195, -265, 77, 178, 449, 0, -64, -256, -401, -49, -114, 96, -131, -110, 128, -119, -251, -1, 28, -19, 172, -164, 154, -18, -167, -128, -94, -244, 76, -125, 212, 319, 141, 143, -19, -130, -226, 138, 338, 98, 604, 269, 186, -235, -129, -136, 214, 51, -92, -180, 297, -21, -57, -74, -238, -216, 86, 195, -157, 201, -94, 193, -337, -109, 13, 106, 68, 162, 164, 67, -344, -102, -202, -74, -29, 384, -173, 387, -76, -227, 57, -158, 136, 140, 169, 294, -45, 189, -136, -487, 6, 76, -89, 231, 172, -91, 96, -168]
6422a68L29k25K07K54p6m66K49m68L87r5l06P64l26P2J7j50n2J43l28K15Q3o7
6444gJ6o9K98o4q7k45j32M49L4O7k05j69J26r7j19J72k0k4J75k20J58j11k13Q3
6468b04J0J67J46j47kj3k19K23j78L35j71Q5Q2l35L09n8n58K89J94J01n6j48J78
6491C0K30k05k09J26J84K9j3pp3j68J96j06J88j47J41o7R1k42K32r3j92K7j10
6514a58L12j8J5J23j87j94M4J6J97N2r0j53OL65o25K74J67L9k08l18O67k52K31
6537C05k12l81J79o5L51J31j56q0j0l80N37m30Q4K42J22J18l34L7J1j10J76K58
6559C93l19j21J84r3M9m0l96O8MJ02L43R3l33R6k44J01K68M7r5J12j8j16J72m27
6583a70K0L2J62L85j63j20P9l84K67N6o6o2j34K46L3j10j86J92j39J93m6J88K7
$$ y = [-168, 161, -64, 143, 397, 321, -145, 104, -364, 23, -72, -378, 386, 60, 132, 149, -1, -53, 90, -238, -23, 60, -7, 9, -60, 238, 174, 87, -158, -290, 159, 193, 260, 55, -114, 12, -85, -204, -32, -52, -76, 99, -121, 37, -74, -287, -204, -194, -27, 119, -28, -30, -43, -262, -39, -217, 118, -53, 32, 114, -221, 88, 30, -528, -239, -45, 56, 0, -148, 30, 260, 55, -154, -28, 156, 185, 172, 165, 92, -76, 120, 14, 202, 55, 196, 129, 220, -22, 210, 117, -75, -48, -158, 154, 136, 151, 274, 87, -107, -63, -47, 150, 202, 112, -41, -35, 330, -295, -21, 146, 185, -23, -341, 326, 74, 305, 93, -288, -109, -174, 177, 308, 152, 72, 62, -318, 219, -211, -127, 115, 237, 355, 21, 58, 69, -41, 135, 393, 74, -47, 137, 44, 93, 53, -343, -275, -271, -169, 174, 267, -66, 30, -214, -113, 155, 202, 107, 219, 201, 85, 257, -170, -150, -118, 44, 429, 266, 146, 225, -159, 108, 164, 98, 36, -98, 148, 181, 71, -115, 77, -62, 131, 85, 273, 300]
6606C00k54k58J72r0K36r5K57j45P0j04M5j70J01j66j62K89J54j76L83n06K90
6627A71l0l71L29k98L43k41K57Q7m20J51L35m83Q3j34L39j35J15n4n7k10L88j36
6649B9j74L24P8m54Q2k78L17r4J33kJ35j22M8j65j4K7J97J76j44j00K1J7K1qk00
6674a50K6J86r6j00K54l66M14l25j50J28K39K02p0k00N5k03J37L3l98M64N3q4
6696D9k4L45k69j80K2j53K61o6R6l11L39J3j42N%o5p1L42L38l28l12Kn8j72J58
6721a81m4J83J71j96L1l49M47k03J16J06k02J50J16j58n27L35K49J74o6k0l13
6742a81K88J24m59oJ26K55K79j61l60J06o7l2p7M35j28Lp0r4lp1n4j02L81k8j29
6767b5L33m96M77l19m09L93l5LJ64r8L76k90k7k91K5J41K19K18m54M57n33j26
$$ y = [300, 46, -212, -40, -130, 106, 11, 268, 123, 193, 89, 134, -36, 65, -101, -263, 26, 180, 4, 387, -119, 171, 141, -230, 99, -199, 144, -97, 160, 247, -173, -22, 313, -170, -87, -221, 118, -17, 98, 44, -13, -223, 165, 29, -145, 179, 257, -197, -115, -393, -76, -170, -37, -39, 96, -26, 22, -143, -157, -130, 67, 243, 99, -1, 20, 37, 58, 50, -150, -124, 62, -34, -134, 120, -246, 168, -157, -307, -179, 60, 262, 192, -8, 47, -156, -19, 14, -384, 80, 133, 49, 25, 370, 101, -79, -57, -210, 51, -15, 81, -230, 109, 122, -20, -15, -15, -80, -151, 191, 529, 201, -111, -109, -167, -339, -181, -225, -42, 129, -67, -36, -385, 62, -141, -25, 81, -121, 29, 145, -13, -540, -205, 44, 218, 152, 132, -181, 107, 231, -228, -234, -108, 147, 426, 265, -95, 11, -56, -88, -165, 270, 142, 145, 75, -19, -22, -93, -147, -249, 132, 104, -25, 308, -188, 289, -30, -439, -46, -81, -78, 86, -12, 364, 74, 47, -244, -219, -78, 141, 359, -95, 362, -171, -297]
6789b97J85R3n3k8N9k1R0j24R4j89J04J09n1K32j14r1j00K04k71K71k73K01N6
6812H6p1K25l69L74j59P2r5l3M7j95J81Q9j19k80K09j18K17jj75M8k5jj26J66
6836e3J04p3L8k48J97J31l14K18j45K0m8M81k02J2J6l91j36J74L82j10p0J37p7
6859D3k7O7J5o7K70l33K90j88R5j11n5k83J68M70m45j3K28j73Q9K82l77J08k27
6882a74M76l93m4J47mk40j59L28J01q4K91k36q7n7J33k99J51J26l9L63l01J13
6904A12L3l51j4K20K73k21n7j59J21L07l41j49N8K41L9j16J56P0j29k34J18K65
6926B42j17L2%p9j26l7k29M06j05J27l64J66L79l86Q8m63J99K89K44o5k61q0J30
6949a0l5j29J66l4K86m57L37j32l1j41K33q9j01K26Q3Nk39R6K05j08l23Q4L75
$$ y = [-297, -112, -19, -72, -100, -41, -62, 28, -96, -2, -191, -87, 22, -29, 203, 89, -2, -102, 102, -169, 102, -171, 30, 86, 15, 240, -129, 245, 86, 158, 63, 30, 77, -118, 63, 152, 33, -247, -38, -156, 61, 60, -115, -67, -92, -93, -219, -53, 51, -22, 16, -232, -35, 96, -218, 0, -145, -125, -173, 308, 106, 118, 134, -257, -393, -219, 163, 53, -17, 120, 43, 16, 83, 98, 31, 301, -32, 258, 70, 165, 54, -1, -284, -116, 354, -91, -104, 124, -49, 40, 322, -55, 53, -174, 302, -91, -135, 12, 8, -232, -391, -63, 38, -46, 245, 9, -78, -135, -2, -301, -150, -24, -63, 300, -1, 112, 145, -206, -220, 0, 273, 52, -5, -164, -43, 264, -77, -226, -168, 73, 112, -4, 152, 222, 93, -141, -23, 242, 125, 157, 157, 78, -48, -85, -314, 92, -13, 114, -250, -84, 295, -91, -3, -466, -267, 22, 266, 201, -60, -140, -10, -45, -174, -8, -42, 244, -213, 124, -8, -39, -180, 53, -36, -137, 89, 172, 177, -62, 34, 239, 131, -192, -108, 267]
6972B67j15k37L01j27k24l9nL5L30l46O73k81k46Q4l82M1j07O64l50R8n8j31J05
6995e0N0j79K85j76O3l20J72J1Q9L4M20l68m2kk65L79j76J3Q6J78k98P5j48N94
7019D25l70l05K57L38o33K44L74k43K50k29l32K03r7n1N7K62K27o2k82Mj96j17
7041b76K42q4NJ85o0j14j83J72j51L01j1j8j82M65n94N75q1m00J19J80j38L17
7063B69j02p9p8j90K48k23K12L1l28L42m2j5j53p5P8L77k26K76k99J11j93j89
7085b48K14O1J83l96k07M47Q4Q0m15K03QL2J05k87N64l01j36J03m9P9nL13k48
7108A84k64L08k61l6K1J71j28K15p6L2l6j04j05K41k39R5o2J73J71o42K08J34
7130@L09n79J37j04L51k26j30M4L71J9j82j24K45m1j05N8K8j81J52k66J82j95
$$ y = [267, 152, -85, 216, 89, -135, -174, -179, -144, 186, -160, 513, 232, -14, 70, -312, -271, -378, 286, -64, 34, -24, -155, -50, 0, -179, 106, -70, -7, -327, -155, -144, -55, -21, 399, 31, -11, -13, -278, 101, -75, -62, 24, 202, -96, -21, -169, 425, 55, -250, 7, 345, -288, -44, 330, 87, 337, 108, -224, -21, -118, -169, -112, 150, 377, 315, 33, 37, -159, -276, -34, -118, -113, 72, 12, -102, -285, -113, -264, 37, 26, 8, -174, 291, -303, 272, 191, -209, -90, 90, -48, 269, 167, 88, 10, -180, 68, -155, 57, 88, -240, 102, 60, 45, -108, -183, -105, 272, 46, 322, 23, 134, -59, -248, -34, 27, 210, -186, -393, 54, 138, 218, -197, 6, 14, 46, 151, -136, 428, 127, -9, 94, 45, 124, 119, 432, 184, -80, 228, -33, -69, -48, 123, -5, 210, 134, 166, 130, 26, -79, 162, -77, 18, -44, 129, 300, -342, -134, 0, 309, -270, -133, -237, 114, -112, -242, -198, 173, 192, 10, -114, 131, 90, -15, 43, 71, -110, 42, -224, -42, -237]
7152b37M66n2k78J89l6j91j88J61J18L06m17K45k05O2l9O1N1M7K4Q4p1l68K71
7175CQ3N2R7m09P2j00o0L08oL0p4Q4j19q6K21r8o4J4l2K5j35M02r8k07J52j28
7201g3jl28K13J26l4N5J07n1k93L5J40J05K0K49j70J7k87q5K08m9K75k45j2K54
7225A76j01Pj23k52M09K3m1j51Q8J7m07R3L52m22L3M87n0j12J59j92j8r9K98o2
7249A12k16K41k26J22k22Q6j10m1P6J18J49L1L7k84J6J35o7K2J68J14m3m4k72
7272i8O0l69K01K13J9j63O68k99k76n7kK83m48J73N26l58k52k20N99j60k90K80
7294C0j15K04j59J12l11L47p6L4L7j55L06q8n5j9J09m98K50K9j07L7K87o3k87
7317a51p1J13q6L14j28O0j30O7L14m20K14M9j49j59J74K31N5k29j63J59R4k60
$$ y = [-237, 229, 177, -101, 88, 52, -139, -327, -166, -48, 258, -159, 86, -119, -57, -96, -35, 16, 63, 87, 171, 100, -268, 3, 86, 138, 235, -174, -102, -202, -262, 46, 40, 70, -4, 80, -39, -125, 96, -2, -66, -52, -84, -59, -194, 208, 110, -97, 55, -73, -74, -402, -189, -63, -97, -42, 65, 14, -279, -244, -104, 1, 21, 270, 100, 117, -170, -255, -47, -96, 179, -66, -78, 176, 75, 82, -41, -293, 116, 139, 98, -53, 35, 52, -355, -262, 90, -332, -299, 188, 138, 26, 185, -7, -25, -124, 174, 112, -104, 137, -89, 33, -189, -103, -213, -254, -178, -60, 89, 120, 157, -127, -111, 24, -43, -21, 147, 261, 218, 174, -98, -38, -407, -206, 7, 26, -137, 531, 232, -44, -101, -103, 180, -268, -95, 431, 73, -179, -399, 200, 40, -250, 30, -85, 119, -40, 72, -239, 108, 32, 66, 103, -52, 254, 166, 111, 92, 201, -297, -47, -18, -125, -88, 199, 136, -151, -222, -109, -195, 119, -9, 51, -79, -12, 302, -118, 96, 145, -4, -163, 11, 242, 297, 68, -95, 64, 158, -102]
7339a02J78l3L73k08j27k48J2Q5p2J95j47j7j21M19l23K87j44j83N3K34m28L79
7361F2l26K36q3k0K60M2j73J10j01j67J15K9k63K21K75j30Q9k82j79M71l15j63
7383b92J23J84j32J76j48k03o6K15K76k59K61j04KM0j5pNl1J38j73k08M00k9l98
7407b45q3M29j92j10L46j65M3J14Nk2j53P2k2j76M65m41J43L7k45O3j30Q2N6N7
7431g2L6K12k48j0K81k98K11m5Q9j85K4p7K88l72R3L36k26q6j56J33J9j99J93
7454e9K61j77K07l6k69K49k08m54O03k27L86k8j31j70j83K40p4O3p3p6K06j90
7476a40K25J45j68j46j89j20L09L09j45k7k01MO3J24K20l55P9O2p1J43j48rK48
7499B12l30JJ48J04p1p8n2j70o7J26K34j16J12k11K35l47K06m2L32l64J02k8k0
$$ y = [-102, 76, 43, 416, 208, 81, -167, -155, -70, -142, 53, -94, -111, -232, 187, -136, 151, 7, -176, -123, 111, -317, 62, -264, -28, -111, -131, 129, 171, -2, 108, 7, -160, -45, -16, -279, -58, 217, 87, 176, -106, -285, 186, -129, -292, -169, 15, -117, 59, -89, -292, -358, -143, 133, -126, 135, 31, 33, 73, 58, 51, 56, 25, 163, -10, -218, 182, 153, -245, -328, 101, -91, -201, 145, -20, 23, 137, 142, 120, -33, 39, 17, -159, 306, -135, 8, 45, -200, -137, -267, -185, -129, -72, -36, 176, -72, -82, 199, -99, 112, 67, 156, -29, -5, -82, 206, -166, -73, 263, 37, -49, -205, -72, -53, -252, -59, 202, 25, 232, 196, -73, 176, -32, -486, 117, -110, 276, 248, 117, -53, -236, 4, -70, -7, -80, -156, 50, -140, 85, 230, 62, -84, -273, -393, -84, 225, 80, 53, -148, -144, -81, 43, 263, -92, -13, 49, -22, 121, -27, -36, 212, -118, -117, 31, 135, 64, -14, -66, -236, -303, -177, 57, -59, 53, -158, 77, -270, -64, -106, 226, -138, -36, -64, -84]
7522h4J60j19j87N9K04l6n0P6j98J40K42k90K47j73K90l70J1K06N3l45kK32j37
7545g1L12l02J57k41L02M8k32j36J19J84j43n1K08k94n8K53pm12J86L08k01K87
7567B16j59K41j38l43j28O09l24K08k8j1j81lJ28j72J39K5L36k50k74R2K22k79
7589g4K78k05j44J41J2Q8k42p1K77J3j36J57j81J2j22K10j45QNK45J41k50J98
7612B15j69k22j63K07N0J77J60l60M0j38j32K50K0KpJ27l4J77k26K7O6P4k46L02
7636A97k95L7j32j18P7M2Q9J84P2L1P7k85q8J58N1n9l23J37K28OJ89l01j12MK56
7661A22J82l04j70JJ29p6N9r7l0J14M15k78r6J9o4m5K94j01J75k20M8R1j03j17
7685e2J16k6l19K97J8j60K57k07J22rM7N9k17K3J15l2j38K95j02k72J05L11l0
$$ y = [-84, 76, -43, -230, -171, 33, -3, -53, 23, -175, -35, 207, -83, 164, -9, 281, -89, -78, 128, 181, -164, -166, 66, -71, 241, -61, 96, -145, 157, 205, -27, -163, -44, 140, -3, -54, 154, -140, -198, 55, 48, -364, -178, 130, -71, 216, 57, 298, 160, -183, -311, 298, -26, 182, 154, 143, -38, -41, 87, -85, 54, 79, 415, 165, -109, -17, 205, -74, 204, -1, -145, -4, 8, 96, -146, -217, 60, 73, -63, 94, -87, -75, -197, 13, -132, -124, -119, 126, 267, 17, 215, 46, -176, -339, -132, -82, 95, 255, -105, -65, -203, -335, -85, -65, -63, -70, 57, 23, 200, -26, 1, 67, 141, -105, 197, -98, -61, -193, -311, -234, -192, -103, 81, 153, 184, 261, -24, -112, 46, 97, 38, -285, -148, 80, 86, 275, -26, -138, -134, 122, 304, 0, -170, -169, -40, -116, -57, -154, -184, -70, 345, 67, -29, -10, -74, -119, 175, 74, 249, 29, 77, 168, 65, -52, 64, 38, -281, 16, 34, -126, 131, -76, 46, 37, 84, 143, -74, -51, 64, 32, -106, 189, 87, -185, -80, 231, 201]
7708B01k29n5k4J85M5k4o6j4j8Q7o4o0R0o0l09L87k56K19k3JJ71k98J11Q4n1j40
7734a10K29p4K07l37p7K2J92M5k45L00l26J9j66qL47O5j44J94o7q6k20M87m76
7757b29J03j22K47k28O9R5J49k70K09p1K51j61J72j42k6Q4K04l27j26m7r7L24
7779F1L0Pj3k14J52k23J23j70K10J88k53J27P0J09k25K00j22okJ73n3o9k43R7
7803d6r6J53M43n93L42j89J10p5j70J94kJ33j8j35qj29k91L10k32L58P4J63j44
7826A52j78qJ7R3m1j5k42j02N44r0p3P9M3j93R5o0J82P2k59m8q6l0Q2m2K04K21
7852C17l28J13M5k85J59n7p1J20j9k2P4P3J03k57j26M25P7j13L9j32j87M8k85
7875b89L31R3j57K46k20K4M3j08K93m8j81k89M19l79J55J52L5K1k83L28m1r0Q0
$$ y = [201, -28, -83, -107, 78, 123, 99, 33, 19, 1, 88, 24, -36, 54, -6, -315, 72, -184, 35, 12, 13, 184, -114, -3, 81, 30, -110, 119, 45, 252, -85, -162, -140, 52, 97, -148, 152, -174, -155, -321, -329, 18, 83, -61, 133, 66, -20, -240, 247, -229, -126, -248, -1, -229, -160, -65, 84, -186, 23, -48, 203, 42, 214, 72, 46, 130, 334, 7, -119, -166, -263, 61, 91, 98, 85, -129, 23, -200, -77, -247, -37, 151, -102, 25, 95, 204, -21, 179, 57, 51, 49, 222, 169, 100, -143, -46, -142, 11, 454, -139, 203, 14, 124, 49, -121, 73, 71, 204, 186, 51, 43, -86, -377, -67, -299, 59, 133, 296, 152, -26, -34, -17, 76, 35, 20, -222, -324, 220, 130, 57, 136, 179, -14, 81, 21, 203, 275, 16, -32, -118, -148, -66, -108, 96, 317, -11, 102, 147, -138, 21, -36, -107, 13, -6, -28, 46, 119, 222, -35, -161, 264, 341, 228, 267, 135, -52, -4, -289, 42, 135, -22, 224, 4, 28, 71, -37, 256, 208, 27, -262, 157, -222, -67, 85, 120, 141, -142, 186, 145, 55, 135]
7898A35J47j96M8j87l8J87j10L3J59k20J48k9m82K93Qo3M13o05L12J72j69M6K8
7921C0j28J12Q7j78P8j73K49m58L03L70k52J9j51K11j49l39P77n49Q9K66q6k62
7943a34K06j88L6lj24M25m79N38m32J10J62k50J84M0L3l47M09L7j93Q1r1q4o9
7966a33N6J34L7J22J5m13L13l01R2K32l66K75M5k6k87K38J38l84O8o5N40j55k74
7989i9l4j97L57J73l97K37j50J69K1l77l0M7K86j5K89n53K88j83J54k06N76k65
8011I1k14L31n9k76J09p7J56o3k70K37J51J09j46j04l1Rj15O9K39j21N2k02J16
8034il27L39j13j20L36p6o8Q6j87K46l04qJ52J10j37J83q3L1J21l60M65k28L63
8057D12j96j10Q6j44j52J57K8k2J49l37K45J79n00j49L77L4M7J30k73O4R3l37
$$ y = [135, 282, 86, 134, -53, -91, 96, -14, 19, 178, -42, 106, 77, -405, -112, -104, -167, 246, -359, -47, 125, -44, 2, 30, -98, 14, 101, -77, 1, -172, 77, -381, -78, 292, 40, 59, -92, 119, -30, -369, 408, -141, -52, 214, 128, -134, 72, -116, -80, -83, -207, 218, -261, 277, -155, -45, 117, -133, 51, 91, 124, -223, 186, 223, 30, 111, 20, -64, -133, -77, 57, 94, 216, 231, -182, 131, -170, -78, 154, -212, 63, 108, 82, -205, 33, 171, -213, -145, -210, 330, 175, -99, -133, -330, 27, 200, -197, 40, -110, 59, 80, -297, -327, -280, 6, -9, 280, -273, 15, -168, -14, -220, 356, 91, -123, 208, 149, -127, -18, -95, 61, -2, -272, -35, 116, 225, 79, -25, -56, -47, -162, -93, 146, 25, 77, -125, -9, -336, 3, -110, -230, 106, 30, -38, 48, -139, 107, -197, -205, -53, 57, -80, 103, 20, 51, 172, -188, 277, 49, 412, 216, 106, 192, 48, -104, 53, 81, 59, 208, -129, 116, 295, -205, -354, 23, 57, 104, 234, -39, 25, 118, -219]
8079b19N6MJ72K69l42j19J4L07j81m1J16j04j13K05n6K30j10qk03J50j5J29p1
8102G0nK7l2O0k46J84J28n0k23P7q0JJ15P3k10J73P9J8j26K2p8nN1n3Q1R9j85
8129c5J29J01p3j11o7M6K2J02m8nm6O2j66l9q3LN00j11J3j53M6l52L10j65K44
8154A24p7j8j67K57K80k73R5k53j11K62O5l20L2j34N51j3l89m8K25k02M8Q3Po4
8178d0o4L6j47N97o19L45O3k6m4Rj54PJ87
$$ y = [-219, -163, -159, 13, 282, -60, -179, -165, 142, -39, -80, 36, -68, -181, 24, -32, 198, 88, 80, -123, 27, 12, 141, 70, 65, 92, 60, 120, -126, 58, 186, 136, -87, -10, -90, -89, 26, 99, -111, 62, 141, 159, 33, 55, -23, -28, 23, -30, 51, 150, -35, 94, 195, 122, 11, -56, -10, 12, 114, 66, 61, 15, 77, -89, -128, -211, -208, 292, 181, 194, 41, 87, -265, 45, -120, 124, 47, 29, -138, 119, 399, 126, 221, -32, -143, 119, 184, -136, -104, -238, 313, 300, -89, -137, 88, -114, -66, 17, 24, -40, -104, -68, -215, 382, -237, 108, 171, 145, 101, 110, -44, -37, 150]
8191A50
$$ Imaginary data points
##PAGE= N=2
##DATA TABLE= (X++(I..I)), XYDATA
0@%%%%%%Nj3J6j6J6k4L2l2M0n2O1p3Q8j04J22j43J67j91K20k55K92l32L75m24
30b25M80n40O06o78P57q46R41j046J161j286J426j579J746j933K140k372K635
47A387k934L276l670M135m688N361o205P294q767J0880j4185K0142l4255J28511
61A06282J34183j72093r4993o0021m6557l9556R3678J42882Q9722J36l2769j03779
73A7115j37781o6893O0657R0188P7457Q4427N8589o6064j43249r3881j5630L388
85a31677N4031J34628J14825j6191q8981p0969p2093q7104P20J27155J30973L6318
97A31635j1915k4310q2879j24573n5700N0323Q6504Q4837Q3760K4244q3902j20059
109d2035o1176j5213m45N9778J27185Q6933k1924p1750p0522q6137o6642L9241
$$ y = [0, 0, 0, 0, 0, 0, 0, 5, -8, 8, -8, 8, -16, 16, -16, 24, -28, 33, -40, 48, -56, 66, -77, 90, -101, 119, -136, 156, -176, 199, -225, 255, -285, 321, -357, 400, -446, 495, -551, 610, -676, 750, -829, 917, -1016, 1124, -1248, 1387, -1547, 1729, -1941, 2194, -2494, 2867, -3338, 3956, -4811, 6069, -8116, 12026, -22229, 106282, 240465, 68372, -26621, -86642, -133199, -172755, -79077, 63805, 153527, 153663, 120894, 17115, -120666, -187559, -126902, -36714, 40743, 125170, 183759, 117695, -25554, -119435, -135065, -131677, -77646, 56982, 171807, 155616, 66635, -4334, -76427, -163531, -162811, -35656, 95317, 131635, 119720, 95410, 12531, -112042, -167742, -117419, -30915, 53922, 137682, 161926, 78024, -42035, -103211, -118424, -118869, -59091, 68094, 155027, 133103, 61353, -9169, -95306, -161948, -122707]
121a22707J22206Q4560J8056R371j3923r8915j25611l1007O8343Q0957O7676O3505
133A22511J2560p2047r8004o1776k7455J2148Q3980J15721M8247l5209n1537n5855
145f716q4882o0148M5230J12846P6885K2356K276l8600r7458q7366p314M7219
157g5672N7725P3996P3013K72q6604r2859m5356j3382J9638P4263R3347M0536
169A18917k1085m7924p1027q3133l1664N8998R1003N6581K6923P042m7197r7023
181c9589p0649J415M2076N6188P4320N9373j5200p8803p5259m1431j7804K3123
193h2240P8988Q5425K8682k4788m8355o7467o9516j7868N2310P5607N6765L4082
205A01625j477o1105r0464m9993Q163L4735N2076P1566N0775k0271p2840o9052
$$ y = [-122707, -501, 84059, 102115, 111486, 97563, -1352, -126963, -157970, -89627, -8670, 59006, 122511, 135071, 63024, -34980, -96756, -124211, -112063, -28083, 87638, 135885, 100676, 49139, -6716, -91598, -151746, -106516, 6330, 83215, 105571, 107847, 69247, -28211, -115577, -122891, -75672, -17947, 56049, 129062, 129334, 42730, -50129, -95485, -108867, -89229, -14966, 78381, 118917, 97832, 49908, -21119, -104252, -135916, -76918, 14085, 70666, 97589, 104631, 57434, -39589, -110238, -108823, -66747, -10559, 63761, 123134, 107934, 29131, -46128, -87559, -105363, -82240, -3252, 82173, 110855, 86067, 37712, -29755, -99271, -117139, -64829, 10778, 67543, 101625, 100148, 39043, -51421, -101414, -93251, -58516, -6440, 65126, 115901, 95630, 22790, -46262]
217d6262m2026j2967L4158P6885O9264J9581k0897m4549o7793o3784q719N2943
229e4166O9410N2719K9876j0222o0982p6993m2411M117L3485N8561O8600L4528
241A06522k7265o3032o0293m1482j0721L8674P4508N9977J6055k1301m7723o5707
253d1788n1898r9M8064O1937N1428K7454j6200o1955o9331l5860M994L5824N9173
266A1743O0727K4291k7328n7089n6964m0672m271M3103O8746N1733J3598k1531
278F6086n0145o2966m2169N239M5120N7967M9411K2051k2075n9662o1566l1064
290h3773N594L8370N9135N3506J6235k8433n3456n5059l5699K612M4416O1985
302B5433M6292J1820k3766n2224n8304l3719Q967M3336N5572M6216J5512k6379
$$ y = [-46262, -88288, -101255, -67097, 9788, 79052, 98633, 77736, 33187, -34606, -98390, -107109, -54166, 15244, 67963, 97839, 87617, 26635, -50358, -92769, -88652, -55167, 3394, 71994, 106522, 79257, 16225, -44068, -85550, -96271, -57597, 16911, 76888, 92943, 71642, 23919, -41788, -93686, -93785, -45721, 16216, 67644, 95098, 78898, 16943, -52388, -88248, -83254, -47430, 11743, 72470, 96761, 69433, 12344, -44620, -85292, -89563, -46460, 22286, 74019, 87617, 66086, 15941, -47025, -89194, -83955, -38835, 19132, 68543, 90594, 68519, 8857, -52709, -83773, -78179, -39809, 19326, 72832, 89067, 60634, 7178, -47881, -83580, -80968, -36552, 25433, 71725, 83545, 59779, 7555, -50749, -84468, -75501, -32165, 23407, 69623, 85135, 58756]
314E8756n5961n5312k8334P863M0553N7804M6058J0993k8595n2000n2567l0384
326h1126Q472M3895N7006M1979R287k6920n2314n3040k7378J1067M3104N4154
338B8186M1721R152k8931n2706n0628k5507J1910M2659N4401M0097O012k9378
350D6988n1181m9396k4092J3117M3454N2669L7559N846k9641n1687m8035k2034
362g6433J4115M3305N1590L6890L336l0703n0025m6682k0751J5024M3348N0589
374C3603L4854L106l1178n0160m5420j8604J6227M2391M9927L3815J256l2212
386C7605m9435m3366j7105J6433M2725M9128L1655m61l1429m8760m2897j5572
398g1479J8182M2571M6873L0674o10l2343m8987m0975j4037J8620M2388M6793
$$ y = [58756, 2795, -52517, -80851, -72988, -32435, 25369, 71427, 82420, 53825, 1825, -50742, -81126, -72654, -28759, 28247, 70226, 79513, 52593, 279, -52761, -80139, -69072, -25968, 28186, 69907, 79059, 50128, -2578, -53206, -78713, -66803, -24144, 30257, 70354, 76366, 46988, -4193, -53589, -77681, -64564, -21110, 31559, 69118, 74964, 45323, -6364, -54399, -76433, -62318, -19013, 32577, 69467, 72803, 42100, -7925, -54607, -75358, -60334, -16986, 33603, 68457, 71563, 40385, -9775, -55195, -73799, -57572, -15181, 34746, 68561, 69817, 37605, -11830, -55196, -72301, -55868, -13143, 35985, 67640, 67179, 35750, -13010, -55907, -71479, -53297, -10726, 36147, 66821, 66211, 33868, -15119, -56094, -70131, -51511, -9123, 37670]
410C7670K9182k686l3016m6899l9393j3650J8847M2777M6034K7518m533l2999
422B8852m6366l7839j2072J9651M2254M4735K6001m681l3399m6036l6922j0395
434f6217K0881M1847M2931K4990n328l4065m5568l4934q976K0927M0864M2797
446D0149K4274p266l4606m3955l3688q043K0975M1972M1678K1305q100l2922m3775
459b2002l3880o858K3876M0549L9210K0976p834l4165m3900l1720m362K2346L9873
472B109L9757K0417j0573l5023m0936k9866n869K3173M2008L8218J6369j0666
484D9118l2027m2003l0928k775K5723L8464L5826J8612r929l6342m1883k5672
496e3816j182K1733L8319L8816J7294j4899l5432l7353k6327l720K4830M1263
$$ y = [37670, 66852, 64166, 31150, -15749, -55142, -68792, -49945, -7168, 38866, 66384, 61851, 28852, -17514, -55353, -67425, -47774, -5520, 39215, 65216, 60535, 27136, -18900, -55822, -66217, -45336, -3489, 39442, 64432, 59104, 25039, -20529, -55463, -64439, -43512, -2648, 40149, 64423, 57157, 22551, -21404, -55092, -63135, -42160, -188, 41490, 62795, 54695, 21773, -22002, -55882, -62740, -38864, 1685, 40895, 61871, 54037, 19872, -24028, -55748, -60110, -37764, 2109, 41866, 62283, 51710, 16687, -24249, -54115, -59984, -36811, 5197, 43415, 59784, 49118, 17091, -24912, -55840, -58615, -32892, 5572, 41398, 60010, 50081, 13739, -28144, -53816, -54998, -33265, 5054, 43870, 61164, 46265, 10833, -26520, -52847, -56567, -31737, 9526]
508I526L4536J2394j1456l2087m0915k8228K357K7644L5811L1733J5866j1602
520D5579l6995l9335k1293R27K1753L8612L7446J1238j9139l3053l2296k4655
532e1211l383K7413M1704L0972P655j3087l1382l9258k3871N384K7055L3408L1109
545D2508J4702j6447l8808l5101j5634J845K1048L8336L5496O614k0783l0905
557B871l1691k3126R46L1392L8664K3664N713j0873l1313m0034k1398J0594K7807
570a6784L1587K8115J0796j8864l7316k9650j4341R87K2668M0709L1944L20k2691
583B7480k7087k9099k2593L518L3091L6245J9978N110j2009l3761l8526j4049
595e1702J3409K4830K8324K8310R782k2864l7623k6285j0947K730K4640L9389
$$ y = [9526, 44062, 56456, 45000, 12913, -28002, -56230, -53873, -26229, 9582, 41315, 57181, 45579, 8584, -30751, -52044, -51117, -29364, 9248, 46694, 57932, 38793, 5740, -26556, -51211, -54594, -27181, 14523, 45495, 53150, 40063, 8681, -30577, -54448, -49064, -22009, 11399, 42508, 57210, 40763, 1955, -33146, -48780, -46935, -25887, 12449, 47945, 54559, 33776, 2871, -28820, -51946, -51000, -19608, 19056, 42720, 48433, 37560, 6247, -33787, -55185, -44591, -16784, 14803, 42918, 53714, 34850, -2466, -32116, -46457, -45470, -22802, 17907, 49851, 50171, 27480, 393, -28706, -51299, -47781, -14690, 21555, 41533, 46643, 34634, 873, -37653, -51702, -38293, -13463, 14861, 43171, 52953, 30089, -7534, -33819, -44766, -42036, -17396, 21993]
607B1993K5503k507j9716k5856l1220k1660J0869L5926L0803J4802M075j1367
619C1645l4695l5745j0391J4217K3669K9273K8511L308k7624l3850k0241j0068
631d1991J644K6308L9543K2245o625j9654k5210l0980j6581J5431L3335K5571
643B3036J5044N576j5725l7892l1268k726J4465K0284K8697K7029o6k8798l1133
656a3477j8926j0104N153L0500L6176J4427p970j5937k4845l1460j4199J9374
668c1288L2741K2646J3961L501j9617l6552k4757k94J1967J9959L1049K4821o315
681D1822l0308k6404j6647j0183P896L2318L2197R906p847j4169k6615l1516q061
694d7611K3158K8898J9389J3678K767k2365l5969k0479J694J1456K0656L1109
$$ y = [21993, 47496, 44989, 25273, -583, -31803, -53463, -42594, -6668, 24135, 38937, 43012, 31645, -3050, -38795, -49186, -34969, -11300, 17973, 46484, 49792, 22168, -11682, -31923, -41991, -40347, -14039, 25504, 47749, 41124, 21470, -3740, -34720, -51301, -35870, -2535, 23036, 38080, 43656, 27931, -9961, -41229, -43955, -29490, -9206, 19491, 46520, 46454, 17656, -13477, -32403, -42507, -37354, -6854, 29322, 43749, 35779, 19842, -5003, -36463, -50662, -31288, 1453, 24099, 38060, 41561, 21944, -14608, -39365, -39659, -27692, -7733, 23316, 48137, 41822, 11514, -14890, -31537, -41720, -33824, -1506, 30691, 40597, 32750, 18581, -8034, -39550, -47611, -24453, 4445, 23834, 37512, 40279, 17914, -18055, -38534, -36840, -25384, -4728, 26381]
706B6381J9540r878k7172k2626j8251j0811J2756L4490K7942M378p210j3093k7500
719a1054k9298l240K2754K5877J9299J4427q23k6379l2562j4810J859R728K2412
732a810L0851J5495j3001k5321k1280j8022q604J6689L3305K3091L395n631j5205
745A3952k9788k4778K026K1691K1768J9465J5731m822k9064l0034j0319K515R684
758b1973K3204K9797J0927j4386k2872k0817j8042n370J9534L0521J9241M230
770C3994n158j8897l0230j9008N934J9313J9430K0098J4858q376k9970k6223q331
783c2566K087J1216K5059K6146O263j4187k0800k0444j8088j540K1405K8113J6071
796B8735M033n817k1102k8929j4496P538J7732J9325K0233J1462j2040k7690k2538
$$ y = [26381, 45921, 36043, 8871, -13755, -32006, -42817, -30061, 4429, 32371, 36749, 29539, 16446, -11054, -40352, -43592, -20838, 5039, 24338, 38765, 37942, 11563, -20999, -35809, -33950, -24222, -1810, 29041, 44536, 31535, 6214, -15066, -33088, -41692, -25003, 8302, 31393, 34788, 29157, 13952, -15836, -40614, -38588, -16897, 4871, 24336, 40067, 35245, 6181, -23853, -34172, -31657, -21973, 1231, 31028, 41955, 27569, 4697, -16120, -34162, -39532, -19998, 10523, 29764, 33994, 28836, 9939, -20291, -39299, -33365, -14052, 5378, 25476, 40334, 31958, 1988, -24235, -32566, -30479, -19263, 5796, 31942, 38205, 24018, 3218, -17226, -35314, -36854, -15449, 12664, 28735, 32768, 26951, 5849, -23080, -37576, -30038, -12306, 7019, 27252, 38714, 26674, -1016, -23554]
809b3554q496J793J4129K7068K1612K203j4297j8137k1042j6890J731K2678K5658
822A4456J4253L047p841k2210k5756j1070P763J7042K0053J9754O950j4632k5287
835c478j8892r036J687J6993K6540J8876j064j3885j8030k0540j4041N131K1804
848g935K2839J3804K759j0722k3573k2252p858Q268J6218K0488J8313L479j5805
861A8023k3580j7177q570L772J8722K5253J4814j784j3457j9020k0108j0600P592
874b6120K0757K0926J3053J946j2828k3663j9850n244Q381J6638K0313J6094L34
887C0737j6156k1489j6578p243O053J9412K2562J2871k226j3951j9496j8624p501
900c1629Q974J9576J9766J2187k23j4152k2313j7682m575Q855J7513K0205J3605
$$ y = [-23554, -32050, -30257, -16128, 10940, 32552, 34755, 20458, 2321, -18721, -35611, -33880, -11202, 14456, 28709, 31756, 23915, 1705, -24051, -35121, -27358, -10316, 9737, 29491, 36441, 21809, -3478, -22370, -31406, -29719, -12726, 13814, 32690, 31626, 17741, -289, -20829, -34870, -29739, -7935, 14904, 28708, 31467, 20745, -2828, -25080, -32938, -24670, -8452, 12036, 30349, 33828, 18023, -5557, -22734, -31304, -27532, -8810, 16443, 31257, 29473, 16016, -3004, -23112, -33712, -26120, -5363, 15563, 28616, 30562, 17734, -5929, -25779, -31023, -22642, -6004, 14309, 30403, 30737, 14581, -6908, -23486, -30729, -24676, -5264, 17298, 30169, 27943, 13992, -5504, -24128, -31629, -22655, -3079, 16687, 28874, 28651, 14499, -7814, -25496, -30071, -21216, -3703, 16502, 30107]
913C0107k081j5926k0492j5678n569Q149J9065K0285J1518k920j4475j9920j7231
926b5168m933J0127J8701J9078J0988k155j5215k0582j5853m125R531J8739J9041
939A8174J0384l291j5383j9341j5230m504R845J9471J9020R025l215j5545j9498
952a0088j4595l246R776J8291J8826R464m526j5529j8827j4323k693J0366J8642
965A538J7196R005l847j5589j9753j3998j230J0615J8193J6820Q179m253j5349
978G527j8606j3662k111J0618J8797J7431P165n687j4868j7832j3716j692J1722
991a4914J8566J6059O891m877j5315j8845j2542j87J0942J7452J6495P632o328
1004B1029j6809j7049j1027r17J0841J8206J6516N488o427j5415j7570j2101N34
$$ y = [30107, 28026, 12100, -8392, -24070, -29639, -21490, -2425, 17860, 29378, 26458, 11983, -7937, -25168, -30101, -19974, -1273, 17805, 28793, 26638, 11423, -9159, -25012, -29137, -19606, -867, 18174, 28558, 25267, 9884, -9457, -24687, -29191, -19346, 125, 19145, 28170, 24955, 9410, -10088, -24683, -27929, -18153, 138, 18964, 28428, 23902, 8373, -10454, -24777, -27470, -17104, 1538, 18734, 27739, 23892, 8303, -11450, -25448, -26678, -16063, 2130, 18950, 27129, 22876, 7527, -11079, -24741, -26852, -16234, 2563, 19994, 27159, 21472, 6604, -11228, -24944, -26636, -14914, 3652, 19711, 26602, 21725, 6410, -12435, -24977, -25164, -14222, 3230, 19725, 27357, 21029, 4220, -12829, -23856, -24773, -13932, 4274, 20790, 26278, 19851, 4436, -13134, -25235, -24701]
1017b4701J2846J7416J3807O053n393j5713j8974j0619J805J2326J6846J5082
1029B0781M956p490j5934j5992j0233q3J2582J8107J4975L132p633j5141j6200
1042a4173j0726K025J3406J6550J3159M713p419j6391j7111q235K921J1868J6661
1055G248J4258L600r475j5943j4941q209J743J2730J7783J2529K261p785j5536
1068B63j6312q921M499J3638J6005J1472L105q410j6234j5781o835L608J2537
1081g366J6702J2763J184j0064j5402j3710p167L020J3606J6575J1142J027r229
1094A3081j5076j5179o640N143J3747J5011J0976J405r848j5870j4160n200M651
1107a7959J2426J6327J1375j03r988j5714j3291n679M619J4250J5206R530M7r303
$$ y = [-24701, -11855, 5561, 19368, 25421, 20028, 4315, -14659, -25278, -23473, -11147, 5699, 20781, 25737, 18247, 2313, -13679, -23912, -23995, -11413, 6694, 21669, 24801, 17168, 2027, -14173, -24899, -22874, -9468, 7082, 20241, 24954, 17535, 1144, -15967, -24202, -21281, -9413, 7248, 21506, 25106, 15631, -312, -15253, -23462, -21719, -8989, 8794, 21323, 23584, 15799, 263, -16049, -24970, -20471, -6833, 9172, 20644, 23749, 15339, -895, -16676, -23511, -19903, -7366, 9336, 22099, 23283, 13219, -2183, -15893, -23060, -20040, -6434, 10141, 21283, 22310, 13081, -1995, -17174, -23814, -18671, -4924, 10087, 21063, 22468, 12620, -3250, -17410, -22610, -17959, -5533, 10794, 22169, 22066, 12078, -3636, -16927, -22606, -17987, -3737, 11469, 20999, 21046, 11743]
1121A1743j5212j4478n101O040J3953J4865R158k84j0173j5258j2825m463N301
1134a6734J3667J5040R679j097j0844j5124j2279m376O375J3358J4775Q600j482
1147A9558j0046j4932j2379m308O880J3598J4486Q000j458j0821j4576j1695l665
1160b1358O578J3180J4378P809j325j0934j4872j1549k870P308J2978J3853P500
1173B0676k455j0622j4130j1399k904O956J4050J3804O175k260j0841j4106j1542
1186a8598k167Q183J3192J2471P251k168j1723j4758r689j311O951J3179J3423
1199A4236O299l735j1506j3020r983k613Q101J4074J2232N655l292j0549j4362
1212h463j0400k84Q431J2428J1747O515k941j2015j4489q606m65P462J3037J2717
$$ y = [11743, -3469, -17947, -23048, -17008, -3055, 11810, 20968, 20684, 10511, -4747, -17572, -22035, -16734, -3067, 11973, 21652, 20555, 9711, -5413, -17692, -22068, -15693, -2335, 12440, 21040, 19558, 9512, -5420, -17799, -22107, -15227, -1629, 12857, 20857, 19399, 8578, -5998, -17693, -21358, -14780, -1600, 12778, 20587, 19262, 8328, -6544, -18093, -20963, -13655, -677, 13176, 20676, 18221, 7599, -6531, -17930, -20834, -13878, 172, 13976, 20151, 17891, 7050, -7056, -18598, -20765, -12582, 610, 13081, 20332, 18164, 6441, -8317, -18006, -19317, -12366, 813, 14236, 20535, 16800, 5294, -7726, -17709, -20322, -12221, 1853, 14085, 19740, 16448, 5899, -8463, -18863, -19147, -10716, 1712, 13459, 19974, 17033, 5018, -9471, -18077, -18542, -11080, 1957, 14674]
1226A4674N507m865j1289j2508r145j870R052J4011J0802M434l576j0430j4782
1239i985r145J051R553J1203J1019N989m162j2718j3242p038M95P378J2722J2536
1253A5656L910o250j1212j1205q632l74R411J3758R607L083l892j1052j3700q095
1267a8987K838R055J0647J1062M599n713j3270j1387n809Q51P494J3365J1746
1280A6491J935p025j0666j0564p555J88J0573J3114Q390K019l928j1859j3758
1293a2645n516L619Q654J0741J0400L447p063j2999j0047m650Q64P947J3890J0017
1307A6659O3p140r613j0612p383K264J1326J1985P481J137m946j2248j2232m296
1321a7555M334Q383J0935R653K291q564j2136q841m267J301R325J3489Q343j486
$$ y = [14674, 20181, 15316, 4027, -8481, -17626, -19496, -10444, 3567, 14369, 18803, 15227, 4797, -9985, -19130, -18079, -8526, 2677, 13696, 19685, 15523, 2805, -10437, -17475, -16980, -9602, 3120, 15656, 19566, 13316, 2104, -9101, -17733, -18107, -8696, 5062, 14669, 17752, 13860, 2808, -10892, -18987, -16149, -7094, 3553, 14615, 19214, 13501, 231, -11156, -16965, -16114, -8620, 4745, 16491, 18426, 11401, 735, -9829, -17384, -17196, -6623, 6491, 14881, 16900, 12972, 1113, -12645, -18161, -14542, -5888, 4853, 15253, 18700, 11637, -1362, -11409, -16059, -15195, -7248, 6642, 16659, 16722, 9582, -31, -10643, -18026, -15762, -4436, 7549, 15030, 16167, 11221, -1027, -13259, -17555, -13221, -4838, 6097, 15750, 18041, 9477, -2659, -11500, -15767, -14466, -5141, 8348, 16691, 15205]
1335A5205o657r626j0720o386L959J1691J0653O195J342n519j2508j1339l069
1348a6779M937Q167J1022Q974K9q768j1408q000l719J920J0272J3003O519k034
1362A4135o828r277j0857m684N467J0977R651N785J116o919j2807r407j592M329
1376a0911Q525J0464Q181r88r044j0849p326l725L394J0940J1643N153k224o511
1390F722r971j0322l431O652J0469Q689N885j23p866j2370q290o67M778Q370J1027
1405I552O569k330r363r467p081l138M130J1425J0339M016k370o714j0192r357
1419a3981j334O448R634Q195N487o74q660j1709p398R6M945R039J0114N321l077
1434A2446r027r055o732k555N592J0702R551K962k266p152j0489q232j00O712
$$ y = [15205, 8548, -1078, -11798, -18184, -14225, -2534, 8119, 14314, 15656, 10137, -2371, -13710, -16779, -11842, -3675, 7347, 16321, 16350, 7582, -3826, -11826, -15545, -13625, -3353, 9650, 16169, 14135, 7307, -1970, -12827, -17511, -12044, -1067, 8584, 14369, 15485, 8566, -4241, -13648, -15240, -10911, -2386, 8078, 16259, 15271, 6227, -4622, -11948, -15673, -12279, -1339, 10304, 15457, 13233, 6722, -3249, -13571, -17002, -10350, 119, 8808, 14693, 14570, 6704, -5666, -13956, -14623, -9845, -1475, 9552, 16121, 13791, 4428, -5039, -12120, -15258, -11128, 297, 10636, 14652, 12282, 5568, -4624, -13981, -15315, -8867, 767, 8962, 14449, 13775, 5115, -6594, -13992, -13896, -8951, 88, 10202, 15523, 12446, 3419, -5636, -12368, -14923, -9331, 1371, 10922, 13884, 11618, 4466, -6023, -14255, -14355, -7643]
1448g643R404Q103M620j805r546j0688n992K63N392R037R922M150m220q347r142
1463f492o554j181O613J0264Q236K997k683q090j0052o969N05O797Q784P985M175
1478A4335l063r230r885n422Q82N093J0109Q794K731m579q562q463o053j05P121
1493f297J0079O996K583l135q462r636n800J096O991Q921P540K812l850r138q648
1508g948m905Q64O296R319P948J597m262q154q578n460J159P032R474P049J402
$$ y = [-7643, 1761, 9864, 14484, 12679, 3133, -7555, -13547, -13284, -7892, 1145, 11067, 15217, 10997, 2650, -6492, -13046, -14227, -7614, 2650, 10886, 13883, 11200, 3110, -6942, -13911, -13406, -6609, 2175, 10160, 14335, 11272, 2042, -7843, -13265, -12383, -7290, 2819, 11613, 14344, 9765, 1203, -7260, -13313, -13418, -6297, 3782, 10778, 13361, 10226, 1764, -7872, -13672, -12576, -5585, 3336, 10876, 13688, 9838, 700, -7948, -12853, -11989, -5693, 3626, 11574, 13171, 8909, 755, -7823, -13283, -12124, -5092, 4382, 11431, 12833]
$$ [...]
8191B19
##END NTUPLES=NMR FID
##END=
