##TITLE=1H_LR-688-AKM
 D2O, 8 sc, 
 9.6.2020
##JCAMPDX= 6.0         $$ Bruker NMR JCAMP-DX V2.0
##DATA TYPE= NMR FID
##DATA CLASS= NTUPLES
##ORIGIN= UXNMR, Bruker Analytische Messtechnik GmbH
##OWNER= root
$$ XWIN-NMR		Version 3.5
$$ Tue Jun  9 11:18:07 2020 Russian Standard Time (UT+4h)  she@DPX200
##.OBSERVE FREQUENCY= 200.1315
##.OBSERVE NUCLEUS= ^1H
##.DELAY= (6, 6)
##.ACQUISITION MODE= SIMULTANEOUS
##.ACQUISITION SCHEME= undefined
##.AVERAGES= 8
##.DIGITISER RES= 18
##SPECTROMETER/DATA SYSTEM= spect
##.PULSE SEQUENCE= zg30
##.SOLVENT NAME= D2O
##.SHIFT REFERENCE= (INTERNAL, D2O, 0, 15.7039)
##AUDIT TRAIL= $$ (NUMBER, WHEN, WHO, WHERE, WHAT)
$$ ##TITLE= Audit trail, XWIN-NMR		Version 3.5
$$ ##JCAMPDX= 5.01
$$ ##ORIGIN= Bruker BioSpin GmbH
$$ ##OWNER= she
$$ F:/spectra/data/she/nmr/H-F/1/audita.txt
$$ ##AUDIT TRAIL=  $$ (NUMBER, WHEN, WHO, WHERE, WHAT)
(   1,<2020-06-09 11:16:34.39 +0400>,<she>,<DPX200>,
      <created by zg, POWCHK disabled, PULCHK disabled
       configuration hash MD5:
       00 E9 B6 7A A2 85 ED C7 34 08 36 98 17 FE 4E 26
       data hash MD5: 16K
       6A D1 9E 1C 99 BC D4 01 63 8E 6E 2F 07 B7 9B 19>)
$$ ##END=
$$ 
$$ hash MD5
$$ F4 49 56 19 4C 0E D6 72 62 E3 46 77 19 FA 0F 5C
##$RELAX= 
##$RELAX= 
##$RELAX= 
##$RELAX= 
##$RELAX= 
##$RELAX= 
$$ Bruker specific parameters
$$ --------------------------
##$DU= <F:/spectra>
##$EXPNO= 1
##$NAME= <H-F>
##$PROCNO= 1
##$TYPE= <nmr>
##$USER= <she>
##$AMP= (0..31)
100 100 100 100 100 100 100 100 100 100 100 100 100 100 100 100 100 100 
100 100 100 100 100 100 100 100 100 100 100 100 100 100 
##$AQSEQ= 0
##$AQ_mod= 1
##$AUNM= <au_zg>
##$AUTOPOS= <>
##$BF1= 200.13
##$BF2= 200.13
##$BF3= 200.13
##$BF4= 200.13
##$BF5= 200.13
##$BF6= 200.13
##$BF7= 200.13
##$BF8= 200.13
##$BYTORDA= 1
##$CFDGTYP= 0
##$CFRGTYP= 5
##$CHEMSTR= <none>
##$CNST= (0..31)
1 1 145 1 1 1 1 1 1 1 1 1 1 1 1 1 1 1 1 1 1 1 1 1 1 1 1 1 1 1 1 1 
##$CPDPRG= <>
##$CPDPRG1= <>
##$CPDPRG2= <>
##$CPDPRG3= <>
##$CPDPRG4= <mlev>
##$CPDPRG5= <mlev>
##$CPDPRG6= <mlev>
##$CPDPRG7= <mlev>
##$CPDPRG8= <mlev>
##$CPDPRGB= <>
##$CPDPRGT= <>
##$D= (0..31)
0 1.2 0 0 0 0 0 0 0 0.06 0 0.03 0 0 0 0 0.0002 0 0 0 0 0 0 0 0 0 0 0 0 
0 0 0 
##$DATE= 1591686993
##$DBL= (0..7)
120 120 120 120 120 120 120 120 
##$DBP= (0..7)
150 150 150 150 150 150 150 150 
##$DBP07= 0
##$DBPNAM0= <>
##$DBPNAM1= <>
##$DBPNAM2= <>
##$DBPNAM3= <>
##$DBPNAM4= <>
##$DBPNAM5= <>
##$DBPNAM6= <>
##$DBPNAM7= <>
##$DBPOAL= (0..7)
0.5 0.5 0.5 0.5 0.5 0.5 0.5 0.5 
##$DBPOFFS= (0..7)
0 0 0 0 0 0 0 0 
##$DE= 6
##$DECBNUC= <off>
##$DECIM= 24
##$DECNUC= <off>
##$DECSTAT= 4
##$DIGMOD= 1
##$DIGTYP= 9
##$DL= (0..7)
0 120 120 120 120 120 120 120 
##$DP= (0..7)
150 150 150 150 150 150 150 150 
##$DP07= 0
##$DPNAME0= <>
##$DPNAME1= <>
##$DPNAME2= <>
##$DPNAME3= <>
##$DPNAME4= <>
##$DPNAME5= <>
##$DPNAME6= <>
##$DPNAME7= <>
##$DPOAL= (0..7)
0.5 0.5 0.5 0.5 0.5 0.5 0.5 0.5 
##$DPOFFS= (0..7)
0 0 0 0 0 0 0 0 
##$DQDMODE= 0
##$DR= 18
##$DS= 0
##$DSLIST= <SSSSSSSSSSSSSSS>
##$DSPFIRM= 0
$$ [...]
##$SUBNAM2= <"">
##$SUBNAM3= <"">
##$SUBNAM4= <"">
##$SUBNAM5= <"">
##$SUBNAM6= <"">
##$SUBNAM7= <"">
##$SUBNAM8= <"">
##$SUBNAM9= <"">
##$SW= 24.9337058887773
##$SWIBOX= (0..15)
0 0 2 0 0 0 0 0 0 0 0 0 0 0 0 0 
##$SW_h= 4990.01996007984
##$TD= 16384
##$TD0= 1
##$TE= 0
##$TE2= 300
##$TE3= 300
##$TEG= 300
##$TL= (0..7)
0 120 120 120 120 120 120 120 
##$TP= (0..7)
150 150 150 150 150 150 150 150 
##$TP07= 0
##$TPNAME0= <>
##$TPNAME1= <>
##$TPNAME2= <>
##$TPNAME3= <>
##$TPNAME4= <>
##$TPNAME5= <>
##$TPNAME6= <>
##$TPNAME7= <>
##$TPOAL= (0..7)
0.5 0.5 0.5 0.5 0.5 0.5 0.5 0.5 
##$TPOFFS= (0..7)
0 0 0 0 0 0 0 0 
##$TUNHIN= 0
##$TUNHOUT= 0
##$TUNXOUT= 0
##$USERA1= <user>
##$USERA2= <user>
##$USERA3= <user>
##$USERA4= <user>
##$USERA5= <user>
##$V9= 5
##$VALIST= <valist>
##$VCLIST= <CCCCCCCCCCCCCCC>
##$VD= 0
##$VDLIST= <DDDDDDDDDDDDDDD>
##$VPLIST= <PPPPPPPPPPPPPPP>
##$VTLIST= <TTTTTTTTTTTTTTT>
##$WBST= 1024
##$WBSW= 4
##$XGAIN= (0..3)
0 0 0 0 
##$XL= 0
##$YL= 0
##$YMAX_a= 329003
##$YMIN_a= -250301
##$ZGOPTNS= <>
##$ZL1= 120
##$ZL2= 120
##$ZL3= 120
##$ZL4= 120
##$ABSF1= 10
##$ABSF2= 0
##$ABSG= 5
##$ABSL= 3
##$ALPHA= 0
##$AQORDER= 0
##$ASSFAC= 0
##$ASSFACI= 0
##$ASSFACX= 0
##$ASSWID= 0
##$AUNMP= <proc_1d>
##$AZFE= 0.1
##$AZFW= 0.1
##$BCFW= 1
##$BC_mod= 2
##$BYTORDP= 1
##$COROFFS= 0
##$CY= 11.3945322036743
##$DATMOD= 1
##$DC= 2
##$DFILT= <>
##$DTYPP= 0
##$F1P= 16.9975609425685
##$F2P= -3.02152046262296
##$FCOR= 0.5
##$FTSIZE= 0
##$FT_mod= 4
##$GAMMA= 1
##$GB= 0.15
##$INTBC= 1
##$INTSCL= 1
##$ISEN= 128
##$LB= 0.24
##$LEV0= 0
##$LPBIN= 0
##$MAXI= 10000
##$MC2= 0
##$MEAN= 0
##$ME_mod= 0
##$MI= 1.114404
##$NCOEF= 0
##$NC_proc= 0
##$NLEV= 6
##$NOISF1= 3.799351
##$NOISF2= 2.8
##$NSP= 1
##$NTH_PI= 0
##$NZP= 0
##$OFFSET= 15.70392
##$PC= 1
##$PHC0= -9796.168
##$PHC1= 10.00088
##$PH_mod= 1
##$PKNL= yes
##$PPARMOD= 0
##$PSCAL= 0
##$PSIGN= 0
##$REVERSE= no
##$SF= 200.130013532006
##$SI= 16384
##$SIGF1= 3
##$SIGF2= 2
##$SINO= 400
##$SIOLD= 16384
##$SREGLST= <1H.CDCl3>
##$SSB= 0
##$STSI= 0
##$STSR= 0
##$SW_p= 3612.71676300578
##$SYMM= 0
##$S_DEV= 0
##$TDeff= 0
##$TDoff= 0
##$TI= <>
##$TILT= no
##$TM1= 0
##$TM2= 0
##$TOPLEV= 0
##$USERP1= <user>
##$USERP2= <user>
##$USERP3= <user>
##$USERP4= <user>
##$USERP5= <user>
##$WDW= 1
##$XDIM= 8192
##$YMAX_p= 0
##$YMIN_p= 0
$$ End of Bruker specific parameters
$$ ---------------------------------
##NTUPLES= NMR FID
##VAR_NAME=  TIME,          FID/REAL,        FID/IMAG
##SYMBOL=    X,             R,               I
##VAR_TYPE=  INDEPENDENT,   DEPENDENT,       DEPENDENT
##VAR_FORM=  AFFN,          ASDF,            ASDF
##VAR_DIM=   8192,          8192,            8192
##UNITS=     SECONDS,       ARBITRARY UNITS, ARBITRARY UNITS
##FACTOR=    0.0002004,     1,               1
##FIRST=     0,             0,               0
##LAST=      1.6414764,     0,               0
##MIN=       0,             -250301,         0
##MAX=       1.6414764,     329003,          0
$$ Real data points
##PAGE= N=1
##DATA TABLE= (X++(R..R)), XYDATA
0@%%%%%%%%%Qj6J6j6K1k9L2m0N3o1P2q5R6j12J30j49J73j98K24k54K88l27L69
32A95m15M66n20N81o48P19p99Q88r84J089j205J337j480J638j818K019k252K517
50A328k821L183l619M155m830N713o925Q702j1592J7287m8524J88857J25952j35329
64A41537n0639l1108j41852j68239L9129J55064J18377Q4724Q1001n9819j92775
75b4600j35098J077J3413L3422J50768J74631l425j32195r1781o3771j06673k2250
87b06482J56380J70798K5310k6429L099p5157j79652r1499Q9134J28878O7797
98F2177O1527M6221o1675j36256q8427k6474J061P8976J57942Q7240o0324q8833
110C3155l6608o2460r3835R471J34664J09886K1482M525k1049j15382j30241k161
$$ y = [0, 0, 0, 0, 0, 0, 0, 0, 0, 0, 8, -8, 8, -8, 13, -16, 16, -24, 29, -32, 40, -45, 51, -61, 69, -80, 93, -105, 119, -135, 153, -174, 195, -220, 246, -274, 307, -341, 378, -421, 467, -517, 572, -633, 704, -776, 862, -956, 1063, -1189, 1328, -1493, 1690, -1929, 2226, -2604, 3109, -3816, 4886, -6706, 10581, -37943, 150914, 276866, 141537, 90898, 59790, -82062, -250301, -211172, -56108, 62269, 146993, 227994, 168175, -24600, -159698, -158621, -145208, -111786, 38982, 213613, 210188, 77993, -13788, -77559, -184232, -206482, -50102, 120696, 146006, 119577, 122676, 47519, -132133, -223632, -134498, -5620, 62177, 123704, 169925, 108250, -28006, -116433, -142907, -141846, -62870, 95072, 182312, 121988, 33155, -3453, -65913, -159748, -150277, -15613, 94273, 115755, 120280, 99231, -16151, -146392, -148553]
122a48553R0088N4791L2647P7635M7579p6461j28294o1803p46K0592O8637J03251
134G9363M7004l3289m7863n0875q5072n8193N5877J16800N8799N05M307k0070
146F7293q9661r0937l070N9630N7363N4567M9989n126p0485p1185l4228j5375
158i1225J1637O8521Q7696L1873l2327n0756n5277n4883j3873M7393O3474L9247
170E1500K6739R906m5460q6671n2973J5404M3192M1973M9138L7480j6064n9634
182A4530n3173k8565j0419K2289O3463O0762J2160k8897l6649m2268m3234j0531
194h0532L9945N7866L7593J4485r236m1948n8132l2584R988L1153L8476M3302
206E0376K6080j9658n4131m4471j6027K435J9839M2946M7405J6047k4543m2234
$$ y = [-148553, -58465, -3674, 28973, 106608, 154187, 77726, -50568, -112371, -113117, -92525, -23888, 79363, 126367, 93078, 45215, -5660, -90732, -148925, -93048, 23752, 82551, 83056, 87363, 67293, -22368, -113305, -116375, -56745, 618, 55185, 105174, 100048, 29563, -41622, -75850, -91225, -79588, -11067, 76629, 108502, 76175, 25419, -29858, -84741, -98614, -51221, 12253, 51500, 78239, 88145, 42685, -43986, -96959, -81555, -38363, 3610, 52748, 90228, 74164, 14530, -38643, -67208, -77627, -55338, 8125, 68887, 81047, 52150, 15501, -26767, -70001, -80532, -40587, 17279, 54872, 69357, 60121, 18173, -39959, -72543, -62555, -31402, 7074, 50376, 76456, 56798, 2667, -41804, -57831, -55396, -35557, 7389, 54794, 70841, 46298, 4064]
218D064l9471k5626J967L4773M4910K8166N169j2486l1375m3416k7729P804L3409
231a9841L6446K9086J2030j7209m1112l6725j3329O185K1058L7281L5451O325
243E5646k4779l3536k7502j8867J360L0088M0189K2473p27j4546k7401l5301j8979
256e1882J2743K8920K6876K1735R399j6831l7948k9211n058Q885J8074K9624K7210
269D2536J226k2866k6252k0954j6128L453K9711L3524J3593l905j2376k3277k9216
282c0931j2064J4160K4562K0439J7256O002j7759l2322k0388k591P569J6898K6986
295A7817K0119m521k0710k0316j6549j1729P512K5770K4936Q401k963j1347k2584
308f164k3143m869J4648J8302J6466J4258K345j8354k5778j4352j012P045J6636
$$ y = [4064, -35407, -61033, -59066, -24293, 20617, 48783, 53952, 41466, 10091, -33325, -61054, -53250, -19841, 16605, 45691, 57721, 40512, -600, -37325, -50654, -44469, -23411, 13870, 49321, 55646, 30867, -2669, -30171, -49038, -47678, -17590, 22599, 45072, 44345, 29799, 2398, -32903, -51882, -39139, -10219, 16657, 38392, 47791, 30960, -6988, -36199, -41257, -32372, -14298, 15326, 42536, 43762, 20896, -5356, -26310, -42438, -38985, -9274, 24250, 37843, 33938, 21562, -1715, -30931, -42995, -28835, -4273, 16166, 33422, 39424, 21665, -10657, -31045, -33636, -26067, -9169, 17817, 37936, 33415, 12705, -7611, -24160, -35889, -28377, -2607, 22329, 30730, 27767, 16420, -6164, -29307, -34176, -19528, -1226, 15240, 29498, 31843, 13489, -12289, -26641, -27653, -20608, -3972]
321c972K3012J2722p159j6537j6223j4561p216R409K1635J8609O615l239j2856
334A0239j9849j5935j004J1543J5905J5142J0409l311j6356j8188j0809j573Q257
347a5530J6978J7019O514o117j2455j5504j3504j785J1946J6421J2337O026k929
360A9417j3746j7688r790K109Q534J3169J4185P402o691j4625j2947p796j473
373a9940Q207J5820J3256K690n865j1132j2942r782N35J0651J3795R595L635m292
387A4231j1586j3531p616J761R295J2206J0218K999n354j1218j2056o704J921
400a5434R158J1538Q896K635n079j1785j1220m749K336P275J1205R692K239p022
414I685j1256q557m550J162P874J1922P638K25o107q307r280n922K667R851R429
$$ y = [-3972, 19040, 31762, 24603, 8066, -8157, -22718, -29934, -20525, 1110, 19719, 26334, 23095, 10239, -9610, -25545, -26549, -15006, 899, 16041, 26450, 23139, 6783, -11405, -22214, -23787, -15530, 1448, 18467, 24981, 18864, 6409, -9095, -22599, -24384, -12438, 3983, 16320, 22346, 19417, 5671, -12017, -21807, -19698, -11164, 2005, 16190, 23592, 16901, 2276, -10671, -18467, -19940, -11733, 4087, 17343, 20033, 14168, 3036, -9906, -19688, -19153, -8502, 5293, 14888, 18523, 14231, 2645, -10886, -18502, -16741, -7446, 4760, 14978, 17977, 12623, 1405, -10651, -17355, -15434, -6276, 5262, 14158, 16793, 11714, -71, -11291, -16040, -13704, -6429, 4776, 14468, 16707, 9685, -1571, -10128, -14678, -13516, -5642, 6280, 13918, 14143, 8036, -271, -9551, -15473, -12806, -2955, 6474]
429F474N916O08m213r536j0131l410L803P661Q627O413Q55n987r805p335k254
444a2314K664O729Q872N947N61o194q990o891k419L074O858Q279N593q17n785
459E167p893o431j995K205P429Q068M451j145n188o809o595k617L462P368P127
474F604L419j000m505p441n875j568L531O755O242L025k28n013p459n463k43L794
490e425N085N764M157p59o160o852l725l21K630N403O639L415k820n840m321l623
506f753k223L175P434N228P16j832l059n300n641m49N144N449K829K832n07n121
522A922o814k729J505K394L942N231L074k870n337l738k889o64L143N760L997
537E927N79j559l593n037l925J314M118L841K720K373j094n381m805j181P45J104
$$ y = [6474, 12390, 12998, 8785, -751, -10882, -14292, -10489, -2828, 5799, 12212, 13067, 7080, -2725, -10060, -12314, -9650, -2921, 5951, 11898, 12459, 6265, -2725, -9616, -12035, -8961, -2103, 6176, 11769, 10952, 5167, -2726, -9157, -11152, -8947, -1518, 6550, 11001, 9856, 4668, -2141, -8736, -11353, -7891, -523, 6604, 10023, 9023, 4518, -2923, -8798, -10366, -6835, -80, 6162, 9187, 8959, 3946, -3513, -8976, -9219, -5425, -340, 5424, 9581, 8822, 2662, -4190, -7915, -8236, -5606, -203, 6436, 9851, 7031, 1191, -3130, -6753, -8976, -5801, 1633, 6861, 7577, 5745, 2686, -2614, -8255, -8704, -3560, 1889, 4718, 7550, 7043, 1922, -4892, -7621, -6116, -3722, 220, 5451, 8525, 5655, 318, -3420, -6309, -6973, -3830, 1930, 5927, 6506, 4947, 1354, -3683, -7608, -6294, -2176, 1665, 4385, 6758, 5664, 283, -4522, -5703, -4958, -3854]
553c854M793N423N67l625l542k140l226j032M276N846J323p82R1k334n647l135
569f998K638L939J644K017L113j531o245l860J159Q30L88L707N339q9m375k450
585g74r37k867j400M490N460N03j809M79k173m960k195K911L478J118J864K464
601E652k021n691k173J197J41O68M045L555j206l559j565j027k539k36M814L373
617C428J2r61K39k499m502l86L040J832N98K270J941l019m552o21J061p50R15
634a954M909J991k016k856l75j350k859R23M704K128p89k6J1k895m110Q12L247
651e05J256l01K522J333l622l585M57N22o17J586L904J393k656j935L82j635k717
668d218J621L831J706j389N27K89l724k762J495K869j47N06K741L05l803k492
$$ y = [-3854, 939, 6362, 6929, 3304, -238, -2378, -5604, -6636, -2360, 3486, 4809, 4027, 4118, 1784, -3863, -6998, -4360, -421, 1223, 3240, 6353, 4822, -1423, -5283, -4124, -3294, -2906, 801, 6140, 6051, 1676, -774, -1711, -4578, -5978, -1488, 3972, 4475, 2666, 3145, 972, -3988, -6183, -3272, 206, 1324, 3188, 5652, 3631, -2060, -4233, -3036, -2895, -2227, 1818, 5373, 4167, 608, -957, -1984, -4523, -4759, 55, 3428, 3440, 2479, 2718, 219, -4283, -4669, -1629, 203, 801, 3071, 5012, 1993, -2559, -3180, -2119, -2869, -1954, 2955, 4946, 2930, 74, -301, -1651, -4510, -3587, 1117, 3245, 2456, 2430, 2441, -454, -4564, -3752, -505, 751, 450, 2972, 4305, 683, -2902, -2445, -1923, -2540, -954, 2950, 4343, 1687, -248, 134, -1501, -4218, -2597, 1234, 2940, 1551, 2078, 2367, -1357, -4119, -2624, 245, 98, 604, 3345, 3650, -153, -2645]
684b645Q13L56r66J682L685N38k802j006O00k020k251K484L290j2o88R39j01l949
702b053j892K316J952n53O80L025o12l850j486J606m27j185K354L346m48k613
718A60o05M30j922j652L229K630p91p15J155o38l587r31K577Q81o45J323K303
735C202j031l603l43J792j198r18K369L158j308k502O56j4k340j060L280J797
751A937n87r85J660r88l228m50K363P13q31J302K160k051k815M52J284q10q86
768a760K711J837j920j204O23k18k164j17K810J034j009L47M84q35k623j26K028
785a02J74r1J282R53j589k264P58M68p82K53K367N16j584l00K36q34j647R25K103
804H42K27p38M39P12j623j585O46R74j41N04J252K79j997j054J047k14j055R99
$$ y = [-2645, -1832, -1476, -2442, -760, 2925, 3463, 661, -345, 255, -1765, -4016, -1532, 1758, 1746, 1058, 1997, 1896, -2053, -3945, -1629, 323, -230, 450, 3475, 2863, -987, -2473, -867, -1294, -2479, -125, 3221, 2773, 160, -445, -15, -1937, -3589, -360, 2270, 1479, 764, 1919, 1281, -2306, -3237, -660, 221, -424, 899, 3202, 2171, -1432, -1775, 17, -1181, -2099, 270, 3428, 2120, -382, 274, 260, -2080, -3140, 140, 1937, 1350, 365, 2025, 1037, -2191, -2641, -278, 435, -396, 906, 3066, 1015, -1800, -1348, -64, -874, -1760, 951, 2788, 868, -336, 287, 69, -2095, -2212, 598, 1632, 623, 970, 1454, 619, -2004, -2130, -102, 72, -19, 1263, 2216, 627, -1637, -879, -411, -1193, -940, 1427, 1943, 359, 59, 295, -539, -2186, -1261, 842, 1069, 331, 770, 1482, -141, -1726, -1080, -106, -247, 257, 1509, 1788, -209, -1263, -216, -430, -1485, -486]
822d86J940K33j402l51M72j051j253J288J336K86m61N71m4j473j122Q29M59J15
840a14K16J267j49j608l30R9K5l15R31J267l36q94k7J4j045j04O04R06K64j46
860E25M71m17j834P6Q08K40J88J62R65n74r27l1M2p70K48J180P93l16m12j63l54
881a00j048L12Q67O53o33L15M25m45j277j39P59J09k10Q77Q71j120p51j16K54
900c97L2l38J001R64o19n12J01m04p48K47R26J11k35M79k35j45p13l26P61j23
920a73L26L69J64l40n07n05J28OJ09R63Q1j59l79l24k91n4nN03L62L69n15K10
942C38o05l40J29J71K26M36M10k54l1o53k57K28n9L85O3K82Q1l12k14k81l77q6
964g20N96N30J58k84j44l58l9k81K02M75K91k16K24l48m54j49L00l7M04j19K97
$$ y = [-486, 1454, 1687, 285, -66, 406, -645, -1898, -610, 726, 1012, 551, 1122, 1078, -395, -1517, -688, -229, -114, 102, 1369, 1220, -388, -718, -619, -594, -909, 22, 1289, 953, 59, 32, 46, -999, -1103, -499, 407, 671, 525, 996, 579, -1255, -1179, -371, -131, 57, 219, 1184, 610, -317, -348, -306, -1076, -828, 352, 1145, 829, 417, 254, -100, -1148, -836, 31, 684, 51, 366, 791, 346, -931, -1070, -311, -202, -412, 465, 1336, 216, -535, -651, -397, -365, -703, 298, 1262, 643, 131, 232, -172, -920, -673, 253, 364, 129, 608, 373, 228, -485, -811, -50, -173, 153, 522, 686, 346, -161, -666, -538, -532, -423, 540, 621, 462, 83, -241, -532, -586, -591, -88, 274, 643, 128, 338, -267, -607, -478, -307, -81, 355, 765, 511, 480, -173, -430, -202, -261, 124, 187, 469, 550, 238, 24, -257, -634, -720, -124, 406, 564, 280, 136, -222, -261, -542, -340, 135, 426, 210, 434, 86, -368, -517, -217, -254, 150, 31, 328]
985C28j9j63j13j82L14n50M65M96ml33l36j4n6l23K61M77L59o38L25N1k05o28
1007d88r7L98K21J4K27P3n52j46K44l40L00L04K49j3k38j25k08l92J59L08L36
1028B34j4j84L93Qn57j2k9J70P5K52l0k16M1k77j21j13P1J59M75j89j69J11o0
1051A8l25j2K35L59J08m30L86l56o64K49N27M6l15M53K10m18m15R7K53q6j58K78
1073D0J39j60Q6P1j30k60k60N13k49J09J29q1N1n06J29N43m16J33K70M48k71p26
1095c98K30J35l32K11K48k5r3Q7Q9k49n3L5J01K46l28K56k35R1k85N7O1K16n4
1118A1K10K45m10j29rJ9j38J51K66K96n85K21O7l58k29K6L04M51o11N71l73j0
1140a4k44k7K49j96Q2L03K00k71m6j86K70l19L63P9M8m77L05k48l16O47k93K67
$$ y = [328, 309, 146, 33, -149, 165, -385, 80, 576, 572, 239, -97, -111, -167, -490, -229, 248, 607, -31, 294, 345, 140, -488, -585, -187, 34, 48, 275, 348, -204, -350, -106, -446, -146, 158, 407, 394, 156, 31, -177, -569, -410, -102, 234, 220, 36, 429, 437, -120, -132, -161, 9, 84, 336, 306, 90, 131, -146, -267, -380, -309, -150, 325, 136, -33, 78, 18, -307, -319, -84, 275, 383, -47, 339, -17, -681, -432, 95, 141, -174, 279, 489, 71, -344, -247, 6, -80, -238, 40, 179, 19, 105, 176, 46, -214, -474, 39, -210, -101, 28, -53, -2, -508, -379, 164, -252, -119, 151, 599, 328, -398, -168, -33, -365, -154, 94, 69, -24, 63, 152, -97, -150, -115, -14, 232, -96, 160, -75, 16, -269, -212, -151, 65, 11, 221, 466, 56, -73, -82, -63, -201, -50, 216, 512, -73, 148, 215, -143, -372, -346, -42, 409, -202, 369, -4, -14, -258, -285, -36, -232, -150, 153, 353, 82, 36, -150, 120, -199, 164, 243, 291, -186, 119, -129, -445, 202, -91, 176]
1162A76N2l23L68j92J40l20J55q5J56k58J95k20J22p9j59J19k0M72j3j71k13K06
1184A08j66n0m82N57J25K12j32l01J72k30r0Q4K10Q9j97M66l92M5k7J58p8j83
1206a02N0N12j25l60L12m84J17O6P7k99J07M92l41k63O9J1J76P6j64RK69j50m1
1229A4J07%p0j40K48k65rK83K3n17O15m19L53k45L38l5n2j33j18K84l47J64j34
1252e5j8M11k18K06k98j67K47j75J73l25J40r8J37K7j6J3k21Q8L46j21k21P9M
1275f2l39J06K14N12l55J02j58J41m63LM00J97k35q5J73j11k02K36J10l78J27
1296f7J12Q3j78J47o7j09J0L7K14j52Kj1o7j29P5M45m56K99m20J3O5K89n82N18
1320G1k99L18l04M12m0K28l40N9J69n25K38j6j28J93J24P9l85J40J34j34O8q4
$$ y = [176, 228, -95, 273, 81, 221, -99, 56, -29, 127, -131, 64, -156, -34, -113, -272, -153, -173, 299, 286, 115, -98, 108, -58, -108, -590, -33, 92, 304, 172, -129, 43, -187, -277, -193, 17, 106, -91, 375, -17, 28, 1, 159, 81, -102, -52, 460, 335, -25, 287, -197, -80, -14, 63, -236, -129, 363, 22, -241, -172, -161, 15, 91, -73, -64, 205, 55, 14, 121, 121, 51, -89, 159, -106, -115, 168, 191, -326, 289, -130, 223, -22, 316, 281, 229, 96, -22, 262, -85, 79, -55, -73, 338, 120, 326, 28, -139, 108, -67, 106, -219, -79, -177, -40, -13, -29, -16, -237, -149, 197, 76, -145, -66, -62, -401, -295, -81, 431, 76, 178, 20, 161, -302, -299, 101, 298, 63, -22, 151, 40, -162, 74, 184, -194, -67, 45, 128, -50, 97, 30, -79, -69, -32, 182, 30, 32, 21, -46, -175, -100, 345, -111, 188, -232, -219, -154, 135, -447, 71, -228, 90, -214, 198, 158, 386, 46, 105, 274, -251, -13, -29, -157, 36, 160, 239, -146, -6, 128, -6, 62, -22]
1342b2J41l04N5J11o1J95k99K30K2O1j26r5M01m67O8Q2k6L57l09J86K7l88L3K
1366a26l9n8K57L20n40M8j72K62k24NJ78P5j92J68P7J3l54O9O35l67o9j3nL08
1390B56m38K5M31l59R4J36K42j39o41K08J03j5k0K14K8n6k22q8M25m22j2M37R4
1413B81k42N6J27j79j31M3k1N2k51J73M57l83M0k63J83q6m4J30m9R5J68oj61j77
1437a88L3K11K35j42j20J76k11j61J32O0M6j87R3Q8OJ66l44J68l20O5L2K42K2
1460A02o7K47n22J55p5K58k61K84jj57K9l48K83LJ48Ln1j04o2K49K56n57J47J70
1484A29k12R2j55j04M53k16L63n84J34k72J91K13r8J34p2j30k0J48Q5q0k9r8K7
1507a01J83J79k91L09l90K44j81K24r8j48j46M4K07j32j7N8O5j55J24J25J5M7
$$ y = [-22, 119, -185, -130, -19, -80, 115, -184, 46, 68, 129, 3, -92, 309, -158, -90, -8, -34, 323, 14, 200, 227, -161, -128, -126, -165, -223, 34, 354, -186, -138, -310, -48, -272, -267, -89, -14, -206, -38, 39, 52, -302, -233, 402, 35, -34, -47, -52, 256, -182, -157, 274, -85, 9, 145, 387, 248, -393, -185, -82, -97, -117, 97, 125, 69, -153, -241, 184, -238, -250, 187, 281, 39, 95, 222, 43, -88, -45, -66, -14, -265, -92, 365, -18, 22, -241, -58, -144, -188, -58, -107, -12, 156, 150, -11, -188, -155, 56, 291, 149, 29, 205, -6, -167, -35, 25, 71, -116, -23, 65, 71, 237, -107, 61, -259, -194, -162, 80, 102, 35, 282, -240, -85, -160, 98, -163, 121, 120, -37, -8, -356, -73, -70, 78, 81, 30, -74, -136, 113, 369, -188, -41, 129, -83, 9, -146, -250, 203, -13, 350, -234, -100, -372, -181, 32, -66, 68, -4, -134, -154, -6, 79, -1, -30, -128, -101, 82, 261, -30, 279, -111, 133, -48, 176, 78, -70, -216, -172, 35, -97, -114, -56, 9, -146, -22, 103, 118, 165]
1529A65k11LJ45J08k35N1k07K71r3JJ0p7J37j91nM03k12k71J76K53k94M51n39
1552a61J90N9j78J05m66L74M0J31l43K87R6k13k64M59J43l81n9L81l39k7J64J30
1574A28qo8QJ17k83l7K95l01J19j96J51K13m41J61M4m0K42k87L2M8J39j86R9K2
1598b9j13J18J55m8k94k5K25l7K26j31M31k51l70J13K22k30j01k7L54k26j9R2
1620C5N5j79N8j07J81j17l5K74j93r4J03K36m59J1L06q1n1J22J37j0m87N88j82
1643A11j48O0j0k24M42l56j7M24j45lj48J92m06K03j49J46j23L2M5J65k05M4J75
1666A05K39p44L41l7J37j41J18O8p5n3L1L4J6OqK98k34J68l83M29l37m4L6K89
1690B59j37J9j81L05o4o33N89p2q1o0o5J73j24nQ2k26J79Q6J58p6j50j65R3J09
$$ y = [165, -46, -43, 102, 210, -25, 26, -181, 90, -3, -2, 8, -69, 68, -123, -128, 275, 63, -208, -32, 221, -73, 378, -161, 29, 88, -90, 15, -451, -77, -37, 94, -249, 38, 134, -79, -343, 116, 259, -122, -181, 200, -139, -166, -2, 128, 120, 52, 60, 177, -106, -143, 152, -149, -30, -226, -75, 138, -303, -142, -98, -138, 104, -183, -151, -103, 36, -150, -51, -29, -142, -24, 131, 83, -211, -236, -11, -48, 178, 47, 478, 227, -143, -30, 192, -38, -139, -166, 188, -38, -57, 35, 90, -89, -31, -138, 43, -74, -109, 165, -28, -122, -19, 217, -242, -231, 75, -6, -57, 65, 202, 192, -295, 293, 111, -37, 23, 13, -211, 231, -125, -142, 282, 137, 134, -14, 178, -228, -25, -174, -28, -151, -119, -74, 91, -114, -70, 105, 344, -400, -59, -96, 41, -100, 18, 86, 11, -42, -11, 23, 39, 45, 37, 335, 101, 269, -114, 315, -22, -66, -30, 259, 122, 141, -40, 265, 201, -432, 157, 85, 4, -56, -121, 52, -72, -77, 5, -221, -42, 44, 202, 126, -24, -189, -96, 13]
1714A3J0K54j47j2j38J3K24l76L34Pk56P9K65m07J67n9K65q9l63j0K19q7J48P9
1738A33l51K20Q6O6L32n44r9q9L95k10J65r5k67J60R7J60k2m2j0K82l73R9k47
1761a54K69j78n7J03M06q3l39J52p6l22K88P8k3q7j60J53O3J58l96J22R2j52K91
1784A48m7k32J24r3J23N8j97p3N17j75k06K38j56K8l04J39K86J35l85K9J21j11
1806c3N1L7Jk38P3p8L48k41K19k64J71j60j23M27n91L20n6L18j00r8J01K83k08
1829A59j30N3j95p6J04P8j32K25j95o7j16J93p0J49J6j61p7K24J03J96k82n5j87
1852b43K10qr3M38p7m9k59J36L3J08k56P9L00J2j27k53M7k73M47j06r8l3P8l4
1876b1J45pk93J18p3o7J11K35k83P0J94j20J6J87k87j74K04J01k68j49J52L49
$$ y = [13, 23, 277, 130, 118, -20, -7, 217, -159, 175, 182, -74, 5, 270, -137, 30, -29, 236, 147, -216, -226, -7, -94, 54, 133, -218, 2, 88, 154, 486, -58, -157, -246, 149, -61, 104, 9, -258, -98, -1, 159, 137, 95, 85, 367, -6, 93, -154, 115, -63, -120, -17, 389, 306, -33, 119, 43, -279, 9, 87, 64, -23, -183, -30, 33, 191, -205, -83, 9, -143, 148, 101, -131, -7, -100, 23, 81, -116, -189, 328, 153, -53, 185, 29, 57, -247, -108, 178, 313, -72, -43, 78, -33, 18, 55, 56, -182, -109, -187, 161, -80, 139, -125, 46, -114, -237, 190, -401, -81, -137, 181, 81, -17, 84, 367, 159, 29, 82, -113, -189, -85, -7, -139, 86, -109, -176, -292, -99, -169, -20, -4, -165, -242, -18, 85, 281, -1, -56, -243, -33, -41, -134, 304, 227, 178, -81, 55, 88, 196, -60, 19, 319, 331, 204, -49, -2, -275, 172, 66, -32, -65, 13, -21, 124, 117, -176, -58, -131, -198, -87, 148, -135, -65, 129, 9, 25, 212, -75, -249, -45, 56, -212, -361, -209, 140]
1898A40l7j14L1O9p2k23K51j14j13L78l54j39N21j89J02r0j12J48J15l11J03j50
1920a60J86P2k11j9M9J90m7j25J71q3m2o6L76n05J40K4j45K04J78k44J06nJ09
1943A53J0m01M04k31N2k34K23J51j78O9k38K77o1j98Q6o9k8k12M39J49j46J27
1965A44j23j85kj26J38J68N3k46L59pl91R6K78l15J49O3k19R6K21j37M9p8N7j76
1989a34J17O9k07L3N78j97M1l09M5k54J98Q8MK3j56p9K68M2l84K21j7j89K54j2
2013D3r0J01n8k4o9J70k91L8J21jmk19M30N4k62K24k01j50K05m1J58o9N2k50J67
2038C4k7m6J20j92K2K26q4J31j66R1p4m6J86l33K39k09q7K73m3L3j57J12M4J13
2062A60l10q2M39J0k09r0j19M93q7k78N5L61m52N9K40l39J6L48o5J5l53K02j36
$$ y = [140, 103, -11, 20, 89, 17, -206, 45, -69, -182, 196, -158, -297, 224, 35, 137, 47, -65, 83, 198, -113, -10, -160, 26, 98, -113, -132, -83, 107, 60, -65, 106, 23, -19, -85, 291, -214, -74, -50, -195, 9, 187, -57, 49, 44, 153, 163, -238, 166, -65, -13, -247, -24, 127, -51, 18, -220, 57, -4, -202, -116, -185, -213, -425, 14, 163, 17, 144, 21, -164, -166, -292, -154, 14, 67, -179, 180, 173, -218, -122, 156, -159, -10, 53, -166, -70, 151, 14, 63, -15, 42, -134, -17, 52, -155, -122, 456, 259, 300, -9, 36, -218, -20, 68, 72, 95, -61, -140, 128, 170, -214, 7, -10, -199, 55, 43, -47, 54, -4, -28, -97, 73, -218, -180, -59, -60, -64, -283, 147, 201, -61, 163, -38, -188, 17, -24, 134, 65, 117, -133, 34, 7, -39, 81, -111, -89, 137, 53, 184, 18, 109, 35, -11, 175, -158, 81, -128, -215, 58, 15, 48, -109, 3, 47, 160, -150, -232, 207, 217, 8, -82, -201, 292, 205, -73, -18, 343, -109, -50, 190, -149, -133, 215, 150, 165, -188, 14, -122]
2085a22K13r2K01l57n6K66q4k74O94m96J78k57kJ20mK74l32L7j61J82K28o2j16
2108b2J09j51L20K9l34k11L17NJ10j90J11k29p3R8M7J26K0l49L76O4j49n4K45
2131B15j16J20j5m45K85p4r3j33R4L00j76K31k78K86l42J79J71l89J74J15j00
2152Ij88J94L18P8p05K59J4M2K44l12J23j52o8K27n6J48k28k34K82k4J0j93J09
2175a03j44m6N77m32L15Q2j34r0J50k47M60l98l63K45K30j86J50j07L7Q1n09L60
2197g2M0l7J54k62J48M31l20O2m3n9Nj61r3K19J60J6q8j36k4N4L72n67N04k32
2221G1O1j93j71M71l68K25j29P9J87m19K53l41J44Q2l23N01N8k57K85ok79n6L01
2244A76O7l53K63k80J07q9J26Rj47k6j0J87j02j0K71l20J3K39l90L39K62k32J27
$$ y = [-122, 91, -1, 200, -157, -213, 53, -31, -305, 389, -107, 71, -186, -188, -68, -72, 202, -130, -93, -254, -72, 156, 94, -22, 87, -64, 256, 285, -49, -260, 57, 62, 172, -18, 93, -136, -209, -111, -64, 62, 82, -267, 109, 173, 24, -30, 215, 99, 219, 204, -241, 44, -30, -123, -256, -162, 138, -38, 193, -85, 201, -141, 38, 209, -180, -6, 109, 9, -179, 15, 333, 411, -294, -35, -21, 21, 265, -47, 76, -76, -144, 83, 27, 175, -53, -287, -5, -29, -19, -212, -103, -247, -293, 284, -148, 167, 249, 115, 25, 175, -72, 388, -10, -373, -128, 102, -84, 66, -41, -4, 77, -432, -72, -32, -69, 85, -177, -29, 402, 82, 144, 101, 42, 47, -114, -207, 12, 172, 188, 100, -36, -60, -6, 366, -201, 303, 71, 132, -61, -232, 239, -129, 96, -33, 46, 233, -186, 67, -274, -130, -48, -371, 130, 188, -69, 216, 210, -69, -125, 176, 243, -110, 153, -127, -20, -109, 17, 26, -121, -147, -157, 30, -72, -82, 189, -131, -118, 121, -269, 70, 332, 100, 227]
2267B27l31m6J92j32P1K24p6J99m47k22M34K62l50n6o0J37j47R5j27J62R5L1j75
2290d0j49K44k49J24pJ7J23m13M34l57K44J25k53J25R6r8j47J54L2%jl3J84L4
2314A89k91J84j46K81j2m32M15J63l95O4J10K5n0k31K08j3Q7j59K20k01N1Rm7
2337B9q5Q4k37K16j95J88J39j83O1r3K63n53M54m9j48k8M1L9J99n7L9j78j54L57
2361A49k67K01k02k8Qk04K79K08j11l9l60L08Q9l26M14Q4o8O1j91N9Qok77q9K85
2386a5rK91j74l6r5K19k83R2j0JJ42k50l8L06K9k60j67J59M44l20K9j02J90r9
2410D4j11M8L88n42J63L87m46J79k88K96o0j17k33M57j30j6l8q4P0k32M28l91
2432b28J76J66R1rj88J6j30K51k48K37J40k16j71qJ59R7k89K67j6m5J3J55m94
$$ y = [227, -104, -150, 42, -90, -19, 205, 129, 328, -119, -341, 93, 355, 5, -51, -111, 26, -121, -26, -153, 9, 104, 135, -40, -189, 55, -194, -70, -77, -60, 63, -350, 84, -273, -29, 96, -157, -32, 64, -34, -181, -27, 5, 5, 4, -29, 155, 189, -102, 82, -64, 217, 205, -227, 188, 351, -44, 20, 130, 155, 105, -126, 82, 69, 156, -3, 217, 16, 67, 76, 29, -56, 28, -209, 7, -188, 0, 139, -44, 17, -76, 187, -366, 88, 39, -109, -137, -96, -57, 142, 85, 124, -54, -208, 149, -118, 83, -119, -147, -139, -343, -64, 144, 33, -6, -366, -58, 31, -295, 119, 203, 135, 196, 5, 64, 72, 66, -211, -300, -15, -24, 267, 93, 57, -38, 181, -102, -10, -20, -19, 123, -127, -165, 141, 170, -90, -257, -98, 346, 26, 55, -47, 143, 44, -67, -19, 369, -173, -10, 377, -69, 110, -178, 118, 58, -59, -292, 165, 35, 19, -19, -103, -33, -265, 163, -228, -52, 114, 205, 196, 8, 24, -106, 145, -103, 134, 274, 58, -113, -121, 38, 135, -154, 113, 97, 52, 65, 220, -274]
2455b74J60R2k67L22m3J24o0l9l13K94P6k06J64j17J58m9j06K9j83L58l01L16
2477A35K02l87K59l7k78L92k93J03Q7j66J17k6J19j57M1l60L19n6jqpj08J41l1
2501@j88J75l13K68Qn2j1n4L84Rj27r9J82Q7k08M7K3m3k56K85j33j39P4R8j2o9
2527f4j08L86j73K0j24L9J09j81p3J28J82o8j21M8l7N8R8k12m9K2J52j88M07k40
2551A1L4l3K26k78J85M3k40O9j94J66k5K20J29k39j2J15j97j00J25l53M79j32
2573aL4J71l39J73n2K77l51J3P5j00mn9J45J27l8j4J12l53J85j20L06o2l0k05
2597a10j9k4K37r8j54J5R0K35j06l07J17j57J01K83k04j44M5J57L14k69j12O5
2619d5K09m7J38k86r2K48P4r4J8Q6n6m67L83n9k28L08m23L88j35k20L27P3j30
$$ y = [-274, -114, -22, -289, 33, -10, 114, 54, 15, -298, -4, 72, -134, 30, -87, 71, 22, -84, -55, -238, 120, -181, 135, 337, -50, 209, 172, -106, 286, -7, 96, 183, 17, 134, 108, 227, 70, 111, -249, 70, 14, 13, 5, -2, -110, 31, 0, -188, -13, -326, -58, -50, -102, -113, -167, 217, 226, 99, 0, 182, 269, 61, 108, 131, 88, -168, 117, -16, -155, -81, 17, 5, -64, -172, 214, 41, 61, -63, -24, 85, -96, -169, -41, 141, 73, -48, 0, -37, 21, 119, -93, -142, -120, 32, -156, 251, 11, 45, 12, 238, -40, 145, 188, -52, 17, -177, -11, -36, 184, 313, 74, 62, 177, -20, -120, 5, -348, 131, -1, 33, 204, -135, 38, -14, 263, -88, -75, 0, -100, -104, -163, -18, 109, 71, 57, 169, -184, 1, -119, 187, 125, 95, -110, -129, -153, 84, -14, -168, -153, -63, 172, 66, -241, -124, -281, -180, 103, -101, -245, -200, -43, 271, 2, -110, -45, 164, 117, 255, -31, -123, 125, 199, 105, 123, 209, 153, -314, 69, 10, -218, 90, -333, 55, -80, -300, 27, 100, -30]
2642c0L7k6l8mK70k6k67Q7K87k37L03l18j68M0K81k26J29j51j86J91J40q1j50
2665a43K64R1l05J58N2k34L1L61l10O6l5L63l09q5Q9L32m35j21L24j27J17l08
2687a64J44J03J67m38K68k31L9M06k23M9J80k45m9L4P4j70R0k66R7J70k15J03
2709g7Q6j38J90p8p4J13j52K22N3l7kmK14m39J93j12K44k65o4L24l62J46J5j30
2733a34L37j6R6m67M62m64N1M13j58K7J36l83K8qm9L34k4l67K2K26r2j19l9j4
2757b02J09J77l00J97n8K82j5o4k21n4J07J40J13l70O5J04j12K53o1N5r9k10J48
2780a6R2Q4m14J14O0K88m2q9l75L09J17k50K22K4k16J64K2j50L13m06M49m79r6
2803b75L94K0O5l18J24j61NJ1J26N9j03oj40K83j77J37o8J42P4l46L53j42M2j8
$$ y = [-30, 7, -19, -57, -61, 209, 183, -84, 3, 290, 53, 356, 38, -130, -90, 191, -35, 94, -57, -243, -52, 88, 7, -143, 121, 212, -93, 65, 117, -117, -86, 275, -35, 31, -4, 359, 50, -35, 54, 386, -49, -170, 154, 27, 144, -164, -20, 83, 250, -188, 80, -151, -112, 294, 71, 120, 300, 55, 6, 40, 114, -56, 34, -232, -135, 35, -180, -77, 9, -129, 61, -17, -91, 22, -130, 92, 145, 108, 106, 102, 316, -123, 70, -42, 202, -63, -127, 197, -165, -19, -4, -134, 203, 187, 283, -184, 278, -186, -135, 278, 120, 147, 283, -100, -72, -80, -129, 205, 181, -186, -164, 62, -30, -149, -188, -202, -93, 84, -216, -19, -77, 205, 190, 126, -95, -149, -42, 98, 211, -159, -94, 10, -102, 151, 90, 145, 46, -164, -16, 76, 160, -254, -140, -80, 208, 166, 77, -298, 11, 128, -122, 100, 124, -92, 72, 94, -56, 257, -149, 300, -179, -275, 119, 139, 204, -114, 10, -151, -146, -135, -9, 50, -53, -59, -199, 84, -93, 44, -24, 118, 192, -154, 199, 57, 99, 81]
2827H1J53l26J44N6m2j64J62j9j03k9K5Oj54L52L0M4m66J38J80r8j3p4k1O6M3
2852b9M43l96J07J5n7j82K24j27j0j90j8L87j64k10L80k0k83Q7j20M6K03J24r2
2875A18j61l07Q1K13K34l21n1R2K67P3nk96J24J4j8l0k36M52j3q1L9l3k98P9O6
2900BPM18l73K48k56m8j30M6j0K19j32J20r8k11K39J37l31J23J0k74K14J21j13
2923g2n6J92k93L86m0q9k91N89l30J38J40l82O3j51M77m95K69K1J17l87K33j26
2945h7l81K82O9K01j69K31J24l29m8L14o2k29Q8K4l3Qp7N4L00n32J47J99k64K18
2969D8l48M80l58J61K05j99j23P9K65l03J54j43j12K7K18Q1j81K11o3J42l20j43
2991b22L08j1K3j6j50J34l16K47q6M3J54k31L35m72k28K37K29K5N3J3j65K32l13
$$ y = [81, 234, -92, 52, 108, 66, -98, 64, 45, -58, -87, -62, -56, -210, 142, 172, 216, -250, -112, 68, -30, -43, -117, -138, -72, -29, 414, 18, 125, 140, 83, -99, 125, -2, -12, -202, -220, 167, 3, -207, 173, 153, -130, -43, -163, -117, 86, 210, 118, -43, -350, -269, -56, 178, -143, -194, -102, 165, 238, 233, -63, 61, 75, 57, 27, -209, 243, 230, 149, 188, 155, -143, -64, 2, 9, 427, 54, 302, 46, -2, -132, -86, -96, 123, -9, 111, 13, -198, 41, 178, -153, -30, -20, -294, -80, 41, -72, -128, 64, -229, 157, 117, 28, -263, 326, -4, 134, 274, -108, -45, -196, 281, -214, 55, 76, 193, -194, 39, -87, -468, -186, -117, 84, -85, 146, 270, -59, -107, 207, 145, -84, 4, 28, -5, 3, -74, -20, 280, -252, -105, 94, -170, 48, -300, 180, -178, -17, 188, -11, -134, -55, 210, -93, 61, -82, -194, -167, 51, 132, -49, 162, 99, 241, -79, -222, 86, 75, 98, 82, -68, 66, -250, -3, -89, -46, 108, -123, 212, -260, -488, -251, -22, 3, 56, 69, -96, 136, -177]
3014a77NN0K74l5k6l87K00OL7J05K09n10J29R1R5k4p1k83O40m51j0k0J02K62n03
3039b92L74r3j88L33k71K80j71M8L4J5k91K31rJ60j02N8m67M56K00j28r0j14Q2
3062E5l09K12J99k57K11P4p9k78K0J47j38J93J6k08L60j65j21R9r5J50k25J63
3084B4J15k16J73M9l77L16j09k37M12k76J37K04m34K10K02m20K21J26j23R1J22
3105B10l33j56K24N5K2J07J3L9J8o2r4J90r1j41L1J51m78M46k54l3J37P3j93J3
3129a06k1N6J36j86J56k28O9K51j19J65k58M9l5K36Pl28l8M61k17k16R0j93M42
3152A73k40Q1L4L0p2P5k49R9L6l45K66L4P2j31K04q8K5j82r3m9N55j22j57J97
3176A53N8P2k00n7K1K2l5J29Nj68L8loj95j0K62j00J35j20Jj40qJ03J41j83J44
$$ y = [-177, -172, -122, 152, 117, 91, -296, -96, -90, -53, 52, 261, -249, -120, -29, 66, 42, -29, -312, 328, -123, -133, -153, -51, 211, -292, 82, -11, -199, 134, -137, 143, -28, 20, 54, 69, -222, 9, 0, 160, 58, 116, -351, 105, 305, 177, 87, -27, 55, -254, -42, 157, -100, 111, 185, 106, -172, -152, -5, -143, 50, 66, -142, 218, 53, -68, 31, -64, 86, -139, 24, 139, -77, 96, 145, -232, 84, -25, -262, 150, -126, 11, 215, -219, -9, 193, -227, -6, 120, -3, 88, 210, -123, -279, -55, 0, 22, 129, 142, 181, 199, 137, 43, 233, 142, 1, 32, 183, -295, 151, -103, -136, 1, 74, -119, -106, -127, -71, 65, -121, 35, -193, -124, 127, 8, 173, -85, -36, -71, 165, 172, -156, -194, 267, 50, -166, -76, -269, 173, -67, 14, 48, 78, 6, 81, -168, -69, -33, -378, -112, -78, -6, -137, 67, -21, 4, -178, -271, -320, 235, 113, -44, 153, 211, 283, 83, 26, 47, 69, 34, 163, 168, 0, 38, 35, 29, -166, -176, 86, -14, 121, 1, 2, -138, -146, -43, 98, -85, 59]
3202E9k17O2J23R3N3k18K61j42p3J56j98J97k58NJ8k13O31l93K46j45r0k1J18
3225E4l12J7J19k60K48Q7K28J51m13J12K6R0k06R3n2J19N1M9k51j23L32j09L19
3248C69l89j58m6J03K16l8j93M8L02J1j29o2P6RK8o14N90l14k4K12J08k45j6K59
3272A03J27n21M65n2k44mk32L88j85J75J01j57J47j78J00k38M14j37K5l6r5P5
3294D1Q2l40J39J21N0NK65n71K83j73K30j49J3J53P0j5l01n2J33q1k46L79n4J18
3318A00m4k09K20j82L98k57k35J42J90l00J04K51n39K96n5j17K69J3l0K86k08
3339I3j42r4J75L6j17r2J27O5k58K36k52n2J12J96q8o7L55j58j46l6J71k6J99
3362B37k58j81M73l50J37j29M0L3K8q8n1J64l31L10pk04J67J96j21m0M4k51r4
$$ y = [59, -158, -96, 27, 120, 173, -45, 216, 74, 1, 157, -41, 156, -102, -97, -79, -292, 339, -54, 192, 47, -43, -64, 54, -258, -241, -122, -382, -134, -47, 181, 332, -81, 31, 57, 147, -59, 34, -18, 101, 152, 201, -50, -173, 159, 50, 369, -20, -178, -224, -121, 95, 57, -136, -88, 214, 225, 96, 34, 110, 119, 147, -467, 123, -191, -215, -3, 105, -140, -156, 103, 230, -291, 174, 122, -122, -126, -358, 30, -155, 20, 121, -36, 111, -67, 33, -205, 209, 72, 97, 61, -34, 41, 123, -217, -78, 43, 93, 98, 363, -208, 75, -98, 132, -17, -4, 149, 219, 204, -97, -149, -16, -97, -343, 36, -18, 100, 56, -153, 67, -115, 283, 26, -209, -67, 123, -177, -73, 178, -361, -65, -120, -237, 32, 45, 15, 301, 93, -49, -143, 32, 68, -49, -141, -14, 51, -207, 29, -223, -275, -163, 33, -55, -122, 233, 75, -71, -107, 64, 38, 237, -21, -202, 271, -79, 58, -71, -31, 2, 30, -58, -109, 55, -276, 34, 27, -177, -10, 186, 65, 25, 69, -182, -276]
3385b76M24j38J4m9O7k35K98l2k12M6K09Qk8j8l61K23p3K32J65l30L12n64M44
3408A26L8k99k2K03k26K86q8J18Rq6K03J2j22m25L21R7j32r1L1K1J14p8j48J16
3432b2Q7p2o2k0P4O3P0r8r2l80O36J3j44j74L38r6l89K51J83j25J10k29l3P3K10
3457A72q7j30l71N00k17J87j24mK23j36J5J12l90M4K73j59K28J1j77j27K80m8
3479G5l06K42J27l00n0K88k2l37K47n8p1Q1J27j39K79j47J9k54k7K19J09j16K92
3502B78l47R8m3o2P0oJ95J0q7l24K46K5o9j00J37K69k74m0K71m92P6J50r6k67
3526c82M26p3q8o3J45J11k51J02J3j20J7K15k21j1L40l64J37p8J11J7K3k67M05
3549A44O9j17J2l1p7n1L27n48K14R4k3j36K48l17J19Q6k91O47j87J2m81L31L7
$$ y = [-276, 148, 10, 24, -25, 42, -193, 105, 73, -139, -93, 116, 124, 96, 78, -283, -60, -133, 99, 264, -66, 246, -318, 126, 164, -135, -157, 46, -180, 106, 18, 136, 145, 59, 262, 274, 152, -273, 48, 145, 13, -78, -47, -26, 88, 10, -138, -22, 65, -7, -69, -89, -15, 48, 118, 20, -72, -452, 184, 197, 53, -121, 217, 121, -268, -17, 166, 41, 151, -78, -111, -38, 172, 85, -45, -416, 84, -133, 54, -70, -74, 149, 13, 28, 140, -250, -206, 67, -92, 136, 147, -30, -157, 123, 75, -231, 11, 138, -162, -212, 76, 54, -283, -36, -94, -165, -84, 43, -96, 183, 36, 55, -199, -226, -7, 102, -14, 278, -69, 29, -14, -76, -6, -12, 183, 193, 106, -218, 28, 53, -16, -116, 21, 290, 16, -24, 247, -245, -169, -19, -115, -382, 44, -29, -117, -180, -35, 76, -175, -73, -60, -180, -163, 52, -169, -180, 160, -204, -67, -145, -34, -17, 6, -261, 144, 213, 96, 108, 77, 0, -51, 276, -272, -58, 36, 13, -123, 125, -192, -73, 13, -278, 369, 182, 194, -287, 44, 81]
3572H1K0j53j92L14J65j97k22j24K36q0J12L0j19j27K27Q1O6K17m89Oj13p9K90
3595e0Qn8n5J24k3J38k10n6K5K59j46Q8p8QM4l4m1R7O0J83l40J4o1k3L08l20M4
3622i5J43J69l28J82l29L11o0j16K53lk61PJ55l7j6j45K47j85K42k98J23l1L18
3645B46k12k27L56l69J28n5J64k40J43QM4K11k9j12k37J33P0j3m1J65j8mj5J45
3669B41q8j55K55j87N0j23J02o0l67J70NK0L24j55M08l31j29j0J41jj13l2J7n
3693b3J37j27R3q0k05K34o8K99j55j36m0K01lL8M0J18l23J01j22m8k8l1J87J57
3717B16k15j69K81j05m3K37j49r2J1j4K2Q2m8N7jk17Q0l34N42O7k49J88Nj53j94
3742a95M43l19K20l65K89j8n4lj39J31j37L5j81J37L53k20N8nqj5j23L97l99M08
$$ y = [81, 101, -52, -244, 70, 235, 38, -184, -308, -72, -152, -40, -10, -129, -256, -29, 52, 118, 335, -154, -148, -261, -340, -50, -42, -100, -155, -31, -54, 84, -126, -182, -157, 102, -44, 44, -34, -26, 18, -16, -57, 40, 100, 283, -57, -43, -104, -127, 181, -139, -95, 48, 217, -111, 71, -258, 53, -7, -123, 130, 127, -134, -127, 28, -9, -25, -170, 77, -108, 134, -164, -41, -72, 246, 34, -193, 163, -206, -78, -133, 31, -209, -66, -58, -14, 197, 168, 56, -181, -48, 22, 9, -32, 133, 115, 111, 96, 241, 153, -2, 253, 66, 116, -7, 95, 35, -332, -162, -157, -137, 187, 32, 440, 109, -20, -30, 111, 110, -3, -35, -18, -23, 114, -13, 80, 0, -205, 29, -39, 260, 105, -31, -71, 130, 127, 165, 205, 323, 0, 101, -21, -69, -97, -128, 59, 216, 1, -168, 113, 8, -35, 202, 53, -39, -28, -42, -20, 62, 14, 71, 70, -147, -67, -401, 141, 208, -41, 147, 152, -1, -195, 248, -71, 149, -216, 73, 55, 1, -2, -141, -10, -147, -112, -293, -156, 197, -23, 35, 30, 22, 7, -116, 281, -118, 290]
3766B90l31m5K56l19K88k11L02j63j56Q3L99j97k61K42k95R3k30m0N93j70K3j39
3788A2L4n7J63k7k03M0L4k64M1L09J07O0O8o17K24O7j43J97J19l90K58rk98K57
3812a8J2J78k17p7q7n5J51O3J00p3k7J64j93J78L5j04l49L03J48j63J36q8Rm4
3836a8K2j99L38J87k50l57K11r9J66k5P4K05l35Q8l3R9L69l84j58J45r2K39j58
3859C5K06J9k58j17K5Q5K38q9j53K84j28k41rm2K35k26l4J18r0N31l86L5k22M6
3883a38R5Lk58L35K47l84J34j35L0%o1Q9J8N2Q0r9L9L3j36l0J97rj48m6J78j46
3909f0K10k52J00n5k2LM47j75k00K21j32k1p9k9j66K11P1n8K08J31k8k59M1j11
3933dkJ42j97J67j37l4L9J11j71J08O4k03l93Q36j95Jj90L6L97n50J48k4r9J67
$$ y = [290, -41, -86, 170, -149, 139, -72, 230, 67, -89, -6, 393, 196, -65, 177, -118, -25, -255, -295, 298, 128, 151, 12, 46, -11, 152, 125, -78, -38, -4, -268, -227, 82, 189, 249, 317, -300, -76, -9, -152, 45, 164, -226, 32, 23, -275, -18, -6, 172, -45, -122, -209, -264, -113, -50, 50, -23, -50, 114, -79, 99, 134, 30, -319, -16, 132, -31, 105, 17, 26, -18, 4, -195, 143, 330, 80, -277, -66, -165, 1, -24, 50, 255, -80, 8, -25, 74, 443, 59, -99, 46, -46, 193, 35, 241, 260, 2, -115, -90, -5, 233, 144, -9, 275, 147, -94, -103, -145, 90, -136, -170, -52, -142, 389, 3, 38, -184, -138, -43, -40, -298, 37, 284, -100, 34, -101, -71, -71, -132, -43, -25, 27, 107, 8, 47, 80, -56, -86, 111, 102, -46, -92, 86, -60, 150, -102, -2, -57, -79, -76, 371, 196, -4, 217, 85, 64, -15, -44, -210, 1, 72, 14, 222, 353, 325, 66, 107, -4, -6, 136, -61, 106, -31, -65, -26, 85, -86, 22, 86, -117, -510, 326, 131, 132, -58, -22, 375, -175, -27, -51, -150, 17]
3957A7J91j32p4L06k51o1Nk82K23J26J0j21j38J15K5j8J53M4k5j08j3J31J22m06
3981a61J20K0J02Q8O8k69k27K02K07j86K0J77R8l77N0rK71j91k50M3M00l61K85
4004A20l15J14P5k85N21m62K90k6J42k18m5N8J72n9j39K06p7j7J27k67K5N23k43
4027B20j10j70Q8J72J30k13r4K12n12J61Q8o1J19O4k76J44R6k40K88N4k38L49
4049B71l86r8J46J53J64k60J09j79j5J22J7j16K0k05K81k81N12p6k96J27L8n8
4071a0K5J48P6k43k93K58k71K47K98j86k53q3K80J88j72J25j30k78L67q0Nj49
4093a31L29k20J2J76r7k04J66j3N1M4n1r9k24K51P4k50J88O4M7L2k18O3J65m40
4117b85K90L24k36K3k42j8J98j9j71J36k71k7L0L16l8j26q3K1K77j64Rm3j9J04
$$ y = [17, 208, 76, 2, 308, 57, -4, 1, -281, -58, 68, 78, -43, -181, -66, -41, -59, 94, 138, 113, 5, -8, 123, 245, -161, -41, -21, 81, 169, 237, -32, -259, -57, 150, -36, -16, 161, 259, -118, -68, -77, 194, 3, -247, -204, 196, -165, 120, -195, -81, -6, -291, 230, -232, 58, 32, 174, -44, -89, -31, 141, 82, -57, 149, 72, 55, 182, -85, -60, 463, 220, 110, -60, 28, 200, 330, 117, 23, 235, -277, -116, -28, -89, 30, 94, -182, -38, 58, -182, 106, 160, -78, 271, -115, -213, -67, 86, 250, -10, 99, -80, -95, 27, 44, -72, -52, -257, 24, -257, 255, 179, -117, 10, 48, -10, 15, 163, 239, -4, -297, -39, -310, -63, 235, 49, -204, -287, -7, 181, 9, 134, 4, -274, 93, 13, 18, -131, 198, -22, -10, 166, 69, -135, 31, 18, 69, 113, 62, -37, -261, -10, 64, -186, 2, 66, 113, 145, -73, -10, 155, -285, 5, 329, 93, 116, -126, -144, 54, 35, -136, 0, -271, -298, -268, 48, 10, -116, -199, -178, 99, -65, -56, -99, -118, -14]
4141a4l34M43L5l5l76J28L50n5jr5J82k66O5J46k66Jk3J68m8K65l49l2l6O8j19
4166a98L1K97j91K02k74M13l36P0Nj11P4R7J41j91l75L95j07j31M56k79J34l47
4188b25K58J71k87L97l94K0j04k1M13O9o23M15j19k45L12r9J1K06O7k46L7m4J45
4211A14m0j60K4J12J8R2l29K1K44l30K16Q3Oqj0K3j02L28l55J92l56J99l85K01
4235b02K09J32k95L51l7k31J12j2Ml2l0J4M9R8k58L07j23N5k63J7N1J22L46n54
4259a70L20J5j50J00j81K3J50J12K6n18K23p3K10k1p0j12J06q9J01o7K05l35K83
4282H8r3j40K60l06K04j59K50P1j29O4J90j46k39n0K97q3k18J15O9R7o2k38M60
4305C02k13l14J18K17j44J98j91J27j41j69J36M0r9L88k71J53M3m14M9n1J53J32
$$ y = [-14, -348, 95, 130, 95, -281, -153, 197, 142, 141, 46, 228, -38, 27, 173, -93, -92, -115, 53, 5, 270, -79, -111, -147, -79, -198, -167, 130, -61, 141, -133, 280, -56, 14, 19, -92, -18, 79, 220, 29, -346, 49, -58, -189, 267, -12, 122, -225, 33, 204, -83, 314, -80, -60, -164, -185, 228, 297, -326, 89, -30, -275, 37, -62, -51, 155, 222, -24, 13, -31, 114, 74, -86, -62, 50, 68, 160, -169, -148, 96, -234, -18, 65, 71, 63, 53, 76, -26, 302, -53, 139, -217, -18, -403, -202, 7, 139, -156, 195, 158, -73, 39, 27, 31, -1, -31, -17, 32, 130, -128, 179, 56, 111, -152, -135, -84, 38, 384, -170, 150, 165, 15, 115, -66, -43, 107, 219, 245, -273, -50, -123, 87, 66, -4, -116, -10, -99, 2, -65, 140, -195, 88, -5, -145, 115, -191, 13, -146, 104, 175, 46, 110, 300, 154, -85, -135, 162, 79, -139, -24, 45, 142, 80, -158, 302, 89, -225, -107, 110, -34, 164, -27, 100, -41, -210, -74, -34, -133, 255, -16, 137, 180, -234, -185, -236, -83, 49]
4327D9o0R4l01K41J71k2k42L54j08k7R4j16m14L60j91L12M6l40J05j34M8J31j33
4350h3J28J61j61J6k85L10j72J85k00K24J28j86j04j89L06j07R6k61J52K79r8
4371A39l35K13L36l35p7j62K30J18k32J32J65o4j50q1o1M59j78l63j6K73Pjk76
4394b59L66J06J19j94q9J42p7k08p7N21k16j25j45L83m94P2o6J73j78k1K42K46
4416B21p2j18N8j67j4J17J4J19k27K95k76P7K41n89K70l7K21r9o4k8O2K1k22K81
4440H4l00K84j77l7J85R9o9k3o7l33K17P2K10k71J62j17q8K18N9j02j02M4P6k5
4464ar1P2j67o1J79K23k25j39K35r5K58p0j37K13j92j5j2K11l29J14q0K20l8p
4488F6l4j58K91m80L55J2J01N7k05k33L14r0j15K48j99K57r1k54L98m07L57j27
$$ y = [49, -11, 83, -218, 23, 194, 172, -70, 284, 176, 149, 243, 127, -287, 73, -118, 194, 240, -100, 5, -129, -81, 50, -83, 45, 206, 45, 61, -224, 86, -86, 99, -101, 123, 251, 65, -39, -228, 78, -29, 67, -194, -42, 237, 139, -196, 17, 353, 18, -59, -221, 9, 127, -105, 27, 192, 128, -22, -103, -164, 295, 117, -246, -262, 11, 18, 17, -259, 107, 213, 332, 138, 49, 191, 114, -94, -171, 350, 134, 9, -136, 247, -247, -175, -241, -68, -246, -267, -25, 221, 149, 31, 89, -78, -92, 25, 39, 158, -69, 226, -50, 27, 268, -321, -51, -88, 133, 34, -30, -58, 4, 25, -197, 84, -216, 68, -109, -146, 39, 138, 69, 46, -21, -354, -137, -65, 145, -126, 36, -81, -169, 49, 108, 6, -96, -52, 24, -1, -92, -20, -187, -248, -69, 154, -71, -210, 25, -70, 188, 118, -19, 194, 2, -13, -25, 186, -143, -29, -109, 111, 73, 66, 32, -126, 165, -315, 40, 52, 153, 210, 5, -228, 86, -4, -119, 129, -70, 187, 96, -158, 240, -167, 190, 63]
4510F3l41K85K67l63L3K79l82J34j36K22j86l2K74j42k08j22J36L50k12L46q9
4531A76J44k91M5r2j65J36N5j12J64k06L34l81K00jj16J49j18j0Q6O0J1k12P5
4554f9J19K25l47K89j72l6J02l59M25j24n8L86o95J13K80k64J85K55j94J46j14
4575I3o0k32J68r0N42j88Q6n62O8j7L00Q3k64J26M6K1o5l27R3J68j04k61K37R3
4599d6q8%rR6k43L77j91n0M3MJ65K4m50N23k14n1J39Pn4J52k11q6K10k1j88N7
4625a05K49k09J16%j71m7R1L96l4m33J68L2j68J55Q9K11n56M2p4L9L13j03Nl2
4649b6j86M4N6p6KQ3P4j65J87K21J2p4l79P6J70R0k4j05j2J35Qj43j4l4n8r7M5
4676a90L6L64k90K29j8j43O7O7K21j18k51j07N2r4l6K24k70n1L03j41K84Jq2K10
$$ y = [63, -278, 7, 274, -89, -56, 223, -159, -25, -161, 61, -125, -157, 117, -25, -233, -355, -219, 131, -81, 265, 176, 320, 29, 74, -18, -183, -47, 8, -104, 60, -146, 188, -193, 7, 6, -110, 39, -79, -89, -3, 57, 68, -144, -69, 50, 275, -72, 217, 45, 9, 111, -248, 177, 53, -5, 381, -314, -201, 79, -185, 0, 255, 61, 207, 93, 33, -199, -31, -121, 421, 233, 319, -243, -175, -192, 108, 191, -73, 53, 99, 120, 55, -272, -179, -11, -115, -376, -139, -46, -134, -134, -143, -47, -290, 87, -104, -154, -111, -107, 58, 82, -368, 155, -59, -110, 29, 36, -18, 134, -77, -163, 47, 26, -162, -105, 144, -65, 51, 51, -120, -167, -76, 320, 286, -147, 21, 53, -115, 40, 129, 340, -216, -174, -248, -209, 104, 1, 6, -26, -212, -168, -112, -188, -186, -103, -29, -194, -7, 214, 226, 152, -227, -151, 19, 109, 85, -20, -32, 103, 111, -32, -46, -80, -138, -235, -190, -154, 210, -80, 149, 131, -12, 55, 122, 343, 225, -26, -133, -81, -175, -211, 13, -257, -308, -5, -146, 138, 139, 57, 267]
4700B67j01k07K42k58J61k57J53p0M7on1rL4o1L04l05R6l57N81k14M7K63l43Q8
4724D4J03j51j05k6j17L60j52O1K58m51K85K5k23J49o5O2L2K08m00J70L04m21
4746e0N0J24m1j55J69p4P5n3j24J11j33n0%K63k82j34L39j92k13L95J89M1k82
4769b7J26k39K17k42R5rK17l51K68k94J54J01K9k7j71J80K57k75k2m8L39k81j09
4792a12R5J62k9J46k24n4K85q5J00k55J17k97J51J59o13N67J31k53l41M7O59l3
4814C23m17j23L36p7o5N8J06j27m4R8J51m17J18q9Q8J57k39R4P4j47K34j20J3
4837a5PR4p0N3k18K13N0k15J66j7j64K10M1o1j13j42J68j01J33L0k39J82J06Q1
4861A79J28m09J8o1O5J11j63K59j67q6M9k27L53K3m3J35j45Q4r3j5L4K12o2k31
$$ y = [267, 166, -41, 201, -57, 104, -153, 0, -70, -23, -29, -80, -89, -55, -116, 188, -117, -21, -378, 203, -11, 36, 299, -44, 44, 147, -4, -109, -135, -252, 108, -44, 17, 275, -176, 109, 134, -89, 60, -5, 57, 89, 297, -103, 67, 371, -50, 0, 124, 83, -72, 97, 23, 98, 45, -79, 32, -101, -151, -151, 112, -170, -304, 35, -157, -370, 25, 214, 255, -27, 99, -140, 77, -165, -70, -79, 138, -213, 55, -239, -85, 16, 45, 18, -153, 27, 284, 9, -13, -61, 278, -3, -112, -17, 145, 116, 262, 38, -16, 269, 184, 284, 29, 146, -151, 0, 159, -454, 113, 244, -9, -350, -303, 356, 323, -94, -217, 119, 42, -23, 35, 141, 14, -30, 68, 219, -198, -80, -169, -81, 76, -163, -69, 5, -142, 92, -28, -15, -8, 86, 16, 69, -149, 64, 114, -101, 65, 48, -116, 94, 135, 74, -39, -181, -13, -114, 19, 49, -190, -8, 98, 179, 307, -102, -84, -145, -80, 31, -132, 127, -40, -126, -77, -304, 49, 72, 29, 164, 19, 103, 10, -5, 29, 241, 179, -52]
4885e2J18l4Q8nl6k41K57k18j1JK11j11j11Q1K86j49k61J52m5J77m4k80N09l36
4909e4J43J10M1j68k69K80k71L73k83K45k7l46M26l05l9M8m4N7K6j45J35J62j45
4932e0o8M8k95N12k08K1r7J65J00n2o2J58M5k41J31R9oj37O3K08j29n9R7l49P4
4957c2J64M0k41j13M54j35ro0J29k08J02j80K39rl07P5K04j79j94J31L40l62J42
4980iJ16R7j37n6K92n3j06j73P3K30k13n9o6J29l66K60J84k75J65n8k23K13J7
5003a8O9R7k93K49j23j30K55k23K31o1n0J82K3K38k73l62K07J89l36K23J84m78
5025b00J31Lp1K34j88R8j02M03l60K9K37j86o6K87q5j91j8Q8j42j82K08k03j76
5048d52M40r5j51L33k12KK03j03P9j91K68P1l50J67q3p9J09o5N1N4o1L14n7l23
$$ y = [-52, 66, 32, 120, 115, 79, -162, 95, -123, -134, -133, 78, -33, -144, -63, 223, 74, -187, -35, -80, 97, 53, -227, 282, -54, 89, 199, 240, 72, -197, 83, -188, 185, -98, 147, 120, -226, 200, -105, -144, -96, -140, -83, -57, -202, -67, 95, -50, -118, -70, -365, 147, -61, -40, -137, 28, 128, 76, 14, 172, 217, -24, 107, 206, 200, 63, 126, 334, 205, 146, 243, -106, -32, 132, 172, -69, -182, 272, 137, 128, 68, 197, -11, 91, -89, 150, 141, -166, -91, 113, -66, -260, -129, 211, -151, -9, 107, 204, 67, 11, 303, 250, 144, -29, 44, 274, 61, 2, -64, 65, -301, -41, 143, -132, 33, -25, -248, -35, -18, 51, 148, -145, 104, -19, -149, 106, -117, 114, 53, 3, 185, 208, 446, 173, -189, 18, 207, -129, 94, 278, -200, -69, -66, -137, 97, -91, 7, -95, 308, -52, -23, 214, 28, -38, 249, 164, -27, -45, 43, -99, -281, -73, -276, -452, -12, -107, -258, 75, -137, -135, 68, -35, 44, -147, 121, 192, -158, 9, -74, -153, -44, -109, -58, -4, -65, 249, 192, -131]
5072a31R3K54j65J17l09L26k65J87j53K50j95M9J50j31R7j82J33J85j46O0k28
5093dR1m4j13j75L92k15J04MJ5Q6k13L4K07j92n4Q6j34M31k57j5L4m6oj19j28
5118b31L54k36K29j82J73%l28R1q8m5L54k88l1J25J11J35k41mP1r6n4K0K60j93
5142i4o1K05k04L71j04k97K43N9k17J84r3J45kN6k84NK1K08k43o1K06k44K49N9
5166A07J3k14L2M48l71J31j45k59J97J08K8j27K35j53oj93J17J27KJ12j83j47
5188a41J52Q7l70L40k50K14K6k03K57J98l14o6j61L74j39o1l9J88j12p5L43j70
5210G8r9j20j77M77j43L12l61m6K34l58K19j88K84k81L47l25m4L26j05P3k78J09
5232f6j11L16j80q9j9M59k80j31q8K39n9J90r7j22J55k24M94n73K08L1j85r8L13
$$ y = [-131, -38, 216, 51, 168, -141, 185, -80, 107, -46, 204, 9, 58, 208, 77, 174, -8, 125, 310, 164, 224, -4, 87, 43, -70, -245, 147, -68, 36, 40, 55, 141, -72, -38, 169, -23, -77, 9, -125, 306, 49, 34, 68, 22, 16, -103, -231, 123, -113, 116, -66, 107, 107, -221, -130, -218, -263, 91, -197, -228, -103, 8, 143, -98, -102, -31, -127, -181, -161, 99, -94, -155, 50, -154, 217, 113, -184, 59, 118, -99, 85, -8, 137, 135, 191, -93, -88, -67, 141, -102, -163, 43, -201, 48, 107, 120, -94, -62, 386, 15, 146, 1, -258, -61, 47, 75, -52, 183, 30, 24, -169, -52, 75, 77, 189, 6, -141, 11, 98, -272, 68, -182, 32, 58, -145, 112, 310, -4, -70, -231, 143, 4, -57, -96, 92, -20, -95, 248, 78, -21, -141, -318, 159, 16, 328, -33, -79, 155, -203, 16, -172, 112, -169, 178, -147, -191, 135, 30, 103, -175, -66, -177, 139, -41, -130, -149, 310, 30, -101, -189, 50, -9, 181, 84, -38, 117, -107, 387, -186, 22, 53, -132, -230, 83]
5255H3j2m6j17J99l18N06o65L16Q8l57K10j6J32l3k58M13j79KK1J39M3NRj35q0
5280e0J71j36K1k4O3n8k8L05k49N7L6q4l59K87o5K7Pj15J47R0j29JJ30Ko1j42
5306a56K2L00q2J2J04j49M6j69O2qJ56j96P1R4j78K99j79j32J31L5j03J18m2k97
5330b41J67L64k73m7p8J68j78Q5rj91M19k00L6k37K26M0J9j43kJ33n2k46J71K90
5354B21k02j4K81l98J70j59O6J30l01J70j5K46l00J87m3k90J1J10K64j86Q5J55
5376A88l55J79j23N6M0p7P5j38l9M11n23L62l53J69J11J50p0N9r8nRJ0J38o5j72
5401f1j25J57Q6j31p5K83j92q1L43l23J47j57K49k6j45r1K76j49K24l34M2L8o6
5424a11Q3J16k70K35L80n49N1N51m24p3J10j22j6M06k25j02k97K63J19m8PJ92
$$ y = [83, 71, 25, -92, 107, -211, 295, -370, -54, 34, -323, -113, -129, 3, -30, -288, 125, -54, -52, -31, 108, 151, 156, 165, 30, -50, 121, -15, 6, -18, 45, -13, -41, 264, 15, 72, 108, 24, -335, -48, -113, -86, -79, -194, -47, 43, -86, -85, 45, 47, -14, -156, -134, 166, 84, 96, 200, 51, 97, -72, -10, -18, 138, -58, 13, 107, -71, 228, 49, -83, 48, 83, -20, 98, 56, -241, -74, 290, 17, -30, -108, 60, -118, -33, -42, -233, 186, -14, 22, -215, 11, 51, 70, -73, -75, 58, 6, -240, -69, 221, 19, 5, 286, -112, 58, -101, -35, 95, -206, -36, -51, 195, -105, 82, 39, -251, -240, -130, 134, -52, 33, 188, -167, 12, -111, -55, -15, -92, -17, -155, -194, 217, -306, 56, -297, -128, -17, 133, 63, 122, 24, 19, 28, 38, 176, 111, -61, -186, -29, 57, -74, -149, 134, -58, -139, 204, -119, 28, -129, 120, 94, -51, -142, 134, -15, 209, -125, -83, -45, -111, -28, 88, -182, 53, 433, -116, -65, 486, 62, -11, 99, -23, -39, 367, 142, 40, -257, 6, 125, 77, 84, 276]
5446B76l34pP6j30LJ53J12l64J07N4n3K9j99O17p00K66K06J8k23n9m9K31P5l91
5470b86K04J26j89r6K6J02n0L58J78m89j05J44K34k04m9K8M21m20j4J65j44J15
5492E5r5K25K9j46m00K99m73K97J31J99k14NK66j17R5J6k9l09L29l13K58n16M14
5515FQ8j30n1J82j98RK47k13Q3J58j14P4J5O9j30j67J33j86K96j80L0K84j42k34
5539g1j23rK57l23M22j07K27l28j39J74j91J45L09j10k4L1j93p2O6K64m49M10
5561A66J4n4J21l85j6J1K53j56L3j54L1P0j55J16J73R7Okj00r1J31j39J59j04
5585B5o2Q9j45O9J78j00j85J21j5q4k5j06K34k50K09K12k83P2J69j27p2Q7O2j25
5609e2m8Ql4L96j28j72N3L6p2o3l5J61j8L45k72Kr3k88K96k84K06J68k72n4P6
$$ y = [276, -58, -65, 11, -119, -116, 37, 149, -215, -108, -54, -107, -78, -277, 340, -360, -94, 112, 130, -93, -152, -201, 30, 105, -286, -82, 44, -145, -241, -215, -113, -163, 195, 373, -116, -221, -77, 157, -47, -96, -68, 353, -67, -81, 84, -60, 55, -40, 185, 214, 68, -332, -33, -506, -209, -78, 121, -93, -88, 178, 61, 156, 172, 143, -166, 163, -150, 108, -408, 6, 94, -36, -87, 95, -103, -94, 153, -60, 23, 181, 67, 141, 156, 225, 95, -72, 61, -125, 171, -9, 21, 305, 163, -71, -194, -203, 54, -269, 153, 46, 273, -55, -194, -20, -211, -66, 243, 133, 109, 140, -53, -125, -59, 205, -244, 166, 180, 126, 247, -138, -154, -143, 110, -46, -13, -167, -136, -66, -221, -105, 68, 165, 171, 169, 69, -22, 109, -30, 129, 25, -37, 52, -93, -24, 154, 54, -131, -10, -25, -109, -134, -240, -6, -256, -47, 165, -118, -46, 123, -4, -76, 11, 73, -52, -100, -92, -126, 270, 142, -30, 23, 59, -13, -76, -111, 50, 32, 377, 105, 107, 14, -274, 22, -262, -56, 112, -160, -214, -138]
5634a38J66j64M32k20J1j09M4j95J54O6J0j68M55l27q0L67m39J76N1N7J08o7k82
5657i2J49K80l96k3P6j22J4K66j04J2oJjo8L03n80K27M3k28N62m97R3K41k67J57
5682D0%L52n65M8k6K07L7j21k47K12L4p3L52l19L8J00j57K16r7k57L39LRk74r6
5707b45L39J20j32n5l73J20K04k71N46n41L78J45m49L15j51L2j11N1K00L5l31
5728a74K1K33k24L78k08o9l15J65O14l53m29O29l35J72Q7lk80k21K57R1K53l75
5750h6r3K1J9p5P35m72J20r6J07r5k87L89j40J03k91L94l24m8Q2K7O0J48k89K38
5774A47j8l1j07m8Mj04M13k31P4k04L41k95L50k90j11j00K52j15M6nP9k28K43
5797F2j55K58j01k50J75n5J17q9k10J68J61o9n0j11K37j96J12M1K24m81J28Q0
$$ y = [-138, 28, -136, 296, 76, 87, -22, 22, -173, -19, 47, 57, -111, 344, 17, -63, 304, -135, 41, 92, 149, 257, 190, -92, 57, 337, -59, -82, -6, -128, -114, 152, 48, 60, 54, 55, 54, -14, 289, -291, -64, -21, -249, 313, -184, -91, 150, -117, 40, 40, 392, -173, -125, -151, 56, 93, -28, -275, -63, -29, -102, 250, -69, -31, 69, -88, 128, 31, -226, 113, 116, 125, -149, -245, 94, 214, 82, 27, -346, -226, -22, -293, 253, -288, 90, 235, -214, 101, -50, -18, -129, -78, 122, 157, -174, -153, 80, -144, 234, 26, -43, -358, -193, 421, 68, -361, 268, -67, 105, 192, 189, -91, -312, -55, 36, 289, -86, -179, -158, -139, -214, 521, 49, 169, 73, 180, 85, -202, 187, 47, 150, -141, 253, -71, -119, -37, -10, 50, 198, -91, 147, 129, 98, -9, -57, -53, -157, 256, 25, 99, -105, 236, -59, 291, 1, -110, -210, 42, -73, -27, -32, 47, -181, 62, -93, 165, 64, -186, -11, -66, 51, -38, -248, -80, 81, 12, -38, -149, 88, -108, 4, 45, 269, -212, -84, -4]
5819dR5q3N02n61k1K71j46J55k20K09m70M2K74j16j23L68k00J19q1j66K24k05
5841a37K15k26J22J32j4j81m6K22l14J90J44p0J13k17Q0KM8pk20N2K95k7Mj49
5865A1J23j89K0K7P9l7q3j02J51J15N4j09j02J55k46J17O4K76m11K11m9N4r8J99
5889B30j19k7l9r6J56J10l94K35M4K34o14J57K43n8j3o8K71m07K43m7M1N5n6l1
5913E0m8Q6j04M9R2m9jK4M4L7j33J0l79m7L52k5L5nK6J13J54j27l56L03j75o1
5939a35R2K2k27L37K07m45J14J05o6j50K78n58O69k93j1J51m1L5O0k15N5j64K81
5962A01j52J78k34K28k94K72l2j77J22j53M28l95K02Q2j41k31J3N50k07j8k97
5983a55K68j72Q9Nm2Q7m76K75R5J28j32J53k8k39K97j33p5k17M71k05J17j32J14
$$ y = [-4, 91, 8, 510, -51, -72, 199, 53, 208, -12, 197, -273, -231, 43, -73, -196, 172, -28, 91, 10, -156, 68, -137, 78, -148, -26, 106, 92, -89, -135, 87, -227, -37, 107, 37, 150, -67, 13, 15, 63, 56, -164, -112, 183, 156, 160, 11, 134, -55, -35, -8, 71, 34, -49, -151, 0, 115, 169, 60, -42, 113, -133, -16, 48, 324, -87, 124, 75, 129, 31, 230, 111, 84, 45, -51, 105, 215, -179, 56, 100, 334, -280, -123, 120, 62, 49, -19, 252, -155, 88, 41, 82, 137, 81, 50, 2, 88, -16, 33, 125, 76, 75, 99, 143, 180, 47, 57, -322, -369, -17, -42, -7, -12, 14, 127, 281, 154, -202, 101, -74, -135, -43, -21, -248, 89, 296, -149, -35, 70, 4, -146, 132, -426, 243, -50, -61, 90, 49, 84, 144, -71, -16, -180, 101, -51, 127, -107, 121, -173, 99, 67, -110, 12, -141, 287, -108, 94, 176, 35, -196, -183, 367, 160, 142, -155, 113, -59, 30, 35, -7, 80, -396, -121, -26, 102, -30, 123, 95, -144, 153, 20, -55, -272, 199, -6, 111, -21, 93]
6006I3o6K68mk79N6j02K04p1j30j62M0j09M76mk2J09k82k8K44j09k69O9P3M25
6030D20m29J55j24J19j44j70K30J80k17K9j23q0Q4J93j13N9j73K32k5K17n34L1
6052a83J78L6n4K01j48j12J29K42K9n25K83j87J41O0l0j01J15N3j3O4k97Q0J90
6075A51j20j1N3K1L5l46L17q9O8M9k45j8J64P1l35J58J90k16J18N8k36O7o3O6
6099i3M5J8N8M5l8L69k98J90l15j0K85l85J68J07k0Q0j2q2m28K39k03R7L59k78
6123a02q6P2J46q9L52m63K86qk93J56j48M9R0J74l22J82n7K95j75l0J90J3k71
6146c9J88o1p7K31l57M7j6L17l54RQ8N0J02j37n7M10k07K1j48l1P8j00K8o3K64
6171A86k06l3q0K08n7m7j4L9Km7Q4Qj05m36N97j34R9K25j86K08m20K32k63J24
$$ y = [93, 27, 295, 291, 12, 68, -34, 170, 99, -31, -193, -153, -262, 214, 210, 188, 297, 15, -13, 231, 122, -147, -78, -5, 420, -9, 146, 22, 141, -3, -173, 57, 237, 20, 49, -74, -154, -70, 123, 10, 69, -104, 128, 103, 320, -214, -183, -5, 31, -23, 178, 30, -82, 47, 289, 318, -207, 76, -111, 30, 90, 60, -41, 74, 127, 114, 178, -119, -39, 151, 31, 20, 73, 94, 129, -217, 100, 11, 79, 128, -117, -135, 29, 100, -235, -77, 113, -103, 15, 73, -163, -96, -159, -93, -48, -30, 28, 73, 35, 404, 106, 296, -19, -29, 256, -129, 39, 146, 126, 206, 194, 112, -316, -77, -280, -183, 176, -102, -188, -116, 30, -59, 293, -170, 116, 108, -185, -29, -177, -128, -38, 136, -186, -4, -61, 234, 59, 29, 219, 232, -39, 149, 88, 11, 242, -115, -68, -84, 233, -121, -112, -24, 26, 128, -9, -66, 344, 137, 158, 10, -21, 57, -43, -15, -78, 186, -20, -53, -133, 75, 18, -29, -43, -4, -2, -49, 35, 43, -62, -498, 99, -35, 64, 289, 103, 311, -109, 123, -140, -16]
6195a6J97j02j58l4L26q0l89L20j96K77J44k08L04n43J78L8k9k41J66K76j19j16
6217ek3K3m6k0J07n1j03j99J06L82j22J72k30M6L5J91k74l2K12n33J24L28n9j40
6241a11J61J34L7k13j62K82j72K09l07K63M6MNk22k28J66J67J20k8N9j31j74N5
6264d0j4J6K48n92K54K9J61L4m88O96l19J06j78O5P6Q2mj96K71p9p4Nn6O7p6Q9
6290H3j35M32l79J23l6lk50J43J29r5q1P2J8k72O2Q4l1n6K91j90J84J01j25k66
6314a97J26j57K6J23J24q5J17k2k33K36j10j9k6O6j5J6kr9j0J54N2k80K94R9j82
6339dl41M94J35l91n7J16%L2j05L00n30K49K16r6R3N9K4l98J00J50J2j46J61l70
6363b97L12r2p4j15L24j61m4K57j59K42J00k67jK7R9k39K8O6L2J35Mj58J15l24
$$ y = [-16, 181, 79, -79, -113, 213, 133, -256, 64, -132, 145, 289, 81, 385, -158, 20, 58, 29, -212, -46, 230, 111, -5, -28, -5, -51, -71, 36, -15, -118, -317, -211, 171, 49, 221, -9, 37, 72, 263, -11, -43, 169, -364, -240, 88, 29, -111, 50, 184, 221, 8, -154, 128, -44, 165, -142, 121, 167, 171, 176, -46, -274, -108, 59, 179, 151, 210, 79, -95, -40, -54, -38, 210, -382, -128, -99, 62, 96, -392, 304, -15, 91, -87, -22, 54, 136, 132, -64, 207, 128, 54, 59, 3, 70, -6, 83, -52, 380, 1, 124, 88, 85, -165, -22, 107, 12, -69, 3, 21, -251, -189, -105, -136, -192, 99, -91, 93, 194, 69, -197, -71, -228, -202, -79, 45, -40, 77, 55, -178, 58, -52, -71, -97, -31, -46, -30, -32, -131, -141, 13, 65, -215, 79, 178, -4, -345, 149, 284, -107, -164, -48, -48, -16, -121, 179, -351, -102, 114, 18, 111, 170, 194, -204, -104, 46, 58, -88, 73, -297, 15, -77, -151, -266, 58, -103, -147, 110, -49, 193, 293, 26, 25, 52, 151, -88, -60, 6, 38, 173, 177, 19, 134, -190]
6387a90J44J88l7J89n68K50M8J22o5N1q5J53l02J33Q6k4j9n0k5J75p7J07Kk95
6411h9J39o9K68k79j17P4J84q2P7j33K5Nm2J21n4l08O3k5M76k41j25K7K80j77
6435bqJ43l01R3J06j25J86j57pJ49j20O5K2k46P6L14l59J25o5M06k21j09J6J29
6459A10j95P0n5J74k66L33k54k32L91J12l32K33J4k22K77l17j10M9L49r1P0j65
6481e7N4J4j27j64N15l01MJ90r9k58J35j8M9J27k12J15K08k65K09j14r1M4m4L05
6505B19k17J7l9j06L9M6J27l68J97j75L94J21j67n6m3K65j23j43m4J17M6k1K90
6528C76m39j41J57j10J5L24j77J22l55K38j27L12k23j54N1K72R0Kk88O2J40J10
6550B57l28O7O5n2j40J17%j33J31J18p4J10j49k02J31L0J84k36K84l32L5J24j07
$$ y = [-190, -46, 142, 105, 294, -274, -24, 24, 146, 81, 132, 47, 200, -102, 31, 117, 93, 74, 24, -1, 174, 97, 204, 206, -89, 50, -19, 249, -30, -147, -73, 111, 29, 106, -27, -2, 3, -39, 82, 28, -280, -217, -242, 234, -7, -132, -105, 175, -2, -10, 133, -168, -75, 31, -94, 92, -65, -72, 77, -43, 22, 44, -202, -126, 188, -171, -46, -111, 295, 74, -35, -19, 110, -85, -15, -70, 104, -162, 171, -83, -315, 76, 188, -144, 89, 103, -119, 158, -159, -269, -220, 129, 38, 108, -57, -3, 11, -116, -280, 235, -66, -62, 128, 29, -229, -94, -112, -63, 64, -148, -33, 175, -90, 119, 5, -86, -42, -86, 219, 2, 19, -20, -126, -87, -41, 86, -282, -85, -260, 134, 255, 88, 32, -11, 254, 131, -12, -56, 61, 107, 86, 376, -63, -204, -47, -157, -142, 182, 5, 127, -228, 10, -117, 195, -28, -182, -131, 141, 231, 233, -55, 7, 147, 257, -71, -4, 61, 9, -131, -14, -14, -147, -16, 102, 28, 138, -11, -213, -82, -52, 132, -104, 180, -152, -117, 7, -100]
6573a00J50k89M30m06J08J27r8K15p1k82M61j00k14J37P8R4k89J31j27r5J55j78
6595a63NK29j70l3J34R7P4j79K28l82K43J80j81j67lM48l71J66j75l32M69j25
6617hj72M50j69l63l0L03O3j21Q4P7K36m27K07k2R6k77m8K15o8k21K77J86m55
6640a87K62J99l82K49j75p4L42o1Qq4j77M14k04l70J52M8J3N4Q1rj97O9J44l59
6664b44J97J20j66l4K01k45M26k61J46j57Om2k3K72j00L6N3k51L09k23K0p3K16
6687A83k97n8L00j34J7l30M78j77J53l45L80l74J49l1J0r2J72L03j30k34LJ96
6709A42n70K29L24j73R5j6P0Nk40J45q4K93p7l38M00j89o7K19k04m4K19k71L12
6732A80l67L51l28J35k5J18Q1j85K08j23m44L53O6J0j20R2j19L04j5l22J83j71
$$ y = [-100, 50, -239, 191, -215, -107, 20, -78, 137, 66, -216, 245, 145, -69, 68, 146, 240, -49, 82, -45, -140, 15, -163, -158, 71, -99, -132, 2, 99, 173, -6, 222, -160, 83, 263, 82, -85, -88, 360, -11, 155, -20, -352, 117, -8, -180, 270, 101, -262, -292, 11, 74, -47, 37, 114, 350, -77, 130, 108, 204, -73, -121, 94, 26, -195, 82, 268, -187, 75, 274, -108, 141, -34, -108, 234, 173, 181, 97, -80, 334, 130, -240, -88, -40, -27, 27, 108, 99, -98, -29, 115, -244, -47, 73, -93, -127, 74, -171, 255, -6, 140, -17, -11, -53, -76, 196, 96, 132, 185, -66, 243, 20, 40, -33, 183, -114, -172, 128, -6, 11, -319, 159, -18, 135, -210, 170, -204, -55, -86, -76, -168, 4, 307, 177, -57, -54, 142, -428, -199, 125, -48, 47, 31, 101, 106, -134, 11, -73, 220, 143, -195, 205, 16, -51, 168, -36, -80, 139, -132, 180, -187, 164, -164, -29, -54, 64, 145, -40, 168, 45, -399, -46, 20, 30, -90, 2, -117, 187, 172, -150, 33, -138]
6754a38K01K58k14q4M8r2J3j44K8J06K24l95M3K20K5j05K4k91J57L76k36P4j78
6777h0l6o5K85j08j69M01l64K49k8k58j8L65n2k07P1L1L79m57K37k73J63Qk01
6800a27J86o2K3K3l84M65j5Ml30P8J90j06l1J40R3r9Ol1k12K3J62J36k77K84j46
6825gk34J64m0K68l8j21lj19K70l41J53j8p9J12M29l58K15k42p6J25j28j35J40
6848f3N0M75o09M4O0K68J58k34k5j91L86k25j97K77m58K81o3l9K42j26m2M5j42
6871a28OJ07J30K78m18K52l65K96j95j87J88J78k00RJ09L9lk26J95M9K2J25l41
6894h0N9k21j12K76J2j36J23L4m9l4J8L63j3k45k98J91J77n2N2j89M55k67J58
6917B22k80j52K50j59K4K06l68M2K99k10K38k34L81l95L78n72M51j73oK12k28
$$ y = [-138, 63, 321, 107, 23, 71, -21, -8, -152, -124, -18, 206, -189, -146, 74, 99, -6, 18, -273, -116, 260, 24, 98, -80, -116, -181, 104, -4, -173, 228, -136, 113, 85, -173, -191, 174, 122, -85, -14, 17, 396, -61, 176, -97, 66, 74, -127, 59, -3, 20, 43, -341, 124, 109, 113, -217, -139, 51, -55, -86, 54, 147, 48, 54, 23, -189, -166, -4, 132, -145, 139, -7, -241, -77, -117, 151, 113, -8, -11, -130, 140, -201, -48, -66, -145, -33, 396, 38, 253, 11, -65, 60, -68, -203, -63, -13, 462, -147, -103, -43, 225, 383, 149, 124, -67, 319, 94, -103, 174, -284, -3, -66, -105, 137, 11, -31, 14, -128, -122, -15, 115, 393, -25, 227, -138, 158, -37, -224, -36, 142, -58, -49, 60, 99, 96, -130, 65, 114, 136, 261, -80, -21, -242, -354, -78, -66, -202, -79, -45, -94, -128, -110, 253, 240, -5, -303, -112, 65, 13, 65, -124, 331, 64, 222, -58, -210, 40, -119, -95, 111, -257, -215, 84, -126, 112, -122, 259, -136, 242, -330, 121, -52, -58, 154, -74]
6938g4J71m0K9r9r0M8J41L2O8k33j8L40J67l73j33j84M69m11Q0J36Q2m11J91N22
6962D10k76l53J23RJ31O9j78R0q3p4J26L8J16n7N0k48p4J15n7J38j75K50r1J18
6986A17l0L4p6l09K28k49L62m7kkj57o5j0L09k16N4L1j04K94k32J12J70l96L06
7010A22k67K61k97J7K02j98K35K9n0J04lL1j29J7j70J04k39J75PJ09O2nj76J11
7034E2J48k8k86R7R5J29k1n22J59L12j54q6K6M5M8J62j5rk91L88j88j25N7j94
7058b01J93M4J52P3l02M8l8O8J19l86L25k2o4p6J94k49n8K86j89J25J67j27K3
7081A05l52K32L8N9k45J4r3K02J57J86m09l6j28K14K22l06K75l87M92n17J12L10
7103A45r7O1J92l79K07j05j77K74j81J11o30O40o0j78J99pq4r4M43l27K47k37
$$ y = [-74, 97, 57, 86, -13, -103, -55, 86, 118, 186, -47, -65, 275, 442, 69, -64, -248, 221, -190, -110, 26, 108, -303, -112, 410, 134, -219, -96, -87, 44, 113, -65, 25, -58, -132, -6, 32, 148, 91, 141, -107, -181, -66, -123, 15, -160, 90, -1, 117, 87, 121, 45, -264, -36, -285, 77, 30, 28, 26, -131, -196, -206, 103, -113, -59, -28, -132, 162, -70, 42, 212, -184, 122, -145, 116, -181, -164, 38, -160, 75, 104, 54, 158, 155, 186, 57, 74, -96, 8, -231, -56, -49, 60, 122, 117, -59, 52, 200, 172, -114, -17, 78, 207, 186, -336, -177, 135, -19, -105, -79, -34, 14, 176, 161, 152, -139, 249, 61, -64, -7, -201, -8, 36, 188, 261, -41, 7, -31, 37, 156, -230, 95, 73, 9, -67, 127, -122, -180, 106, -83, 42, 209, 82, 105, -247, -15, 23, 82, -163, -149, -242, -40, 117, 303, -106, -142, -270, -56, 166, -140, 135, -252, 240, -277, -165, 145, 48, 109, 301, -78, 129, 24, -153, 121, -60, 51, -579, 61, 1, -177, 22, 15, -69, -163, 280, -47, 200, -37]
7125c7j77J91J25k83K2J01l0o4J01K62l09R1LK6l6K04j99k25P5R7J52l92J45L94
7149B37l52j32K52Q0k6k20K30J31K3l82N7P4Jq3K34r3J8J34k02k69J86J14p1K53
7173A94l01K86R6j02m1j49j9K87l15K4j49O43j72j24k13K24j95j27M1Q3L5N7o3
7196@R8l3k9L2l31K26J31k36j1K94l12J17pJ58Q5k88K25k17K37j88J93m53N5j22
7220c76L92oK05k53K8n9L4K45j91l40M91k57J15J26j69J8r6J42j69Q8k81K16n
7243a02k69J71J36K39j23O5l48K45K30m82N26k47p3m8Q0p7J69j24l5L9J58k39
7265a09J52K28m06J31j48J96o8r9J21j83N41k77j41k02K24R2j17O6k20RL30k26
7287a06n4J86J62l7K18l32l9J37M4k29j16j1K12j2j57K14J37l69K67j8p3J34j20
$$ y = [-37, -214, -23, 102, -181, -159, -58, -88, -152, -51, 211, -98, -7, -4, 22, -14, 190, -9, -234, -159, -62, 90, -302, -157, 237, -115, -247, 5, 85, 59, -161, 69, 200, 223, -159, -102, -28, -27, -110, 124, 31, 49, 183, -19, -288, -102, 12, -59, 194, -107, 179, 275, 173, 132, -17, -36, 251, -64, -40, -189, 454, 282, 158, -55, 169, -26, -153, -112, -29, 6, 63, 0, 98, 65, 36, 68, -263, -37, 94, -142, -153, 141, -171, -54, -61, 97, 182, -106, 119, -98, 139, -49, 144, -309, -254, -376, 16, 10, 215, -38, -10, -69, -35, 210, 19, -321, 170, -87, 28, 154, -15, 3, -93, 49, -120, -32, -313, -97, -102, -371, -200, -64, 175, 52, 117, -231, 14, 244, -238, 288, 41, -32, -80, 0, -77, 92, -32, -67, -28, 130, -109, 43, 271, -135, -4, -152, 44, -24, -123, -2, -185, 356, 79, -62, -264, -40, 52, -65, 1, -219, -210, 120, -106, -160, 26, 188, 151, 369, 37, -2, 135, 179, -50, -166, -177, 35, 23, -134, 80, 217, -152, 115, 97, 24, 158, 38]
7310C8n3J1l3l9O5l94M62j11O4k98K66L09j77M9j55r7j72M61l4k2k47L1o6K49
7334A07o3J71j40j7r2j58K55N7j49M4J51m10P84l60j59m50L70l1j4K92j24M9J30
7357B43k97j2mj8J76n3q2j13l6K96j19j48R2K60k78L5L53k64N7k49M0K27J11L4
7381B51k89k46L50K99l82o4J76J8j70k82J19L83l23L11l20J74K5r8k0R6K8j94
7403a58J41j0N0j63N8j7K4J10O9J2N5j52po2rL33k70j07K41Qk31J58k9j61lJ81
7429F1j10K61Kj18j3L6j82K47j32k71L54j88K91k77k48M07l04K77m9Q7q1K11l81
7452a20J89pk56j7N33k77j51J04J4j40o6L52l06K50q9L10l16k20M27j74K7K05
7474B72k48k01K43J83m7j38m6J0R4j59R3R4qj82j58p5o3L27R5M4k64M3K9L70l33
$$ y = [38, -15, -4, -37, -76, -11, -405, 57, -54, 10, -288, -22, 287, 110, 159, 4, -93, -265, 196, 162, 140, -107, -76, -142, 107, 44, 215, 75, 58, -34, -192, 63, 120, -29, 15, 166, -244, 540, 180, 21, -429, -59, -90, -104, 188, 64, 113, 243, -54, -66, -70, -88, 88, 35, -47, -160, -196, 100, -19, -167, -75, 185, -93, -58, 295, 31, 88, -161, -121, 106, 217, 251, -38, -284, 66, 365, -17, -81, 95, 113, -57, -339, -220, 163, -160, 151, -169, 5, 30, -68, -88, 8, 36, -158, -17, -27, 23, -140, -82, -99, -75, 35, 104, 116, 171, 19, 12, -50, -59, 274, 4, -103, 138, 146, -85, 73, 44, -117, -120, 61, -49, 212, 214, 96, 83, 119, -63, 184, 52, -219, 135, -53, 238, -39, -287, 120, -184, 93, 44, 131, 50, 261, -120, 69, 62, -194, -211, 322, 45, -106, -2, 12, -128, -194, 158, -148, 102, 13, 323, 7, -213, 214, 40, 67, 272, 24, -177, 66, 249, 202, 64, 18, 28, 122, -37, 56, 150, 142, -40, -198, -273, -336, -9, 86, 130, -134, -91, -62, 308, -25]
7499b5J74j05q4K65o4k1j19J94P7l37K1J95k17j8L30m27K88L3j20k06K17R8Ql6
7523A21j27K5k46J27K80k21j15J9J99R5k05L00m95J78J86j84J27j75PN7P2l7J93
7546A81j61p6J48j02J36m18Q8K76J2R8l43J45l7J56k00o9Q4L42l22M0k8J32NJ59
7570B46k34k20J90j85J14lrL89K2l06Q4l07L40l88K40r8O3K00j44j15k3L09k05
7593d0K70l40K80m41M38L0j20M0l31L58N8j54j77J17J77k96J15n0n5p2L64q9l65
7616b83J43R8L7Q4l8O2k91N1K32j72LK36j81k21O2n7J62m5Q9O6j52J21rJ3o8k00
7642b58J15J34k65M28J3p5n0m9j6J32j77N8R7j06J04q6KQ4J30k15M6k9j37m5L79
7667B14J2j91q7m4O7K0P6nq0J58l2j96L02m50J24N4j11P2K18j08M2k27K01R7j84
$$ y = [-25, 149, 44, -40, 225, 161, 140, 21, 215, 292, -45, -24, 171, -46, -64, 266, -161, 127, 160, 40, -166, 51, 149, 157, 121, -6, 19, -227, -100, 180, -41, -156, -137, 62, 157, -48, 252, -243, -65, 121, -63, 64, -111, -104, -47, 25, -12, 181, 20, -56, 92, -10, 126, -292, -204, 72, 84, 182, -161, -16, -53, 103, -97, -166, -82, 260, -62, -22, -50, 82, 87, 246, 12, -208, -18, -203, -89, -92, -101, 288, 310, 4, 88, -219, 121, -267, -27, -125, -62, 138, -6, -121, -144, 165, -40, 230, -110, 170, -271, 167, 197, 77, 117, -214, 144, 202, 48, -129, -12, 165, -131, -16, -66, -121, -193, 171, 82, -283, -140, -42, -5, 79, 41, 103, -188, -137, 95, -77, -74, 162, -19, -240, -178, -235, -73, -118, -29, 37, -115, 6, -3, 10, -58, -258, -143, -9, -274, 154, 167, 92, 42, -7, -23, 109, -68, -10, 87, -19, 85, -1, 1, 85, 215, 0, 46, 17, -120, -165, 214, 226, 35, -52, -96, -29, -9, 67, 62, -18, 140, 108, -88, 214, -236, -112, -58, -169, -97, 121, 13, 55, -172, 29, 126, -58]
7692e8K94m06O7K12k42J8j66K04L32l89O5J50j91J44kK6K1k5r4m9j87M23q8J02
7716A61j56K76o5m12M98n38K31K4PL85m16J04P0l40K00q8j7k7n9J27M47l53j90
7739a31L13k02j38J12K83k06J25p9k26K40J18j44P4m9p9K08l49%J51J07l38L63
7761A53k31J51r3k02J61J28q3K07j9k01M8%m4Q4j80L93j10k71J16K12k35O5J11
7784A60pk64m0K14j63L15r2k3n7m9mJ70r5q3J65j30J70m78K85R6o4j37J43M6q3
7809eJ8j01J37R0l09p2M51j85r2j37N23j47n5o0M9m6k76L27J00j34j46J13l8K47
7833B52j95j69k2L52j70J27j09J72l00K4j63P9J81k31J93j02L84o41K40N3l95
7854d40O19q0k3q9L1PQO4N5j71M15l90k58p8KL32M2N7j34j64J65P1o6k7K3l22
$$ y = [-58, 236, -170, -103, 109, -133, -115, -281, -77, 255, -134, -69, 81, -110, 34, 32, 58, 79, 54, -40, -89, -276, 147, 59, 161, 5, 281, 216, -196, 302, -236, -5, 19, 26, 411, -5, 99, 169, -171, 29, -59, -76, -103, -162, -35, 412, 59, -131, 182, -20, -158, -46, 237, 31, 156, 77, -149, 91, 209, 65, 139, 90, 11, 219, -130, -130, 21, 128, -210, 153, -78, 73, -20, -222, -61, 67, -16, 191, 172, -29, 19, 19, -25, 59, -121, 272, 162, -109, 7, 219, -16, 49, 160, 153, -111, -151, 63, -100, 215, 123, 100, 43, -6, -10, 160, 65, -18, 147, 17, 187, -291, -6, 90, 26, -111, 32, 78, -5, 13, -88, 49, 139, -170, -242, 209, 24, -68, -205, 318, 171, 116, 56, 105, 59, -217, 110, 210, 76, -70, 43, 5, 252, 57, -112, -134, 218, 48, 175, 66, 238, -62, -38, -201, -122, 59, -172, 21, -81, 303, -338, -98, -45, -440, 179, 99, 76, -13, 18, 25, 33, 97, 152, -19, 396, 6, -252, -330, -328, 4, 46, 103, -31, -195, -30, 41, -25, -52, -29, -351]
7880c51K21l9L59l50J73L2k0R4m0j2k37M8J33K8L8j27L10l95J59n9p4Q4J11j63
7904g7N6K10m95J57L15j98j85N43m66J07j12L79j89O8j45Q8O4k12K19N3l51K34
7926F3o4Oj33J53p4L1O3j82L02j83l83J99J93k4M8K8k51K67m3L2o3J05J9j91R0
7951HR3j36l7j31RJ15LLK6J10j52J86M2J24k61K5P1m3j71K09m8N4m50M53J44r2
7977A54k69K10q3J00k19K96k03j7r9K58R2l3l34K18qj64K17Q0k06K39lk26k3k73
8001b96L0J66L75l65J83l2k71J98J44k89K60Q9j92J17j24M1j89K02n6l00K99j05
8023a15M03k21j42K29pJ2l56K50L82m11jr8K18k36K32j93P0j59L39P4l13K30k37
8046e0r5r3J18L04r2P5k24k07M51O0nj03o7k7l70M41J3K1l11R0k26J31L94l97
$$ y = [-351, -130, -169, 190, -160, 13, 45, 25, 119, 79, 67, -170, -122, 11, 39, 77, -50, 260, -135, 24, -35, -109, -25, 86, -77, -21, 189, -306, -149, 166, -32, -217, 326, -140, -33, -145, 234, 45, 113, -32, 56, 120, -92, 127, 180, -171, 63, -1, 5, -128, 25, -49, -18, 45, -137, 165, -18, -401, -202, -9, -33, 15, 43, -208, 59, 16, 48, -15, 90, 109, -82, 8, 101, -35, -72, -203, -194, -79, -76, -73, -47, 63, -89, 97, 139, 263, 2, 27, 98, 55, -116, 93, 45, 99, -351, 102, 246, 154, -115, 95, 12, 112, -107, 189, -14, -31, -130, 128, 220, 187, -147, 71, 63, -101, 116, 196, -10, 229, 226, 0, -23, -296, -266, -100, 275, -90, 93, 61, -210, -12, 132, -157, 103, 192, 0, 117, -7, 34, -155, 47, -9, -309, -10, -115, 288, 67, -75, 154, 147, 159, -197, 53, 435, 24, 23, -75, 143, -93, 139, -54, 16, -143, 196, 270, -43, 187, -50, -145, -238, -120, 184, 92, 167, -57, -264, 187, 247, 242, 139, 72, 45, -325, 116, 129, 150, -161, -71, -297, -166, 228, -169]
8070a69J09K75k80J78k99L11k67L96l34J22p6j37K51J23k17k94L38j2l09K06J51
8091F6J69K8l39p4L60n40K72m7J65r5j28M3j19J98K17j69J7J9k7l2j24O8K13l5
8115A06m8n3J98O0k78k64L72%j14L9j97J95j84J29J2r4M63k68J21p4k34J07n1
8138e7J97j20p8N6k23N5J48L19k04L8j79k4O3l42J26J27P8k2K3K2j61K01J78k88
8162f7q1N50k40l08K63k52J69j38k8K1L4P2K5%J50j96j07j9q9J93j76J3K95R3
8186A77k98M0N7K02l5
$$ y = [-169, -60, 215, -65, 113, -186, 125, -142, 254, -80, 42, -34, -171, 80, 203, -14, -308, 30, 18, -291, -85, 66, 235, 263, -76, -150, 210, -330, -58, -105, 60, -35, -163, -120, -239, -41, 176, 7, 24, 43, 16, -16, -140, -72, 141, 106, 58, 5, 203, 263, -15, -279, 93, 93, -21, 18, -179, 16, -168, -39, -27, -121, 342, 74, 195, 121, -113, -6, -57, 140, 20, -58, -2, -225, -170, -22, 297, 93, 131, -48, -72, -9, -351, -225, -98, -20, -42, -19, 3, -158, 43, 221, -67, -148, 402, 162, -146, 117, -135, 34, -104, -132, -111, -77, -5, 20, 20, 170, -26, -133, -152, -241, -48, -224, -211, 84, 177, -121, -81, -24, 178, 143]
8191A43
$$ Imaginary data points
##PAGE= N=2
##DATA TABLE= (X++(I..I)), XYDATA
0@%%%%JjQj6J6k4L2m0M8n6P2q8J04j20J42j69J96k31K70l10L58m10M67n32O04
29C21o83P72q68R73j089J216j356J507j677J862k062K286k532K803l103L437l812
46b005M232m711N260n893O638p525Q604r954J1696j4048J7415k2670L2095n4241
60c5107K00772J63338l11029j04868k1687m6307o8649J45974K02656Q4966l9183
71A70876m2673j29325j76892o1171J17744J12021O7420R8009P4326j09771j98325
82g7761q6690K0163O931O2331J74902J25820o8280j26626n4766o0476j05870Q342
94a81980J72684J52041J3461l6557l9986j01444j24482k3744P1476Q0817R0795
105G3081R9785p71j37410j25547j6584O205j2125O8209J48248O9283o1047p9516
$$ y = [0, 0, 0, 0, 0, 1, 0, 8, -8, 8, -16, 16, -24, 24, -32, 40, -48, 56, -64, 78, -91, 105, -126, 144, -166, 192, -218, 249, -283, 321, -362, 410, -458, 515, -574, 642, -714, 793, -884, 978, -1084, 1202, -1330, 1473, -1630, 1807, -2005, 2227, -2484, 2776, -3117, 3521, -4004, 4600, -5354, 6342, -7706, 9709, -12961, 19134, -35107, 165665, 329003, 17974, -86894, -108581, -154888, -223537, -77563, 125093, 210059, 170876, 128203, -1122, -178014, -239185, -121441, -9420, 58000, 156009, 230335, 120564, -77761, -164451, -144288, -137357, -75026, 99876, 225696, 157416, 30790, -23976, -84452, -190322, -181980, -9296, 142745, 156206, 119649, 79663, -21781, -146263, -170007, -98531, -17714, 73081, 172866, 172095, 34685, -90862, -107446, -101241, -113366, -45157, 103091, 172374, 111327, 31811]
117C1811n6618q6905o0085P4562J41941N8888j3607N393j7056j08850j12291K507
129a40310Q0529P1703O3146N4867j8012r2518p7336l0214k1521J2738R9257J13844
141A16173J3041o6573n0808l7300o5782l6859N9297J01532N4186O848j1745n1798
153C0212q5658m9284J7662M3138M6825O4028M7310k6654q1474o5422k6377j225
165h6919L6177P3849N8193L049k6449l4517n8081o2268k609O6500O9843L1452
177F8220Q242j1321n1687o8178l0143J7178L5960M4894N3664K4414l4983o2905
189f645m3230j6451r13K9865N9921M8788K759k9950m0523m5272l4117P763M7402
202b0603M9493K7729Q668j4467m7864n5769k0622K2732L6500L3516L2277J6833
$$ y = [31811, -24807, -111712, -171797, -97235, 44706, 103594, 89987, 95380, 78324, -30526, -142817, -140310, -59781, 11922, 75068, 129935, 111923, 19405, -57931, -88145, -109666, -96928, 2329, 116173, 129214, 62641, 11833, -25467, -91249, -128108, -68811, 32721, 86907, 93755, 82010, 30212, -55446, -104730, -87068, -43930, 2895, 66923, 114233, 87579, 6105, -59317, -85694, -86919, -50742, 23107, 81300, 84349, 57900, 23383, -34698, -96966, -99575, -33075, 36768, 68220, 76462, 65141, 13454, -54724, -84867, -67689, -31729, 13165, 66829, 91243, 56260, -6645, -49875, -66326, -67239, -37374, 22547, 71335, 74094, 44144, 3621, -41651, -75768, -68005, -20603, 28890, 56619, 65287, 50820, 2956, -52813, -73435, -50703, -14203, 19313, 51590, 68423]
214F8423k2278n1171m3948j4567J1937L3584M5560L2498k191k8809l4391l1528
226c6881k1611N590L7440M5122K3981j091k0682l6717l8914j5125J8206L2966
238g716L0518K4259P074k3268m3081l1139n851J1797K5399L6519K7606m033k8652
251A9432l0290k3669j4304Q781L4366L5360J4242m340j6494l0400l3390r249K1207
264b8748K9167K1897J6529L596k1480l5610k2370k067R770K2110L2394K0634r071
277C6751k6367k2929j7478j0290J0049L1006K7311P966n105j4497k6889k6242
289c6714k547J9204K2638J8076J4108j41k2961k8760j4182K10R155K0205K6729
302B5020J2389j0831k0441j7983j5860o643J3431K6706J8902M236l878j4059k3795
$$ y = [68423, 46145, -5026, -48974, -63541, -51604, -18020, 27540, 60038, 57847, 29038, -5353, -36881, -58492, -52902, -15462, 29660, 53641, 52550, 31868, -4849, -43763, -58888, -40682, -7716, 22802, 47061, 54135, 30867, -12214, -43353, -49204, -37407, -12008, 24511, 52117, 48084, 19432, -10858, -34527, -48831, -40050, -5684, 29676, 43918, 39578, 23084, -7316, -40706, -49955, -28748, 419, 22316, 38845, 42441, 20961, -14649, -37019, -39086, -29316, -7206, 25188, 45822, 36751, 10384, -12545, -30023, -40313, -30264, 742, 28053, 36019, 30914, 16417, -10472, -36714, -39261, -20057, 2581, 20657, 34765, 34624, 11663, -17097, -31279, -31069, -21914, -1709, 25020, 37409, 26578, 6137, -11846, -27706, -34349, -20918, 5788, 24690, 28926, 25048, 10989, -12806]
315a2806j9342J744J6552J8154J5327J0952m331k0997k1603r552N92R017J8600
328B307K0930O970j0075j6711j6088j2669j942J4187K0379J3807L705m927j4832
341E041j9906j1156L127J2513J5532J4651O185p815j7003j5178q209p0J1337J8146
355G195J3765J630p808j2745j4859j0677K775J3540J4945R821L761n238j5784
368C21j5814n833M608R584J3061J1998L923q951j4755j1624n461J562J0355J5410
382H384R964p2p378j1629j1542p004K791J1819J3012Q326P27p320j1631j1387
396a2940n016L707J0451J2431P410j98o889j1156j0546m841M758J0287J0471O343
410A4272J556o791j2359r828k498M835Q253R842P919j38q513j0812o905l108L246
$$ y = [-12806, -32148, -30404, -13852, 4302, 19629, 30581, 26250, 5253, -16350, -25902, -25310, -16293, 2307, 23237, 30207, 20132, 3421, -12667, -25336, -27278, -13091, 7288, 21095, 24800, 19873, 5041, -14865, -26021, -22894, -10381, 5151, 19802, 25987, 18172, 1169, -14009, -22218, -22288, -10951, 7195, 20960, 22590, 14782, 2037, -12822, -23499, -20724, -7184, 7761, 17582, 21343, 16105, 321, -15493, -21326, -16718, -7134, 5927, 17925, 21848, 12897, -1858, -13482, -18943, -17381, -7026, 8384, 18348, 18276, 10898, -731, -12273, -19277, -16486, -4667, 8345, 16671, 17398, 10078, -1553, -12940, -17956, -14249, -3798, 8633, 16043, 15845, 8956, -2200, -12746, -17587, -12829, -2542, 7929, 14272, 15828, 9037, -3322, -13150, -15648, -10813, -2560, 7282, 15201, 15063, 6550, -4262, -11167, -14275, -11029]
425a1029Q666J1359N669k794o206q389q216m003M325J0200Q845M067o87o136r404
440c733p893j597N165P969P741M451p29o612r176o608j481M962P892P374M320
455A2045j447o578q855o169l67M719O979P064M127j953o995p364m895q88L850
470f727P590P576K719k948o188o530m891p86L954P855O564J686k255n519o535
485d435m998j75M846O841N213J198j021n398p305m368J102N011N174M832K419
500H936j902o373o361k111J136K379N636O349J785m190n447l991k983j245M366
515d016O960M187j3k278l585n632m120J291N658M215K668K077j277o318n728j382
531g293J994K662M479M789P41l509m397l711k142j80M336N746K371l66j338l610
$$ y = [-11029, -2363, 8996, 14665, 11871, 5665, -2724, -10940, -14943, -10618, -418, 8427, 12494, 11807, 5671, -3733, -11626, -13223, -8058, -89, 7652, 12103, 11374, 4762, -4414, -11022, -12503, -7541, 351, 7725, 12045, 10598, 4020, -4835, -11004, -11371, -6652, 327, 7391, 11518, 9565, 2570, -4794, -9689, -10577, -6727, 863, 8439, 11158, 8210, 2022, -4508, -9399, -10185, -6231, 1624, 8188, 9874, 7619, 2100, -4435, -9433, -9608, -4762, 2079, 7292, 8490, 7469, 2071, -5234, -9602, -8500, -3489, 1685, 6517, 8936, 7034, 661, -5700, -7811, -6675, -4296, 1340, 7689, 9474, 5284, -163, -4154, -7137, -8382, -4016, 2944, 7131, 7118, 4840, 1255, -4377, -8497, -7206, -1548, 2667, 5335, 7412, 6135, -183, -5911, -7293, -5299, -2637, 1842, 6631, 7372, 3863, -534, -4245, -6387, -6567, -2231, 3515, 5886, 5520, 4182, 572]
547E72n764k115K653M040K590K965K241l005o020l211K69N93J425N262M527j425
563E597m043k519j918l116J27N359N052q8r04J32l476n801j390M333L476R77K014
580C812K321k823o043k076J375K31P95N078M055j756m769j193j566k520J53N126
596B00M076l73j057r1k983m770q39L977K437J127K362J128l118n198n70Q54o1
613b899J562M662K232k776k697q59j774k258J564M624K164j124K25k65l725l382
629d726O65L403R55R13K959M43m160l547M05O51o36J654M812J041l246j752j65
646c31k336k003K224M830N77j227L48Q1l550l220J676K760M35O48K926j89m180
663e31k480J015N16j291K216M203P3k973p25j15k462j371K840L390j92q40J254
$$ y = [572, -5192, -7307, -4654, -614, 1976, 4941, 7182, 4177, -1843, -5054, -4785, -4192, -2767, 2495, 7022, 5597, 1554, -965, -2883, -5999, -5872, -513, 4539, 4451, 3547, 3679, 203, -5598, -6988, -2655, 821, 1798, 3812, 6133, 3310, -2733, -4809, -3434, -3203, -2408, 2670, 6725, 4969, 200, -993, -2559, -5079, -4926, 200, 4276, 3903, 2846, 2755, -228, -4998, -5837, -1860, 577, 1704, 4066, 5194, 2076, -3122, -3692, -2838, -2899, -1337, 3325, 5557, 2781, 84, -775, -2549, -4807, -3243, 1381, 3545, 2421, 2646, 2381, -1344, -4726, -4061, -658, 297, 1210, 4169, 4612, 452, -3095, -2690, -2039, -2675, -1021, 3791, 4832, 1586, -166, -331, -2667, -4670, -2446, 2384, 2961, 1734, 2082, 2163, -1387, -4607, -2931, -171, 264, 912, 3838, 3649, -531, -3011, -1996, -1480, -2771, -555, 3648, 3721, 748, 23, -92, -2554, -3925, -1085, 2305, 2113, 1273, 2527]
680B527r01m158j349K126K112l95J326K344j006m053j189J406j86j017K907L106
696C600j091k706J83K83k882o52K803K742q21m27J008j184l672n96K816R05p96
713d87J783K398j860l761k40J475o42n17L100K173j833j913N75j24k999K00L228
730E56K003j820K92Q99j363l064KK752k39o73J915K057k194l213M54J239j300
747a697O5L022J782k273j433J198r66k470O26L192R38j578M96P98j451l177J125
764a803K397l01r31K073J166k377j780R07M67j543P51K573Q02j995q68Q78q62
781d46j827Q49K383L06q86O52K75k119j470Q74J343j64K33J688L08j978j412Q00
799e91o7p37Q39K249P3j616kJ66j237j197J508J802o13k52P49J30k018j263J349
$$ y = [2527, 1626, -2532, -3881, -1755, 357, -38, 1288, 3632, 2626, -1427, -2616, -1210, -1396, -2413, 494, 3600, 2509, -197, -14, 269, -2613, -3265, -462, 2280, 1459, 1032, 2040, 856, -2816, -3412, -596, 309, -487, 1296, 3694, 1834, -1927, -2167, -692, -1334, -1851, 1249, 3422, 1589, -324, 251, 127, -2872, -2672, 556, 2559, 739, 1031, 1930, 567, -2497, -2495, 257, 18, -655, 1260, 3317, 1123, -2090, -1636, -397, -1697, -1632, 1390, 3172, 899, -534, 664, -302, -2772, -2146, 1046, 1984, 406, 902, 1700, 249, -2928, -1803, 594, 293, -638, 1435, 2601, 224, -1556, -649, -182, -1725, -974, 1599, 2401, 406, -462, 416, -446, -2273, -1424, 959, 1265, 379, 1031, 1306, -813, -2283, -1409, -66, -230, 3, 1691, 1999, 21, -1391, -591, -658, -1395, -556, 1693, 1766, 150, 148, 314, -923, -2120, -612, 1190, 577, 325, 1074, 1204, -814, -2077, -728]
818g28J112q27P98J585k32k128l56K01j86k84J033J529m30r61m15J33j061l52
836a569J148J497l82m75P04k93j570m97J016N41k15O84P07n10j285k3M83q68J62
855g45R18J128l21p83n4o4j189L2J058O02p2K68Q8p45j214LO57J64O36M10N61
876A338r96j075L82p4m05L00J032O74q32j57K46n96o85J37R05N93k97J14K97j168
896b67m62n5N72L63J00M51M48n96j112J11J99Rj31R10M09m84n44j02m67J30p0
917e88O63O55j04k48k22j62n51o5L66K26r9P26Q0n37m29k04K14m87Q36J66M97
938G33R0o57j90o78K34L20L65k4J84J71k62m39k31k4j0K07M93M5n5r2m44N5Q2
961a27L5K54J0L56m90l6k34J2r8L12J42K97r8k28R4j83n71p4L38P08r1l71L36
$$ y = [-728, 384, -443, 355, 1940, 1708, -420, -776, -575, -761, -1045, -12, 1517, 1087, 126, -289, -156, -1217, -1569, -421, 1076, 694, 219, 923, 630, -940, -1437, -421, 120, -95, 589, 1296, 786, -499, -522, -39, -907, -745, 173, 1301, 980, 197, 143, 79, -1110, -1078, -20, 582, 510, 778, 866, 121, -1093, -1090, -433, -269, 367, 777, 1338, 342, -733, -351, -425, -830, -530, 502, 1176, 344, 187, 433, -163, -848, -711, 194, 787, 490, 604, 901, -267, -729, -784, -212, 151, 251, 702, 1150, 554, -558, -447, -248, -239, -370, 540, 949, 465, -79, -181, -648, -518, -588, 75, 730, 626, 378, 156, -6, -557, -622, -256, -30, -129, 597, 677, 140, -289, -493, -279, -766, 70, 236, 733, 823, 166, -24, -702, -468, -148, 217, 193, 377, 548, 286, -153, -384, -408, -418, -211, 282, 327, 272, 180, -264, -209, -127, -92, 162, 172, 528, 38, 2, -232, -220, -318, -6, 136, 433, 335, 107, 201, 18, -553, -627, -289, 419, 328, -43, 293]
984B93k10l18n18N15J92M2K29qP3k05l83R4q6R4p2Q00j41k06l51J93m99L6L89
1007d7L11L5q2J55k66k81l39J42N34r5L5K05J79l56m89J95J13l06L33O32k18k95
1029I5j39l42NJ41J88N64m08R0P1j30m01m5K80k8k04O77R3k33k89l04l2j24K88
1052a87K88L05k94J31k10J7n51K6L88M66k14k04J94k38n6q9J73O4K15j35J99j62
1074A26j98l1R0l94K50K42L57m04j34J92k70r8k17O89Q5j72K04J7m49l38K01M60
1096B08m19j2O50n00n8j0k08J53j01LQ26j75l54k24K99k00j09M5K05J51k17M21
1118C74j02k65l20K88J84l76M84P2j81k18n6L13n45J18M24L90m35j14r3J5j10
1139a53r5K24J07j96q2J99j0k1k35J69J91k98O09j93o8k25l1J23J72k30m0J53
$$ y = [293, 83, -235, -753, -238, -46, -4, 225, 217, 290, 85, -298, -204, -290, -196, -268, 532, 391, 185, -166, 27, -472, -436, -47, 264, 299, 217, 372, 106, -175, -514, -372, 162, 67, 102, 307, 486, 130, -359, -164, -51, -357, -24, 608, 390, 95, -44, -386, -381, -240, -52, 512, 104, 194, 265, 135, -266, -311, -31, -59, -263, 414, 507, 274, -15, -319, -351, -475, -187, 101, 406, 112, 243, 33, 50, -501, -475, -87, 379, 165, -39, 155, -83, -139, -228, -55, 9, 224, 89, 288, 126, -72, -103, -13, -407, -157, 85, 442, 38, -96, 96, -174, -272, -489, 200, 285, 113, 317, 334, -115, -453, -252, 208, -211, -223, 427, -73, -131, -141, -349, -196, -297, -294, 532, 357, 3, -221, 78, -122, -231, -186, 19, 170, -47, 374, 272, 7, -313, -25, 159, -217, 267, 339, 158, -60, -116, 197, -348, -230, 194, 584, 149, 35, -58, -43, -153, -248, -24, 83, -113, -195, 4, -6, -27, -262, -93, 98, -200, 409, 216, 148, -77, -108, 15, 187, -43, -83, 70]
1161G0J8j5P2l3k22n0Q9J95M4KK14n97L06l59K83K50m67K58N3K10q6n04M4L55
1185A30j56J29K17m9j45j7k12p3L6R9K70k04J80P4l16k18N5n4M30k8J86m93M43
1208B84O6l90k34K1K51j75KL18l1k02j78J91j09K37K72k23n0N3j90K5m1m3J07
1231c9J37j27qN2O5l30J44K46J1n5q4N2L8j49N3K6P0l06M36j09n7k89L53l10j94
1256c74K18j12M56j69J66m3Rnk1l67K55KL0J85o2k55J77k09p8j23L79J7j17NJ44
1281A08m9m43M79K84k23K1j00K7j15j78k29O61l11j95L86k0l52L69j7j20J58L2
1303A73o3J93m29J15k8k5p1K14Kk04J93l49L82R1l64O2N06n64Q1L7J19j35j65
1326b29J91j48k47L14K60J60k10k7J74j40k31L50J06k22J40J89l65k34L0L36k72
$$ y = [70, 88, 73, 145, 112, -110, -160, -71, 124, 168, 170, 384, -213, 93, -266, 17, 267, -200, 58, 111, 321, 235, -269, -225, 130, -26, 103, 320, 271, 126, 109, -103, -176, -140, -41, 229, 25, 205, 279, -37, -255, -200, -254, 176, 148, 334, -159, 284, 350, -40, -274, -253, -2, -177, -175, 143, 112, -90, -268, -77, -186, 51, 323, 100, 50, 103, -87, -62, -103, -146, -39, 98, -29, -37, 15, 80, -250, -106, 140, 151, 96, 12, 64, 102, -47, 6, 32, 102, -204, 232, 123, 66, -223, 130, -180, -374, -156, -268, 188, 19, 185, 142, 151, 146, 125, -242, 13, 15, 45, 230, 168, -87, 90, -119, -197, -320, 59, 76, -41, -36, 108, 59, -384, 95, 379, 156, 177, 77, 104, -11, -189, -418, 243, -68, -263, 123, 103, -249, 120, 103, -17, 141, 173, 110, 303, -126, -11, -39, -64, -135, 79, 81, -123, 70, -279, 103, 194, -170, -108, 398, -166, -85, -48, 71, -64, -229, -38, -186, -433, -119, 141, 301, 91, 64, 238, 98, -133, 217, 323, 101, 241, 430, 65, -169, -139, 197, -75]
1347g5M8R2J12m6m00J73J7K26j63J08K98l36n8L14m53j77K62R5J79j99j12K31
1369A36k06q5O6K14J92m75K35j03K32k98N1l3k02M4L93r2l97K60J20Kl22J77P4
1392a7J08m40O28j62l18j26J00N49o57K27J22K68m85J79J67k98o7P1M84r3n01
1413b61K67R2j26n1L9J35L1K5k56M00m58J06R4j12P9j97L76k31l1mK53k27j41
1436a98O4M52k74j79J40O4l95nK62J9N4j73K2K54K7l45K29R1M2k75m6J28P5j4
1460A9k59K23j45M94k19O7l60J16j79K76k6N5k97L86n5j18P4j69Mk6M34n4O0j04
1484A97l21moL33k20m9P7l7r6j02L51rk99j7L44j80K36m47N37k30l09K10j05o5
1508b11k5J59j9n7M21j21k67K99l21R3L1j15K29j13L0q3K8P0J52j71r5J91q0j30
$$ y = [-75, -27, 65, 177, 131, -269, -96, -79, 147, -16, 92, 390, 54, -4, 310, -143, -320, -58, 37, 216, 17, -95, 136, -70, -155, -89, 125, 317, -158, 77, -26, 206, -92, -41, -74, -276, -232, 161, 69, -328, -68, 52, 54, -268, -91, -17, 91, -349, 279, 117, -201, -327, -227, 322, -335, -108, 14, 282, -203, -24, 143, -155, -222, -151, 333, 240, -261, 6, 98, -28, -79, -40, 95, 126, 151, -105, 295, -163, -57, 37, -75, 4, -193, 183, -48, -79, -83, 170, -57, -198, -134, 318, 44, -135, 5, 69, -326, -331, -69, -50, 4, -169, -147, 107, 134, -211, 18, 109, 151, -124, -170, -42, 33, 19, -240, -17, -162, 332, 113, 180, -180, -64, -243, 33, 7, 62, -235, 151, 96, -22, 52, -117, -113, -139, 295, 241, 301, 197, -124, -128, -134, 199, -21, -70, 7, -30, -126, -228, 123, 114, -185, -202, 142, -38, 198, -249, 288, 58, -251, -41, -146, -211, -236, -77, -96, -153, 268, 147, -120, 179, -142, -49, -18, -133, 96, -17, 13, -70, -42, 28, 180, 9, -86, 105, 25, -105]
1532a05J21l44N52k18j7l3R3MM7j94m1Q4J31j72o8K90j99J81Kk70K95J81l29L39
1556C30m76J48j93j77K75J36J29j06o8j67L12l18J21k44j8K09J36M0p5o3K15R2
1578B38k80O5j40L37j74m29M38L6J09j35O9N1Q2j85O3l81J92j0L1l3k9p2J51o9
1602g5K00m0m7j01n1n9L37j32l78K90K38jj49N7p9r4L4K59l12J99o2K22k63MR7
1627I4K6j61J21p0j61J44J06P2k40J2J03P7j31K5j22L02k18J29k99J66J46k72
1649a51J76k1kk35R9K16k01K71L4n63J95L48r6L8j35L3o4R3o0p5J35l6j63N6Q9
1674a9J07j44J06j56P9P9l52J93R6J39l8K17l74P9J56r2nm2k84N1O8K19K2o7j52
1699a14K51j91q0J67j22J40k26j25K45Mj44L22%l2Jj4l30K71KJ69l28J67N7q3
$$ y = [-105, 16, -328, 224, 6, -11, -44, 49, 53, 100, -94, -135, -51, 80, -92, -160, 130, -69, 112, 114, -156, 139, 320, -9, 330, -146, 2, -191, -368, -93, 43, 172, 66, -2, -169, 143, -175, -54, -298, -316, -107, 29, 69, -6, -69, 146, 238, -42, 23, -117, 220, 46, -383, 55, 91, 200, 65, 134, 185, 267, 82, 145, -236, -44, -54, -23, -56, -85, -157, -6, -75, 125, 85, 38, -63, -114, -173, 164, 32, -346, -56, 182, 181, 32, 89, 10, -84, -50, 209, -103, 96, 34, 256, -7, -3, 94, 120, -41, 80, 10, -151, -7, 99, 171, -69, -57, 46, 123, -8, 17, -105, 197, -21, 108, -191, -25, 121, -151, 25, 4, 2, -233, -134, 82, -119, 152, 186, -377, -182, 166, 70, 108, -27, 6, -58, 35, -25, -100, 35, -1, -164, -108, -19, 88, -56, 50, -106, -27, 52, -300, -107, -11, 128, 90, 307, -67, 12, 168, 76, 71, 29, -255, -204, -136, 83, 105, 38, -114, 137, -54, -134, 33, -89, 51, -175, -300, -55, -51, -195, 127, 127, 95, 96, 82, -248, 23, 25, 194, -134, 33, 90, 7]
1723Gj5k69M01J8l18l6L74k2j35P3K7k02l4J40p4l8M0J37p2r3J27k16M44j51j56
1748d3K16r0k24K7m3L47j53N7OK6l15J61J49o6l78J03R0J7J67j04k84L98j78n5
1772a69K29k9lj33j53Q2K53j21L19m27J04K43L3l26K75j09K34l41j96L77j52O0
1794E0k34J09J24k36q5M20J47l96K50J9j54R2k35r6L17j67j85L49k48K03j64L4
1816h6J8J64k0k20J46K2r9J73N5l0j07j97j0k5K77p1k22K46R4j13j3J32j2n1q8
1841c7r7m9j34L28j51L40j88k76L34k50l4J75j48K9R5Q8L20m69L53j23k07M67
1863C66l18j39J72k73M43k99K34k7k38Q6R4L31m13K27p3k23O7q6J22p0m5Q0J0
1886B8K1J75k63J41lo7m8j10K62j11j88K35R9l26J69k31M32m2lj91N6P1r1n8K2
$$ y = [7, -8, -277, 124, 142, -176, -212, 162, 140, 5, 78, 105, -97, -131, 9, -65, -103, -63, 74, 2, -91, 36, -180, 264, 113, -43, 173, 83, -141, -114, -157, 190, 37, 94, 100, 126, -189, -28, 121, 55, -323, -220, -130, -113, 54, -50, -334, 64, -114, -169, 60, 31, 28, -105, -258, -176, 77, -44, 275, -152, -48, 195, 228, -98, 177, 68, 302, -39, -235, 142, -10, 50, -184, -75, 49, -187, -272, 148, 295, -101, 149, 168, 14, 106, -129, -225, 92, -75, -260, 89, -159, 44, -120, -86, -68, 96, 76, -144, 2, 24, -75, 98, 153, 123, 16, -181, -191, -216, 61, -10, -232, 14, 108, -5, -18, 114, 102, 51, -37, -134, -183, -317, 11, -140, 200, 12, -264, 70, -180, -214, -39, -187, -158, -63, 25, 345, -124, 229, 106, -101, 366, 48, -91, 81, -192, 251, -48, 186, 159, -79, 7, 101, 432, 19, 246, 173, -50, 17, -69, 53, -17, -62, 18, 28, 49, 224, -39, 102, 99, 32, -16, -126, 136, 25, -163, 72, 171, -155, 14, -217, 215, 173, 170, -21, 35, 106, 15, -43, -21]
1911b1M1j41K27J8p7j50j30L47L6m37K61p7j9K2J53l14K76k4j41L87k54jJ6k2
1935b4M7K36l26k8J14P3K1j67o1J4j11M30N5n43k1M58M4k58j9k34L23q7k12M16
1959A40j8k68J15J60q9l9j59K92l31J79j2L24k56j22j50O1J46J06j67K97k08Q0
1981H1L9j47J72k85J78j03L8J65k39Q7J91k80k30M70M9o8k00k09J64N44m25M9
2003D1L5O0l44l8J40L2J28k2J91k57L0Q1O4j95J18k16L36m15K00J42j33J6J11
2026A05q6j88K92k05j47K02K14K4k55p2L88k49j4m5R6OM0L05n08K74k20J26k48
2049a65L10k20J2P8J42k48L82k48J01J63j79q9p1K90k27N7j84L30j52NJ94j94
2071H7q6M8j29o6nJ46j4J7m9l0O1J10k89N5j23K52J30k57J9J64L2J23j95j62O2
$$ y = [-21, 20, -121, 106, 124, 47, -103, -233, 114, 150, -287, -26, -103, -122, -100, 53, -261, 15, -9, -150, 237, -17, -18, -2, -24, 23, 259, -67, -95, 19, 92, 113, -54, -115, -101, -212, 218, 273, -270, -291, 167, 211, -47, -66, -300, 23, -64, -276, 140, 122, -146, -31, 129, 40, 1, -158, 134, -197, -18, -30, 294, 38, -84, -234, -173, -27, 79, -88, 209, 1, 81, 120, -27, 145, -140, 38, -65, -27, 138, -101, -14, 177, -103, -333, 137, 186, 118, -82, -291, -127, 417, -8, 41, 76, 136, -208, -246, -106, -74, 54, 32, 223, -34, -4, 77, 141, -54, 64, -152, 184, -231, -31, 111, -22, -6, 105, 19, -169, 123, -82, -229, -27, 187, 211, -44, -116, 272, 23, 9, -36, 60, 66, 106, 411, -97, 177, -43, 83, -165, 145, -75, -63, 15, 157, -91, 291, 43, 144, 307, 128, 39, -32, 258, 31, 88, -96, 234, 82, 87, 281, 87, 1, 49, -80, -146, -151, -5, -19, -2, -51, -81, -20, 90, -199, -144, -267, -15, 115, -142, -123, 41, 73, 196, 1, -161, -99]
2096i9O8J42k89R8K17m40L19M3q0J33k32J57k2K7p4J06n4Q5o7J1j23m7N3M84k22
2121A94l26J49J11l92K24Q7J88j68k89L46K5l8q7k92N02k57j59J03j01m9M2K67
2143H0n1p1K34q4R7j60O2l48K35Nk22K49k81L90j02L0L7j80k43N30M3j03K0j72
2167eo1m0L91j30j8m26L17J99k85L5j5j5l8K17K6qk14L01L4m54Q9J54k43Q9L24
2192B24m13K74j67j10M46k48l55M29k10K07j67J67j04k98J79O6p8n2L08J1j53
2213d4m7J34L12l09k96J48J49J52l81m2N3N6K08Nl24O71p57L05K74n59L21j25
2235i6N7l6j43J37R5p3k09P6L86q8k54R2K03j57J30k52M9K46k66J66m9R2j34J65
2259A37O2Q1m89K93j88M7k4Q1J4m2J36j50J74p8J14On68K73J36j95P1n8J96P5
$$ y = [-99, -31, 111, -178, -80, 137, -303, 16, 59, -21, 112, -120, 37, 15, 42, -32, 74, 20, 105, 38, 49, -74, -121, -68, 416, 194, -132, 17, 128, -264, -40, 47, 235, 67, -222, 124, 149, 111, 24, -268, 234, -23, -182, -79, -180, -229, -187, 80, 29, -42, 192, 108, 205, 45, 107, -241, -6, -1, -223, 26, -255, 135, 33, 63, 100, -80, -323, 207, 250, 147, 167, -5, -66, -106, 285, 155, 137, -289, 28, 227, -58, -23, -38, -53, -91, 126, 152, 144, -70, 231, 265, -189, -100, 54, -189, -100, 224, -189, 85, -82, -192, 254, 6, -349, 80, -130, 77, -90, 77, -27, -325, -146, -80, -158, -210, 98, 109, -44, -91, 43, 355, 46, -250, -102, 47, 199, -182, -224, -171, -115, 93, 98, -226, 445, -312, -7, 267, -292, 29, -96, -39, -75, -218, -81, 14, -59, -268, -192, 194, 106, -148, -56, 147, -10, 120, -132, -83, 163, -103, 63, 14, 106, -28, 137, 199, 280, -209, 84, -104, -57, -81, 0, 14, -28, 108, -42, 132, 54, 168, 174, -394, -121, 15, -180, -109, -167, 29, 104]
2283A04l8J7oj12M65n75N5Q4J61j62J01o6J17j62j46K50j27j18J64k8j34K03j74
2306a27J57K0k81M86k50n6M8n1J41Q6k69r5K71j13P8L4j29k90M10k06L8K08L53
2329D63n23J88k26K12j87P8J03k02K33j51j94K27o7K31k45N4Q8R1o7k63L48k38
2351d7J37L5k7k7M2k7L95m70k2q4L1J01j17p9R0j46K66K10l31L41l30L79l32J46
2375A34q8l5l44M72m25M38k23K57j46L4j13O5K71k90P2J16j59Nj59L37j52k6R4
2398A35r8%j6k4J19j25k32N31n58J97q5K21k2j01j9q2P1j1K30r4R4O9J30j87j43
2423@Q2N7J9l29K04j61j72M43p7PJ70k52M8P0l55K39j78N45j98j26j00K05K16
2446C57m01L42k92j53OR3P8K4p7j94J02L03R4k84j06O8P5K9k04K24p2k94K92K50
$$ y = [104, 66, 83, 77, -35, 430, -145, -90, -6, 155, -7, 94, 28, 145, -17, -163, 87, -40, -158, 6, -22, -156, 47, -127, 30, 50, -231, 255, 5, -51, -3, -54, 87, 173, -96, -191, 80, -33, 45, 79, -50, -340, 70, -136, -98, 110, 463, -60, 128, -98, 114, -73, 5, 108, -94, 139, -12, -206, 21, -46, 185, -60, -6, 82, 173, 106, -157, 191, -47, 90, 125, 98, 71, 113, 86, 481, 11, -11, -95, -64, 37, -80, -159, -69, -215, 51, 261, -70, 271, -59, 320, -12, 134, 46, 11, -333, 139, -286, 152, -71, 186, 40, 74, -39, 26, 297, 7, 79, 195, 36, 41, -118, 219, 67, 41, 135, 37, 37, 21, -3, 116, -9, -241, 290, -268, -71, -156, 65, 43, -58, -77, -159, -88, -99, 131, 37, 131, 200, 330, 143, 0, 82, 139, 158, -171, 33, -128, -300, 143, 66, 73, 243, -9, 39, 109, -246, -7, -185, 360, 162, 36, -64, 141, 357, -44, 298, 6, -147, -141, -48, 30, 54, -23, -217, -115, 188, 282, -2, -108, -40, 35, 64, -140, 84, 12, -282, 10, 260]
2470B60l10j51rp1J30P2p3K92j65J46k77J48l36L13j41J1L12K21l20k85P3M55
2492B95l75J59l35K07J78k90P3P4j24k0L76m00L34k02j44K46j21N2L63n32M14
2513B28m02K34M6k05j38K68Oj96O3L24l70%L46j68n6J42k79K37J08k02L4qJ39
2536A51k89J61M1L1k80J44j86L63j75j83J03q3K70M2k33KR8J16k5K2l92L46J27
2559A71l98L97k35N8j74J43K3J68jj01q6p7J27P1J8n5p9m3j6K85r1j65kq1l5K08
2585C0J7o1P0J9l79L70k49L01j15L21l19K1J39n1q9r4O7rJ97r6Rm89N58m50R6
2610a86N04j79l6K63k10l27R4J66k69j9J16j5K01m01N29n7m34J98K60j81j72p5
2632b30L65q5j57k9K31m6J17j34p5J05k51K05P7J26k28r9j96K47n8L22p4l89L54
$$ y = [260, -50, -201, -210, -281, -151, -79, -152, 140, -25, 121, -156, -8, -344, -31, -172, -161, 151, 372, 52, -233, -160, 295, -80, 79, -256, -49, 129, -161, -88, -14, -138, -158, 218, -182, 152, -50, -194, 52, -69, -17, 346, -186, 228, -174, 60, 106, -99, -237, 31, 37, -159, -96, 228, -142, -142, 204, 36, -20, 122, -157, 80, 188, -14, 20, 12, 151, -138, 23, 64, 95, -185, -41, -227, 136, -39, -222, -119, -202, 68, 110, -123, -121, -23, 93, 68, 90, -302, 44, 171, -227, 170, -65, -7, -181, -38, -15, 153, 152, 51, -35, -112, 15, 86, 104, 49, -30, -73, -89, 196, 105, -60, -62, -143, -178, 30, 47, -14, 56, 75, -304, 66, -183, 118, 3, 324, 5, 26, 165, 114, 25, -69, -2, -11, 186, 90, 99, -390, 168, -282, -186, 318, 139, 103, 366, 156, -171, -77, 89, -180, -199, -83, -98, 103, -298, 231, 174, -260, -62, 198, 17, -155, -230, 135, 50, -107, -136, 95, 49, 166, 32, -43, 62, -189, 16, 93, 219, -9, -108, -304, -57, -115, 207, 133, -256, 98]
2655I8M2j64J01l28J43n4J35L02l05K09j73J89m07K07J50k69j21J17J92j33m6
2676a15j49L68k23k23L08R4j15K34j67l49J58L38J21j92k59L43j16j9q8q2K34
2697A01l9k19L52J1m27J72j83M11k48L1J26r9NR8J44j69j35J22Pp4r8N9q2rN6
2722h7Q9m1J43k33m6K80Q1o64O50l37j55M69k28N36o51R7J63k71P6K16k95j25
2744c33K58K85k6l7k29k1L08l99k20K48L3K05j20J31l18J10K30j94K44l82O28
2765D01k68J86l12j13K89j38j70L80m40K55K71j44j73l20K94m3j03K02M2K8r2
2786C2K26k68j43M2K54j92K06K6j65r1R7k37J01K5K06o6k28J20j43J59k27L52
2808H6O6j01O7r3J72k10K14m9l25J26O9j02j68J66j4j9J14J03l44M40r3k6j3K15
$$ y = [98, 140, -24, 77, -251, -108, -162, -27, 275, -30, 179, 6, 195, -212, -5, 145, -124, -245, -128, 64, -69, -115, -264, 104, -119, -342, -34, 60, -55, 179, 12, -337, -179, 159, 280, 88, -171, 172, 56, 37, -51, -133, 101, 62, -157, 195, 206, -221, -49, -232, 179, -69, -38, 88, -11, -6, 92, 236, 67, -68, 54, 61, -13, -111, -52, -134, -143, -87, 2, -39, 104, -129, -175, 105, 186, -478, 172, -165, -320, 149, -79, 457, -194, -97, 66, -205, -129, 87, -208, -333, -75, 210, 184, 147, -82, -103, 205, -194, -414, -166, -133, 72, -48, 83, -235, -125, 105, -89, 155, -227, 401, 133, 319, 7, -106, 183, 45, -125, 255, -185, 70, 341, 197, 24, -296, -2, -45, -148, 54, 96, 124, 32, 258, -10, -153, -111, 143, -49, 157, 183, 18, -73, 24, -213, -112, -87, 119, 53, -175, -55, -198, -39, -266, 86, 152, 51, 118, 25, 197, -13, 201, 152, -173, -47, 22, -80, -248, -82, -96, -115, -1, 102, -242, 198, 105, 79, 66, 281]
2832B81j83j47j51J04j68Q1P8K92jJ4k58p1K80J58k30k61K35J10k34p6P7j20K48
2855E8k47J65k05L81j34k76K95P1p6K13n04L16J67j57j62J4K53J08k86L05l60
2876f1M5M2N8K78r0k38k91K88J05j52K1l7K4K05l4m9Nj24K17m6N4j87k0r2K1R5
2902C7J26L64m90K96l49K16Q2l30J21j78j27K98k88L64m2K0p7j22n4J61k84l5
2924b91L72q7J79k33L69o34J43L60%k79K03l13R0K29J2l6J91j91j00k34kK32J35
2947A15n21K40M94k83l8N9k8k55J7L22J76o0m13L34j79L4J84k08M3j35j43N0k18
2970d13L60J80J0j19K5j44Q2J6p5J32Jr6m4lK33n58L89M9j01R9j14k98O86k33
2994F4j85Q1k49L46k97L27m0Ql41M04q8J66m33M93m28J76j76K45K1j71j60K30
$$ y = [281, 98, -49, -200, -96, -264, -183, -105, 187, 186, 200, -58, -129, 151, 309, 79, -182, 53, 163, -71, -147, -70, -190, 58, -189, -24, -229, 152, 18, -258, 37, 108, 32, 245, -259, 57, 224, 67, -95, -81, 172, 280, -6, 299, -61, -16, 26, 84, 362, 272, 34, -257, 31, 136, -16, 5, -32, -8, 197, 163, 114, 119, -5, 212, 166, 220, 33, 13, -79, -58, 37, 163, 527, 37, 333, -16, 200, 282, -48, 73, -105, -232, 66, -222, 142, 100, 120, 43, -79, -133, 28, -256, -291, 81, -6, 173, -60, 309, -325, -182, 178, 178, -101, 102, -211, -121, 108, 120, 84, 275, 84, -16, -250, -252, -20, 115, -406, -166, 328, 45, 7, 66, 38, -217, -200, 122, 298, 238, -175, 159, -20, 14, 198, -10, 33, -102, -245, -195, -413, -53, 127, 137, 18, 43, -101, -19, -3, -78, 54, 55, -41, -85, -88, 145, -413, -24, 25, -76, 23, -91, -389, 297, 64, -121, -40, -289, 57, -240, 87, 47, 55, -286, 118, 30, 196, -237, 256, -172, 4, -172, 73, 94, -77, -237, -7]
3016gj41L04k66O0j37J29jl9L65l42K41P5m44M58j77k0K11l74M1k77K41j51MK11
3040c6j22K23K2k13K26K2k24k5M74m22O0J24j12k29J09oq7M41k18M1j31Q2Q9l9
3064D9K8L3M8n3j36j47J76M0J77l81L4K11j57l4N5O0l6j1j12P8j86M26O8j79j33
3089h2j1L8jK19k18P1Q8j07l1K37l53L0j91K68J48j43j5L60l42O8J07r1j72L51
3113B28l92J48j39L18j0k26j0J96J72l08J54m58J27K26K36l49O6j1N4k6N5j21
3135g0J81M8k06L0j21J49l6j61J69K2j12M5L52m28K3J12r0M2K04j86N9l26K97
3158cMn8P8l23L98j23J14j92J52Q2j33K19j84j74J5R1k1nJ57P3k2j54j83K30k47
3183b09J60O0Qp8J19p7M0K18m5n14L20Q2m9m73N73j36J44l2R3l42L81l38J08m7
$$ y = [-7, -148, 156, -110, -50, -187, -58, -59, -98, 267, -75, 166, 241, -203, 255, 78, 58, 269, -105, -64, -341, -100, -251, -247, -36, -158, 65, 87, -126, 100, 122, -102, -127, 347, -75, -15, 109, -3, -232, -123, -129, -216, 225, 7, 48, -83, -1, 88, 49, 77, 110, 158, 105, -31, -178, -2, 38, 215, -166, -132, 79, -78, -112, -57, 3, -33, -44, -156, -78, -264, 162, 230, 51, -82, -93, -55, -56, 163, -55, 16, 104, -3, -34, 203, -150, -120, -311, -43, 105, -38, -53, 307, -35, 33, 140, 49, -123, 228, -164, -16, -155, 163, 153, -73, -83, 113, 285, -23, 131, -327, -200, 26, 262, -87, -21, -32, 22, -4, 51, -70, 111, 159, -47, -17, -138, 11, -25, -186, -17, 5, -107, -62, 290, -138, -115, -3, -93, -51, 153, -33, 26, -300, -3, 1, -57, 21, -302, 96, -27, 87, -105, 47, 129, -4, 215, 31, -143, -128, -37, -58, -63, 94, 167, 145, -9, -192, 38, -209, -49, 11, 19, -59, 60, -17, 23, 241, 196, -318, 2, 84, 35, -438, 135, -1, 143, 111, 204, -138, 243, -95, 13, -34]
3207c4j00N0J68l11K89j03k82L78o4K4q0J07L0j07K21j59l44L50k97J67L5N4l84
3230c92L91J4L9k18J36j2K38J8l38n1J03l34L30J53k48J85J42L9k86q8L06o9M3
3253A01m12L58Rk01k3Q1J80N2k56J69mqJ96k39JK12k98j16k6J00P4j86M71n10
3277b75p3K63J43l01M49m15J53L10m52M32k89L73k77o2j47K36L9l34J33Q6m0j8
3299f6J62j22j37mqK82r5N0K36j48j08J52l11j65J74J05k93k7N12m10J94k21Q9
3322a59k7J97j29J71j92N0N6K06l82N2k59M60l0q0J27J94m9k09O4q2N2j16M19
3345C34n22J20J80r1K71k08l4J57j88r7rK77j72K27l91K37j47J78l20P3J84m8
3367A1J34o6n2m1n4r2q8K66q4k18j3L02j98L61m04K71r8j29L82j03K24k79o5r5
$$ y = [-34, -134, -84, 84, -227, 62, -41, -323, 55, -9, 15, -65, 42, 72, -35, 186, 27, -317, 33, -264, -97, -62, -8, -392, -1, 13, 52, -166, -30, -42, 196, 214, -124, -175, -72, -406, -76, 77, -171, 14, 156, 195, -91, -179, 127, 58, 101, -311, 47, 56, -145, -168, -87, 93, 145, -111, 58, 54, 46, 242, 3, 4, 216, -82, -198, -224, -124, -50, -236, 235, -275, -348, -85, 58, -243, 206, -209, -56, 254, -198, 234, -55, 318, 41, -21, -168, 68, 107, -227, -94, -8, -48, -66, 96, -26, -163, -167, -175, 107, 12, 62, 298, 150, 42, 194, -117, -282, -108, -3, -296, -323, 189, -221, -27, -248, -159, -186, 11, -118, 53, -139, -89, -33, 173, -209, -157, -416, 44, 14, -66, 61, 255, 206, -3, 61, -21, 31, -85, 334, -188, -68, 112, 21, 292, 84, 50, 207, 19, -78, -87, 190, 18, 245, -146, 91, -56, 122, -198, -125, 59, 11, 145, 79, 27, -14, -68, -160, -248, 18, -66, -284, -297, 5, -193, 168, -236, 35, -63, -192, 190, 87, 311, 32, -33, -128]
3391a28J12k4N3k03J62L3j31M14m75L66k11Jl4k04M02p8j2O2M2j65k93K25J9P3
3415Fj01l8J01lk4L3k34M33j83J76j79k02M88k60lp8Pk6n1R2j03J45P1j7j98n7
3441b05J42M1J75l00j8K77r8J30j84Q0j36l9K45j46J50j22j52QJ68L53m44%M8
3464b7J88j27r4J63k45J75m5k1O0L11n18K16MJ6j34R3j7J3J53k40K86j16J28j27
3488I5j34J60L3l92N5J16q9K87j60K09j21J00j42j09P6k30M81m07K59j37J12j66
3510a04L70J71n69Q1L05l58J29L21j02k59J16Q0l75J19J62l4L6j30R2k15k26M85
3532I5k09j0J58M1p7j07K44J3l02M2J38O1J92J55l77j43K65j04q7K2J35j36P5
3555H4J66O2l19j12K68k3O0k49M0o0M26o93K39Q9J25p06O43O2j60j55O2R8J78
$$ y = [-128, -16, -40, 13, -190, -28, 5, -126, 288, -187, 179, -32, -31, -65, -269, 133, 55, 43, 105, 147, -18, -311, -86, -67, 6, -95, -133, -32, -35, -59, -26, -260, 173, -10, 166, -13, -215, 273, 13, 10, -68, -61, -87, -138, -46, -149, -4, 67, 50, -148, -205, -63, -22, 153, -147, -165, 112, 14, 144, -40, 40, -96, -135, 110, -36, 114, -8, -160, -152, 16, 369, -75, -75, -27, 161, 34, -60, 103, -142, 33, -12, -33, 27, 338, -180, 36, 40, 56, -78, 15, -2, 11, 164, -76, 210, 94, 222, 95, -39, 121, 154, -238, -183, -67, -156, 131, -29, 180, 59, 159, 17, -92, -16, -246, 235, -172, 87, -50, 62, -104, 266, 437, -132, -51, 254, -104, 25, 346, 244, -15, 101, 181, -194, -75, 87, 53, 89, -41, 51, -164, -390, 95, -114, -124, 34, 75, -2, -109, 135, 148, -154, -112, 26, 87, 279, 434, 57, -86, 179, 75, -12, 10, 145, 9, 84, 250, 312, -7, -119, 149, 126, 186, -63, -23, -83, 343, -350, -111, -22, 103, -603, 40, 102, -58, -213, -151, -53, 125]
3578A25J36k34J11j75l7j13K46K7m62L78j19K60n5m43K61L3j08l6J81r5L32j50
3600F3Nm2%o0o5N4J55k96J63j86L64r9k56J48l9R4j23J47m5M11n97K41j5q7r3
3625a58L97m87J94n0L95q8n14K68K47P2n6k26Q6j90j0L62j75L9J68j29m34N56
3647B67k19q6Q3l02K24L51m51P7L31m7m87M72k01p3qN3J17j56J18k98N0J61K89
3670B65k88m2Q3j19pK28l42J88m9J39%k46L02N6l71K11rJ20j3O9j90R0o8j16m4
3695a53L93l18n9O2K82j33k9J2L17k41K19k70j26j99j35M26j01J06j88K33K26
3716C24k40j51J99J45m31K72o3n1L7J36j66k01K74j0l0N4kk6mrl55M57Ml74J16
3741i5L35l19L1M6j18J60j28j44K8J31k9k13K83j89J08J16j46K99o6L9j59l9N6
$$ y = [125, 261, 27, 138, -37, -74, -187, 59, 86, -376, 2, -117, 143, 88, -355, -94, -61, -169, -205, -24, -119, 213, 63, 68, 26, 26, -34, -99, -45, 110, -186, -23, -209, 155, 56, -200, -52, -91, 3, -120, 27, -18, 393, -204, 37, 22, -65, -158, 239, -248, -54, -104, 291, 203, -311, -43, 204, 276, 220, -6, 80, -110, -120, 242, 67, 106, 274, 145, -289, 267, 48, -38, 45, -257, -33, 318, -133, -56, 275, 228, -259, 213, 12, -61, -69, -16, 101, -55, 63, -235, -185, -24, 265, -23, -65, 18, -101, -108, 120, -222, -34, -83, 56, 56, -190, 112, 168, -203, 8, -1, 119, 106, 175, -15, 75, 7, -109, -153, 240, -78, -137, -75, 207, 74, 45, 57, 374, 133, 352, 82, -44, -243, -378, 48, -53, 53, -135, 98, 324, 84, -67, 132, 277, -154, 118, 55, 4, 41, 177, 11, -190, 84, 74, 44, 98, 96, 70, 66, 57, -298, 159, 163, -211, -95, 240, -79, -48, -2, -120, 40, -88, -232, -204, -73, -102, -315, -32, -221, -113, 3, -143, 156, 90, 129, -30, -69, -13]
3764a3J57ml12J33J99k19J37o9N8k4J35m09R1J84L80m15p9J73r8J71l4j50j68
3787a76K79j01Q3k28J17K8jnJJ52n4k7j23j39Q2l0L30l65J67j94J02P4l4J75K8
3812A41L6k87j0R3J85k92o3K6J79o9M7K3K71m66O1R5o2rj15O7N3O4JQ7j34L20
$$ y = [-13, 144, 140, -172, -39, 160, -59, 78, 9, 67, 43, 178, -231, -140, 44, 424, 9, -70, 103, 5, 176, 142, -8, -176, 103, 2, 85, -143, -26, 2, 1, -4, -3, 149, 95, 68, -55, -194, -112, -142, 188, -177, -10, -204, -102, -28, -62, 113, 141, 177, -110, -120, -27, 158, -134, -197, -171, 8, -61, -14, 9, 280, -186, -125, -30, -92, -101, -216, -149, -96, -32, -31, 56, -78, 242]
$$ [...]
8191I5
##END NTUPLES=NMR FID
##END=
