##TITLE=1H_LR-686-C1
 CDCl3, 8 sc, 
 18.9.2019
##JCAMPDX= 6.0         $$ Bruker NMR JCAMP-DX V2.0
##DATA TYPE= NMR FID
##DATA CLASS= NTUPLES
##ORIGIN= UXNMR, Bruker Analytische Messtechnik GmbH
##OWNER= root
$$ XWIN-NMR		Version 3.5
$$ Wed Sep 18 14:31:45 2019 Russian Standard Time (UT+4h)  she@DPX200
##.OBSERVE FREQUENCY= 200.1315
##.OBSERVE NUCLEUS= ^1H
##.DELAY= (6, 6)
##.ACQUISITION MODE= SIMULTANEOUS
##.ACQUISITION SCHEME= undefined
##.AVERAGES= 8
##.DIGITISER RES= 18
##SPECTROMETER/DATA SYSTEM= spect
##.PULSE SEQUENCE= zg30
##.SOLVENT NAME= D2O
##.SHIFT REFERENCE= (INTERNAL, D2O, 0, 15.7039)
##AUDIT TRAIL= $$ (NUMBER, WHEN, WHO, WHERE, WHAT)
$$ ##TITLE= Audit trail, XWIN-NMR		Version 3.5
$$ ##JCAMPDX= 5.01
$$ ##ORIGIN= Bruker BioSpin GmbH
$$ ##OWNER= she
$$ F:/spectra/data/she/nmr/H-F/1/audita.txt
$$ ##AUDIT TRAIL=  $$ (NUMBER, WHEN, WHO, WHERE, WHAT)
(   1,<2019-09-18 14:30:40.06 +0400>,<she>,<DPX200>,
      <created by zg, POWCHK disabled, PULCHK disabled
       configuration hash MD5:
       00 E9 B6 7A A2 85 ED C7 34 08 36 98 17 FE 4E 26
       data hash MD5: 16K
       C8 97 F5 3C E7 11 A5 B8 1F 31 0A 36 C6 9F 31 E6>)
$$ ##END=
$$ 
$$ hash MD5
$$ 42 20 A6 8C 12 47 2F D4 58 CE 36 9B 6E 8A 47 23
##$RELAX= 
##$RELAX= 
##$RELAX= 
##$RELAX= 
##$RELAX= 
##$RELAX= 
$$ Bruker specific parameters
$$ --------------------------
##$DU= <F:/spectra>
##$EXPNO= 1
##$NAME= <H-F>
##$PROCNO= 1
##$TYPE= <nmr>
##$USER= <she>
##$AMP= (0..31)
100 100 100 100 100 100 100 100 100 100 100 100 100 100 100 100 100 100 
100 100 100 100 100 100 100 100 100 100 100 100 100 100 
##$AQSEQ= 0
##$AQ_mod= 1
##$AUNM= <au_zg>
##$AUTOPOS= <>
##$BF1= 200.13
##$BF2= 200.13
##$BF3= 200.13
##$BF4= 200.13
##$BF5= 200.13
##$BF6= 200.13
##$BF7= 200.13
##$BF8= 200.13
##$BYTORDA= 1
##$CFDGTYP= 0
##$CFRGTYP= 5
##$CHEMSTR= <none>
##$CNST= (0..31)
1 1 145 1 1 1 1 1 1 1 1 1 1 1 1 1 1 1 1 1 1 1 1 1 1 1 1 1 1 1 1 1 
##$CPDPRG= <>
##$CPDPRG1= <>
##$CPDPRG2= <>
##$CPDPRG3= <>
##$CPDPRG4= <mlev>
##$CPDPRG5= <mlev>
##$CPDPRG6= <mlev>
##$CPDPRG7= <mlev>
##$CPDPRG8= <mlev>
##$CPDPRGB= <>
##$CPDPRGT= <>
##$D= (0..31)
0 1.2 0 0 0 0 0 0 0 0 0 0.03 0 0 0 0 0 0 0 0 0 0 0 0 0 0 0 0 0 0 0 0 
##$DATE= 1568802639
##$DBL= (0..7)
120 120 120 120 120 120 120 120 
##$DBP= (0..7)
150 150 150 150 150 150 150 150 
##$DBP07= 0
##$DBPNAM0= <>
##$DBPNAM1= <>
##$DBPNAM2= <>
##$DBPNAM3= <>
##$DBPNAM4= <>
##$DBPNAM5= <>
##$DBPNAM6= <>
##$DBPNAM7= <>
##$DBPOAL= (0..7)
0.5 0.5 0.5 0.5 0.5 0.5 0.5 0.5 
##$DBPOFFS= (0..7)
0 0 0 0 0 0 0 0 
##$DE= 6
##$DECBNUC= <off>
##$DECIM= 24
##$DECNUC= <off>
##$DECSTAT= 4
##$DIGMOD= 1
##$DIGTYP= 9
##$DL= (0..7)
0 120 120 120 120 120 120 120 
##$DP= (0..7)
150 150 150 150 150 150 150 150 
##$DP07= 0
##$DPNAME0= <>
##$DPNAME1= <>
##$DPNAME2= <>
##$DPNAME3= <>
##$DPNAME4= <>
##$DPNAME5= <>
##$DPNAME6= <>
##$DPNAME7= <>
##$DPOAL= (0..7)
0.5 0.5 0.5 0.5 0.5 0.5 0.5 0.5 
##$DPOFFS= (0..7)
0 0 0 0 0 0 0 0 
##$DQDMODE= 0
##$DR= 18
##$DS= 0
##$DSLIST= <SSSSSSSSSSSSSSS>
##$DSPFIRM= 0
$$ [...]
##$SUBNAM2= <"">
##$SUBNAM3= <"">
##$SUBNAM4= <"">
##$SUBNAM5= <"">
##$SUBNAM6= <"">
##$SUBNAM7= <"">
##$SUBNAM8= <"">
##$SUBNAM9= <"">
##$SW= 24.0689530833862
##$SWIBOX= (0..15)
0 0 2 0 0 0 0 0 0 0 0 0 0 0 0 0 
##$SW_h= 4816.95568400771
##$TD= 16384
##$TD0= 1
##$TE= 0
##$TE2= 300
##$TE3= 300
##$TEG= 300
##$TL= (0..7)
0 120 120 120 120 120 120 120 
##$TP= (0..7)
150 150 150 150 150 150 150 150 
##$TP07= 0
##$TPNAME0= <>
##$TPNAME1= <>
##$TPNAME2= <>
##$TPNAME3= <>
##$TPNAME4= <>
##$TPNAME5= <>
##$TPNAME6= <>
##$TPNAME7= <>
##$TPOAL= (0..7)
0.5 0.5 0.5 0.5 0.5 0.5 0.5 0.5 
##$TPOFFS= (0..7)
0 0 0 0 0 0 0 0 
##$TUNHIN= 0
##$TUNHOUT= 0
##$TUNXOUT= 0
##$USERA1= <user>
##$USERA2= <user>
##$USERA3= <user>
##$USERA4= <user>
##$USERA5= <user>
##$V9= 5
##$VALIST= <valist>
##$VCLIST= <CCCCCCCCCCCCCCC>
##$VD= 0
##$VDLIST= <DDDDDDDDDDDDDDD>
##$VPLIST= <PPPPPPPPPPPPPPP>
##$VTLIST= <TTTTTTTTTTTTTTT>
##$WBST= 1024
##$WBSW= 4
##$XGAIN= (0..3)
0 0 0 0 
##$XL= 0
##$YL= 0
##$YMAX_a= 542221
##$YMIN_a= -825683
##$ZGOPTNS= <>
##$ZL1= 120
##$ZL2= 120
##$ZL3= 120
##$ZL4= 120
##$ABSF1= 10
##$ABSF2= 0
##$ABSG= 5
##$ABSL= 3
##$ALPHA= 0
##$AQORDER= 0
##$ASSFAC= 0
##$ASSFACI= 0
##$ASSFACX= 0
##$ASSWID= 0
##$AUNMP= <proc_1d>
##$AZFE= 0.1
##$AZFW= 0.1
##$BCFW= 1
##$BC_mod= 2
##$BYTORDP= 1
##$COROFFS= 0
##$CY= 11.3945322036743
##$DATMOD= 1
##$DC= 2
##$DFILT= <>
##$DTYPP= 0
##$F1P= 20.1720416913024
##$F2P= 0.152960286110954
##$FCOR= 0.5
##$FTSIZE= 0
##$FT_mod= 4
##$GAMMA= 1
##$GB= 0.15
##$INTBC= 1
##$INTSCL= 1
##$ISEN= 128
##$LB= 0.24
##$LEV0= 0
##$LPBIN= 0
##$MAXI= 10000
##$MC2= 0
##$MEAN= 0
##$ME_mod= 0
##$MI= 1.114404
##$NCOEF= 0
##$NC_proc= 0
##$NLEV= 6
##$NOISF1= 3.799351
##$NOISF2= 2.8
##$NSP= 1
##$NTH_PI= 0
##$NZP= 0
##$OFFSET= 15.70392
##$PC= 1
##$PHC0= -9571.408
##$PHC1= 11.00096
##$PH_mod= 1
##$PKNL= yes
##$PPARMOD= 0
##$PSCAL= 0
##$PSIGN= 0
##$REVERSE= no
##$SF= 200.130013532006
##$SI= 16384
##$SIGF1= 3
##$SIGF2= 2
##$SINO= 400
##$SIOLD= 16384
##$SREGLST= <1H.CDCl3>
##$SSB= 0
##$STSI= 0
##$STSR= 0
##$SW_p= 3612.71676300578
##$SYMM= 0
##$S_DEV= 0
##$TDeff= 0
##$TDoff= 0
##$TI= <>
##$TILT= no
##$TM1= 0
##$TM2= 0
##$TOPLEV= 0
##$USERP1= <user>
##$USERP2= <user>
##$USERP3= <user>
##$USERP4= <user>
##$USERP5= <user>
##$WDW= 1
##$XDIM= 8192
##$YMAX_p= 0
##$YMIN_p= 0
$$ End of Bruker specific parameters
$$ ---------------------------------
##NTUPLES= NMR FID
##VAR_NAME=  TIME,          FID/REAL,        FID/IMAG
##SYMBOL=    X,             R,               I
##VAR_TYPE=  INDEPENDENT,   DEPENDENT,       DEPENDENT
##VAR_FORM=  AFFN,          ASDF,            ASDF
##VAR_DIM=   8192,          8192,            8192
##UNITS=     SECONDS,       ARBITRARY UNITS, ARBITRARY UNITS
##FACTOR=    0.0002076,     1,               1
##FIRST=     0,             0,               0
##LAST=      1.7004516,     0,               0
##MIN=       0,             -825683,         0
##MAX=       1.7004516,     542221,          0
$$ Real data points
##PAGE= N=1
##DATA TABLE= (X++(R..R)), XYDATA
$$ [...]
2905A792J598p003L792P885o718r919O971J0944o659r967N960P401o364m602O981
2920B092J571q344Q39Q986k596j0806L238J0982k185j0093J354O655l751l238
2934e296O296K421q736k436Q904K193q574j813Q375N71p042R25O067l358m984
2949f487N359N145o341n030O336M833n514k629N614O29n663R30P012j397p147
2964d350J808O998j272n137K690K910m381j684O568K493o443k804N409K054m031
2979H28l73L855r34l682K082L636l695l812M468L976m565l859L462L279l193j837
2995c64K308o75k825K271L728l393n514K554N949j357n332R3K103m93J54K405
3011A612j217m709L75M937km521M0M459p36l384L37J805j63j82J517j059l318
$$ y = [1792, 3390, -3613, 179, 8064, 1346, -8573, -1602, 9342, 2683, -7284, -1324, 6077, -287, -4889, 2092, 3663, -4681, -3842, 5144, 2548, -8258, -5020, 5962, 3777, -6316, -4962, 1693, -2058, -5296, 1000, 3421, -5315, -7751, 1153, 3346, -5228, -7041, 1334, 1905, -5137, -4212, 1855, -1503, -6487, -1128, 4017, -2324, -7354, -1018, 3815, -1699, -4328, 1286, 1915, -3748, -2818, 4194, 2797, -4350, -2542, 4456, 3184, -1953, 737, 3647, -734, -2418, 4150, 6643, 200, -2604, 2805, 4859, 828, 455, 4310, 3376, -306, 1776, 5412, 1717, -2095, 2373, 6349, 1784, -2075, 1387, 4666, 1473, -364, 1944, 1269, -1556, 715, 4443, 1050, -4464, -1910, 4039, 2682, -2650, -2557, -454, -947, -793, 1612, 395, -4314, -3939, 998, 996, -3525, -3485, 974, 238, -3146, -2809, -1004, -1167, -1349, 168, -891, -4209]
3028d209J152N418K32n477k334L534L341n36j220r31j809R46M149Q25m601k632
3044d152L990L128j857k722M71K056M79j85j070k904L20N045K950m619n223R87
3060c306N181J845k005k269j512O43K905K099k899m116J362M302O03k999k143
3075b309J722J850O05j051k527j369L013L846n34n320j866K892L463K43k128l013
3091b483k71K141L478k25l282k516J895K408l67j460L5Q92J83K8j046j090J83
3108a497K582J418k326k814K45K912J635q87k000j596K08K447K307j152k359j145
3124b022J528R91p61q5P59J27o16l94m61k44J237J477q33k728o21K994K235o67
3142A916k375k163K64K335K510J87k878j454J050J904r73r65O52J441j97p12q66
$$ y = [-4209, -3057, 2361, 2593, -2884, -5218, -1684, 1657, 1121, -99, -1030, -2839, -1893, 2256, 3081, -1520, -4152, -162, 2966, 1109, -1613, -1142, 914, 1393, 1208, 138, -2766, -2446, 2599, 5549, 930, -4293, -3306, 1875, 3720, 1715, -554, -2066, -1423, 1482, 3581, 682, -3434, -2072, 2230, 2833, -166, -2309, -587, 1263, 1868, 817, -1710, -3079, -66, 3780, 3246, -2074, -3940, -1048, 2415, 2658, 530, -2483, -2754, -613, 2865, 2640, -642, -3158, -1263, 1145, 778, -682, -647, 245, 428, 456, -590, -1680, -1497, 1085, 2503, 177, -2637, -2392, 520, 2155, 1268, -732, -2328, -2120, 327, 2634, 1482, -877, -2022, -494, 497, -264, -349, 410, 537, -79, -473, -934, -1178, 59, 1536, 703, -2025, -2646, 348, 2583, 1916, -459, -2622, -2358, -23, 2487, 2674, -204, -1658, -608, 1296, 323, -642, 10, 1451, 1254, 542, -324]
3159c24m08J372K224m37l338k813K640N175Q15l930l851k44K255L222J192k544
3175A006l682P72L448Q15l136j348J519J344n06j009k91NJ673J678k292m874L1
3192d847N517M176k430n170j189J265K410K613k28m002k129L063L841j395k999
3207a504K8J421l76o20J788K99k62p2J048k903k548K949N317l95m307j388J722
3224A97K03O07K123o34m508o79M522K576j974j814Q00j717k522K541M512m73l611
3241A49n64J290j784l13L788R96l981k157L447J620k365o43K367k033l545K084
3257a644N037q98l431P16J013l381r35M966K572m376k565L555R21k838K54L911
3273B877k149m450J972M438n16k869J804J384m819k272N907M018l848k985K877
$$ y = [-324, -732, 640, 2864, 2427, -911, -3724, -1084, 4091, 4906, 976, -2875, -3119, -864, 2358, 3550, 1006, -2676, -1904, 1544, 2359, -777, -2125, -606, 738, 232, -777, -1068, -1063, 610, 2288, -4, -4878, -4847, 670, 4846, 2416, -2754, -3943, -2678, -268, 2345, 2117, -1885, -4014, -951, 2890, 1495, -1504, -1476, -55, -431, -1051, 737, 1036, 774, 702, 1750, -1153, -3701, -752, 4565, 4170, -137, -1525, 197, 400, 1007, 3130, 2496, -2012, -2691, 1831, 4407, 2433, 619, 1419, -298, -2820, -279, 4233, 3760, 149, -415, 875, -909, -1222, 2566, 3562, -419, -2576, 871, 2491, 126, -517, 1850, -183, -3728, -1644, 3393, 2495, -936, -220, 793, -2588, -3523, 1443, 4015, -361, -2926, 629, 1550, -1288, -1034, 2877, 728, -3722, -1750, 2688, 2172, -697, 1107, 2491, -2328, -4600, 1307, 5325, 1477, -1508, 1369]
3288A369M15m153J192M993j365m967K435M504l377m500L696M446m289m277L068
3303h10L118j686L56K904l505p163K419Q980N9p305j123M325q93j920L249P64
3319A769n753j844P049K210o049j575N881L47o735j364N865J118j917L005Q69
3334B876p297l725Q562O493n750o202L535L501k284L79M161l162o044L151P579
3349E773k553n590L231N032m502n298M269M217k751j335M970j404p444J416Q770
3364F801q11q505L07O116q49k790L454J940p078m321P053M106n071j489N347j116
3380C094p873l6P793J45n796J450L850n194l755P309M694p550n869N265L699m160
3396b934N91N492k705q152J619P793j961n366L633N676o083m843N823N001n416
$$ y = [1369, 1784, -2369, -1177, 3816, 2451, -2516, -81, 4423, 1046, -3454, 242, 4688, 399, -3878, -810, 2308, 622, 978, 3882, 377, -6786, -4367, 4613, 4672, -2633, -3756, 569, -324, -2244, 1005, 1769, -3984, -5828, 1221, 3431, -2618, -4193, 1688, 2035, -4700, -6064, -199, 919, -998, 2007, 2876, -4421, -8146, 416, 6909, 1159, -5043, -1508, 1993, -291, 88, 4249, 1087, -4957, -1806, 5773, 3220, -2370, 861, 5893, 1391, -3907, 362, 4579, 1828, 493, 5463, 4059, -3385, -1969, 6801, 5990, -2515, -2208, 3908, 3059, 269, 3723, 5663, -1415, -5736, 1317, 5423, 352, -1137, 4210, 3094, -4779, -4815, 2978, 3123, -2673, -1223, 2627, -2567, -6322, 987, 5681, -1869, -7738, -2473, 1226, -2934, -2343, 3149, 444, -7708, -6089, 1704, -257, -5623, -1990, 3686, -2397, -7240, -1417, 3584, -1832]
3411a832l793N621P03n747L103Q708l260j1102P06Q926J109l683K981J757p228
3426c031l342R335M537q507l549P494J815o985K98P799j903p081K102N304m104
3441A82l783P987N526r865q057P232O963m995k467M886j889o139L479Q815m963
3456B912j1154L849R938k299o793L510L793o251k706P526J410q395q5J0448o08
3471E095j0270q4Q957r65p183L186N907n085m680P716L844r066l435R375K684
3486E996r324j598R325J453p599N97N239m820n626Q538Q291q178r109O485O305
3501E975o191l198P434M63r117R76R765p66r518J439O914m486o549P073P898p265
3517H47q388N049N412n757j414P930q28j0633L42J1471M23r808J81O902l998n070
$$ y = [-1832, -5625, -4, 699, -5048, -1945, 6763, 3503, -7599, -6893, 2033, 3142, -541, 2440, 4197, -3031, -6373, 2962, 7499, -1008, -4557, 2937, 4752, -2233, -1935, 5864, 3961, -3120, -1018, 4286, 182, -3601, 4386, 9912, 47, -8010, -778, 6185, 1190, -1277, 3609, 1720, -4419, -940, 7875, 2912, -8242, -4393, 5545, 3246, -3547, -37, 3756, -2495, -5201, 2325, 3735, -4660, -4745, 5703, 5095, -5175, -5259, 3698, 2733, -4450, -1264, 4643, -442, -5122, 2594, 6438, -2628, -6063, 3312, 5996, -3328, -4926, 4399, 5852, -1747, -1150, 4089, -731, -6357, 2181, 10472, 2294, -6815, -330, 5975, -216, -3414, 4020, 4483, -4634, -3658, 6107, 5341, -4177, -2738, 4176, -310, -6859, 214, 8112, 847, -7541, -2492, 2920, -2837, -4251, 3679, 2851, -7782, -7440, 4031, 4454, -5354, -5173, 1729, -2269, -7339]
3533g339O708O770p616o844O215M896p031k026Q650J799r149r15Q407k93p613
3548e381L086P508m313p527N554P389n208n411O019K908p518j057R521J687r325
3563b068n85P845j069p071L232P311m211o654M291N555m883l721O927K142r501
3578b460k679R809M132o897k726L079k752l549O468P500o617j0042L475P772k125
3593B388l920L312R52p058k24P911J172p252q96N076k022n852M142P308l063p467
3609e493J321M413j976q65N176n09q442j127R359L377o729k951L149k59k329L688
3625a97M473m483n411M082M272l712k612M829K097n188j667M274J719m003K77
3640a250L747k451l754L016N040k606m593K272K807k627j807L599J268l599p46
$$ y = [-7339, -631, 6139, -1477, -8321, -2106, 2790, -4241, -6267, 2383, 4182, -4967, -5882, 2525, 2232, -5381, -2295, 5213, 900, -6627, -1073, 6316, 1108, -4303, 1716, 4624, -2894, -3951, 5570, 7257, -2068, -2653, 5192, 4123, -2948, 284, 7595, 3384, -3270, 1021, 6576, 1693, -2028, 4899, 7041, -2460, -5139, 4670, 8802, 1905, -821, 2258, -494, -4043, 2425, 9925, 3308, -6734, -3259, 4513, 2388, -1532, 1780, 2732, -4326, -4550, 3361, 4533, -2719, -3615, 1461, -561, -6413, -2271, 5037, 1974, -5493, -4172, 241, -1735, -2600, 2576, 2067, -6375, -7502, 1857, 5234, -1495, -4446, -1297, -1556, -3885, -197, 4276, -207, -5618, -1536, 2736, -976, -3588, 1241, 3338, -1850, -3517, 757, 2476, -1527, -1250, 2497, 46, -3708, -692, 4348, 1742, -2851, -579, 2228, -399, -2206, 1393, 2661, -938, -1684]
3655a684M003n16m418Q67M254l76m452J048L213j138k118J983J171l887r25M476
3671A501J863l441j826K026J154k952J138K907j710k508J056K866j546k161K313
3686F80J915k898j899K709J667j964n6J676j110k890K094L517p55l096l33K407
3702A664k89p32J168m41k272Q18K511N04k929q66K192N60j680j29P41m64o19J993
3720A730L40l290j125K792J892j720k079K17J359j05k1K36j964q53K304J738j723
3737b72k403N88J892j32j281k99K64L51J115M38j514k037J310K620qj799q83P09
3755a341J023P6M40j085q67N11J468N03j691m55J431P02r10j38m8L81L18J036
3773A354o60j249m5J818N83j273q41O23J246l82k21k25N0Q1M87N73p87q42J187
$$ y = [-1684, 2319, 1803, -2615, -1748, 2506, 2130, -2322, -1274, 1939, 801, -1317, 666, 1837, -2050, -2975, 1501, 3364, -77, -1903, 123, 1277, -1675, -537, 2370, 660, -1848, -792, 2074, 528, -1633, 680, 2595, -303, -2202, 507, 2174, 210, 154, 1830, 720, -2170, -76, 3441, 2686, -410, -743, 1664, 1375, 643, 1811, 1370, -902, -84, 2427, 2931, 2, -864, 1328, 1888, 208, 79, 820, 356, -263, 1730, 2070, -1220, -2345, 447, 2339, 619, -1460, -1243, 116, 11, -10, 226, -1738, -2591, -287, 1451, -272, -2675, -2087, -195, -327, -1608, -1907, -1643, -1292, -177, 261, -1253, -3290, -1980, 640, 632, -1167, -2050, -1341, -318, -242, 198, -887, -1754, -1243, 225, 728, -963, -1418, 13, 715, -195, -333, -381, 0, 318, 1354, 694, -555, -600, 1218, 1801, 528, -313, 310, 1556, 1174, 953, 728, 778, 859, 1346, 1919, 1132, 290, 1477]
3792A477O58o85q41q8O30R3K14m17j50q45Q07J122j296r52K17J196l39n47l57
3811a03J04m45L49K84k49q73q5J247J79j377m21K03M23K58J02m6p82m88R45M67
3831c08p52n71N69N24j84j60K00m26k48J001P42j099j428J251J033L19p48m99
3849g84j12K25P66J049j063j777P44J817J009j544j197K59Q08Q04N62o78r71k02
3867b85J801M95j723j148J493J542p20r06n83j01L31J780K54k473j215J102K748
3884B392q64j829k78L56K71J94O87r01j416Q36J517j107j920N91K264n04j727
3901a438nR20n58J28J110m54k374J41K619O38k373n56K026j83j867Q04J631n67
3919c58j542J409P33j918o40L404N26k910j595K809J308j107l30J430j725j490
$$ y = [1477, 2135, 1450, 609, 521, 1151, 1244, 1458, 1041, 891, 46, 853, 1975, 679, -273, -56, 1140, 801, 254, -103, 1, -444, -95, 189, -60, -933, -1018, 229, 408, -969, -1390, -1187, -764, -506, -404, -450, -1232, -1720, -775, -308, -1060, -1631, -1062, -538, -722, -882, -682, -1108, -1356, -355, 387, -712, -2140, -889, 144, 463, -285, -784, -896, -671, 95, 1144, 81, -1696, -952, 865, 1874, 330, -867, -608, 200, 1004, 1566, 888, -83, -285, 1516, 2011, 288, -860, 633, 2175, 1455, 549, -34, -135, 196, 1976, 2230, -243, -1458, -356, 2392, 1528, -301, -579, -223, 48, 242, 929, 28, -1388, -552, 965, -142, -2062, -1471, 793, 289, -1438, -1443, -523, -1081, -953, 157, -297, -2671, -2530, 89, 727, -1646, -2202, -176, -359, -2226, -1422, 209, -358, -1900, -491, 242, -1676, -2316, 1088, 1614, -1296, -2891, -82, 1226, 119, -211, 1219, -506, -1996]
3935a996J895K490j647k378K133J407j714j618J956J444k000j45J550p56j968
3950a347J568L099j750m069Q62L633k23k124J182L55l004l96M191Q69l777j196
3966b127L058J60k377M11K924j484l260J964K815j950k334L062J738l740k392
3981c532L445K253k290l31K051j185l798K381M610j159m909O61L481r74j278K377
3997A803M78m157j185N015J621l983j386L690O9l957O19L308q57k341J612K438
4013B787m004k254M348L209l983l523K960J845k332O72L014k069n047J453M844
4028A920n92l661J897K510m079k303M120K354k942k248K731O35l747J988M788
4043C371k080n961O93M584j6j983K069R18l961k164M875L111l707j690K973k27
$$ y = [-1996, -101, 2389, 742, -1636, 497, 1904, 190, -1428, 528, 1972, -28, -173, 1377, 621, -1347, 221, 3320, 1570, -2499, -1637, 1996, 1773, -351, 831, 1186, -1818, -2214, 1977, 2846, -931, -2127, 931, 1091, -1286, -875, 2049, 565, -2695, -731, 2084, 134, -2200, 862, 2600, -1140, -3532, -87, 2166, -124, -455, 1596, 411, -3387, -1006, 3604, 2445, -2464, -1803, 1678, 704, -574, 1803, 2281, -1876, -3061, 1954, 3575, -408, -1794, 1896, 1965, -1992, -1373, 1935, 1078, -1263, 349, 2787, -1217, -3471, 877, 4086, 103, -3420, -460, 1385, -947, -275, 2739, 670, -4377, -2924, 1920, 1328, -2333, -436, 2074, -2005, -4308, -188, 2166, -776, -3024, -293, 342, -3405, -1417, 3371, 1291, -4670, -3977, 607, 591, -1392, 677, 1595, -2366, -4530, 345, 3456, -251, -1941, 1032, 805]
4059H05l417J791N217j883n495P11L992l43j070L014J96n425k067O192L534m044
4075A708k475K376k54k495K601L677l252m751K445M483j688k558K184J197m318
4090a120j072M439J091m108k73L888j203m414J929L594k035l574K543K770k822
4105c67k122L858Q08m997n89M788R08m588q0L813j174l226J855K812l738k594
4121d633M862L708m436l716K765K325k729J1L823j943m691K914N584k385n644
4136d185J661L932j402k429L760J378m896j307N268O16m888j15N676p90n238J321
4152a638M690k032l673K776K333l322j615M903J652n655k094N735J096m937o1
4167a842M671n37l878J966L071m372l319M858M519m667l532L623K124m099k07
$$ y = [805, -2612, -821, 4396, 2513, -2982, -2271, 1721, 1378, 308, 3322, 3518, -1907, -3974, 2218, 5752, 1708, -767, 1609, 1355, -1140, 1461, 5138, 1886, -2865, -420, 4063, 2375, -183, 2001, 3198, -1120, -2192, 2247, 3338, -770, -1043, 2845, 1642, -2772, -843, 2751, 716, -2858, -315, 2455, -367, -2489, 1369, 2177, -2820, -3409, 1379, 2287, -2301, -2381, 1432, 258, -2968, -1113, 1699, -2039, -4633, 229, 3937, -499, -4215, -1450, 875, -1854, -1843, 1980, 37, -4654, -1740, 3844, 1459, -4185, -2524, 1408, 6, -2423, 1337, 2715, -2181, -3488, 1780, 2396, -2492, -2607, 3069, 2279, -2959, -1638, 3052, 1020, -2653, 123, 2456, -866, -2481, 2422, 4074, -1581, -3675, 2060, 3156, -1781, -1842, 2829, 2292, -1586, 380, 3451, -921, -4240, 618, 5137, 470, -3062, 561, 2685, -1414, -1621]
4182a621M411q26n011J046N527j433m334K105L550m739l841N741M847m012m321
4197b911K378J278l366K050N804l231p762J256Q103L28m705l76J707l351j336
4212d134O739L151o313l906M386J781m049J15N761j111o448O81N857n92l790K055
4228A83J677m526k745O930M358n273m744L352J765l257J702M590j952o706J832
4243b814O183p27m975K025K908l839k648N272L436m634l036L704L66l811P93N456
4259C659k51o093N47M601j484l938L244L422l998l625L957L317l234j912L159
4274A371O2m744P06N658k70m761j65L555j749k895L315L306l750l598L234K673
4290A948k867q47L134j80m612K70N247R06m082n99K267j796k094L618L595k904
$$ y = [-1621, 2790, 1964, -3047, -2001, 3526, 2093, -2241, -136, 3414, -1325, -5166, 575, 5422, 1410, -2911, -533, 745, -2621, -571, 5233, 2002, -5760, -4504, 3599, 3927, -778, -1154, 553, -2798, -4134, 2605, 5756, -557, -4463, -77, 1704, -2345, -2230, 3531, 2420, -4028, -3347, 2510, 1918, -1872, 183, 1860, -2666, -5411, 1519, 5877, 604, -4140, -788, 977, -2280, -578, 4012, 2060, -4646, -2814, 3369, 2642, -2333, -308, 2600, -1239, -3887, 1385, 4821, 187, -2849, 855, 1221, -2590, -1797, 3659, 3408, -2685, -2138, 2463, 979, -2959, 285, 3707, -291, -3916, 41, 3358, 124, -1788, 1371, 1433, -3311, -2605, 3053, 2783, -1978, -2143, 1412, -337, -3232, 83, 3389, -361, -3959, -725, 1948, -919, -1766, 1368, 1188, -3424, -3154, 2093, 2999, -1083, -1682, 585, -1211, -3305, 313, 3908, 1004]
4306A004m035K319J790k200l31L492J13m497r0M111P22k909K68J778k107k222
4322b794L213L083k280l345K083K069k508p41K573N73l237K89K912o19k374O75
4338d28K041j036k668J668K470r27j518N26K65k095l9L417R00l580n56K283o7
4355F56k000J136J760j324j884J143J536j107p09J421M31j905j132K232J022r20
4371C56j43Q36o42k153J032K439m14k119M93J323r18k77J415k17k114r6J891J083
4389A775j075o45J44l91q42Q30J472p54j161R15J21j089p20J774J005j316r12
4406h69j89M18l2J058L32j694j475R00J737L08j335j66K5l66K64M62M41q78P2
4425i87Q26m49j020N60J233l9j108m81O49P96O47M8q32j182J03K274K66j193n75
$$ y = [1004, -3031, -712, 1078, -1122, -1453, 2039, 2152, -2345, -2435, 1676, 2398, -511, -243, 1535, -572, -2794, 419, 3502, 1222, -2123, -40, 2029, -479, -1220, 1353, 1926, -1311, -1022, 1890, 1271, -1103, -428, 1613, 577, -2091, -423, 2047, 1120, -398, 128, 393, -1702, -1741, 1676, 2576, -1004, -1560, 723, 656, -1344, -208, 1552, 228, -1656, -513, 1023, -84, -793, 628, 1059, -846, -1978, 254, 1276, 356, 213, 1049, 407, -1746, -714, 1725, 1311, -808, -315, 1008, 90, -187, 1228, 1011, -1103, -1199, 692, 1775, 700, 55, 199, -192, -1034, -204, 1268, 514, -647, 268, 389, -700, -1420, 354, 1359, 43, -869, -1058, -640, -672, 386, 718, -976, -2451, -1551, 186, 494, -841, -1007, -982, -1348, -1084, -622, -181, -1059, -987, -161, -610, -1630, -1070, 163, 124, -984, -1465, -816, -20, 627, 675, -157, -1339, -1236, 1038, 1304, 111, -464]
4444d64L85M28K88J32M36l30j48M8j12l93L82J259L37j393j658Q14J142P06k43
4463A616k33r37j63J038J60o26n71J89P72L1j139O7M35J16q9n25p46K22J282K62
4483A161o70j992K65J156Q03o73q12p45L80Q00J199j212j134L45N14P05r07N6
4501g61J83M95k71l97n78L93O26R67l2j614o29J006R55N9q74Qk79K22O82M41r43
4522c41k56N76N71l32k71L7K69l68o3k24J41L46k4N56o07q17N23N56k90n26J55
4543c89J8j22K62O81m41p18k62Q51J15m55M31O33p34r39M09O33P2j00L15l1p84
4564e55k53J253M68j054j34Q22J74q22M93N90m76m09Q59L25r74n04J211M01o72
4583G43k14N97L77j057N0J352n86r85N03J089l64j941Q47J073o19j90L64J79j310
$$ y = [-464, -79, 349, 637, 769, 1205, 875, 727, 775, 663, 270, 652, 1911, 2248, 855, -803, 11, 1153, 1859, 1616, 1383, 446, 283, 1321, 1481, 855, 284, 473, 1245, 1276, 137, 204, 639, 755, 666, 141, -605, -383, 899, 1161, 491, -1501, -1236, -80, 723, 50, -762, -1507, -1127, -327, 872, -340, -1474, -1129, -615, 90, -817, -761, -578, -83, -354, -751, -1329, -936, -310, 657, 625, -989, -1618, -612, 343, 402, -472, -464, -743, -521, 161, 602, -341, -597, -21, 550, 218, -53, -16, 253, -115, -178, -402, -261, 85, 61, 617, 10, -807, -284, 272, -18, -544, -389, -371, -493, -231, 450, 9, -709, -971, -120, -5, -460, -29, 604, -130, -1069, -660, -27, 45, -55, 260, 229, -555, -808, 445, 913, -141, -275, 547, 721, -101, 392, 982, 506, 97, 956, 1281, 307, -197, 1014, 1415, 743, 529, 1126, 1503, 446, 496, 1848, 1262, 277, 780, 1869, 1505, -436, 411, 1484, 865, 675, 1039, 1218, -92]
4602i2M6J153L96j676o13J837k73j499L46R50n80q84R85N68j620o06J568P47j723
4621i70r06J406M93j456L52J078q90j171J028J641j119k001J211J429j192q12
4637a879J718L37j858l21J953P57j710J02J252m33j509Q48K383j206j923Q66J721
4654A098j019j076J801M82k016k44K178M97k314L3K202o74k302J049K715p46k620
4671i56Q06R74j117k00K873l79l445p57L409J469k170j026J201n76j400K054J859
4688B619k299k402J725K473j651j806K145J043k671q20K403L81j789O22J783j566
4704A90k485K024L246j862k713R51K181j263r78J971L24k634k99K987L71k859
4720h48J52K757n94l131J185K426j086j960J513P83k262m93K729Q18l397p99L243
$$ y = [-92, -46, 1107, 1503, -173, -786, 1051, 778, -721, -375, 575, -5, -889, 96, 664, -956, -1562, 6, 753, -970, -1876, -470, 23, -1433, -1081, -3, -893, -2064, -1036, 605, -514, -2515, -1304, 125, -1067, -1879, -161, 176, -1682, -2003, -50, 707, -1003, -901, 351, -82, -1591, -743, 1640, 434, -1489, -623, 1098, 79, -997, 804, 1286, -730, -974, 1204, 1701, -613, -580, 1622, 948, -1354, -305, 2410, 1664, -956, -150, 824, -293, -493, 2380, 2001, -1444, -2201, 1208, 2677, 507, -519, 682, 106, -1294, 760, 2619, 320, -2082, -357, 2116, 465, -1341, 804, 1847, -824, -1644, 759, 1140, -649, -27, 1756, 190, -2295, -271, 2975, 1113, -1600, -649, 1532, 269, -709, 1262, 1586, -1048, -1347, 1640, 2011, -848, -696, 2061, 1467, -1664, -479, 1947, 861, -1099, 414, 1197, -1065, -1558, 1171, 1989, -1408, -2207, 1036]
4737A036L31k763K92K026o21k244J075J944k011r08K555R41l439j749L563J383
4753A411k011j084J282l72j368J809K318k228l423J984L121j088k220J293J049
4768D73k019j74K629q1k409M18K246p97k309J540K441j304k251R83J695j127M2
4785dJ864l99l370J65L825L50k814n11K138l9j890J514J593k448j568K392J785
4802B583k289j040K054L7k322J93K742m95k654O81K237j125j860J924J355k660
4818f39j623L107J393k508j032J902J51j834O62K404j534k698J632K435j174k381
4834a737J725J339k018j169L020M29k501l68K278k91k750J691K988j479k980P33
4850a090K348q47j365K187J6l048k12L665P39l252r17K303j9k042J464K119j890
$$ y = [1036, 1367, -1396, -1104, 922, 301, -1943, -868, 1076, -935, -1843, 712, 1653, -1786, -3535, 28, 1411, -600, -1684, -402, -774, -2142, -333, 1985, -243, -3666, -1682, 1439, 351, -1869, -576, 473, -1546, -1720, 909, 828, -1581, -1163, 1083, 286, -2023, -483, 1958, 654, -1597, -614, 1081, -46, -4, 1860, 1461, -1909, -1744, 2081, 2431, -383, -894, 1244, 1205, -685, 829, 2422, -26, -1594, 798, 2583, 294, -746, 1308, 1345, -977, -784, 1958, 1463, -1191, -510, 1727, 602, -1258, 666, 2021, -639, -2262, 845, 2238, -270, -1302, 600, 751, -1083, -421, 1983, 449, -2249, -617, 1818, 644, -1737, -12, 1327, -691, -1860, 1160, 1589, -912, -1280, 998, 707, -2043, -352, 2636, 1157, -1823, -1090, 1258, 411, -954, 1233, 1249, -1799, -2011, 1654, 2393, -859, -1776, 527, 508, -1534, -70, 2049, 159]
4867A59k438K016K148k329j844K515J448k789j257K705R02k724K76K340j214l055
4883c141K034L288j543l262J464K048j677r02K475P65l469l52L315M03k874j57
4899a585L453j063l140J409L153j379k429J518J369k349o05L242J063l290j097
4914a730K843N92k718K13L005q52l273J750K497j382k351K306J137l057j008L487
4930A459J872l242j510J653O88k023J049K463j747l302K074L215j839k839J999
4945c0J633j873j604K087J274k175k22K124q75l037J225L924o78l568K83K663
4961A151r88j101J504N83k279r25L502J076k934j160K678J39k602O51K136K55
4977A686k500Q49J457j830j205K265J600k260j655K060J500k070o56J766n43j589
$$ y = [159, -2279, -263, 1885, -444, -2288, 227, 1675, -1114, -2371, 334, 1236, -1488, -1212, 1128, -86, -3141, -1107, 2181, 638, -2624, -1160, 888, -789, -1691, 784, 1549, -1920, -2272, 1043, 1446, -1428, -1585, 1868, 805, -2335, -926, 2227, 848, -1581, -63, 1306, -1043, -1648, 1594, 2657, -633, -1730, 1113, 1705, -1013, -800, 2205, 1353, -1920, -170, 2327, 945, -1406, 900, 2037, -1020, -2028, 1459, 3331, 89, -1421, 232, 920, -1103, -54, 2409, 662, -2640, -566, 2649, 810, -2029, -30, 1603, -270, -1874, 213, 1487, -688, -910, 1214, 339, -2698, -1473, 2451, 1773, -1795, -1512, 1151, 163, -938, 566, 1149, -1130, -2055, 1447, 2523, -411, -1571, 1107, 1246, -1356, -705, 1431, 1686, -814, 35, 1492, -338, -1543, 722, 2322, 62, -1593, 467, 1967, -103, -759, 1007, 464, -1125]
4993a125M03K000r01j567Q98J900k038j989J660K185j255j278O65M04j340M64
5009i14J487m21k256J41K243O2j919J53J453p64j179J069R72j257J13J361l95
5026e1k056l27L036J171k397j178J434K55l20J361K33j943j059K345J263q99j248
5043c80Q67P05j186N1J147K14j012L64O18j017n27J037J464j159j577O24R36K04
5061A373l36J81l06j640M09J736J56j084j35L81l78q62M30R23l72j005M23K4m29
5080e11L32J017j97j835j46J010Q19l00l60l8n97l46M68P37k56k91K55J70j008
5099a077M3M78N80p06J47q1k4O35L73k14o79j049O41J542J52m26m35l74J36L36
5119bP39m72m28J27K34o2j03j56O17j39n98m90M42R9P84K36n21j118j98J356J69
$$ y = [-1125, -722, 1278, 377, -1190, -292, 1608, -430, -2419, -759, 1426, 171, -1107, -442, -38, -1378, -914, 573, 152, -2104, -1963, 280, 342, -1577, -1424, 29, -735, -1914, -845, 127, -1130, -1017, 344, -51, -2107, -2434, 602, 1773, -624, -1802, -368, -113, -433, 928, 1161, -782, -1841, 504, 1767, 868, -380, 487, 1192, 6, 57, 1204, 1418, 406, 770, 1388, 371, -156, 881, 2345, 1186, -391, 233, 1169, 1373, 1037, 1218, 912, -728, -319, 1417, 1573, 489, 354, 735, 357, -505, -75, 848, 476, -529, -106, -82, -511, -179, 838, 641, -1194, -1340, -330, 489, 189, -171, -209, -806, -1152, -684, 53, -203, -494, -239, -69, -1077, -1034, -556, 24, -682, -535, -616, -640, -5, 368, 154, -525, -1574, -933, 609, 761, 335, -100, -474, -338, -2, 737, 265, -163, -36, 198, 136, 33, -123, 494, 355, -243, -733, -291, -192, 592, 828, 307, -811, -1009, 347, 516]
5140E16k5m95l10p2J18J53p5k72l94P21k05n2k4K63L31o03m02L19o0O52L46k29
5162B01p03n95J234M63Q5m19n67K83Q8M72l2J1j79p1K80j81j94Q80J78k54p79
5183B01j20N00M56L12k17n80o01O88Q08l01n92n8%K62m6k4j12j60j56L1q9m49
5205b47K88P26mj078n91O54P39p2n33r17N2N22O48j47o26q08K00Q90j16j80J15
5226d85l65M02L1n54l41L03J044L34j278p66M09J130J69l91o72k40O74N76P15
5245F95p03r55J88J080J15r06N7M72O78o84J26Q1j26L51Q09o00j259K56J336P24
5265A735j412j96j3M44M2O01R3r63m46Q19M12r17j61Q08M27p57o87M62L0l2M2
5286C31L08q94m80Q34R76p35j135O53M27m28k90M01J18p20K85R78o42j101L49
$$ y = [516, 491, -4, -314, -386, -268, -115, -190, -462, -856, -135, -340, -392, -416, -153, 178, -425, -827, -508, -568, 84, 430, 201, -502, -1097, 137, 600, 685, 266, -301, -18, 70, 542, 510, 521, 342, 271, 551, 370, 176, 1056, 1234, 980, 201, 81, 581, 1037, 1349, 1132, 552, -49, 639, 1447, 1146, 554, 496, 496, 758, 712, 688, 576, 416, 260, 291, 202, -247, 41, 767, 763, -315, -906, -252, 487, 415, -118, -1035, -983, -461, 187, 40, -586, -1394, -1194, -304, -420, -600, -485, -850, -448, -417, -971, -1312, -1009, 35, 369, -909, -1675, -1266, -136, 33, -358, -1030, -1270, -596, -20, 695, -8, -963, -775, 305, 420, -486, -429, 43, 721, 37, 163, 244, 118, 469, 1278, 678, -581, -325, 1011, 1735, 323, 127, 114, 558, 600, 1201, 1294, 331, -115, 704, 1116, 199, 38, 846, 1273, 516, -171, 291, 321, 289, 331, 639, -255, -735, 99, 1075, 340, -795, -142, 285, -143, -433, -32, 86, -634, -349, 629, -13, -1114, -765]
5305g65J462n15j320M24J042k4o48k5J08o25K40J211Nj431k32J407N54j003l55
5324d90P77k38n77O15Q02j280m36J368O58j437p32J170J067j083n18Q27l88r84
5342h79J142J129j246j152P23J421q70j201R57O54j014k59J107K21j310j01J618
5359I40m10j463M86J224k89j463K83J404q22p88R74Q78j488o47J487P8j065m47
5377a128J959nj712J78J142j33r85R75N81j395p61J441R61j301q14J220O50j526
5395f53L9J556m34j115P47J144j026j402R00J708j156j310J058Q85r72n32J183
5412F20P8j837O41J803l92k112K24J748k89j046O23O72j186n04J521N37j655o03
5430a157J936K43k131n0J414K63j197N46O75r36r32J514R88j523j171J332J119
$$ y = [-765, 697, 182, -1138, -714, 328, 304, -344, -369, -261, -886, -646, 565, 570, -861, -1093, 314, 868, -135, -490, 287, 49, -528, 87, 889, -391, -827, 541, 1199, -238, -970, 200, 1267, 184, -334, 493, 105, -879, 263, 1392, 146, -1006, -283, 1138, 268, -933, 24, 678, -336, -595, 512, 733, -577, -678, 940, 530, -933, -447, 777, 488, -975, -692, 712, -110, -898, 76, 954, -534, -1181, 306, 384, -681, -1128, 831, 826, -886, -708, 434, 301, -684, 291, 872, -523, -1284, 157, 1118, -183, -997, 223, 873, -653, -614, 942, 508, -607, 140, 1284, 258, -1144, -244, 1464, 308, -1002, 56, 941, -31, -563, 620, 698, -1139, -498, 1305, 913, -1199, -975, 773, 484, -562, 61, 733, -453, -957, 564, 1101, -554, -1157, 779, 1022, -1109, -1159, 255, 518, -679, -133, 542, -394, -1326, 188, 1176, -347, -1518, -186, 933]
5447I33j043n38R25j54q89N18R89m95j574Q36J647q95j274R92J180p78j115J191
5465D56J93p71L55N86j85j711R05J969p75j816K58J380l47n48N26L50j188J59
5483b04J668j35k128k8J711L54j800J18R05m48n72J092K28j704M0K097Lj832j077
5502a712J876P00r86o93O15o04l40J393Q78j969j484K036J271j517r79J293L98
5519A76j103r2J331n30j225P30J496j175j408J603J306j081j442J272Ro55M72
5536c16J192n74j710M28K352n97j730M04J408p63q88J056P89j147n69J831j77
5553I89j781J02K482j76k257l1J798j2j331Q33P83j508m35J489O12k056l10J885
5571A076N84j849n52J645j06j206M35Q92j409q49J965J479k025j981J359J633
$$ y = [933, -110, -648, 277, 123, -766, -248, 741, 246, -1328, -492, 1155, 260, -1014, -22, 1158, 380, -735, 456, 649, -122, 233, 819, 634, -1077, -172, 1797, 1022, -794, -536, 844, 497, -51, 475, 825, -363, -204, 1464, 1329, -799, -827, 884, 1238, -562, -444, 461, 13, -559, 533, 761, -943, -903, 1194, 1197, -635, -1712, 164, 864, -122, -815, -200, -804, -1144, 249, 1127, -842, -2326, -290, 981, -536, -1515, -222, 176, -927, -1019, 312, -218, -1443, -713, 783, -392, -1800, -197, 1109, 28, -1414, -142, -133, -788, -316, 876, 302, -1408, -980, 1372, 775, -955, -551, 857, 94, -794, 262, 1051, -96, -665, 1166, 989, -792, -690, 1792, 1616, -641, -672, 1126, 1114, -217, 616, 1399, -109, -544, 945, 1557, -499, -809, 1076, 1660, -189, -741, 904, 798, -408, 27, 919, -490, -1339, 626, 2105, 80, -1901, -542, 1091]
5587A091p06j136R56k81j155M97K140n83k297N43K067p48j674Q96J433j469q71
5604a297J645K35j490J85J748k66k175K82K097k9j774O8J613m12j250J357L20
5621H57j516j019J923J217j978o43J194N59j449M57J581q68j762O65J944j213
5637e1j175Q29J390j555r69J475Q25j420o91J317K00j109Q1J693o95j828Q14J691
5655H22n42j198L39J015o69p26J097P33j646n66J928J31j500l82K135j49j575
5672g53O24R13l52q09J081L32j351m80J347J234j353j113J015O61o23n3Q35l31
5690H24j331M53J712n69j486Q82N10n91p04M80Q74r87N4P50n71r61M24J521l93
5709H91j543L18M58j4m20N44q2p36k33Q95L11p61k61P48k43r55m65J870m7r65
$$ y = [1091, 385, -751, 205, -76, -1231, -734, 1406, 823, -1474, -931, 1136, 388, -1286, -390, 1043, -426, -1297, 348, 583, -907, -722, 1026, 760, -1415, -1133, 964, 935, -839, -771, 842, 430, -820, 537, 857, -659, -1678, 245, 1462, -516, -1159, 35, 594, -855, -398, 1183, 315, -1447, -782, 1162, -51, -1226, -397, 993, -562, -1531, -56, 769, -651, -1342, -25, 175, -934, -853, 840, 145, -1683, -869, 822, 280, -918, -579, 436, -233, -959, 138, 871, -775, -1341, 587, 718, -782, -1164, 971, 822, -753, -129, 784, 432, -377, 704, 1036, -315, -795, 552, 1786, 433, -680, 335, 996, 373, 320, 1155, 824, -507, -54, 1658, 1089, -397, 485, 995, 404, -300, 180, 1054, 67, 121, 871, 300, -661, -237, 1284, 891, -652, -334, 124, 110, -310, 234, 152, -584, -817, 78, 389, -372, -633, 115, -128, -1083, -1548, 322, 275, -690]
5729f90l07M11k56J65Q67J17r14p18O00J161o88l15J54M7k46K0Q93m44m69O26
5749A4K00o73m37Q23R99m93j143R2N16K14Q9L34n85r74P88Q68Po09n25N78N77
5770F60l16j46q6l94N14M10k59q61J59O76K51n70p19K66Q12J64m0l71n28l16Q76
5791A82M68n90p08O55L24k97k30Q7J10J31M52p51m01M05O56M74q04p97L14N18
5811A98P18l06l69k67J37N86J50m20o80L21O60j18o34K63K84Pk6n79j10J45Q32
5832G92L34n15j315J32Q15O37l51m84n55M92J14L81q13k67O0N53r0j96m13M35
5852b54O95l85n69o70M53L71L72r9q30j37N45N06j64j34n09J80J81N02j68n90
5872g04j0L53M67m77j28J15O21J81n46l10L16J51L04L49n94o13L36O55L51p50
$$ y = [-690, -997, -586, -842, -677, 190, 307, -607, -1325, -725, 436, -252, -567, -413, -366, -612, -592, 301, -143, -612, 14, 214, -459, -896, -73, 926, 433, -710, -618, -102, 112, 201, 535, -50, -1024, -236, 632, 639, 30, -495, 83, 660, 344, 198, 112, -282, 232, 642, 383, -478, -319, 357, 608, 38, -681, -415, 397, 561, 521, 150, -378, -694, 182, 650, 60, -648, 7, 331, 34, -196, -109, 1, 132, 584, -167, -568, -163, 493, 967, 163, -634, -320, 198, 916, 610, 241, -26, 111, 697, 847, 427, -253, 68, 728, 610, -24, 239, 523, 530, 504, -75, -185, -40, 792, 1126, 611, -704, -572, 243, 880, 529, 45, -510, -18, 96, 477, -336, -603, -543, 10, -80, -276, -689, -254, 441, 56, -513, -1183, -730, -359, 13, -86, -916, -1053, -508, -2, -166, -300, -809, -629, -448, 54, -114, -704, -714, -361, 106, -371, -499, -384, 237, 418, -128, -438, -122, 29, 333, 682, 88, -525, -189, 466, 817, 67]
5892F7q4R0J43r3M48k95o5l62M03N9O6l00L81J30k95m49o6N29L35q6l21m88J31
5915a22M91N43o50m66R5J30l17O47O6k57j83K86k31j19l60N54N02p63k36j70P55
5936A95K72j51k09k93l16M72Q25n05o74l56J034p9j35j97M00j42l02J20M7l55
5956c49J05Q22J94j262k71R70J92n23K14n4n79j45J217L75j025n27M18N90n23
5975a61l50P51l08k81K33K27m02j4K47Q98j084n61Q13N24k47o87j45K02j30P1
5995d04P35J44j250j3J071n19j31Q9Q28m17r62J11J081m19o9O26k30q28N9R27
6015D29K80q88n23P61J71m55K16M57l74o34P13O82j011k06J037J9q00m82R06L80
6035F78n20k63J23l30l08O61J131n48j548M07J183n05m27M65P6k61k26N37j88
$$ y = [67, -17, 73, 216, 123, 571, 276, 211, -151, 252, 311, 377, 77, 458, 588, 293, -156, -222, 307, 642, 556, 235, -253, -122, 369, 912, 262, -204, -109, 21, -296, 351, 417, 160, -23, 263, 32, -87, -447, 107, 609, -154, -390, -560, 195, 467, 316, 107, -186, -502, -30, 795, 290, -384, -740, 294, 215, 80, -117, 283, 141, -161, -41, 6, -349, -244, 578, 772, -490, -761, 209, 401, -122, 92, 38, -541, -686, 531, 906, -119, -646, -228, 362, -161, -511, 240, -68, -349, -116, 111, -291, -305, -58, 840, -244, -805, 8, 532, 285, -402, -547, -345, -475, -404, 331, 475, -775, -788, 283, -236, -367, -278, 550, 133, -829, -718, 363, -56, -125, 501, 271, -557, -498, 429, 709, -179, -702, 59, 230, -225, -9, 448, 74, -560, 153, 835, -176, -382, 655, 674, -126, -608, 298, 678, 158, -105, 18, -312, -620, 41, 1172, 624, -924, -517, 666, 161, -266, 199, 275, 14, -212, 325, 137]
6054A37m25L16J005p85j541Q37J475j79r35J73n2k23K3J181n08q64n25J759J47
6073A016q00n78Q78k18o87N58N16o06j74M24K11r33m81J582M86j112j024J031
6091H9J72k71J88M04p34j041R82J249r17j145P26R56r59m14Q45L59j023L23N00
6110B89m08j095P00J260p55j053O04J041l86j070L24M99n89l3J279r0j222k34
6128i39J558J33j475J52P95m8p69P30J37p06j43J182K61j315n00J224O88o95j59
6147A11Q7j26n04P90P50j161q73J202P40q72l92L11K55o3p6L56m20n26L66R20
6167H75p56o75J69J368o19q87M70L23l71n8R60n55j082J49J440m6j016K0N66m36
6187a61L0M78N13j091m43J061P7q63LR74j47j111L19R43n9p22J61J01j97m73J361
$$ y = [137, -288, 28, 1033, 248, -1293, -456, 1019, 840, -95, 78, 26, -197, -174, 1007, 499, -365, -890, 869, 1016, 216, -362, 516, 298, -389, 169, 685, 79, -95, 329, 540, -393, -874, 708, 1194, 82, -942, 89, 261, -10, 178, 582, -152, -1193, -211, 1038, 121, -1024, -298, 658, -301, -715, 130, 489, -534, -211, 289, -119, -1214, -514, 746, -9, -1062, -458, 583, 197, -873, -549, -50, -639, -672, 607, 517, -705, -939, 619, 752, -723, -571, 224, 176, -593, 137, 274, -432, -575, 607, 868, -447, -947, 277, 965, 270, 111, 198, 72, -432, 358, 1108, -53, -926, 276, 1016, 144, -248, 63, 318, 255, 179, 535, 115, -411, -45, 875, 119, -556, -387, 981, 362, -525, -55, 268, -103, -161, 799, 244, -838, -689, 751, 705, -311, -291, 275, -161, -131, 347, 860, -231, -674, 387, 464, -399, -396, 578, 431, -680, -361, 582, 523, -199, -38, 63, -134, -607, 754]
6208G54N08j495j096J264Q15n11k44L25l89o15N31J199n60j442O32Q56p62m72
6226g02J042L82r35m60O21L46q44N80J257j249j402R34J350m61j328K8P24l65
6244d82K43R70l10j628K21J122N99j349j51R50K3q19L59O72q20l84Q00P91j423
6263f16k42Q94R64j258k64Q83J6q24L23O79m24o94P26J028j160o42R86P86q90
6282B71p81P62N46r08k8P96k37j034M46J082l23j205L11J133m28p56M30M92o42
6301g3o83J417J62j074J83M38K49j076k53J217J34j200O4O59k60l33J043k9j033
6320d48p60J386P23j108k79L86N69o40J9O61p45l24M63Q24m46j181O65J268j102
6339f9o55R11L22l64m59P61l64o63N87P25n43j019J73J251m72m06L9M46n90K50
$$ y = [754, 1262, -233, -1329, -65, 750, 239, -5, 320, -69, -684, -153, 1046, 486, -956, -324, 532, -230, -702, 340, 722, -213, -673, -52, 294, -550, 30, 1287, 38, -1364, -430, 920, 459, -869, -841, -117, -482, -239, 731, 421, -1207, -986, 136, 735, -614, -765, 185, 208, -611, -252, 420, -400, -784, 16, 807, -616, -858, 36, 1000, -258, -522, 361, 377, -447, -124, 555, 131, -563, 163, 1191, 31, -611, 375, 1161, 271, -510, 252, 798, -110, -138, 658, 421, -613, -167, 915, 592, -613, -302, 831, 403, -353, 77, 569, -73, -756, 661, 823, -251, -68, 370, 619, -457, -710, 507, 641, -559, -495, 164, -96, -429, 614, 585, -448, -1208, 178, 901, -207, -486, -100, 469, -171, -152, 509, -236, -560, -97, 727, 281, -900, -235, 1033, -69, -724, 187, 509, 145, -314, 447, 83, -580, 7, 732, 189, -830, -657, 594, 122, -284, -245, 201, -389, -139]
6359a39R2L99p87k87J092K84j113M4O45N9p66N6P07m60P0N64m31l89k12M48P09
6380E85r40k78L68P37n55pJ51k42m95R64J31l98o88M59Q40j76j006J59O69l03
6400b5M61k92j22m19M20P35l36p09l0R42k0m55j08k54P6M06M80O8j170j8O05K18
6422D53n49l4M62M6o7p5K28q33L27M46M20j098m91R54K32j70k06j03P1p9K88N09
6444G31m84m02J97N30m95j50j55N18q5k71j13P6M0K38L74q22m7n8P53J06m36j55
6466a10K9K13O9l8l93J91J25M15r5p47L9N60M4p9l02m44Q4O34J78k17o49k02P99
6489A04O05l98p69m9K61M04j96k07k55j27O90J40m24m84L57O37m1n69k12J7O42
6510A26J69k53m90j30J11O05J5n17j88M08M37q2l11r9K2K52L83m53M3l95Q00j07
$$ y = [-139, -47, 352, -435, -722, 370, 654, -459, -415, 230, 289, -477, -421, 286, -174, -104, 460, 29, -360, -572, -124, 585, -355, -633, -265, 472, -83, -90, 61, -181, -676, 288, 419, 21, -667, -208, 632, 456, -550, -391, 278, -25, 436, 144, 22, -397, 23, 758, 422, -287, -317, 625, 605, 150, 42, -212, -136, 270, 750, 818, -352, -370, 235, 453, -96, -130, 332, 378, 311, 236, 464, -369, -42, 404, 824, -274, -765, 189, 421, 251, 45, -58, 13, -66, 222, 731, 247, -155, 42, 572, 77, -73, -228, 290, 205, -66, -179, -103, -63, 175, 549, -273, -320, -378, 375, 481, 45, -110, -81, 132, 201, 163, -230, -39, 86, 501, 406, -341, -302, 258, 302, 223, -79, -523, -439, 195, 373, 156, -493, -695, 104, 709, 311, -458, -507, -246, 158, -38, -245, -500, -627, 63, 203, -221, -705, -348, 289, 248, -321, -533, -516, 126, 295, 42, -448, -578, -467, 138, 153, -364, -552, -144, 293, 211, -100, -199, -177, 75, 458, 5, 48, -347, 453, 346]
6532C46J6n46J7K95L10J26n16l7rL48L94p11P4L3m9K99p6p0m8j91P9k4k92m4N65
6557B89J97m89N0l74M37J80k05l89L32j38J88J53l45K4m03N34Kqj21K23O1p8p5
6580D5j77l68M75L64m53n27M6Q44J01j95k95r3J85K70J53n87L8q6O13l96l26J52
6602b17J85M57l71l30K03J4K54J58j46o35q4O51K97l73k88j00L20r2J13n03M94
6623Gl37n3M91k67J3K3N43m34n36L33M22j30O9j70j81k9K88P3n2m97J28M14Kk93
6647a73Q2K11nq7j62k77L23K18K14j92n60J37M86R0q6r9K07k82j68Q35r2o95O6
6670iM87K53n58j8N64k84m93Q0kJ58N3K98L1o30m06O14N36j58j093M37K22m64
6692c82M11N39o82m03L59N00j19o69J2O35P7o38Q4O3KL00K83o68o01J30J275J5
$$ y = [346, 362, -184, -167, 128, 438, 564, 48, 11, 2, 350, 744, 33, 107, 140, 91, 390, 314, 244, 196, 5, 84, 60, -232, -276, 289, 486, -3, 47, -327, 110, 290, 85, -304, 28, -110, 78, 231, -114, -90, -493, 41, 43, 35, -86, 137, 198, 120, 45, -132, -500, -25, 339, -114, -641, -595, 249, 350, 155, -140, -233, -48, 222, 375, -212, -174, -260, 353, -43, -369, -217, -32, 425, 54, -276, -73, -59, 195, 353, 207, -428, -512, 139, 436, 63, -225, -325, -5, -97, 16, -487, 7, -330, -383, 108, -159, -146, -123, 420, -14, -550, -217, 205, 75, 144, -26, -207, -236, 52, 125, 73, -424, -296, 118, 120, -173, -91, 120, 115, 28, -134, -411, -88, 130, 344, 152, -408, -271, 215, 305, 219, 120, 327, 45, -123, 712, 620, -75, -9, 478, 731, 173, 155, 719, 435, -58, 22, 20, 178, 231, 529, 560, -70, -476, 138, 674, 516, -577, -140, 82, -382, 29, 568, -114, -517, -158, 342, 223, -446, -434, 201, 278, -360, -276, -213, -211, 89, 372, -296, -897, -767, 508, 523]
6714E23j076M2M05J54m70N98J22n80j39L53P01r34l13N94L37m90n16N71N40l92
6734C0j19M44n83k26L14P21n09r22N31Q65o3l68kj02k79K59M39r6p11K04N18k3
6756C22p32K49M26J14m49K07r4k48j77Q51L81j382k42P95L38k61l93K45k87J87
6776a50J54L83l82n08R05k19m26k50N59P37j010J16J19N8m67N17L40o79n14R59
6796B42N31n0p57j10J28j16M40J67l59n73p0J109l10o75J22O56j84l41J05J80
6816A35l55o2P26np63l1O80M29j261l5L93L06l03Po4j29m7O54J09o86n43N65O80
6839D00n68o2J32J66j16o3N02n43n43M99N05k16l47K78L17k83m52J61J76k99M30
6860G4L98n80k93M73L18k83m02j4R09p63l31P30N1n63J96P17m0p75J10P30j24
$$ y = [523, -553, -511, -106, 48, -422, 176, 298, -282, -421, -68, 633, -301, -614, -20, 317, -173, -689, -118, 422, 30, -89, 355, -228, -454, -140, 581, 72, -850, -319, 546, 483, 115, 113, 11, -268, -9, 430, 334, -377, -173, 345, 322, -410, -161, 265, 379, -70, 137, 43, -205, -382, 469, 850, -532, -774, 21, 359, 98, -295, -50, -337, -150, 4, 387, 5, -503, 402, 183, -243, -493, 66, 803, -207, -91, 28, 86, -381, 136, 476, -203, -717, 242, 773, 723, -34, -144, -16, -132, 308, 475, 116, -457, -527, 582, 272, -403, -281, 375, 191, -150, -45, 135, -220, -282, 444, 439, -324, -355, 325, 754, -507, -542, -149, 157, -146, -139, -203, -332, -379, 275, 384, -302, -845, -280, 400, -168, -230, -98, 68, -48, -111, 391, -152, -695, -196, 309, 93, -254, 24, 341, 58, -394, -233, -57, -356, 74, 472, -108, -401, 72, 390, 107, -295, -309, 600, -163, -494, 236, 287, -276, -80, 637, 597, -178, -68, 662, 538]
6881E38q31J46M19j68k51N71n8p77L02M79J64p26k5M97N4p08J90M44m18l61L49
6902a70M18k47m13O31K23p47j58R04l00l48j5M76l46m06N12L66m08o63Q72j03
6922G8n00K88K96q0l93j47M15J10l26N9P22l64p17N54R42n69q08L84J25j18m5
6943i4L29k1p11M65N54Mj123M50M12j58l65J06P16m17k72L63J47o08j41P80K76
6964F92r28j83O51J60l50k80L21o68K37O43K51m39p04N48O69n15p79P33rl25J05
6985a70M98o08j51L25P73p68p19M45P23j59k66J89Ll81M3M96N2q44J68Q77k97
7006B29n51j07Q37j20l41n6K43j71l56Q04p4m05l65O82L77n58j49J63N1k78P4
7027g1K00l68j93K93M00j51j173Q55M85k28k67m2J49j81M60L39n65n02K16O97
$$ y = [538, -293, -147, 272, 104, -147, 424, 366, -411, -109, 370, 534, -192, -217, 280, 334, -374, -184, 260, -158, -519, -170, 248, 1, -412, 219, 442, -305, -463, 441, 141, -207, -222, 254, -92, -498, 14, 380, -28, -691, 181, 78, -422, -134, 162, 82, -311, -458, -43, 67, -259, -200, 522, 158, -559, -5, 937, 368, -440, -56, 69, -49, -94, 235, 214, -497, -32, 522, 526, -597, -147, 265, 107, -258, -152, 564, 147, -125, 238, 385, -223, -364, 416, 692, -236, -419, 232, 392, 42, -238, 83, -585, -348, 295, 546, 107, -597, -49, 620, 105, -674, 59, 50, -275, -170, 328, -280, -431, -106, 667, -101, -820, -375, 348, 189, -77, 112, 115, -266, -223, 273, 325, -519, -351, 526, 229, -322, -429, 408, 288, -53, -109, 134, -37, -393, 411, 337, -68, -433, 249, 626, 68, -81, 82, 133, -145, -71, 129, -239, -432, -139, 261, 110, -1063, -208, 277, 49, -218, -260, -111, -292, 168, 507, -58, -560, -344, 353]
7047C53M2q18m9Q28k83J00k02K28o74L80Q00l88o98k07Q49K69m81o10M90Mj1L07
7069B29Q6p81J70L96M06m79l77O0M35J1l2j52M5l44L17O69o04k04J29M09k49l49
7091b09j00O27K5l60K65Rp45M49O88m58k97l12M77K13j16k87m6J15N5K26l52k23
7113c56R6K91L27p05q4L13M2J13k92K1j56L34R7K4k84j53M17K40m41k73L63J22
7135E6J42k36k6l80Q7M13K48k20n59K07M44j9l86pL3J31L49J26l80m75M34K99
7157B81L3l01o5Q4M71n5m05k78L20l7J28J41k45l15M72J35l61k08K66l8J85l74
7179a66P85m54j65J06kk2j0M5J91j8m36J00J54k53J57K90j77n87L47J68Q5k65
7201a27J48K22l27r9L46k69K56j76K41k52Q6P1R7m62%K54o7K25k01J69P7j67j51
$$ y = [353, 395, -423, -472, 356, 73, 173, -29, 199, -475, -95, 705, 317, -381, -588, 261, 530, 49, -561, -71, -67, -78, 229, 315, -466, -296, 100, 506, 27, -350, -290, 145, 156, 124, -28, 17, -327, -10, 659, 55, -149, -20, 389, 140, -209, -309, 318, 343, -17, 248, 257, -488, -39, 649, 191, -106, -418, 59, 272, 156, -131, -177, -62, -7, 219, -133, -356, -260, 31, 358, -347, -431, -118, -76, 37, -255, -234, -390, -56, 41, 65, -219, -372, 45, 285, -156, -429, -66, 56, 198, -38, -64, -444, -357, 56, 304, 84, -475, -268, 176, 157, -229, -236, -203, -72, 277, 403, 23, -452, -18, 281, 314, 13, -52, 32, 503, 448, 43, -235, 85, 48, 176, 317, 72, -243, 229, 364, 3, -205, 61, 23, 208, -166, 619, 165, 0, 106, 104, 82, 72, 117, 308, 290, -146, -46, 108, -145, 12, 302, 125, -462, -115, 53, 138, -127, 21, 243, -84, -183, 163, -106, 150, -26, 215, -37, 49, 120, 217, -245, -245, 9, -58, 167, -34, 135, 212, 45, -106]
7224a06OK22l6k02j6N60n26k17M77J1k33J80k02j22J79K56j86l97J70K30J81m19
7246a90J31L7Jj19J22j1R0m1K8K6r5k03J78k72J95Q7j10M09q36N41K33o92K13
7269b78K17K59k17j18n0J94j71J93Qk35J40l9L03l59j34j0N15r7r7k24M70N9m2
7292B87J05j40L0k69L36l5o43L44k3M36j85n75L72nM86k19Q1l53l43M60L37q4
7314D00m23j49M52m17K9L84n84J97L55K42o75oJ56J74K5l06k14N2N52j5J60o75
7336b86j22K77J23M71p77J00J37LJ49j17j60R2j78K51K64m12k38O09O8j42j16
7357dpj26M22k16l0q14K42R38rq9o81L1Q53j36n05j1L9J12J54om61K00O38j50
7381C84m43k08J07M08j8J25m18J21l23J32N57k32m50k32N74N6Oj23pP8k7o1Q4
$$ y = [-106, -100, 122, 86, -116, -132, 428, -98, -315, 162, 173, -60, 120, -82, -204, -25, 231, 45, -352, -182, 48, 229, -190, -59, -22, -21, -140, -18, -29, 61, 20, 48, 74, -21, -224, -46, -318, -123, -36, -146, 263, -573, -32, 201, -491, -278, -61, 198, -19, -137, -187, 7, -164, 29, 37, -198, -58, -97, 206, -153, -287, -297, 218, 121, 24, -200, 270, 329, 287, 392, 252, 282, 13, 349, 314, -329, 15, -8, 428, 243, -332, 40, 35, 521, 302, 383, 30, -313, 147, 484, 400, -23, -172, 280, -137, -108, 276, -308, -111, 244, 486, -189, -195, -39, 135, 160, -146, -360, -308, 244, 229, 389, -286, -408, -131, -8, 463, -314, -214, -77, -74, 75, -42, -202, -110, -288, -37, 227, -185, -423, 186, 254, 112, -4, -11, -137, 285, 69, 39, -775, -533, 405, 396, 307, -374, -343, 510, 374, -131, -142, -103, 9, 163, 157, -304, -104, 534, 384, -59, -267, -160, 248, 230, 355, -63, 58, -265, -133, 424, 192, -258, -490, 84, 140, 146, 23, 16, 94, 67, 6, 90]
7404I0k90Q6L92J92p27L0K40J49j14p4k17J47P3L36q1o12j17N53M97n33Nj68M24
7427B81m01J47n2j7r4K05L47m61k89L01K44J1l57J43J89k72J05n0j19L0j36O40
7449C95l11k82M5P7K37k11K51j20m8j66O09p6r07K20K44L45m12l05M64k86K0K9
7471a88N68m41l89K43R1k7m21M85K37j29Q5j49J70k90oL11k13k24K50N14m55k15
7493a93L5rK40l5J01j98J04j28L53p1k20Q3O94o12q4r9N29k58k49N6J16m90J61
7516a74M19k02k75J92j7L96l55R0K61k12l97L72j52L13m16J80J11m24L5L62J17
7537B24n72J61L54R2p11L44M24j14o78N82q7J02j47L04p5l72k05M64K22k46P8
7558A44n2o3k15O8M49n8o45R4L33Q6k47J36K60n28J31L18M7m05J80K74k77l65
$$ y = [90, -200, -114, 278, 470, -257, -227, 13, 162, 48, -26, -243, -96, -23, 313, 232, -380, -497, 56, 553, 20, 25, -143, 281, -120, 27, -25, -42, -136, 69, 416, -45, -334, -33, 211, 222, -135, 8, 197, -75, 30, -20, -139, -109, -245, 395, 84, -198, -153, -76, 161, -50, 201, 81, 33, -133, 476, 400, -507, -287, -43, 302, -110, -415, 49, -237, -217, -188, 380, -61, -450, -207, -116, -143, -564, -79, 158, 29, 114, -35, 135, -155, -161, 150, -63, -287, -37, 477, 22, -193, -158, -167, 73, 38, 139, -59, 45, -83, 270, 199, -21, 62, 756, 144, 60, -39, 490, 232, -17, 39, 155, -335, -174, 245, 43, -232, -40, -57, 339, -16, 74, 335, 123, -274, 98, -54, 259, -157, 23, 134, -290, -255, 107, 224, -348, -187, 167, 259, -452, -108, 316, 202, -476, 106, 19, 121, -26, 278, 203, -169, -374, 90, 312, 66, 144, 92, 29, -186, -118, 331, 273, -372, -278, 55, 141, -106, 30, 290, -238, -107, 211, 258, -147, 33, 307, 30, -335]
7580c35K53O89n95j92J95l13L65l21O18Jo38j55K28K29L5J55m20J90k33L79J92
7601C27k95l45L06K89j67n36O03J67m49M4J4R4l49L49N65p73m97N06L10q8p3n7
7623e5jL22N7p4j47m09N23K34j75l89K2L82K92m40k90J07j06L0M90j53l65k79
7645d24R48k1p17p9K61L13k60M12l97k25p5M37K64o50j50K24L99j50l66J11N5
7666i0R0K72rj90j77m0N51j53n37m5M98k08k50J46K13o1J33K92l35o61M34N43
7688D16k72l05M9K61Q1k84K29L6k55k20O50Q8m73k90N64j67M5l84L41r5oK77k92
7711fj32k08J55Q26m63m36p8P68k49j08Q3j70l15J73M93k64l74K89L43j80l66
7732b19j0J71p2J41J25l53j54K60K03O7k97l16N35M3k97n2M30m12R9J71M5j76
$$ y = [-335, -82, 607, 12, -180, 15, -298, 67, -254, 364, 365, -273, -428, -200, 29, 64, 219, -201, -11, -244, 135, 327, 32, -313, -7, 282, 115, -421, 182, 349, -100, -56, -42, 52, -297, 52, 617, -156, -653, -147, 163, 75, 2, -55, -56, 266, 323, 249, 102, -307, 216, 450, 275, -114, -92, 290, 582, 142, -148, -41, -147, -117, 373, 220, -145, -424, 524, 503, -214, -293, -32, 281, 21, 433, 36, -189, -264, 173, 437, -213, -363, -139, 260, 110, -256, -145, -90, 0, 272, 263, 73, -104, -144, 407, 254, -283, -328, 170, -38, -288, -142, 71, 10, 143, 435, 100, -561, -127, 416, 144, -161, -112, 149, 230, -54, 175, 211, -44, -264, 386, 474, 1, -289, 275, 108, 153, -231, 110, 15, 9, 286, -6, -138, -346, -191, 635, 172, -264, -342, 426, 177, 69, 152, -18, -333, -160, 333, 69, -305, -16, 327, 147, -219, -229, -58, -130, 11, 136, -217, -371, -111, 92, 159, -138, -454, 81, 124, -173, -225, 205, -207, -108, 63, 108, -68]
7754f8r9K87o3j88M8M98l2m13M0J42o1k27o3K91j07j13j7J29J55j65M3J09j47
7777b1j31P93n34k59K53R0k85j18O0R5J15j7J61j04j84J74kJ63m48M40j93J34
7799A82l35r2O4R8k54L25P1j04k92N56j99k53qL92k3jJl11K81rq2m7m7j13K78
7824G8J48k39K37P6k84j70K89j93oj19N02l22J90k32N6K18j69j76J05J76J15l22
7846d2L5Jo4J47p0j1K01j43L73j29k76l10K40j52k4J32J62r2k4K19j46k15p7L94
7870A29m1l74K05N78o38M16l99j9r6M26l23J48P1k00l5J91J24l36o2J46N9R6K41
7893C07k86m3J90q3K20n60K16m1L4R7k14K38k26K54R1k75r5J60K88j18J0k48K20
7916A36j2j35K0j15j73K84K33k73J60k47K76m0J06l18J58j69L95m63K29k57J59
$$ y = [-68, -167, 120, 57, -131, -83, 415, 383, -30, 10, 152, 91, -136, -199, 92, -15, -128, -145, -16, 139, -26, 17, 126, -21, -152, 641, 107, -152, 101, 191, -94, -212, -152, -57, 58, 41, 202, 98, -86, 88, 86, 249, -199, 241, 48, 182, -153, -245, -181, -83, -337, -12, 59, -45, -337, 219, 20, -233, -241, 151, 128, 127, 128, -183, 98, 89, 7, -40, -87, -200, 78, 226, -13, 224, 300, 16, -154, 135, -58, -64, -183, 319, -3, 187, -45, 11, 229, 60, -116, -11, 165, 280, -42, -7, -6, -70, 77, 7, -4, 197, 54, 427, 298, 22, -288, -48, -200, -224, -92, 70, -22, -46, 173, 27, -188, -265, 129, 88, -286, -81, 497, -141, 275, -124, -143, -239, 187, -136, 12, 83, -117, -152, 39, 163, -173, -235, -89, -30, 66, 307, 21, -22, 168, 85, 305, -255, -39, -80, -46, 51, -163, 75, -151, 103, 194, -81, -176, -16, 272, 154, 164, -84, 136, 124, -11, 9, -106, -279, 5, 238, -35, 125, -122, 154, 114, 220, -98, 60, -109, 286, -177, 52, -205, -46]
7937d6M7L11p2m88J44L31j04k32j23L00j55L00k53k69M31k2K66j55m50J81k59
7958c17K56M11j57k75R6l79N72k18P0j04J23L88m86m34L56K85j53p3M2l23L83
7979F3J30P8l24k01J3J52L50J06n84j18N75J21j98n55M14K70l45J18j60J39J93
8000B37l83J92K6k50J00J75q1p2k69K25N6J83K5M7m70K39JJ12j48n6Q6O1o5j00
8024a29k06K04L85k69J96M4m65K71J29L2l69N1j2L44k93J91J0k5J19J81j21n62
8046b94J04L82p9k15k26L07J04J67k93K39jj00M5Jo5k41K98M9q1o6J35k02j35
8069a67J66J27j43j30Q8L31j36m24L94J45j9k03J3j17j57K5M26j62j61n7J63M15
8091D17l87j23M4K46l45j83M22k69j34N81j84j72J23N2k51j55M57j19ML5O8J9
$$ y = [-46, 1, 312, 240, -248, -104, 227, 123, -109, -232, 68, -87, 213, -40, -309, 122, 100, 366, 211, -239, -58, -317, -61, 350, 193, -82, 14, -365, 207, -11, 59, -45, 78, 466, -20, -454, -98, 187, 34, -39, 3, -320, 63, 193, 271, -53, -254, -241, -89, 261, 367, -217, -335, 240, 361, 163, -392, 22, 292, -53, 65, -95, 44, 237, -146, 46, 72, -178, -78, 97, 16, -56, -325, -100, -44, 139, 164, 211, -259, -20, -19, 93, -55, -111, -25, 36, -29, -129, -335, -131, 254, -15, 181, 225, -240, 31, 160, 192, -177, -126, -138, 206, -87, 104, 114, 89, 208, 389, 268, -294, -190, 192, 113, -102, -328, -21, 83, 250, -43, 196, 195, 95, 140, 141, 76, -165, 133, 182, 101, 35, 170, -32, -167, -1, 126, -17, -147, -59, 272, 136, -288, 106, 251, 232, 29, 42, -75, -232, -207, 219, 57, -104, -161, 2, 417, 30, -93, -49, 197, -148, -331, 91, -178, -312, 269, 85, -87, 36, 88, -163, -318, 139, 20, 24, 59, 127, 146]
8113A46P5j56k94M47j70k5j38o6J16J3R6Q6k34Q5N8M9m15K32L67m02J2K27l07
8136a98J09J20j96L12m92R0M48j80k65J36M53o5k55k57J29o0j1M52r9l26J84R6
8158A25N1m18J02J24J21k59m5J93M5k54K80k03L1k37K34K49n40K67J3J84k45j7
8180a99L35k66j47L02k81P5m3K9L19r1k58
$$ y = [146, 221, 65, -229, 218, 48, 23, -115, -181, -65, -52, 44, 130, -104, -19, 39, 88, -327, -95, 272, -130, -118, 109, -198, -89, 31, -165, 147, -345, -255, 193, 13, -252, -116, 337, 272, 17, -240, -111, -171, -182, 270, 171, -155, 29, 125, 176, -242, -140, -16, 105, -154, -199, -6, 39, -215, 65, -138, -107, -344, -110, 139, -401, -134, -121, 63, -182, -199, 136, -130, -277, 25, -256, -181, -224, -195, 124, 33, -225]
8191b25
$$ Imaginary data points
##PAGE= N=2
##DATA TABLE= (X++(I..I)), XYDATA
0@%%%Qj6QqJ6j8K6l2M0n6O9p7R5j19J39j62J90k26K64l01L47m03M62n24N95o74
29c57P63q60R60j078J211j347J497j668J854k056K277k521K794l094L423l792
45a994M208m677N212n827O544p394Q414r667J1255j3342J6210k0416K7206l9955
59b4223P1882k92360n80982N98896N38568j03921j82287J00026j87707k67995
69c30103K98233M93834k12147m69055J39672L66526j63099j96819L25076K16307
79D68425m05563k84761K99983K19168j76753M1672K57884k27537m87717J66296
89a28903N69895k1051m75595o4211K45003k7522o6200K33588K4930m32745j62136
100c04947M08833J99904l13249j07750K88650l512l51037j3032K94951k1494k02543
$$ y = [0, 0, 0, 0, 8, -8, 0, -8, 8, -10, 16, -16, 24, -32, 37, -40, 55, -64, 75, -87, 103, -123, 141, -160, 187, -216, 246, -278, 317, -357, 406, -454, 506, -572, 639, -708, 789, -879, 975, -1081, 1196, -1325, 1469, -1625, 1798, -1994, 2214, -2463, 2749, -3078, 3466, -3928, 4486, -5181, 6074, -7268, 8942, -11474, 15732, -24223, 47659, -244701, -825683, -226787, 311781, 207860, 25573, 125599, -62108, -330103, -31870, 461964, 249817, -219238, -79566, 286960, 123861, -72958, 252118, 468425, 62862, -221899, 78084, 297252, 120499, 162171, 420055, 192518, -295199, -128903, 440992, 419941, -55654, -119865, 125138, 97616, 31416, 265004, 289934, -142811, -304947, 103886, 303790, -9459, -117209, 171441, 167929, -183108, -196140, 98811, 77317, -125226]
111a25226J39827J79888k54447k33154K66009K39635k52759k16257K17025J43046
121A03587k00778m7817K23302k5480k61112M7717K43618r9347k25040J79225K69606
132B07481j82760k95798J12014K14709q0430p8241J41975r247k26570M4442L14393
143A61968K841l21464o5237K26714N1388r5907R3017J00133j88202j66342J71672
154b9419J67182j26115q0731J65856M2248k10224n2039K01521N7087j50681k0117
165c5432R8020o1265r1529J38550J36261j58968j87537R5803J47111n9087o5342
176d3415P5401j803j24119K4867J52049l6554j79287J3612J62786O912j01853
187e1404K4465N9093p4409n2236J02873N2807j04994l0783J30099M3333j10928
$$ y = [-125226, 14601, 194489, -59958, -293112, -27103, 212532, -40227, -256484, -39459, 103587, -97191, -145008, 78294, 52814, -208298, -160581, 83037, -16310, -241350, -62125, 207481, 24721, -271077, -159063, 55646, -24784, -103025, 38950, 29703, -196867, -152425, 161968, 164809, -156655, -221892, 4822, 56210, -39697, 53320, 153453, -34749, -201091, -29419, 137763, 11648, -69083, 96773, 139021, -71203, -123242, 78279, 135366, -15315, -35432, 62588, 1323, -90206, 48344, 184605, 25637, -161900, -66097, 81014, 21927, -43415, 31986, 30183, -93936, -69069, 82980, 46426, -132861, -119249, 43537, 50449, -51404, -26939, 32154, -42255, -94491, 8382, 61189, -43805, -74588, 55511, 98844, -12084]
198a2084l4929Q0056j238n8566O0765R2842n9015r3319N3048P4314n0104m0688
210A1082P3018K8238q5651k6296Q5038K6831n6164N85L2130o3118p0048P2045
222B7690J03808l0646q2091m545Q35m8317J5392Q9779J103j04155l4554O4822
234h79K3096l5481k229J690n7931k4583Q0160N8201n9540o3016K1683J3833l7295
247h2291J1031O5071l14o2165q346L3855j0938j3139M9961K4421p4863n6856N9367
260f5206P9144j148k8804j4113l9272l2959N6489Q6269j1973o7956L831M2686
272F988k1888l8480L3817N1248j0888k5116R349j639j3827L6223M8324m2493q3618
285e2000J9788J02827L7763n1513m5114o979L916L0284M8232j1406o6963o095
$$ y = [-12084, -47013, 33043, 31805, -26761, 34004, 126846, 67831, -25488, 27560, 101874, 51770, 11082, 84100, 112338, 26687, 391, 85429, 112260, 56096, 56681, 88811, 25693, -44355, 27690, 131498, 100852, 18761, 14216, 15051, -33266, -17874, 71905, 73008, -31147, -65701, -879, 22217, -13264, -15493, -13803, -71734, -96317, -16157, 42044, -17496, -80512, -58829, -44996, -82291, -71260, -6189, -6503, -68668, -77014, -43159, -54097, -67236, -17275, 7146, -67717, -124573, -65206, 13938, 12790, -16014, -30127, -69399, -102358, -45869, 40400, 28427, -39529, -35698, 6988, -14900, -53380, -19563, 31685, 20797, -4319, 5030, 3391, -10436, 25787, 74111, 31618, -52000, -32212, 70615, 108378, 56865, 11751, 4772, 8688, 38972, 87204, 75798, 8835, 2740]
297B740P2048K3527o5445l8666M3394L8671j9607l4356j4669M385L9436M8851
309A00309l2404j12613m5986R3614J03431k0915r5743n0109K0367M6193L1085
320C7229k0501o4332k3937O3586N6991m6381q2933L863P4366L1964m5098n7301
332g2484p266N1533O6993L001q6430p7153M3124J15171L5870p9295p8527J5335
344g0128P4104M6404k2956o4496l2826M5213P0979J654o5285l2131M6170N0718
356D7420j8901o0202k0405M5688O2373Q996o2558o9328P699Q0653N2515m1339
368C2611p6643j4748N5392M9440j2981n3445k9066K8716M8449M789m4481l0947
380d2914K7366M9036K027n0328l6030K6672N8820J9693m2927n3733J034N6573
$$ y = [2740, 74788, 98315, 32870, -5796, 37598, 76269, 56662, 22306, 7637, 12022, 51458, 100309, 67905, -44708, -90694, 2920, 106351, 85436, -10307, -60416, -40049, 6144, 37229, 16728, -47604, -71541, -7955, 49036, 2655, -80278, -76415, -2049, 29915, -15183, -72484, -79750, -28217, 38776, 41777, -44653, -121806, -78682, 36489, 72359, -6936, -85463, -70128, 3976, 50380, 27424, -37072, -69898, -24685, 46294, 47948, -17337, -49468, -3298, 47420, 28519, -31683, -52088, -6400, 55973, 64969, 2411, -66917, -59218, 21435, 73950, 32611, -44032, -58780, -3388, 46052, 33071, -20374, -49440, -20724, 27725, 32514, -11967, -42914, -15548, 33488, 35515, -14813, -50843, -24171, 34649, 54342, 11415, -42318, -41284, 15289]
392A5289M3967k3136o0646k0883M3064N1706j486m8614l3968K0358M4163J0499
404D0313l5425l2214J3565M2856J3348l8170m3985O733N0398L1930k5959n4331
416c0941j9330L8114N0706J373m9727l8851J8688M9726J7760l1306l7358J997
428b9149L5091K5479j4571l6265j1217L2185L6486r052m2757j8170K8820L6576
440C3456J243k9993k7895L472L4898K8081j8020m6293j3231L6236L4323j2392
452B3885l5219j4152J3345K0648R962j5232k9772n289L3028K3157k6026l6371
464c8036O789L1571R979j4118j4798r246L525K3858J8229k1739l2848J0666L8282
477A2114L596k8210q828J5793P580R74O814p218k1974O089L5616N057l5199j3064
$$ y = [15289, 59256, 36120, -24526, -45409, -2345, 49361, 47875, -739, -34707, -14349, 29814, 40313, 4888, -27326, -13761, 29095, 42443, 4273, -39712, -32979, 17419, 49349, 23390, -30941, -50271, -12157, 38549, 39922, -9805, -48656, -29968, 19758, 37518, 6212, -31146, -29149, 5942, 31421, 16850, -19415, -30632, 1553, 38039, 28987, -13770, -31940, -3120, 33456, 34699, 4706, -23189, -19717, 15181, 43262, 25242, -21051, -34282, 1954, 36277, 23885, -11334, -25486, -12141, 8507, 18469, 3237, -26535, -31824, 1204, 24361, -1665, -38036, -31247, 324, 10303, -3815, -18613, -27859, -24334, -476, 17753, -3986, -36834, -26168, 12114, 15710, -12500, -21328, -5535, 2045, 3019, 9833, 2615, -19359, -13270, 22346, 27403, -7796, -20860]
491b0860K7302J3111j5747m327J0375q171j1802J5851J3847k0959j3996K4002
503H626J0832l1468j3995L2834J7668k6247j6539J4255J439j0845J7490J9651
515B3701k6544l1407K2778L3761j3493k1339J5793R839k6639n966L6710J2617
527B9811l0484r477K0030o095j8651K4923L0948k8982m2439J8386L8145q776k0398
540c059J1044n34k9225L432M1485J301m1044m255K8870j0432k8854K1897L5541
553B6167k4303m0407J3805K8817r340p681J6897j1948l6358J8501N6391p063n9378
566c5900m855M7580Q837k5819J847J0759j6926M063M1523k998o0305p198O6590
579B7198K2721n2634k3980L2481J3097j2069J1398J138m2218p050O5112K4949
$$ y = [-20860, 6442, 19553, 3806, -521, 9854, 1683, -10119, 5732, 19579, -1380, -15376, 8626, 19458, -12010, -26005, 6829, 24497, -1750, -18289, -4034, -2595, -13440, 4050, 23701, -2843, -34250, -11472, 22289, 8796, -12543, 3250, 13089, -13550, -19516, 17194, 29811, -673, -10150, 9880, 3785, -14866, 10057, 41005, 12023, -30416, -12030, 26115, 17339, -3059, 7985, 7451, -21774, -18342, 23143, 24444, -16600, -20855, 8015, -2417, -31271, -9374, 26167, 1864, -38543, -24738, 4079, -5261, -12942, 3955, -7993, -44351, -25850, 30541, 23478, -35900, -40755, 6825, 15662, -10157, -8310, 2449, -14477, -10414, 31109, 28111, -32194, -39392, 27198, 49919, -2715, -26695, 5786, 18883, 6814, 18212, 19350, -22868, -29918, 35194, 60143]
591F0143p0055m1621N6873M4711l8388l6024J2392O402J053L8182R904p5429m6529
604g8386P8637P5490n4317q1142K1033N5268J847p731L612m0795l9107O1071Q0339
617G5819m8940r8962K4620R0602m344o1813r00J9958j8417J4999N7470k3004r0846
630f3758J0500J01063kr6171o167Q0890N776n5211O786K7176l5399p811O9973
643C7645J629j06316j5149J29074M9554j09837o7372N5851L3950j4866L8041K8737
655F0941q9522o8714R8595R9227p5279r2976N4979O1099n4059k2192P7673R171
667E8943q8460m890P5040k4402o6983P2776R7957q8365j35928N3958J27415j4913
679F2148o7086J6135p981p1376M1162J42302j7788j73976l3684J35996L9871q0058
$$ y = [60143, -9912, -51533, 5340, 50051, 11663, -24361, -11969, -5567, -4514, 33668, 43572, -31857, -78386, 251, 75741, 21424, -59718, -38685, 16583, 18430, 10699, 14311, -26484, -65591, -4520, 75819, 26879, -72083, -47463, 43139, 38795, -23018, -23918, -3960, -22377, -7378, 50092, 27088, -63758, -53258, 47805, 47803, -48368, -54535, 26355, 32131, -23080, -16294, 10882, -24517, -32328, 37645, 39274, -67042, -82191, 46883, 96437, -13400, -80772, -24921, 9029, -5837, 32204, 60941, -28581, -97295, 1300, 100527, 25248, -67728, -12749, 48350, -5709, -27901, 49772, 58943, -29517, -34407, 40633, 16231, -50752, 22024, 119981, 31616, -104312, -50354, 77061, 62148, -4938, 11197, 3216, -68160, -26998, 115304, 97516, -76460, -110144, 25852, 65723, -14335]
691a4335O000N8879n7383p0309P5657O8961q5894n3982J06395M5437j25784m9746
703i6104J25898N3690j01154l6166O6996j5855n6683Q2775R2899j08411j35573
714a27688Q3993J34293n3098q9281N7476M3595q2423j5357J07713p81j22807J2660
726e1705J27884k7511j31231L8442J36159l3296j18276K4901O3903n7352k0249
737d8331J23323K8934j62232o5652J42515O9279j02997l0750Q5090k0657r3985
748g5463N5666J12069o4972j13458O2625Q7887p9925o3759J15288P0619j23509
759a6932q1249R3540N1038o9601Q814Q5938n2218j22198N9763J44072m0908j31951
771g1892K5149Q6445m3172m4649Q9407M2273j14496n4670J00638L5188r0586L900
$$ y = [-14335, -8335, 50544, -6839, -77148, -1491, 67470, -18424, -72406, 33989, 79426, -46358, -96104, 29794, 83484, -17670, -53836, 13160, -2695, -59378, 23397, 116296, 7885, -127688, -43695, 90598, 37500, -51781, 5695, 49290, -33133, -48490, 59223, 58442, -64365, -51705, 76179, 48668, -82563, -44121, 92038, 58742, -59534, -34633, 29270, -28082, -48331, 74992, 103926, -58306, -123958, 18557, 87836, -15161, -45911, 39179, 18522, -75463, -19797, 92272, 27300, -86158, -23533, 64354, -15571, -79330, 35958, 106577, -16932, -98181, -4641, 46397, -23204, -14390, 71548, 19330, -102868, -43105, 100967, 60059, -71892, -46743, 39702, -3470, -48119, 41288, 83561, -30935, -85605, 15033, 50221, -40365, -36465]
783c6465J10422j8344j25897J0879J11961j1634q1535L2597N5519o6137m2722
794f1356J02420N4129j12589o7106R3763N0379p6614j4290Q4027o092q6743J7824
806b2248P7068m1563p4972O2648Q2115o4499p6611O2560N8959o6056m3051O4643
818A8993J7052p2226Q185R1606j0315r7317R48P1232k2179n6387N1174O5973n6018
831A0721o6530M4226M0684n3046j9993O8032J2691p4815p368P3488Q39o5310R903
844b6478N1960l3499n6152M7625P1415k8337n5480J3686R188l9290J4142P8926
856D7706L552q6217j9977O8983K0778m6203p532K4261k0082j7972N1296L6459
868E5052n0770m2943L5270K0820m5558q694O5351K9767m7505l3716Q861l683n8
$$ y = [-36465, 73957, 55613, -70284, -59405, 52556, 40922, -40613, -8016, 47503, -18634, -61356, 41064, 95193, -17396, -84502, 9261, 59640, -16974, -31264, 52763, 46671, -40072, -22248, 54820, 13257, -61715, 933, 83048, 18549, -58062, 4498, 63457, -2599, -45650, 18993, 36045, -36181, -27996, 63610, 53295, -44022, -43074, 28158, 5979, -50408, 766, 66739, 10721, -55809, -11583, 29101, -23945, -43938, 24094, 36785, -38030, -45398, 28090, 28929, -36381, -26478, 25482, -8017, -64169, -16544, 54871, 26534, -28946, -15260, -6072, -45362, -31220, 47706, 51258, -34959, -54936, 14047, 34825, -11378, -18910, 5351, -14731, -32703, 18593, 55052, 4282, -38661, -3391, 17429, -28129, -36823, 28528, 58295, 10790, -22926, -14065, -17748, -17806]
881a7806M8286K6112o3750n6606M9285P2700j2982n2383j2737K117m362K9799
893G673M3736j6517n0938K905L4584j7160l6765K5424N0278p338l8505o295Q711
906b07l061J2858K0862k5648m6228J9108O6627J0047n4153l2306J1672J1871P036
919a522J9702Q84k8797p151K6271n56l7356l469M3508J5752l4722k4653J3303
932a8806J9199J1967O966k3473m6911k433O1794M2120l0538m5473j921J6955L467
945g087L359N443o627j890K0625Q017l4091k5062L0780L8657j4321l7384l150
958b2731K4986K1152Q257j5468m2858k1960M2048N7737n489n3054k3173K1993
970h560K3082L284n913j5420j3198J4359K7778m820l1444k265L0371O263l0331
$$ y = [-17806, 30480, 56592, -7158, -63764, -14479, 58221, 45239, -7144, -19881, -17764, -22126, 7673, 51409, 34892, -16046, -13141, 21443, 4283, -32482, -7058, 43220, 35882, -2623, -8918, -207, -3268, 9590, 30452, 4804, -41424, -22316, 44311, 54358, 205, -32101, -20429, -8558, -1522, 18180, 19064, -9733, -16884, 9387, 8831, -28525, -31994, 11514, 27266, -7456, -32109, -18806, 393, 12360, 19326, -4147, -51058, -53491, 8303, 50423, 19885, -25588, -27509, -10554, -7087, -3728, 1715, -4912, -6802, 13823, 21840, -12251, -37313, -6533, 32124, 17803, -19581, -22731, 2255, 23407, 31664, 16196, -26662, -48622, -6574, 51163, 45674, -7380, -30553, -8560, 14522, 17806, 11893, -3527, -16725, -2366, 25412, 20592, -10852, -13117, 17254, 23517, -6814]
983f814j9702J5656K6657J6487k453l0617l7780M696M8961K8568k7006l6512Q87
996a8972K2203J0279m098j0668j2804L97J9581J0504j8146j6128J5349K0124j1594
1009F027k7545m275J9680K0027M714j4057k5624q973K5212K8967q980l4618j2110
1022c1555K2461K4757K985j2861j6036q000P224J3655J467n989O941J4038o594
1035A2493k7723j3456J9424K9432R007j7328k5763q206J9495K7227l2k8872k1068
1048b5370J2644K5818P324j4017j3962n61P618M111p354r326M323J7924O710j7459
1062a577k1365J794K2085J3410j2017k2927o723J9683K5506K886k6108k7652J979
1075c1026K7268K0620m373j6580p591N150O576j791n407K150J2053P933q539j5759
$$ y = [-6814, -26516, -10860, 15797, 32284, 29831, -786, -38566, -33870, 15091, 43659, 16653, -19859, -18972, 3231, 13510, 9412, -1256, -14060, -13663, 5918, 16422, -1724, -17852, -2503, 17621, 6027, -21518, -25793, -6113, 13914, 18628, 4571, -21053, -30026, -4814, 24153, 15173, -19445, -31555, -9094, 15663, 18648, 5787, -10249, -18249, -11025, 2630, 4097, -1892, 5049, 19087, 12493, -15230, -28686, -9262, 20170, 29177, 11849, -13914, -22120, -2625, 24602, 24570, -4302, -25370, -12726, 13092, 20416, 6399, -7563, -8124, -506, 3605, -3749, -13075, -8752, 9172, 15882, -1577, -22942, -21148, 937, 14347, 2330, -20597, -27320, -7637, 17869, 20755, -5353, -33005, -31026, -3758, 16862, 12489, -4091, -11682, -6532, 44, -1747, -7154, -5004, 7049, 14982, 6443, -9316]
1089i316j588J7114J5061m752j9132j1449R115K0853J2667p076k0080j1144O905
1102b822J4108M993k973l117o00j244j736l06l55J03M29O73j559K62N240K138
1118A3234r519j1886m55R349O992K031j532o885j0378m443N185O782L010J068
1132B553l797j2300p235J0013J5318k033j6820r448N237Q757P275K156q297j2204
1146b0825j4J0679J435q446K621J2919J762j2842p964M955P083N508L929n623
1160d823j2017L286K1177P526j9881j5884J0606J8060M366k736l909p324k476
1173d029J2034Q373j0558q114J5396J2956j4154j7673Q218J8379K236q133p162
1186G769p638p9J9700J6569j7971k9191L713K5447L832j5050l615N323o64p84
$$ y = [-9316, -10904, 6210, 21271, 16519, -2613, -14062, -4947, 15906, 28573, 21497, 1417, -9727, -2822, 11286, 16279, 13306, 10189, 9589, 8345, 6609, 6303, 5948, 6051, 6480, 7153, 5594, 5856, 11096, 13234, 3715, -8171, -8626, 723, 7715, 9746, 8214, 1329, -9049, -13492, -8307, -1525, 1485, 2553, -1244, -13544, -20779, -10766, 4552, 2519, -14301, -23749, -18512, -9755, -2480, -324, -8621, -20825, -20839, -10160, -8725, -17171, -14550, -1631, 131, -12711, -20675, -15720, -8637, -3129, 800, -4823, -16840, -13554, 7623, 15149, -4732, -20616, -10010, 8050, 12416, 9680, 5771, -1553, -4029, 8005, 16378, 5820, -2294, 13102, 26058, 11904, -5769, 2449, 20828, 23064, 14931, 7769, 131, 52, 19752, 36321, 18350, -10841, -7128, 18319, 22151, 7101, 3486, 8809, 8145, 7361]
1200G361L397q288j4972R738K6193m163l2016q458K3627J3600j1566j1758l030
1213a0335k645Q462J9852l477l2589j0218L0132J9645j9637j9581P909J1720j283
1226b045M42j120j3199k310K5283J2953k9401k6167K1592L3787k733k3056j0350
1239a6324j251N586K2872J6002k4722l3202J1909L6481Q04k5377m475J3176R36
1252B415j826O628n617j6024R792K6587q038l4173O01L4217R583k3480j2547N156
1266f726J880R172J9163r263l7984n486M2104K0649k8477k3277J0019R603q66
1279E11R338M558k2800j3107K7475J9921k7287k2299K3695K1907j7354j5892J0491
1292h43L781p837J2437J2978k4957k4010K8968L4804k1821l7843J1140K8327l658
$$ y = [7361, 10758, 2470, -12502, -2764, 23429, 19266, -12750, -21208, 2419, 16019, 4453, -7305, -10335, -12980, -4518, 15334, 11857, -20732, -30950, -818, 18827, -810, -20391, -12482, -762, -2045, -1603, -2723, -15922, -18232, 7051, 20004, -9397, -35564, -13972, 19815, 17082, -5974, -16324, -17575, -11989, 10883, 26885, 2163, -31039, -19130, 17351, 18155, -7222, -11697, 1479, 2415, 589, 7217, 1600, -14424, -4632, 21955, 13917, -20256, -19655, 14562, 24145, 665, -11882, -6726, -4846, 4326, 23489, 14226, -23758, -29244, 12860, 33509, 5032, -18245, -8226, 1377, 511, 9849, 14407, -8393, -21500, 5975, 25896, -1391, -23690, 5, 21912, 4558, -11334, -843, 2938, -4899, 7538, 20516, -4441, -28451, 517, 35321, 13500, -24343, -13203, 15124, 11466]
1305A1466r239O713q897k0890J7923L7656j4486m6049N633M2073m43l0481K563
1318f458J7739j0564p186K1735n49l5262J808M6201K760n0312j0814M3403J2707
1331B5208k9195n036J3159j4260p044L6316J2609n1404k6681M9554L4371l7959
1343c62k8848K4827J1676k1499P640K5718k3097l3713L0542M0822l3556m3751
1355d3601L2107M2452k6839l3293K2563J5493k4673N079L8219j6878n3252J6738
1367b5885O1865r373n6348N926M2183j0208k5814K4928J6363m0761j3460N1392
1379B0808J4735n4412j2948N3999R214n0218k438M3675p663l7176K1292L4722
1391C3590l4196l4234M1238L4373m4548l1045M5035K3016m4735j2368M6698J503
$$ y = [11466, 2227, 8940, 43, -20847, -2924, 34732, 20246, -25803, -20170, 21903, 21460, -9021, -6458, 11281, 717, -6469, 15266, 14717, -20545, -18737, 27464, 30224, -20088, -30902, 12501, 25208, -3987, -9023, 4136, -10124, -17168, 19148, 31757, -19647, -46328, 3226, 37597, -362, -29210, -4383, 7293, -14206, -6566, 19152, -3945, -37658, -7116, 33706, 150, -43601, -11494, 30958, 4119, -29174, -6611, 8882, -15791, -10712, 27507, 10629, -42623, -25885, 35980, 26607, -29741, -23815, 18368, 8160, -17654, 7274, 23637, -17124, -30584, 20808, 35543, -18869, -31817, 22182, 31396, -18822, -21260, 22415, 14752, -22424, -1132, 33590, -606, -34840, 6398, 40771, -3777, -34822, 10213, 33229, -11506, -23874, 22824, 24327]
1403B4327m8524P041M7899j6612m6143K5984M5541l3077m3683L5944L7153m0013
1415d163k7511M3594J7928m8102q706N1457k29n3801O106N2340j5655m8688K5004
1428a0426M7543l3692m6115L5603L8127l7646k6730M1993J5164m8976n527N4919
1440B4237j138n9037M063N7518p515m9120J5597M0834k7540l5422L8047L2740
1452C3264m3701k8246M7211K2622m6861j1673M9061J807n3059K633N4299k313
1464B5044m2825J1359L0719k8282k7625M5534L3933m9307l8929M3501L5662l1875
1476F909j8653K8870n139l8501J8589N3150j6164n3635J1278M2341j8819l2710
1488b2484K9719L0720l3979k9479L0799J8818k9059k134L5939j3307n3474J0924
$$ y = [24327, -24197, -17156, 30743, 14131, -32012, -6028, 39513, 6436, -37247, -1303, 35850, -4163, -31674, 11920, 29848, -18254, -26960, 24497, 24268, -29533, -23427, 28913, 13258, -35430, -10426, 37117, 3425, -42690, -7087, 31040, -6606, -33336, 8657, 23821, -25155, -30682, 24237, 23099, -35938, -31875, 25643, 18128, -30992, -15395, 25439, -2101, -37523, 524, 33264, -10437, -38683, 8528, 31150, -15711, -27384, 21677, 23484, -29575, -26942, 27357, 25044, -17781, -6422, 24297, -3985, -31610, 13924, 47857, -1450, -40379, 3122, 38784, 6909, -11744, 17126, 11987, -26514, -7925, 45225, 29061, -24574, -13296, 29045, 10226, -22484, 7235, 37955, 3976, -25503, 5296, 24114, -4945, -7079, 28860, 15553, -37921, -26997]
1500b6997O1874L911m9501j0647K0817q254o638L5373J1281n1441k5327M7038
1512A489K9685l5788k3040K4722O495k5325P054K9278j2634k9568J6639K4648
1524A3655k7707k7042L3926L4698k5086l1577J2866J3491j1339P708K4158j5935
1536A816l8176J2985M4947j681l5113m39K0624o980j2364J9532J3674j9147p620
1549g942K1319j305l0115L050M0046Q491l3295j3402J6781O390j482J3371n12
1562B1395l1459j2743L6445K7769k2122k5632O126O995q513N414J8554n020j9428
1575b219L393J1066j2686j0181K1793J7038k4735k6409J2200K4990L914p096r063
1588B005j9739j0989K7006L4147j1354l7220p488K1596Q036o404p25j059q055
$$ y = [-26997, 34877, 38788, -10713, -21360, -543, -8797, -15435, 19938, 31219, -20222, -45549, 1489, 31174, -4614, -27654, -2932, 3563, -21762, -14708, 14570, 1936, -27632, -10993, 13655, -14052, -41094, -7168, 27530, 2444, -29133, -16267, -2776, -14115, -6407, 17751, 1816, -36360, -23375, 21572, 19891, -15222, -15661, 4963, -2017, -14381, 5151, 18825, -322, -7942, 13377, 12072, -18043, -14993, 25053, 33544, 249, -13153, 3628, 10018, 8536, 21907, 21395, -10064, -22807, 13638, 41407, 19285, -6347, -221, 6774, -1739, 3675, 22229, 17209, -2219, 1174, 12240, -446, -10627, 11166, 28204, 3469, -22940, -10740, 14250, 18164, 11068, 2005, -17734, -28723, -1717, 32430, 21076, -16144, -23632, -2036, 6000, -404, -1129, -2188, -10243]
1601a0243M152J4950m149j9138L368K1129k205k5112m468K1871J4960m105j0145
1614H65j3514j1211J2356K8455M149k8884j5425J8765J8460o407j3513m184J001
1627i087N934J2532M40j6901o865J7392J1354j7871j9626R045K0718P508n628
1640H945j1434j5261k023J9073J5969j1131k0418L534J6572K301r499l630K46
1653f756j495K062O057j982m426P867R048j0998j9554J594K0119J1246m844q102
1667a64n658l132P031J2200j528j3757l498J3013Q226l995l049K149k736n839
1681g37P38P109M803L678L743n877j4372l611J3800J1766m009q516k509K395L326
1696A1727M427n27r844p874M734Q969J823k040l63k046q519p011K775P450M415
$$ y = [-10243, -6091, 8859, 4710, -14428, -11060, 10069, 7864, -17248, -21716, 155, 15115, 11010, 865, -12649, -23860, -11504, 16951, 21100, -7784, -23209, -4444, 14016, 7609, -5904, -10088, -9087, -3153, 9379, 9819, -7082, -13947, 3445, 14799, -3072, -22698, -13653, 7065, 14573, 8945, -2489, -17750, -19773, -700, 15269, 4138, -16280, -12746, 3826, 6127, -3372, -7002, -6756, -8251, -6189, -132, -2114, -6540, 1327, 10375, -623, -20177, -18583, 1536, 12782, 7938, -164, -5822, -8954, -1923, 10277, 8749, -5008, -8506, 4507, 12733, 8738, 5689, 7838, 5102, -737, 1, 7110, 11913, 15591, 19334, 13457, -915, -4526, 9274, 21040, 17031, 8515, 6006, 8401, 11727, 16154, 15627, 5783, -2091, 2643, 11612, 13435, 11395, 11032, 8986, 467, -6544, -3769, 3681, 8096]
1711H096J327l398r901p572L202Q915Q05p252m737R40K567L716K502m750j0383
1726a5923n826N253R126M813j132m326p301m528L426O830J507k045n74O58m59
1741a0501n6K544J304j505k459l94J119N098P410M051o602j2264m388R055J3444
1756E856O653l954j0281n913M956J0025L633o099o525K085O914L943j052k768
1770G473j990l94q50q08qM675P524J682r305j1598j388R710R752P91q591r338
1786b663M36R750P666n597j2659n490O984R446L068l022o150m794o02J931M61
1801a235J0M321N120l162j0076n327O405R207J867n651p401l418O360J1952K804
1816A1776j1308j1440J550R878M555n16j466j976k760P02J315k303j254O195M961
$$ y = [8096, 9423, 6025, -3876, -11448, -8246, 669, 1474, -5778, -10515, -9575, -7008, -3292, -790, -5540, -15923, -21749, -16496, -7370, -2557, -3689, -8015, -15316, -19844, -16418, -9588, -8081, -10126, -10700, -10042, -10501, -10557, -8013, -6709, -8214, -10673, -11067, -9948, -4850, 2560, 6611, 9, -12255, -16643, -7588, 5856, 12509, 8555, -1726, -7639, -2683, 7342, 10975, 4876, -1649, 436, 7350, 11293, 10241, 7473, 5483, 5089, 4239, 3431, 3423, 8098, 15622, 17304, 7999, -3599, -4987, 4723, 14475, 15266, 6675, -2663, -2227, 7523, 15189, 9592, -3067, -8557, -1573, 7873, 10941, 7919, 1769, -3025, -3627, -1696, -1235, -1225, 3096, 8216, 5054, -5022, -10349, -3944, 5263, 7130, 1479, -5922, -9340, -2980, 8972, 11776, 468, -10972, -9422, 456, 5011, 4495, 3029, 1053, -1707, -1005, 310, -1993, -3247, 2948, 7909]
1831G909o205q636K553R967K402p937p831k016M368J1463P936r586j7310l330
1845a6253J3180P795n223n064J131J206j346N32j728m785K458R347j558j3937
1859a4245m030J5148J2266p489j5254o523L570J1619J3889n68j8238j2728J2831
1872i752J6973m399j4023J81J0146L639m72j980n696k612J0161R457j0646j4153
1886a3176R649K1805J516j8895j0703M242R654J1339N700j2360j8764M485K4178
1899A8670O252j8380j1591P985Q310m92K10K68n991r79Q809j557j6216k341K1626
1914A4583J1914j6239j8042K019Q960M075L260k233j3861o069J7016J3356j4848
1927C891j9320N304J4167j250n868K191l10o240K644O650p788j1261R876J6321
$$ y = [7909, 1704, -6932, -4379, 5588, 7990, 53, -7778, -9794, -5426, 6037, 13973, 4387, -12923, -16253, -3073, 4722, -501, -5565, -4434, -3228, -4574, -4042, -5770, -10555, -8097, 1250, -308, -14245, -18275, -3127, 9139, 1650, -13604, -20127, -16557, -4938, 8951, 8383, -9855, -22583, -9752, 7221, 2822, -11201, -11020, -874, 2765, 2293, 313, -5383, -7995, 2166, 11623, 977, -13176, -3527, 18278, 19794, 899, -9804, -5562, 4092, 15431, 21131, 8771, -9993, -5508, 18670, 24922, 6542, -5049, 2936, 11246, 10754, 10964, 11232, 5241, 4262, 13071, 11514, -4702, -7043, 14583, 26497, 10258, -7784, -5765, 3195, 7270, 10530, 8297, -5564, -11633, 5383, 18739, 3891, -15429, -10125, 4042, 2792, -3076, -885, -1195, -7435, -4791, 1859, -5929, -17190, -7314, 9007]
1941I007p172j7995K199J3707j16o117Q91j777p304O984J6633l909k0435r66J7848
1956A478K008j2937L23J0142j67l914N176j418j4032R11K1115O079j8778q177
1970a2191J3010N296q089J550O502p137p560J1909J0197j3025r993J3144Q539
1983A2152j4331p044J3183N854j0297j09Q608p113j1801J1752J5190j2358j7708
1996a4022J0392J5920p425q683P463n08j4783L640K1737m12k1230j281J6217l225
2010C800j3290P951J2687j0854j0247J4396Q296j8585q046K0673P486j8373m141
2023h247J5830j651j5546Q471J7671j1878j9822J2391J8246j2473j2432J5216
2035E776Q512k0085o945K1423N472j9988j2J8439p121k1084J1888K4797j1910
$$ y = [9007, 1835, -16160, -13961, -254, -370, -6487, -5596, -7373, -14677, -7693, 8940, 5031, -15404, -16370, 1478, 3486, -9451, -9128, 1014, 847, -3067, 2109, 691, -13341, -12430, 8685, 14764, -4014, -12191, 819, 6115, -1974, -424, 6078, -1059, -8619, 3290, 13487, 462, -9531, 3613, 12152, -2179, -9223, 3960, 9814, -483, -592, 8016, 903, -10898, 854, 16044, 3686, -14022, -3630, 12290, 4865, -3818, 3645, 3137, -11646, -8006, 13731, 13319, -7911, -9192, 7025, 3800, -9490, -1539, 11148, 294, -9953, 4443, 12739, -5846, -13892, 6781, 14267, -4106, -8247, 7583, 5932, -9614, -1143, 16528, 4650, -15172, -2781, 15465, 2992, -9440, 5776, 14288, -5797, -12742, 8681, 14153, -5835, -5847, 12592, 5471, -15613, -3725, 21072, 9162]
2048I162k5253Q553J7615r277n985J8072k97l1122n322L4336J2750k4998j0253
2061a2019J3287m635j3017J8866K2185k1690k9658J4766K3780j0843j1224J7614
2073G412K878k8626m818L2107Q856k5037n407J8038p483j8491J9133K5789k0113
2086D238l1184J4136K4966r497j0056J6169q22k9641R32L8014O380l3449p634
2099a7448K3312j746j7214J4628K0177k1474k3254K1320K1644k0466j4532K3506
2111H453R106k8069o718K9196N222k5660j04K2257q671k2009J7926K3899k1510
2124C318k6903K0823K5281j7815j8542J6763Q408k0354j94K6302m853l1432O602
2137a2596L3596o271l2783N110K6491o006j7000J1934Q031k2582n043L1976Q208
$$ y = [9162, -16091, -7538, 10077, 800, -5185, 12887, 12590, -18532, -23854, 10482, 23232, -1766, -12019, 1268, -3367, -16384, 2482, 24667, 2977, -26681, -11915, 11865, 1022, -10202, 7412, 10290, -18336, -23154, 8953, 17809, -7228, -12635, 5403, -2080, -20571, -1438, 24351, 4238, -26946, -12810, 12156, 2659, -7397, 8772, 7950, -21691, -20759, 17255, 23635, -9814, -17448, 5864, 4118, -13096, 1532, 21709, 235, -23019, -1699, 19945, -521, -15053, 8453, 17559, -10510, -17228, 11968, 17190, -8470, -8574, 13683, 5012, -16997, 929, 24828, 3318, -23585, -2762, 22519, 4704, -13838, 2925, 11333, -9021, -9215, 17087, 12234, -19198, -12596, 21000, 14729, -18054, -12944, 13547, 7541, -9459, 2475, 10506, -12076, -17119, 14857, 23065]
2150B3065l4944j2787L0460J1778k3336m245J8688n607j7436J2718J8297j8138
2162a487j8417K2861J8627k6161j9468K4401J9241j8554j3115J2548J336j3011
2174a1199J3125K0531k0358l1384J6842L6299o749k8341J088J2902o869J73J9089
2187A5149k189k9160j511L0067M500k5199k504K1581k748j9825N984J7301o756
2200D690j1124J1163M159k0002l679K8530R115k8575j4493J9732J3145j0226k014
2213D21N391j1656j0110J9297J7796j7341k1209J2012J6702j0484r907J1041N790
2226G743j2161k451J1741l417j2650Q684J6363j0812k0372P841K0315l165j3745
2239f086J735L825o799K309J4731k257j9278m10J9269J895j6361j933J2362K08
$$ y = [23065, -11879, -24666, 5794, 17572, -5764, -10009, 8679, 3072, -14364, -1646, 16651, -1487, -19904, 2957, 21584, -4577, -24045, 356, 19597, 1043, -12072, 476, 1812, -11199, 1926, 22457, 2099, -29285, -12443, 23856, 17107, -11234, -10146, 2756, -4113, -3940, 15149, 12960, -16200, -17711, 12356, 16856, -8343, -10847, 10734, 7986, -11839, -5855, 11446, 4690, -6434, 4729, 8888, -11114, -14793, 13737, 22852, -5723, -20216, -484, 12661, 2435, 421, 5812, -5844, -15954, 3343, 21139, 3798, -17411, -5399, 11303, 819, -9088, 1953, 7743, -4418, -6869, 4872, 1455, -11195, -2511, 13852, 3040, -17332, -9491, 10824, 7659, -6086, -4351, -526, -7325, -5016, 9715, 7458, -11820, -12230, 7039, 8934, -7427, -9360, 3002, 3210]
2253C210p666L780M066q618k676J4163M370j7433p147J5378J0009q653o262L585
2267A06k512l725R181R197j0389j1693Q012J1228n710q154N328M964o213j734
2281b114P340r06p180L545Q912n843j1702L809J2566j75p235m92M59m647J656
2296b007J0439R3j2273l875J0154M410n654j736K523l248l628N634N208n308m365
2311c633M904L013p194m091P092M077l875j773K274k847l133M527O089n142p306
2326g018L149O053j029k435J903n23n652j07O711J746l768n52L254k939m825K882
2342c150O185j510m008J026J164j774J052M523r60o953j674N725K943j633L43
2357A299R55m009m086K944M859J75j624R84j036l846o18N828K235l954l150J147
$$ y = [3210, -4456, -676, 3390, -5228, -7904, 6259, 10629, -6804, -13951, 1427, 11436, 2783, -3479, 106, -2406, -6131, 3050, 12247, 1858, -9835, -1823, 9405, 3695, -4459, 869, 5833, -380, -2114, 5226, 4320, -2860, 685, 9597, 3754, -7948, -4139, 8427, 8252, 1017, 525, 984, -3663, -2007, 8432, 8525, -3748, -7623, 2531, 6941, 1287, -449, 2074, -1174, -4802, 832, 6040, 732, -3633, 1271, 4284, -2910, -7001, 91, 4168, 293, -1480, 794, -2053, -5186, -659, 5430, 288, -7018, -3869, 2184, 1155, -1280, 623, 100, -5552, -5659, 1052, 2798, -970, -1522, 1732, -1207, -6032, -3150, 3035, 1525, -2483, -1457, -293, -2067, -1015, 3508, 2548, -4405, -6079, -354, 2589, 956, 1299, 2254, -1755, -5841, -2897, 1962, 2137, 513, 1497, 461, -3385, -4003, 1825, 4060, 106, -3044, -1897]
2373a897J239J113L058R91n552n227J872N647K116n41o06k871l162J619M168J098
2389C065l527j197K205P72q06K82J192j234k060R5M22L61K901M390j459p713m835
2406g146L605P326L803j520o214m121J203P384L551n302o764K69N691L348j534
2421C579l157j207N50J636j171k746o7N552M861l803r279l562O104P975J335o623
2437b3o658j20Q149O595l120j0670m387N241Q116J707m096l459m13J855N00l368
2453d151j463M316N933N5p959n745L402Q241K830n787o908j339O990P905L81q279
2469a578p146J749O949K639k093j488J223J248j637k879j423K595N455J814n530
2484a02n782K822Q524K547o780p785r2O558P865J642o509q044L79O815L053m155
$$ y = [-1897, -658, 455, 3513, 4504, -1048, -6275, -4403, 1244, 3360, 2819, 2213, -658, -3820, -2201, 1967, 3065, -462, -1659, 546, 1318, 512, 794, 1986, 752, -1308, -1213, -791, -430, 2471, 6861, 5402, -2311, -7146, -3541, 3785, 7588, 6068, -146, -4267, -3064, 4320, 7871, 2569, -4195, -3926, 1765, 5113, 3579, 422, -785, -235, 1401, 230, -2516, -2583, 2969, 7830, 4027, -5252, -8814, -2710, 5265, 6600, -23, -6681, -6801, 1348, 7943, 4823, -5847, -10234, -4993, 3123, 4830, 734, -2725, -3138, -1283, -783, -4151, -5614, -1298, 4635, 4690, -3269, -9014, -5612, 2629, 5459, -328, -7236, -8575, -1585, 6320, 6701, -1578, -8724, -6975, -26, 2613, 520, -968, 255, 1503, -134, -3013, -4436, -1841, 3614, 5428, -102, -5884, -3062, 5462, 8009, 1229, -6556, -6648, -90, 7775, 9417, 2908, -5136, -4757, 2058, 5111, 956]
2500I56k374L498L209k308m085j390K226L952K166m344p629O55J0614P111o898
2515E359j1548l508N966P589M315k693q099m111M946O240k330o855R45N424J066
2530B706l608j177J009K29P99O27m709l964N911J0637n29j1756p034L799O195
2545h65L867J542l449q022o78Q590N195o307o678L063L431q37Q79L398j323m718
2561b912N95J680l149j477Q094O406o493q428J347N110N57O82J515k894n523L720
2577a170R266j335r030j128N217n30k159M528L677m889m230K764J084n043J685
2592a293Q941m0r530k657O902J877l907N04Q93m975j990Q629O108q153p514L857
2608b348L180m690M57P598N74p481j420L883k163m114O858N624p735q340O777
$$ y = [956, -1418, 2080, 5289, 2981, -1104, -2494, -268, 3684, 5850, 1506, -6123, -5468, 5146, 12257, 5359, -6189, -9697, -3731, 3858, 8173, 5480, -2619, -6730, -1784, 4456, 2126, -4729, -3784, 1640, 2706, -902, -2079, -1070, -841, -42, 585, -4124, -8088, -2177, 8460, 7931, -3825, -10859, -7060, -865, 3002, 4544, 1095, -6927, -7605, 985, 6180, -127, -6805, -3742, -311, -1148, -269, 3129, 1806, -2912, -2317, -637, -3786, -5263, 2831, 9237, 2744, -5684, -4337, 773, 1330, 2012, 3527, 633, -4890, -1170, 8096, 6761, -2269, -3397, 1820, 1290, -869, 3659, 7336, 2447, -1783, 981, 2065, -2978, -1293, 7648, 7608, -1922, -4579, 2323, 4200, 293, 797, 1690, -3285, -5275, 3354, 9462, 1309, -6205, -2348, 832, -3858, -3401, 4197, 4771, -2710, -4130, -247, -2410, -6524, 334, 5958, -1777, -10117, -3340]
2623c340Q728l648o007J546k63m362M724R931k854j1992L53R040r13o274K328
2638c003O104l968l583O063K101q119j702R115J771r709l87R863R15p449P46M714
2654C472m995n159Q136P007p009n524P027K833q183k580R327J426p414P65P143
2669F272l556p759N780Q326o978r403N887P530l501j837O218l134j3331Q60J5597
2684F971M262j1103k923M455l004l230Q782N850j2001q923J0616R685p047m965
2698b575O418J16j0623J201J2088J9q925L075O373r069q730J1938J2108r614j1727
2713g927N880O546m273N58Q065o285j4163M906J7383j507j4342K108R721o326
2727C44q849Q406O940q029l944J0539j38j5342N21J7435J116j7003l125J2237
$$ y = [-3340, 5388, 1740, -4267, -2721, -2984, -7346, -2622, 7309, 4455, -7537, -7184, 1856, 943, -5331, -3003, 3101, -867, -4450, 1613, 3714, -4405, -6107, 3008, 4779, -4930, -5317, 4546, 5461, -1988, -1242, 3472, -1523, -6682, 1454, 8461, 1452, -4072, 2955, 5788, -2395, -4975, 4352, 5778, -1636, -871, 6272, 2716, -5043, 737, 9063, 2085, -7318, -1431, 6099, 2598, 761, 6979, 3845, -9486, -8626, 6971, 11233, 130, -2793, 1662, -1342, -4572, 4210, 10060, -1941, -10864, -248, 9437, 2390, -2575, 3843, 3959, -6664, -5463, 6625, 6644, -2281, 794, 7167, -1902, -10632, 1306, 13414, 3800, -7927, -2047, 4499, 226, 784, 8849, 2564, -11599, -6693, 10690, 9183, -5159, -3051, 6670, 344, -8505, -99, 6841, -1188, -5132, 5407, 5269, -10073, -9552, 7883, 8999, -8004, -11129, 1108]
2741A108R98p097N452N515j3116q398J4387J0404j2396p680J2653L983j5038l461
2755a2686J4635L147j0671J290P466p773p935J4663J2965j6162j7841J1543J6552
2768I193m287n891N317l598j2940O341J9726k378j9030J709J5518m010j2358P828
2782A140J2340q930j0705R038O443r285J08J5311k813k2183l55K2145N469j5634
2796B089l358P653m813n526J3480Q134j8125j2514J6511J3217j3354r078J0902
2809E218K392j2816J141J3688m016j3669O165J3325j0423j5166J1032J4483r967
2822A387j2527R294O310j0451k014J3425j377j7591J768J8541j366j6555K023
2835i133J3131m140j1217P871Q008j0434o086J4618O123j6812o254J5618N305
$$ y = [1108, 2106, -4991, 461, 5976, -7140, -15538, -1151, 9253, -3143, -10823, 1830, 5813, -9225, -12686, 1949, 5096, -5575, -4285, 3181, -4592, -12527, 2136, 15101, -1061, -18902, -7359, 9193, 4906, -985, 4332, 734, -12206, -5865, 13861, 11483, -7547, -5838, 9680, 5670, -6688, 1140, 13480, 4550, -6155, 2883, 9326, 41, 149, 15460, 12647, -9536, -9891, 12254, 17723, 2089, -1269, 6384, 1571, -3955, 9525, 17659, -466, -12980, 3531, 16748, 3394, -5684, 5218, 7610, -5206, -4065, 9623, 5607, -8062, -1897, 11428, 1005, -14161, -3129, 11354, 1387, -11140, -1846, 4464, -5987, -8001, 5424, 4047, -13544, -11776, 6765, 5399, -11156, -9133, 3998, -142, -11359, -3488, 4520, -5914, -12000, 2618, 8741, -8071, -14325, 1293, 6598]
2848F598j3046j329J1660k448j1213P106J1327q733j2094J0454J1951j0666r592
2861a0025J1237P353j1253m438J1409J173j1468K771J3007n512j4272O078J4827
2874A0887n187j2736M693Q548p049m035J1157K466j4198k641J3978K519j3415
2887e013j22J2393j213j1216J814R417m676o228Q126N402j1740n862J3257O817
2901A1156j1956o386R194L782p031J121P383n239r237P692J0447p087j0586O608
2915a39Q638n845n762O124K956p089o78Q668j825j0262L048J1016k784j0617J318
2930c233Q411k381n234M809K798q014k497R017J954q879k503Q439J256p913k26
2945d196O263k100n567L889M874n718n458N994M914n507l923N064J814o089J47
$$ y = [6598, -6448, -7777, 3883, 1435, -9778, -2672, 8655, -78, -12172, -1718, 10233, -433, -10025, 1212, 8565, -2688, -7126, 4283, 5456, -6012, -3241, 9766, 4254, -10018, -3940, 10887, 5700, -7036, -2343, 6205, -844, -4879, 6278, 8744, -5454, -8095, 5883, 8402, -5013, -5135, 7258, 6045, -5171, -3357, 6060, 1384, -4844, 3282, 8684, -3056, -8918, 4339, 11156, -800, -7186, 2008, 5790, -1241, -120, 7263, 2024, -7213, 479, 10926, 3839, -6747, -139, 8499, 2654, -3108, 3016, 5972, -1117, -1795, 6873, 5048, -5214, -2166, 8850, 6066, -4551, -3233, 5178, 2797, -2437, 2372, 5170, -2844, -5341, 3676, 5630, -3249, -5752, 2687, 3943, -3970, -4196, 2067, -33, -5600, -1711, 3163, -2555, -8013, -2019, 2895, -2612, -6535, -1471, 343, -5746, -5599]
2960e599O628j417o933J765O790j439n916K002L744l238j778N450K128o421k792
2975g026O316K688m297j293M549j61l841J609L808k537l242M277M110m372l951
2990c363M181L681l023k291K754P21j906J326L220l404m353M011N321k246n685
3005a056L82M026k21q07J498j219l715Q66M582j28m581P2L814m66l778J08K738
3022B115r4j128O83r48k707J530M636q16n593j970M975K523j854k095p19j74J338
3039b98L075l52m500j950M288L305l019l479J699K387N1j376j224j033J106M291
3055B971R58n155m293K480O301N24l806k411k51J910K663M85l083l467K440M072
3071B338J29m457j093K361K151m90j889j596k0L001L055j920m981j130M173L547
$$ y = [-5599, 1029, -388, -7321, -5556, 1234, -205, -6121, -4119, -375, -3613, -5391, 59, 2187, -4234, -7026, -710, 1978, -2319, -3612, 937, 776, -3065, -1456, 2352, -185, -3427, 850, 4960, 588, -3363, 818, 4499, 1476, -815, 1939, 2660, 754, 2080, 5300, 1896, -2457, 1554, 6875, 4629, -1056, -674, 3352, 3131, 2324, 3822, 2603, -1112, -246, 4336, 4208, -373, -301, 3513, 3047, -731, -623, 2115, 2021, 893, 1576, 628, -2079, -549, 4087, 3271, -2322, -4292, 683, 3206, 1352, -743, -1462, -1636, -298, 2777, 2425, -2075, -4025, 263, 3568, 549, -2930, -1231, 1156, 1207, -169, -1393, -2426, -1320, 2971, 3929, -1226, -5519, -3039, 3262, 3786, -20, -2431, -2682, -772, 1891, 2376, -707, -4174, -1734, 2338, 2467, -1990, -3083, -722, 1429, 939, -950, -2546, -2566, 435, 3490, 1570, -3411, -4541, -368, 3179]
3087C179j336l370j755R38K580K398r10l984j468K499K891p82j939PJ155P0o87
3104e14l70o58R82J863R31k770k650J351L553Q58k078k062l08J246K368P58j575
3121I25k501m2K086Q53r29J14J55J1k08n27j12N56P59O89j007k338M16L227J049
3140C176k091k790n68J674K671R99j002k743j140J738J869q28j459Q88J409p07
3156A096j333m67N91J293J159p17l217r48L566L949j099n082k421K212L019K599
3172D200p57l387k510J694L749M4l469j368K469J372r74j280Q3J01J156N58k226
3189e45l389J191N297K367m501m890j7K902K932O14j725l794j065L802L027k169
3205C7l921M03K402j70r68J312Q69j804k69M68j211j476K662M739j736n238o49
$$ y = [3179, 1843, -1527, -3282, -2344, 236, 2634, 1724, -2260, -3728, -1229, 1662, 880, -1059, -1052, 103, 173, -514, -884, -1542, -560, 1303, 2234, -536, -3186, -1835, 1718, 2576, 498, -1564, -1872, -626, 1742, 2500, 925, -1576, -1618, 468, 1321, 392, 506, 661, 672, 464, -63, -175, 381, 1140, 1829, 822, -1516, -1100, 2127, 3176, 1085, -1705, -2273, -599, 2072, 3071, 2069, -674, -1814, -76, 1793, 965, -494, 394, 1803, 1096, -237, -704, -113, 1180, 2339, 1622, -1595, -2543, 1023, 4972, 3873, -1209, -3630, -1418, 1601, 4200, 3443, 56, -2454, -760, 2989, 3033, -436, -1804, 665, 2037, 1063, -217, -134, -33, 1123, 1681, -545, -3934, -2743, 2554, 4921, 420, -4470, -4487, -1585, 1347, 1961, 236, -3558, -4623, -821, 2206, 37, -3884, -3481, -1079, -1249, -2217, -905, -36, -1840, -2109, -1641, -2852, -4328, -1666, 3073, 1337, -3901, -4550]
3222d550L027J319q2N95r78k746L2M488K254l317k563R19J33q91K968L864j793
3239B679m860j41K492n33n55L407N71m137j401L988J769k770j222K266j005k421
3255a873K030M499j399m005Q6J357j307o43M554J583n060k863L676J935k763l53
3271e46K964j192m194K056M887j404m075J234J400l141j419N875L324n226l406
3286b863K795J460l222R92M633j629m430J798M284k878m215L665M373l925m418
3301c580L676M368k576j551K144k519n287L654Q708j302q697r93N526L67l089
3316a151J783J344m975r41O704J948o932k706O318N88o774q79O970J214l918L56
3332a051M84n137k283Q829N030p552o723M593N013k895j517L256k266m779L038
$$ y = [-4550, -1523, -204, -286, 309, -669, -3415, -3383, 1105, 3359, 42, -2521, -1602, -1469, -2360, 608, 4472, 2679, -2181, -2322, 170, -363, -918, 2489, 3060, -1077, -2478, 1510, 3279, 509, -713, 1553, 548, -1873, 157, 4656, 3257, -748, -662, 695, -612, -1255, 3299, 4882, -178, -3041, 635, 2570, -193, -546, 2418, 1226, -2968, -912, 3975, 2571, -1504, -270, 1130, -2011, -3430, 2445, 5769, 543, -2863, -68, 1392, -1830, -838, 3795, 2166, -2264, -466, 3818, 940, -3275, 390, 4763, 838, -3580, 96, 4464, 1888, 337, 2481, -38, -5325, -1671, 7037, 5735, -2962, -3955, 1571, 1938, -1151, 632, 1976, -2999, -3940, 2764, 4712, -2220, -4926, 1392, 1980, -4794, -5673, 1297, 2511, -1407, -1051, -567, -5704, -7987, 842, 5872, -1680, -8403, -3810, 1203, -1692, -3209, 47, -2219, -6998, -3960]
3347c960P614k575p368L168N320l853n472N112N169l352k094L626l43n831J617
3362c222Q365r96q417Q53P308J02m551K256K427n762k743P275M824n364l038M887
3378D204R9o818Q25Q392K1o777O45M314l155l579O128M127q111n367O324N361
3394F633m686j698M205j954p581K227Q439j570o923K442N298n288n293N629M973
3409D853o133l830N336K050n342J025P046l899j0508K126J0779M12o311Q95K279
3424G78n716k343Q776M575q854m578Q053K768p137o50P273p02p901K230O315k424
3440D63m495O467M483r757o881Q887P969n711m719M031P36n468L373P300m682
3455A996j0353M459J0862k384q741K542M869n135l025O922K490q260n28Q957j31
$$ y = [-3960, 3654, 1079, -6289, -3121, 2199, -1654, -7126, -2014, 3155, -197, -2291, 1335, 992, -4839, -3222, 5143, 4147, -4270, -3417, 3891, 3993, -558, 1698, 4125, -1637, -4380, 2895, 7719, 2355, -683, 4204, 4303, -2515, -1690, 6702, 6723, -54, 591, 4905, 1750, -1829, 4299, 8426, 315, -5052, 1272, 6633, 1947, 249, 4454, 2500, -5081, -2854, 5585, 4015, -2908, -466, 4832, -456, -5749, -120, 4853, -1280, -5110, 226, 2276, -3066, -2041, 5005, 1106, -9402, -7276, 3503, 3915, -2396, -1501, 778, -4938, -7281, 1495, 6070, -2784, -7362, 691, 3459, -3678, -4328, 2945, 2243, -5658, -3428, 2887, 463, -4032, 2435, 6918, -2839, -9720, -833, 7136, 1425, -3294, 737, 1473, -3995, -622, 6678, 1996, -8357, -3898, 6964, 4580, -4161, -1619, 3250, -1885, -4910, 2012, 4502, -3758, -4286, 4671, 4540]
3470D540j0878L19R755m73p996J975O540m401m899O304L968q439l781R487L530
3485E551r377k218R662J266q396q81O801k549m665O848O802q557q438O991P843
3500F683n765m236O845J655q306K49R868n40r981Q10Q385k615o206N822P006p374
3516B300q619O361P038n000l235O354rr617O21J1576m05j0991n73Q191j818n770
3532c596N201N615p619p117O783N799o609l698P973J368r092j559Q925j65p930
3547e721J719P555l977p623N069P543n674o550N240M138o207j745Q668J383r539
3562e721j302Q258L71p036K390P322l971o694M153O303m076n009O256K702p875
3577c929k025J0433L501q613m167N099M45k831N423N450p200r371N424R336k551
$$ y = [4540, -6338, -6019, 3736, 3263, -4733, -2758, 3782, -619, -5518, 786, 4754, -3685, -7466, 2021, 5551, -3826, -6044, 3618, 4884, -3512, -4393, 2408, -141, -4806, 2042, 8844, 287, -8151, -1160, 6683, 918, -3318, 3527, 5182, -3124, -2875, 6993, 6453, -3528, -2718, 5667, 3052, -3154, 2668, 9674, 2300, -6319, 42, 7080, 2080, -1155, 5199, 5190, -4427, -3806, 7770, 7365, -3626, -4199, 3992, 2174, -3596, 1605, 7220, -399, -7516, -733, 5066, -1543, -5241, 2732, 4100, -4992, -6551, 2374, 2209, -5721, -4002, 3553, -424, -8047, -2978, 4565, -1109, -7659, -2419, 1719, -4488, -6233, 2435, 3818, -5721, -7023, 1235, 1606, -5430, -3040, 4282, 311, -6383, -2230, 4073, -3, -5012, 1244, 3946, -3929, -5954, 4479, 7980, -633, -4800, 299, 744, -2087, 3336, 8786, 1586, -7785, -2361, 6975, 4424]
3592D424n464K175J903m919k51P893P73q197j698O596p50n203K979O676l882p960
3608d905K040O398j732k657L498n97o812j29R234K343q118m173N153J287k435
3623a605K431L205m688n242L999N347l622l492L882K470m874k112N131J538m126
3638a758m92L950j530l904L240M849l111n017K158M127k414k165L346J431l902
3653a192r06L986J1l961M47M763p85m668J197L517r59k591J103J386k480q42L999
3670B025J448m184k225L161R85k240N41K458j686k813J333K769j667k087K042
3685a40J745k866j511K577J782k372o71J386p13j673J539K997j310l524P75K333
3701C54J57j323M02J50j431N06K807O4l069p86K588R95j668n35J340J3l25P43
$$ y = [4424, -1040, 1135, 3038, -1881, -2132, 5761, 6534, -1663, -3361, 3235, 2485, -2718, 261, 6937, 3055, -4905, -2865, 3533, 1801, -856, 2642, 2045, -4767, -4896, 4338, 6681, -1437, -5610, -457, 830, -1605, 826, 4031, -657, -5899, -1900, 3447, -175, -3667, 215, 2685, -2189, -4301, 830, 2368, -1758, -2250, 1700, 170, -3734, -494, 4355, 1244, -3773, -1615, 2512, 98, -2067, 1279, 2710, -1192, -2098, 1888, 1899, -2062, -1615, 3148, 2363, -2305, -1108, 2409, 1450, -1141, -38, 1348, -1132, -1974, 2025, 3473, -711, -2936, 225, 1210, -1030, -489, 1969, 283, -2530, -1197, 1572, -95, -2182, -140, 1605, -1261, -2772, -195, 1587, -785, -1456, -70, -783, -2456, -917, 2080, 770, -2754, -1979, 354, 511, -812, -410, -260, -1691, -1185, 1622, 1686, -1383, -2169, 419, 1414, -254, -789, 551, 564, 239, 982]
3719I82J30k176n85K904J740k449j871J097J563k91j20j82j086l45J727J477k081
3736D34k514J405K239m78j526n76P84M58O05R6j795j825J909K374l08k558o64
3753a940J611N72m37O6q16j002Q69J993l17k418r3J358P66q97o63O76K65L94n8
3772g1p21q26L83J414L89j587m49J174P82j19r03K31Q0j49O83N27q99m22J055
3791E72P90q55q82L86J291n0l09j26n59J66Q06N79p63q43O79J239o78o65l9L75
3811A114l1p3J55n14l26N20N69k0j423p3O23J23N0O7m18q83j22Q32M05j136o22
3832a183L79R80m52o34J02r1k89Q25K55j146j374J307J353j71j317p48N50Q24
3850h30L29M29j248j582R00K296L66k083o79L99J258K85K91p39j220O72J760M13
$$ y = [982, 1112, -1064, -1649, 1255, 2995, 546, -1325, -228, 1335, 1044, 924, 742, -344, -689, 1038, 2515, 434, -2080, -675, 1564, 1086, -440, -1016, -232, 226, 831, 927, -868, -2693, -784, 1590, 1282, -1276, -1940, -329, 243, -194, -128, -944, -1946, -1077, 916, 599, -1819, -1912, -554, 212, -685, -1348, -672, -407, -13, -71, -792, -1618, -1235, 179, 568, -1019, -1468, -294, 488, 369, -534, -303, -223, -372, 311, 838, -61, -483, 572, 1362, 507, -375, 11, 1302, 1252, 943, 817, 258, 424, 1230, 1809, 1046, 203, 882, 2121, 1443, 778, 739, 1114, 1083, 1010, 1165, 651, 325, 845, 1414, 1394, -29, -102, 521, 644, 694, 761, 343, -540, -662, 170, 575, -561, -1183, -804, 176, -276, -910, -808, -899, -1188, -363, -108, -1254, -2628, -1321, 32, -139, -1456, -2204, -1654, -830, -501, -72, -1320, -2902, -2002, 294, 660, -1423, -2102, -1703, -445, -160, 131, -608, -1828, -1156, 604, 1017]
3868A017k138m89J987J410j079j544L80M23J024J092j19k198j032K512K119j302
3884B063k494O62J384j99L36N96n56j255P28J887j286j963Q87K068n44k087K91
3901E18J340n16j24L16l03j522J51K738k22l048l44K232p8j624K06J638q32j549
3919a023R10R18j656m70K479L76l387p21K895J298k119o77R31o45r57J514K342
3936B008k132k849K140K164k157j784K198J802j950j070J831m9k081J344K448
3951A863j845l267J530L919n00k663L11Q32k109K5L815M62l573j472L276N96k217
3968a017j47K801j549l062J819L013j662k514K359J649l288j721L469K183k658
3983c25j483K245p89l076K120M430j665m750Q27M193n88k164J370R91l572p30
$$ y = [1017, -1121, -1610, 377, 1787, 708, -836, -456, -33, 991, 2083, 1964, -234, -1266, 1246, 3365, 2063, -431, 231, 1615, 1416, 1752, 2348, 1792, 537, 1265, 3152, 1866, -97, 790, 2858, 2314, 227, 518, 1858, 1342, 1218, 1534, 1231, -291, -140, 2598, 2376, -672, -1016, 1216, 1138, -486, -280, 1358, 526, -1023, -113, 805, -851, -1321, 1158, 1534, -1853, -2574, 321, 1619, -500, -1177, -246, -891, -1848, -334, 2008, -124, -2973, -833, 1331, -826, -2610, -412, 1390, -560, -1630, 201, 152, -1929, -585, 1863, 18, -3249, -1719, 2200, 1700, -963, -652, 180, -1929, -1904, 1911, 2373, -1200, -2672, 604, 1200, -1017, -1164, 1637, 88, -2974, -1155, 1858, 196, -2318, 41, 1690, -1598, -3319, 150, 2333, -325, -1808, 437, -352, -3428, -1308, 3122, 1457, -3293, -2466, 1727, 1139, -1025, 345, 1336, -2236, -2966]
3999b966M992J691m474j281L474K91l726P68M011p51k877J744J980k851k353M647
4015B319K328m148l375L589K684k162q88K587j703m250K395N152j218m670J347
4030a3K733k554k478L879K948m000k998L340Q09k759Q15L720j976n650J117N625
4046B558j30l434K41J450l391j547M986K637m497k723L310O69l137J423L916j868
4062D63n420Q63M895K02k619J243O97m440j182O415L075m827l209K848J376k277
4078a897J705K956k976m204L135N009k030l450J714J534l043r01M646J181m435
4093a056o01M185o05l999J195M487k080l626K279L578l003k465L200J306m104
4108a309j107N089R09m935m12M511p52l755J375L096k771k506M061L107m923m125
$$ y = [-2966, 2026, 3717, -757, -2038, 1436, 1727, -1999, -1231, 2780, 2029, -848, 896, 2876, 25, -2328, 2319, 4647, 499, -2876, 713, 3397, 1235, 347, 2934, 1231, -3019, -624, 4528, 3310, -1360, -13, 2720, 166, -2312, 1567, 4515, 515, -2483, 857, 1666, -1093, -278, 3442, 1466, -4184, -3067, 2558, 2428, -1006, -765, 685, -2706, -4253, 733, 3370, -1127, -3850, -540, 129, -3008, -1585, 2331, 463, -4957, -4094, 801, 1003, -1616, -373, 324, -4116, -5298, 1117, 4192, -635, -3844, -996, 380, -1897, -192, 2764, -212, -4416, -1281, 3728, 1698, -1752, -38, 1496, -1547, -2448, 2198, 3379, -1056, -1657, 2528, 1923, -2076, -881, 3606, 1526, -2100, 179, 3757, 754, -1711, 1489, 2795, -1309, -2416, 2673, 3582, -1353, -1765, 2746, 1994, -1761, -386, 2710, -61, -2567, 1494, 4601, -322, -4447]
4124d447L835L171k936q73K979j160l814J857N236k270n896J856N022j505k967
4139a912K692J246m102j415M975J263m872k04M973l45n205R98M780j766l966K091
4155g69L266k838j819M290R08n512j331O083J421n300n53M585j48l935J067L410
$$ y = [-4447, -612, 2559, -377, -1250, 1729, 569, -3245, -1388, 3848, 1578, -4318, -2462, 2560, 1055, -1912, 780, 2026, -2076, -3491, 1484, 2747, -2125, -2329, 2644, 2299, -2906, -1908, 2872, 1106, -2860, -769, 2497, -341, -2160, 2130, 3038, -2474, -3805, 2278, 3699, -1601, -2154, 2431, 2283, -1652, -585, 2825]
$$ [...]
8191F1
##END NTUPLES=NMR FID
##END=
