##TITLE=1H_LR-685B-CM2
 CDCl3, 8 sc, 
 18.12.2019
##JCAMPDX= 6.0         $$ Bruker NMR JCAMP-DX V2.0
##DATA TYPE= NMR FID
##DATA CLASS= NTUPLES
##ORIGIN= UXNMR, Bruker Analytische Messtechnik GmbH
##OWNER= root
$$ XWIN-NMR		Version 3.5
$$ Wed Dec 18 14:03:35 2019 Russian Standard Time (UT+4h)  she@DPX200
##.OBSERVE FREQUENCY= 200.1315
##.OBSERVE NUCLEUS= ^1H
##.DELAY= (6, 6)
##.ACQUISITION MODE= SIMULTANEOUS
##.ACQUISITION SCHEME= undefined
##.AVERAGES= 8
##.DIGITISER RES= 18
##SPECTROMETER/DATA SYSTEM= spect
##.PULSE SEQUENCE= zg30
##.SOLVENT NAME= D2O
##.SHIFT REFERENCE= (INTERNAL, D2O, 0, 15.7039)
##AUDIT TRAIL= $$ (NUMBER, WHEN, WHO, WHERE, WHAT)
$$ ##TITLE= Audit trail, XWIN-NMR		Version 3.5
$$ ##JCAMPDX= 5.01
$$ ##ORIGIN= Bruker BioSpin GmbH
$$ ##OWNER= she
$$ F:/spectra/data/she/nmr/H-F/1/audita.txt
$$ ##AUDIT TRAIL=  $$ (NUMBER, WHEN, WHO, WHERE, WHAT)
(   1,<2019-12-18 14:02:30.45 +0400>,<she>,<DPX200>,
      <created by zg, POWCHK disabled, PULCHK disabled
       configuration hash MD5:
       00 E9 B6 7A A2 85 ED C7 34 08 36 98 17 FE 4E 26
       data hash MD5: 16K
       26 EA 10 9D 3D D5 CA 19 CB 30 FF B8 7A AF 6B 84>)
$$ ##END=
$$ 
$$ hash MD5
$$ 91 B6 0E 1A 3F 06 94 16 DC D1 85 D2 FA 47 45 2F
##$RELAX= 
##$RELAX= 
##$RELAX= 
##$RELAX= 
##$RELAX= 
##$RELAX= 
$$ Bruker specific parameters
$$ --------------------------
##$DU= <F:/spectra>
##$EXPNO= 1
##$NAME= <H-F>
##$PROCNO= 1
##$TYPE= <nmr>
##$USER= <she>
##$AMP= (0..31)
100 100 100 100 100 100 100 100 100 100 100 100 100 100 100 100 100 100 
100 100 100 100 100 100 100 100 100 100 100 100 100 100 
##$AQSEQ= 0
##$AQ_mod= 1
##$AUNM= <au_zg>
##$AUTOPOS= <>
##$BF1= 200.13
##$BF2= 200.13
##$BF3= 200.13
##$BF4= 200.13
##$BF5= 200.13
##$BF6= 200.13
##$BF7= 200.13
##$BF8= 200.13
##$BYTORDA= 1
##$CFDGTYP= 0
##$CFRGTYP= 5
##$CHEMSTR= <none>
##$CNST= (0..31)
1 1 145 1 1 1 1 1 1 1 1 1 1 1 1 1 1 1 1 1 1 1 1 1 1 1 1 1 1 1 1 1 
##$CPDPRG= <>
##$CPDPRG1= <>
##$CPDPRG2= <>
##$CPDPRG3= <>
##$CPDPRG4= <mlev>
##$CPDPRG5= <mlev>
##$CPDPRG6= <mlev>
##$CPDPRG7= <mlev>
##$CPDPRG8= <mlev>
##$CPDPRGB= <>
##$CPDPRGT= <>
##$D= (0..31)
0 1.2 0 0 0 0 0 0 0 0.06 0 0.03 0 0 0 0 0.0002 0 0 0 0 0 0 0 0 0 0 0 0 
0 0 0 
##$DATE= 1576663349
##$DBL= (0..7)
120 120 120 120 120 120 120 120 
##$DBP= (0..7)
150 150 150 150 150 150 150 150 
##$DBP07= 0
##$DBPNAM0= <>
##$DBPNAM1= <>
##$DBPNAM2= <>
##$DBPNAM3= <>
##$DBPNAM4= <>
##$DBPNAM5= <>
##$DBPNAM6= <>
##$DBPNAM7= <>
##$DBPOAL= (0..7)
0.5 0.5 0.5 0.5 0.5 0.5 0.5 0.5 
##$DBPOFFS= (0..7)
0 0 0 0 0 0 0 0 
##$DE= 6
##$DECBNUC= <off>
##$DECIM= 24
##$DECNUC= <off>
##$DECSTAT= 4
##$DIGMOD= 1
##$DIGTYP= 9
##$DL= (0..7)
0 120 120 120 120 120 120 120 
##$DP= (0..7)
150 150 150 150 150 150 150 150 
##$DP07= 0
##$DPNAME0= <>
##$DPNAME1= <>
##$DPNAME2= <>
##$DPNAME3= <>
##$DPNAME4= <>
##$DPNAME5= <>
##$DPNAME6= <>
##$DPNAME7= <>
##$DPOAL= (0..7)
0.5 0.5 0.5 0.5 0.5 0.5 0.5 0.5 
##$DPOFFS= (0..7)
0 0 0 0 0 0 0 0 
##$DQDMODE= 0
##$DR= 18
##$DS= 0
##$DSLIST= <SSSSSSSSSSSSSSS>
$$ [...]
##$SUBNAM2= <"">
##$SUBNAM3= <"">
##$SUBNAM4= <"">
##$SUBNAM5= <"">
##$SUBNAM6= <"">
##$SUBNAM7= <"">
##$SUBNAM8= <"">
##$SUBNAM9= <"">
##$SW= 24.9337058887773
##$SWIBOX= (0..15)
0 0 2 0 0 0 0 0 0 0 0 0 0 0 0 0 
##$SW_h= 4990.01996007984
##$TD= 16384
##$TD0= 1
##$TE= 0
##$TE2= 300
##$TE3= 300
##$TEG= 300
##$TL= (0..7)
0 120 120 120 120 120 120 120 
##$TP= (0..7)
150 150 150 150 150 150 150 150 
##$TP07= 0
##$TPNAME0= <>
##$TPNAME1= <>
##$TPNAME2= <>
##$TPNAME3= <>
##$TPNAME4= <>
##$TPNAME5= <>
##$TPNAME6= <>
##$TPNAME7= <>
##$TPOAL= (0..7)
0.5 0.5 0.5 0.5 0.5 0.5 0.5 0.5 
##$TPOFFS= (0..7)
0 0 0 0 0 0 0 0 
##$TUNHIN= 0
##$TUNHOUT= 0
##$TUNXOUT= 0
##$USERA1= <user>
##$USERA2= <user>
##$USERA3= <user>
##$USERA4= <user>
##$USERA5= <user>
##$V9= 5
##$VALIST= <valist>
##$VCLIST= <CCCCCCCCCCCCCCC>
##$VD= 0
##$VDLIST= <DDDDDDDDDDDDDDD>
##$VPLIST= <PPPPPPPPPPPPPPP>
##$VTLIST= <TTTTTTTTTTTTTTT>
##$WBST= 1024
##$WBSW= 4
##$XGAIN= (0..3)
0 0 0 0 
##$XL= 0
##$YL= 0
##$YMAX_a= 247208
##$YMIN_a= -108577
##$ZGOPTNS= <>
##$ZL1= 120
##$ZL2= 120
##$ZL3= 120
##$ZL4= 120
##$ABSF1= 10
##$ABSF2= 0
##$ABSG= 5
##$ABSL= 3
##$ALPHA= 0
##$AQORDER= 0
##$ASSFAC= 0
##$ASSFACI= 0
##$ASSFACX= 0
##$ASSWID= 0
##$AUNMP= <proc_1d>
##$AZFE= 0.1
##$AZFW= 0.1
##$BCFW= 1
##$BC_mod= 2
##$BYTORDP= 1
##$COROFFS= 0
##$CY= 11.3945322036743
##$DATMOD= 1
##$DC= 2
##$DFILT= <>
##$DTYPP= 0
##$F1P= 16.9975609425685
##$F2P= -3.02152046262296
##$FCOR= 0.5
##$FTSIZE= 0
##$FT_mod= 4
##$GAMMA= 1
##$GB= 0.15
##$INTBC= 1
##$INTSCL= 1
##$ISEN= 128
##$LB= 0.24
##$LEV0= 0
##$LPBIN= 0
##$MAXI= 10000
##$MC2= 0
##$MEAN= 0
##$ME_mod= 0
##$MI= 1.114404
##$NCOEF= 0
##$NC_proc= 0
##$NLEV= 6
##$NOISF1= 3.799351
##$NOISF2= 2.8
##$NSP= 1
##$NTH_PI= 0
##$NZP= 0
##$OFFSET= 15.70392
##$PC= 1
##$PHC0= -9785.165
##$PHC1= 12.40081
##$PH_mod= 1
##$PKNL= yes
##$PPARMOD= 0
##$PSCAL= 0
##$PSIGN= 0
##$REVERSE= no
##$SF= 200.130013532006
##$SI= 16384
##$SIGF1= 3
##$SIGF2= 2
##$SINO= 400
##$SIOLD= 16384
##$SREGLST= <1H.CDCl3>
##$SSB= 0
##$STSI= 0
##$STSR= 0
##$SW_p= 3612.71676300578
##$SYMM= 0
##$S_DEV= 0
##$TDeff= 0
##$TDoff= 0
##$TI= <>
##$TILT= no
##$TM1= 0
##$TM2= 0
##$TOPLEV= 0
##$USERP1= <user>
##$USERP2= <user>
##$USERP3= <user>
##$USERP4= <user>
##$USERP5= <user>
##$WDW= 1
##$XDIM= 8192
##$YMAX_p= 0
##$YMIN_p= 0
$$ End of Bruker specific parameters
$$ ---------------------------------
##NTUPLES= NMR FID
##VAR_NAME=  TIME,          FID/REAL,        FID/IMAG
##SYMBOL=    X,             R,               I
##VAR_TYPE=  INDEPENDENT,   DEPENDENT,       DEPENDENT
##VAR_FORM=  AFFN,          ASDF,            ASDF
##VAR_DIM=   8192,          8192,            8192
##UNITS=     SECONDS,       ARBITRARY UNITS, ARBITRARY UNITS
##FACTOR=    0.0002004,     1,               1
##FIRST=     0,             0,               0
##LAST=      1.6414764,     0,               0
##MIN=       0,             -108577,         0
##MAX=       1.6414764,     247208,          0
$$ Real data points
##PAGE= N=1
##DATA TABLE= (X++(R..R)), XYDATA
$$ [...]
2057a180n94K43K27M81J192Qj60j43l9r51r23K99J52N39N97K80J15K1k92q1q11
$$ -1180 -1774 -1531 -1304 -823 369 377 217 74 35 -916 -1839 -1540 -1388 -849 -252 28 143 164 -128 -209 -1020
2078a020k37m69O09L35N37M13M52L2k80j069m30k23l37O53N07O00O11j9m99k19
$$ -1020 -1257 -1726 -1117 -782 -245 168 620 652 372 -697 -1127 -1350 -1687 -1034 -527 73 684 665 166 -53
2098e3o14k88n25p2P62N04R66P9m02M51q22p84n03K51J78O87M74P68K03l63l24
$$ -53 -667 -955 -1480 -1552 -790 -286 680 759 357 808 -14 -798 -1301 -1050 -872 -185 289 1057 1260 897 573
2119E73m86o52n33K73M28N33R15N99N4m43p57j43l83n56K95N64M66P76K50o1j48
$$ 573 87 -565 -1098 -825 -397 136 1051 1650 1704 1261 504 361 -22 -578 -283 281 747 1523 1773 1712 1564
2140A564l50j032k45j22K38R16L29P18K05P4n15q46l42p01K44P26K77J051j7J95
$$ 1564 1214 182 -63 -185 53 969 1298 2016 2221 2295 1780 934 592 -109 135 861 1138 2189 2172 2367
2160B367J01o80o05n06j10J09N8P18P02M20k89j36n15m53p09Q3PO04K71Q26J91
$$ 2367 2468 1788 1183 677 567 676 734 1452 2154 2574 2285 2149 1634 1181 472 555 562 1166 1437 2263 2454
2181B454J57o88n97k95o21j71M85L17N95N70L43p90k48m63m88l87K05J04M42Q04
$$ 2454 2611 1923 1326 1031 410 239 724 1041 1636 2206 2549 1759 1511 1048 560 173 378 482 924 1728
2201A728P8j13j57m08p17j84j89m4J50L76M47L44K97n98n21m63k19j28J71K21
$$ 1728 1806 1693 1536 1128 411 227 38 -6 144 520 967 1311 1608 1010 489 26 -193 -321 -150 71
2221G1L33M22Ol7m01k05p76j8N8J51J24M99N53j80q0l29o98j40j31j12L47K49
$$ 71 404 826 832 795 394 189 -587 -605 -547 -396 -272 227 780 600 520 191 -507 -647 -778 -890 -543 -294
2243b94M16P7K00m92k57l83o61M33K90J32L5N33j51k40L9m52Jj03Q7J59J91K69
$$ -294 122 199 399 -93 -350 -733 -1394 -961 -671 -539 -504 29 -122 -362 -323 -775 -774 -877 -790 -631 -440 -171
2265a71K54l82J3K0n55M9m12L69L27L76J48j34l74Ok89r7q1N76k43K9K98J93l13
$$ -171 83 -299 -286 -266 -821 -772 -1184 -815 -488 -112 36 -98 -472 -466 -755 -852 -933 -357 -600 -571 -273 -80 -393
2288c93k15M2k68O0Q2o6N37k27O9J75m24Jl02p0J3J58J66K72M97m31j58ko7l10
$$ -393 -608 -566 -834 -774 -692 -758 -221 -448 -379 -204 -628 -627 -929 -999 -986 -828 -662 -390 107 -324 -482 -484 -551 -861
2312h61l9k80M17J80k05K82o5K55o21K18m87l13O58oL37L53k04j86m78J49n22
$$ -861 -900 -1180 -763 -583 -788 -506 -571 -316 -937 -719 -1206 -1519 -861 -867 -530 -177 -381 -567 -1045 -896 -1418
2333a418o5q9L69L56K43L49l13Lj87p19l31M63K2J71N22j48J79N0l85m03n6m8
$$ -1418 -1483 -1572 -1203 -847 -604 -255 -568 -565 -752 -1471 -1802 -1339 -1317 -1146 -624 -772 -593 -543 -928 -1331 -1387 -1435
2355a435J0K83N1N86J01K92k50N5q26j75k66K58L39O56J88K83j34l76q1n71j62
$$ -1435 -1425 -1142 -1091 -505 -404 -112 -362 -307 -1133 -1308 -1574 -1316 -977 -321 -133 150 16 -360 -441 -1012 -1174
2376a174o5J63O49J89J17M22j93l73k98m68j55N63o8O46K18N03Q7j06n92k38m29
$$ -1174 -1239 -1076 -427 -238 -121 301 108 -265 -563 -1031 -1186 -623 -691 -45 173 676 763 657 65 -173 -602
2397f02KJ39K66O49J58M36r2j39k65n07l03L41R3R4O43N64m5k28l53j82o97k4
$$ -602 -600 -461 -195 454 612 1048 956 817 552 45 -258 83 176 270 913 1477 1432 1204 851 669 -28 -52
2419e2K86J32O04M58K47L46n00m68l94l37j73K53L98K82M25N31R8m91k04p33m90
$$ -52 234 366 970 1428 1675 2021 1521 1053 659 322 149 402 800 1082 1507 2038 2136 1645 1441 708 218
2440B18l26O95K49N68L2O30pn55l35o17m81P4PR26J60L63K42j73k74p48l26m37
$$ 218 -108 587 836 1404 1436 2066 2059 1504 1169 552 71 145 152 1078 1238 1601 1843 1670 1396 648 322 -115
2462a15M18J55L73L76M97j56k24m02l47n37l20J36K52O88K74L40P9p02Q9p19k08
$$ -115 303 458 831 1207 1704 1548 1324 922 575 38 -282 -146 106 794 1068 1408 1487 785 874 155 -53
2483e3p6NK22M58L61K78m16k99m1m85o82J98K60M81K35J87L17M3n42l85k85l57
$$ -53 -129 -124 98 556 917 1195 779 480 439 -46 -728 -530 -270 211 446 633 950 993 451 66 -219 -576
2505e76P9J98M08N30N0%j82m37p6n86M9nL09K61N75j64L03l27k59m18l39k8L0
$$ -576 -497 -299 109 639 689 689 507 70 -6 -592 -543 -548 -239 22 597 433 736 409 150 -268 -607 -635 -605
2528f05N64j5L37M85k37k3n54j81j45l06J50L19J23N09K6r8k63k1n00k63P1j03
$$ -605 -41 -56 281 766 529 506 -48 -229 -374 -680 -530 -211 -88 421 447 349 86 65 -435 -698 -627 -730
2550g30N43K76J86j81K47l67j31k28m69O9K49M33p7O3K11J0k92l7l76r8K72l71
$$ -730 -187 89 275 94 341 -26 -157 -385 -854 -785 -536 -103 -180 -117 94 104 -188 -225 -601 -699 -427 -798
2572g98N45N3K44o0Pk80k80l32L04k35K22N5J98m15L99m0j79P6k94j32K91j71
$$ -798 -253 -200 44 -16 -9 -289 -569 -901 -597 -832 -610 -555 -357 -772 -373 -413 -592 -516 -810 -942 -651 -822
2594h22J65R8q4k02KJ18j14k50J00J84K69k86K53k12mj67o4L7p8J58k03L68K6
$$ -822 -657 -559 -643 -845 -843 -725 -839 -1089 -989 -805 -536 -822 -569 -781 -785 -952 -1016 -979 -1057 -899 -1102 -734 -708
2617g08j79O0j19J00K52k25j38L29r6j44j14kM34k50K24m44N79j72K84j11m59
$$ -708 -887 -827 -946 -846 -594 -819 -957 -628 -724 -868 -982 -984 -550 -800 -576 -1020 -441 -613 -329 -440 -899
2638h99K42l32L86q8P4J87J38l0l7k33M12l75o0j89R9M65K4O9M6Pr2J13j14k44
$$ -899 -657 -989 -603 -691 -617 -430 -292 -322 -359 -592 -180 -555 -615 -804 -705 -240 -216 -147 -101 -94 -186 -73 -187 -431
2662d31K67J70j06N05Q4m7l94N16n83k9O8N9j50L19M66J40J5k31k45j30j06k99
$$ -431 -164 6 -100 405 489 442 48 564 -19 -48 20 79 -71 248 714 854 869 638 393 263 157 -142
2684a42J87L38J19K77o1L48k11j88o48j16L34j3O2J58M27j23J23k7n00j19o1k61
$$ -142 45 383 502 779 718 1066 855 667 19 -97 237 224 286 444 871 748 871 844 344 225 164 -97
2706i7M29J3N71K54l05K65j49o49o2k17l5M52j62P56n9r8k31L40m16j63k60j94
$$ -97 332 345 916 1170 865 1130 981 332 270 53 18 470 308 1064 1005 907 676 1016 600 437 177 -17
2728a7N67k14N04m1L64k70q2n97J9k96L62O3K43l4O20j93k23k08j60m10M5o5N57
$$ -17 550 336 840 799 1163 893 811 214 233 -63 299 362 605 571 1191 998 775 567 407 -3 42 -23 534
2751E34Q1K17j15j64m2m17p0l59K29K03M1M85k95M45k06O3m48m76K84j03N1K77
$$ 534 615 832 717 553 511 94 24 -335 -106 97 138 623 328 773 567 630 182 -294 -10 -113 -62 215
2773B15Q4L90K02k84j02n31K7k9j54M05L40q4Q5p3Q6j81n48Q8k07K21L22L16P
$$ 215 299 689 891 607 505 -26 1 -28 -182 223 563 479 564 491 577 396 -152 -64 -271 -50 272 588 595
2796E95K04L9l06k98J07m82L30K13m6M54J43l95j91O9l65Q9l85M47l80O59k00
$$ 595 799 838 532 234 341 -141 189 402 356 810 953 558 367 436 71 160 -225 222 -158 501 301
2817C01L41j60lL1o76k30J96K35r9J41R9M17l55O2m14m50j37L03k16M19K88R7
$$ 301 642 482 479 510 -166 -396 -200 35 -64 77 176 593 238 300 -114 -564 -701 -398 -614 -195 93 190
2839A90k45K70k80l39j6l11L70L9p5M18m4M2k00k22o5k78l32j33O12J02L1J44
$$ 190 -55 215 -65 -404 -420 -731 -361 -322 -397 21 -23 19 -181 -403 -468 -746 -1078 -1211 -599 -497 -466 -322
2861c22J65k16l66P6m02k7R4J72M62j02J21l77L23j58n89M55k39K27j4k8O88l42
$$ -322 -157 -373 -739 -663 -1065 -1092 -998 -826 -364 -466 -345 -722 -399 -557 -1146 -691 -930 -703 -717 -745 -57 -399
2883c99j46k0l43n2J18J6j04K84LK12K17j19l39k37k4j28J5K36K03K41Nm12L23
$$ -399 -545 -565 -908 -960 -842 -826 -930 -646 -643 -431 -214 -333 -672 -909 -933 -1061 -1046 -810 -607 -366 -361 -773 -450
2906d50j55j39k07K58K57n7M31l24J46Km8J33n82K31K82j08p0J36K95k87O0N1
$$ -450 -605 -744 -951 -693 -436 -493 -62 -386 -240 -238 -286 -153 -735 -504 -222 -330 -400 -264 31 -256 -196 -145
2928a45q0o1j08Q6K08jM1K4K8k72K07L1J4k2P2j22K63j16k51K08L4j26K73j64
$$ -145 -225 -286 -394 -308 -100 -101 -60 -36 -8 -280 -73 -42 -28 -50 22 -100 163 47 -204 4 38 -88 185 21
2952B1K95k11J04pr4K20j08m8j7j14K01j72L87J06l77J64k44J80n07J90L27k24
$$ 21 316 105 209 202 108 328 220 172 155 41 242 70 457 563 186 350 106 286 -221 -31 296 72
2974G2L7L77m20K17J1k45j63J13JL6L34q0j0R2N7k41ll83J60K8J87J67m1Q8J2
$$ 72 109 486 66 283 294 49 -114 -1 0 36 370 290 280 372 429 188 185 -198 -38 -10 177 344 303 391 403
2999D03o42M69l46K00J21l72N07l76M77k54J20j81K1J06l39K48J5Q0J41N8l56
$$ 403 -239 230 -116 84 205 -167 340 -36 441 187 307 126 147 253 -86 162 177 257 398 456 100
3020A00M30l53l51PM83l86K42j38K99M00l85J55k32o5J12k10K19j6L42r7j18J91
$$ 100 530 177 -174 -167 316 -70 172 34 333 733 348 503 271 206 318 108 327 311 653 556 438 629
3042F29o1j81k67m7K8K9M39K32l31j27J30J13p9l98J47J12K9k7M74l38J90mq9
$$ 629 568 387 120 73 101 130 569 801 470 343 473 586 507 109 256 368 397 370 844 506 696 692 603
3065F03p5Q8k36j37L09l07N86j84k7j59J61l35k30o9L11J34J10j76K27k10l70
$$ 603 528 616 380 243 552 245 831 647 620 461 622 287 57 -12 299 433 543 367 594 384 14
3086A4K22K32l24k0J31K45K58m46q3P6j50j49l86K07K76k4n6J85j09K90l80N6
$$ 14 236 468 144 124 255 500 758 312 229 305 155 6 -380 -173 103 79 23 208 99 389 9 65
3108F5j85j26p5J82K42J06n4j82m1j39m01K49J55k33K68jM7k14K18n3l65j07R4
$$ 65 -120 -246 -321 -139 103 209 155 -27 -68 -207 -608 -359 -204 -437 -169 -170 -123 -337 -119 -172 -537 -644 -550
3131e50r6K54J96k51o0QK62j63j41j55m8N45n55J57oL30M5j73k88K7K9J20M8j41
$$ -550 -646 -392 -196 -447 -507 -499 -237 -400 -541 -696 -744 -199 -754 -597 -603 -273 -228 -401 -689 -662 -633 -513 -465 -606
3155f06J42j8J68J40k53p8j77m2K21n5O0M43l92J75r1l8J68j44l29P9J65N4M02
$$ -606 -464 -482 -314 -174 -427 -505 -682 -724 -503 -558 -498 -55 -447 -272 -363 -401 -233 -377 -706 -627 -462 -408 -6
3178fk78L21Q1m45mk7K46j28l07J75K01k46K31J57l11j23M79n8l24j52L21K62
$$ -6 -284 37 118 -327 -331 -358 -112 -240 -547 -372 -171 -417 -186 -29 -340 -463 16 -42 -366 -518 -197 65
3200F5o7L1l32K55j90j72J24J46Jn6J56j71J71m1k16J93J74L9n9j14j72L23J19
$$ 65 -2 29 -303 -48 -238 -410 -286 -140 -139 -195 -39 -210 -39 -80 -296 -103 71 110 51 -63 -235 88 207
3223B07l69J16J33o7J11n28K53L22J99j27m61M04O6j84k63K54O1m8k0q0K87m12
$$ 207 -162 -46 87 20 131 -397 -144 178 377 250 -211 193 259 75 -188 66 127 79 59 -21 266 -146
3245a46N2l8j28K54j99L58j88P4J26m76K76N4L8k76p2L56L29o47N48j29k26R7
$$ -146 -94 -132 -260 -6 -205 153 -35 39 165 -311 -35 19 57 -219 -291 65 394 -253 295 166 -60 37
3267C7j87J0J6K14N1q9K87l37j66N01k77J2K2r6n0K57k65pK26r2K91p6j48J13
$$ 37 -150 -140 -124 90 141 52 339 2 -164 337 60 72 94 -2 -52 205 -60 -67 159 67 358 282 134 247
3291B47m64N87j20J41k13O1j9J03k4j71L33p6N3jk85L86j57L04l90m6l25P56j45
$$ 247 -217 370 250 391 178 239 220 323 299 128 461 385 438 437 152 538 381 685 295 249 -76 680 535
3314E35l73K29K98k66j77M49j62j0l26l7K78K14j23j79K05J27l07r1P2K34l08
$$ 535 162 391 689 423 246 695 533 523 197 160 438 652 529 350 555 682 375 284 356 590 282
3335B82Q4M03j49k12K4J56k51k3k06J42K3L0L88j71k55O2j75L61n27n2M10j02
$$ 282 366 769 620 408 432 588 337 314 108 250 273 303 691 520 265 327 152 513 -14 -66 344 242
3357B42n0L65n8k80j62N8p6K59j29o5J85k82J48O8k69K57j06k44R2N9r2j94K41
$$ 242 192 557 499 219 57 115 39 298 169 104 289 7 155 223 -46 211 105 -139 -47 12 -80 -274 -33
3380c3J04j57j32J7J11O3m00j21M13L30l84J54j63K5k47L3K12o4Q3o0O8oK73l62
$$ -33 71 -86 -218 -201 -90 -27 -427 -548 -135 195 -189 -35 -198 -173 -420 -387 -175 -239 -156 -216 -148 -154 119 -243
3404b43j34L56k91k12J45O9o6K37j18j68L44k30J12k30j03L25K27j5j50j7r1J77
$$ -243 -377 -21 -312 -524 -379 -310 -376 -139 -257 -425 -81 -311 -199 -429 -532 -207 20 5 -145 -162 -253 -76
3426g6j34l16K45O3Q5j49M39k05j82J02Pj34J27j59q9K95J15l79R7M86k25j73
$$ -76 -210 -526 -281 -218 -133 -282 157 -48 -230 -128 -121 -255 -128 -287 -376 -81 34 -345 -248 238 13 -160
3448a60j07O4r9L50m02L34k37j86M24n9k74N15l90J65K75m98O2J20P7k71K57k18
$$ -160 -267 -203 -302 48 -354 -20 -257 -443 -19 -78 -352 163 -227 -62 213 -285 -223 -103 -26 -297 -40 -258
3470b58J8Lk3K62L9k46K45k58K5J09K1l6j01J49J41Ok27J46l26j09k0J32JL68
$$ -258 -240 -237 -260 2 41 -205 40 -218 -193 -84 -63 -99 -200 -51 90 96 -131 15 -311 -420 -440 -308 -307 61
3494F1k53L1l4K14q4k99Kk40K85L24m44L92N6k26J56m93L67k20L55j58J02O5K39
$$ 61 -192 -161 -195 19 -65 -364 -362 -602 -317 7 -437 -45 11 -215 -59 -552 -185 -405 -50 -208 -106 -41 198
3517A98m34o5R7J24j64k61M34k68K64k09K90J69p6l37J14k99L11P5l30K69K39
$$ 198 -236 -301 -204 -80 -244 -505 -71 -339 -75 -284 6 175 99 -238 -124 -423 -112 -37 -367 -98 141
3538A41q4k77j06J3K28Q0k56OL29JK1k36M43k59l7l5j63L92j15R6J89k06K76j98
$$ 141 57 -220 -326 -313 -85 -5 -261 -255 74 75 96 -140 303 44 7 -28 -191 201 86 182 371 165 441 243
3562B43K35o00J08K78J9j87J18Q0K2j6l31L38K3O3n72K81k14N70j85L52m63j32
$$ 243 478 -122 -14 264 283 96 214 294 316 300 -31 307 330 393 -179 102 -112 458 273 625 162 30
3584C0P6K55k62L1k8J45K56j4k92L85k14R2Lr0J43j20J32K80r5n23M30k91r9j26
$$ 30 106 361 99 130 102 247 503 489 197 582 368 460 463 373 516 396 528 808 713 190 620 329 230 104
3608A04NJ55M0q3j41L76j23j55P9k22J52K02j00j8j02k8o8J20J63j63j15J10j93
$$ 104 109 264 304 221 80 456 333 178 257 35 187 389 289 271 169 141 73 193 356 193 78 188 -5
3631eN1K62j2l15J27R8J65o66L75j17Q5j15k1Q7j57J89Oj93J16M5R7r9k0plK17
$$ -5 46 308 296 -19 108 206 371 -295 80 -37 48 -67 -88 -1 -158 31 37 -156 -40 5 102 3 -17 -24 -27 190
3657A90j92M3k67K41m6m5J17r3K0p0m5J85k38K81j61R9j84q3J42M3K26j98J96
$$ 190 -2 41 -226 15 -31 -76 41 -52 -32 -102 -147 38 -200 81 -80 19 -165 -248 -106 -63 163 -35 161
3680A61l67o0j14M17k70j14J72O3J42R4Q8n35L18p8j47O4NL9L3J22K11m47R4M3
$$ 161 -206 -266 -380 37 -233 -347 -175 -112 30 124 212 -323 -5 -83 -230 -166 -161 -122 -89 33 244 -203 -109 -66
3704f6j83L45n6J5k34J21P0KK87j48m90K86J27j44K53l82J10M55o79M07j36j52
$$ -66 -249 96 40 55 -179 -58 12 14 301 153 -337 -51 76 -68 185 -197 -87 368 -311 96 -40 -192
3726a92O8K48k6j02j4j40R7j59m7J96q1k0J13k58J86j20K93r8j37K6R8O4O8p4
$$ -192 -124 124 98 -4 -18 -158 -61 -220 -267 -71 -152 -172 -59 -317 -131 -251 42 -56 -193 -167 -69 -5 63 -11
3750a1j93P9J25K2j78k10N3P2n0L09j90R0L0p1r5P6k65J24l36L72o2J57j12K12
$$ -11 -204 -125 0 22 -156 -366 -313 -241 -291 18 -172 -82 -52 -123 -218 -142 -407 -283 -619 -247 -309 -152 -264 -52
3774e2q0J54l48K2K87k52LL5J6L43l79k07K39K98l47J58j38p3n6K37k27K95j65
$$ -52 -132 22 -326 -304 -17 -269 -266 -231 -215 128 -251 -458 -219 79 -268 -110 -248 -321 -377 -140 -367 -72 -237
3797b37J60j78p3N2j22J99M4J39J49l18j85L55l9LM6O8l23K32k25J90j1k31K34
$$ -237 -77 -255 -328 -276 -398 -199 -155 -16 133 -185 -370 -15 -54 -51 -5 63 -260 -28 -253 -63 -74 -305 -71
3820g1mJ90N5j0K1O4J3k34J26M7l25L24mj57J52j33J43j62L21j55k61J58Pj40
$$ -71 -75 115 170 160 181 245 258 24 150 197 -128 196 192 35 187 54 197 35 356 201 -60 98 105 -35
3844c5L43K1q6O7q2p8lj21mK72L41l04K04k41k83J36K51l54K2K24l7J4J61k20
$$ -35 308 329 243 310 228 150 147 26 22 294 635 331 535 294 11 147 398 44 66 290 253 267 428 208
3868B08j84n6m5K94l15P5L1Q0j63L68K0j23j80O3q2K68J01j99K72k17j53K77l5
$$ 208 24 -32 -77 217 -98 -23 8 88 -75 293 313 190 10 73 -9 259 360 161 433 216 63 340 305
3891C05J7k25j67j20M18j10j13K20k18l1K48M12m97m9k00N1L7J41l2J58J06l88
$$ 305 322 97 -70 -190 228 118 5 225 7 -24 224 636 139 90 -110 -59 -22 119 87 245 351 -37
3913c7K2J11K61n60M3J11J17L2j2j54J53P5j33K33j02j07k1j57K44J32m0k96K60
$$ -37 -15 96 357 -203 -160 -49 68 100 88 -66 87 162 29 262 160 53 32 -125 119 251 211 -85 175
3936A75q2R6j90j21K49j12J73k10J45M5l36k09K85jJ46M2j44PM35m43j26N94n98
$$ 175 93 189 -1 -122 127 15 188 -22 123 168 -168 -377 -92 -93 53 95 -49 -42 393 -50 -176 418 -180
3959a80J08M7K21k40J3o6M93j54O9j51m31N49j71J16k15J81J55l37n7J75k27N7
$$ -180 -72 -25 196 -44 -31 -97 396 242 311 160 -271 278 107 223 8 189 344 7 -50 125 -102 -45
3981d5n0K67k64m7L25l25N04m67J76p7K00j94j27N10l93mJ59l6j16j06K2M44m81
$$ -45 -95 172 -92 -139 186 -139 365 -102 74 -3 197 3 -124 386 -7 -11 148 112 -4 -110 -88 356 -125
4004a25J29j20q6R8L9r9K0j32k8J32p0K44j04M4P9k2l6j8k8j43k03M2K52K95l65
$$ -125 4 -116 -202 -104 -65 -164 -144 -276 -304 -172 -242 2 -102 -58 21 -1 -37 -55 -83 -226 -429 -387 -135 160 -205
4029b05M6O5q3k09J95j00J82j99k95M08j85J87J7R0n95L63n8L39k11j49M19j2
$$ -205 -159 -94 -177 -386 -191 -291 -109 -308 -603 -195 -380 -193 -176 -86 -681 -318 -376 -37 -248 -397 22 10
4051A0O4r0m5J2j25lJ03q5L11k40j36J84Nk30L34l7l32N17l25J02j57j15P6K66
$$ 10 74 -16 -61 -49 -174 -177 -74 -159 152 -88 -224 -40 -35 -265 69 32 -300 217 -108 -6 -163 -278 -202 64
4075F4k89j9J13n1r1R1KJ41k41N5K24K41k91j93M23mj76J4L3R2k02k68L34j58
$$ 64 -225 -244 -131 -182 -273 -182 -180 -39 -280 -225 -1 240 -51 -244 179 175 -1 13 46 138 -64 -332 2 -156
4099a56J75m6p6p4M23j70l77M23Q7m73M83j00k76L52l42M49m1k46J64p0j4j55
$$ -156 19 -27 -103 -177 246 76 -301 122 209 -264 219 119 -157 195 -147 302 261 15 179 109 95 -60
4121f0q3J35M93k31j68J90j10j74K19j24k14K43J16k8o1j53P9P4l10L94k10J48
$$ -60 -143 -8 485 254 86 276 166 -8 211 87 -127 116 232 204 143 -10 69 143 -167 227 17 165
4143A65j8q2k86L62l40K58o5J88J3n04L85J48k37l7o6j01N45l63K35m7j74N7K08
$$ 165 147 65 -221 141 -199 59 -6 182 195 -309 76 224 -13 -50 -116 -217 328 -35 200 153 -21 36 244
4166B44j46k17O5K01L1k18K15j11l9K21l26K00j39j63O0J64k70L17J21J75l03
$$ 244 98 -119 -54 147 178 -40 175 64 25 246 -80 120 -19 -182 -122 42 -228 89 210 385 82
4187H2j15J41J24j57lj61J41KJ9J60k58qN6j05L46l53m2P0K50K04n44L56r6r0
$$ 82 -33 108 232 75 72 -89 52 54 73 233 -25 -33 23 -82 264 -89 -131 -61 189 393 -151 205 109 19
4211A9ON1O5P9j33J21j98J38N02k87l33j29K0r6M12k12K93m4l53L54k01L2j7j24
$$ 19 25 76 141 220 87 208 10 148 650 363 30 -99 -79 -175 237 25 318 274 -79 275 74 106 89 -35
4235c5N10m34K67j60k50K19J34J1j07j23J87J57k0l34o6K27k54j15L37j00n6J
$$ -35 475 41 308 148 -102 117 251 262 155 32 219 376 356 22 -44 183 -71 -186 151 51 -5 -4
4257dk5K12k69J13n7o1m3M50l48k09K86m8R9m5O9M9o5n5j67j41J0N04j83N1k57
$$ -4 -29 183 -86 27 -30 -91 -134 316 -32 -241 45 -3 96 51 120 169 104 49 -118 -259 -249 255 72 123 -134
4282a34K71k85j48L36l55K50L4j51J58j90K6L12K7l96J76o8N3j66J71r5j55L30
$$ -134 137 -148 -296 40 -315 -65 -31 -182 -24 -214 -188 124 151 -245 -69 -137 -84 -250 -79 -174 -329 1
4304Al23j2J75j08J63j81j20M52l6M2l41P3K26j08n0j17J07K6j12L3Q9N3O5j80
$$ 1 -322 -334 -159 -267 -104 -285 -405 47 11 53 -288 -215 11 -97 -147 -264 -157 -131 -243 -210 -121 -68 -3 -183
4328a83N1N7k57l6L63j39J81l99N09l64k5l13L36L28l09J29j5K63l85J00j45P1
$$ -183 -132 -75 -332 -368 -5 -144 37 -362 147 -217 -242 -555 -219 109 -200 -71 -86 177 -208 -108 -253 -182
4350a82j0K59k8k0J16n51L72O0L4m5k17L14l03L7M23j41l57K40J78l1k83P3r4
$$ -182 -192 67 39 19 135 -416 -44 16 50 5 -212 102 -201 -164 259 118 -239 1 179 148 -135 -62 -156
4373a56J77j3O0m7J16j19K14Qk94J42l2J80n50N88k19k35J67K88j97l25M53m51
$$ -156 21 8 68 21 137 18 232 240 -54 88 56 236 -314 274 55 -180 -13 275 78 -247 206 -245
4395b45L09j17n2J2N4M05l79J28n1j99LQ8J48p5j28K1J54k06J54M0N4j68P8Pj87
$$ -245 64 -53 -105 -93 -39 366 -13 115 64 -135 -132 -44 104 29 -99 -78 76 -130 24 64 118 -50 28 35 -152
4420a52N3q4ML91l07l06L1L93k5J57n8k5j71R2k71J4J94j75M94j74j15o0K3K02
$$ -152 -99 -183 -179 212 -95 -401 -370 23 -2 155 97 72 -99 -7 -278 -264 -70 -245 249 75 -40 -100 -77 125
4444A25k8o8j66P4Q7M7K28N4q4j71k5p1k70J20K21j34K83k01J72k54Q4Q9Q4j57
$$ 125 97 29 -137 -63 24 71 299 353 269 98 73 2 -268 -148 73 -61 222 21 193 -61 23 112 196 39
4468C9J50m35N6M05J3k10Q7k48L97l37J09J29J5j1J03j60L4L9j09P8k14J30Nl5
$$ 39 189 -246 -190 215 228 18 105 -143 254 -83 26 155 170 159 262 102 136 175 66 144 -70 60 65 30
4492C0J64k73j35M46j49K3l00Q4L08l69J02L83J97n70L31j03l49M16k77j17L33
$$ 30 194 -79 -214 232 83 106 -194 -110 198 -171 -69 314 511 -59 272 169 -180 236 -41 -158 175
4513A75m4O3k35K71j71J9j34k13N53q0n46K26M94o27K76p4K0j46J72m0j0L08j47
$$ 175 131 194 -41 230 59 78 -56 -269 284 204 -342 -116 378 -249 27 -47 -27 -173 -1 -41 -51 257 110
4536A10J0o2k8L4j75P4K76j87k26L08j30k08K16j72RL8k14K73K01k26J15m2m7
$$ 110 120 58 30 64 -111 -37 239 52 -174 134 4 -204 12 -160 -151 -113 -327 -54 147 -79 36 -6 -53
4559e3J74m35J44j37L83k45m1l24O29n74L00J12J65k57L8K58l27n4P3K84l55K13
$$ -53 121 -314 -170 -307 76 -169 -210 -534 95 -479 -179 -67 98 -159 -121 137 -190 -244 -171 113 -242 -29
4581b9r8J22j34J2j13N08l02M0k38K12j10j50K91K06O8k12k01J01K2J1J61k37
$$ -29 -127 -5 -139 -127 -240 268 -34 6 -232 -20 -130 -280 11 217 285 73 -128 -27 -5 6 167 -70
4603g0L25l57R5j42j63J74M7K79l60M94j37k38k8q8J89n1J13r3j48J89m5j81J33
$$ -70 255 -102 -7 -149 -312 -138 -91 188 -172 322 185 -53 -81 -169 20 -31 82 -11 -159 30 -15 -196 -63
4626f3m58O96l35J33J63k11n0j8O2K06J62k32J39j14kj6Q0l25k9K14p4q1P4lK94
$$ -63 -521 175 -160 -27 136 -75 -125 -143 -81 125 287 55 194 80 78 62 142 -183 -212 2 -72 -153 -79 -82 212
4651B12m34K72j03k9K60k66o9l5K96m32K01K15K0j29m08N15k20j7L52l14j59N2
$$ 212 -222 50 -53 -82 178 -88 -157 -192 104 -328 -127 88 108 -21 -429 86 -134 -151 201 -113 -272 -220
4673b20K09N0j69K72l80J67K5K16k21m9j3l7L13r2n0l84L50J40k12j54K18N8N3
$$ -220 -11 39 -130 142 -238 -71 -46 170 -51 -100 -113 -150 163 71 21 -363 -13 127 -85 -239 -21 37 90
4696I0Q9l0k31J2K2J00j7K21o1l70K72R9n91J83J95n8pO9J0L6k5K74m10J55l86
$$ 90 179 149 -82 -70 -48 52 35 256 195 -175 97 196 -395 -212 -17 -75 -82 -13 -3 33 8 282 -128 27 -359
4721c59M33N4p5k80J40P2Q2L40j73k93l5J43K45j57j76J74j86P7j41L89k10Q1
$$ -359 74 128 53 -227 -87 -15 67 407 234 -59 -94 49 294 137 -39 135 -51 26 -115 274 64 145
4743A45r8l3m9M30m05J73Mj27J24K30k50q7J43k28L2RM34j73j02k80K04Q9m5n8
$$ 145 47 14 -35 395 -10 163 167 40 164 394 144 57 200 -28 4 13 447 274 172 -108 96 185 140 82
4767H2J30j77o5o4J47j22M44l75K52R6j23r2lK0L47n95J86Q7j50k41L99R4k73
$$ 82 212 35 -30 -94 53 -69 375 0 252 348 225 133 130 150 497 -98 88 175 25 -216 183 277 4
4790DL03l82K32j96K33l27J48l48K09R3j14L05k60K38J96o84N06j83n6K59n94
$$ 4 307 -75 157 -39 194 -133 15 -333 -124 -31 -145 160 -100 138 334 -350 156 -27 -83 176 -418
4811d18O04j26o4K62m40M2K5K43j51R8q3j36J39M1k32j4L4O1o2P2K07k20K98j93
$$ -418 186 60 -4 258 -182 -140 -115 128 -23 75 -8 -144 -5 36 -196 -210 -176 -115 -177 -105 102 -118 180 -13
4835a3j66M9QK64m8o2k05J44j01K26J70l33M65k67l65L96j46k54L99j62j32JK36
$$ -13 -179 -130 -122 142 94 32 -173 -29 -130 96 266 -67 398 131 -234 162 16 -238 161 -1 -133 -132 104
4858A04j22l21L80k08L39j65K2k17M58j70k73J52Q0k5j02k15J97J26J57k37J53
$$ 104 -18 -339 41 -167 172 7 29 -188 270 100 -173 -21 59 34 -68 -283 -86 40 197 -40 113
4879A13N4l91J51L60l97M9M5K13l16K4L6J67r5J14j11K23J13o63L24P6L01o05
$$ 113 167 -224 -73 287 -110 -61 -16 197 -119 -95 -59 108 13 127 16 239 352 -311 13 89 390 -215
4901b15p4K38J3nP4ok8r2k84N81r5J02j26PJ11m45J64j38K42J67k10j13N6J26
$$ -215 -289 -51 -38 -43 31 25 -3 -95 -379 202 107 209 83 90 201 -244 -80 -218 24 191 -19 -132 -76 50
4925E0j47j22m3K16L7J1l9k0R7j04M2J33L9J64m27J40j73p9N76k20m31P1K67j91
$$ 50 -97 -219 -262 -46 -9 2 -37 -57 40 -64 -22 111 150 314 -113 27 -146 -225 351 131 -300 -229 38 -153
4949a53N8J13j01j2J02J45j74j93J35J09l4l0m5Q4kJ14o1j48p3K52q9k02M26r00
$$ -153 -95 18 -83 -95 7 152 -22 -215 -80 29 -5 -35 -80 4 2 116 55 -93 -166 86 -3 -205 221 -679
4973f79Q92j27l5J47l20pK55j98qk1P3K41K9k89R5J08k26p3K33O8r9J56l3j0q1
$$ -679 213 86 51 198 -122 -129 126 -72 -80 -101 -28 213 242 -47 48 156 -70 -143 90 158 59 215 182 172 91
4998I1m13M71l28M51l35m8j02K61J94l47K51j13R7p8n5J56m35M26q3j82J63q9
$$ 91 -322 149 -179 272 -63 -111 -213 48 242 -105 146 33 130 52 -3 153 -282 144 61 -121 42 -47
5020d7R0j0j85M54r8J57j92p7pk67L28o8k2L46m65J06J11n2j01K31J46l27k7J95
$$ -47 43 33 -152 302 204 361 169 92 85 -182 146 78 56 402 -63 43 154 102 1 232 378 51 24 219
5044B19k26l05M52l1k42l9J21N3L7n5J64m20L04j04K12P6l5j99l4NK12Q8l90L61
$$ 219 -7 -312 140 109 -133 -172 -51 2 39 -16 148 -272 32 -72 140 216 181 -18 -52 -47 165 253 -137 224
5068B24j83k42K00j56L50j71k85J23P5j15m3J04K75l40L73l05p2J64j63J02J5
$$ 224 41 -201 -1 -157 193 22 -263 -140 -65 -180 -223 -119 156 -184 189 -116 -188 -24 -187 -85 -70
5089g0j07R0O5J57r6l48N40j03l9k24K16k8j32L5j93q8K70J30k95J27R6pQ3J05
$$ -70 -177 -87 -22 135 39 -309 231 128 89 -135 81 53 -79 -44 -237 -325 -55 75 -220 -93 3 -4 79 184
5113A84K18m31J29l66M93j75J84j90p4J41k09j33j27M99o0R5L6l65N8KrL42j03
$$ 184 402 -29 100 -266 227 52 236 46 -28 113 -96 -229 -356 143 83 178 214 -151 -93 -91 -100 242 139
5136A39j6J0N6k11P4k23L42j32j16K29o1P9k30N9K3l4J65J8l43M61O5m52L19l2
$$ 139 123 133 189 -22 52 -171 171 39 -77 152 91 170 -60 -1 22 -12 153 171 -172 289 354 -98 221 189
5160A89k34K21j92J46j4k53J87p4o8J48j31L59k93Qo7M02m31l5QJ43q7J92m05
$$ 189 -45 176 -16 130 116 -137 50 -24 -92 56 -75 284 -9 -1 -68 334 -97 -132 -124 19 -68 124 -281
5183b81L69r1l8J93J1n02jK66K61J5o3p4K7j85N4L3j75K67j37%J9m8p2L23j37
$$ -281 88 -3 -41 152 163 -339 -340 -74 187 202 139 65 92 -93 -39 -6 -181 86 -51 -51 -32 -80 -152 171 34
5208C4q6Q1k47L88j41Q1L7l02R7j42m3J9J72R8k58r1N01m36J96L03k98n1J45K92
$$ 34 -52 29 -218 170 29 110 147 -155 -58 -200 -243 -224 -52 46 -212 -303 198 -238 -42 261 -37 -88 57 349
5232C49n92K66O0J85m45K55k53k2L0J03K29k51MO6j44O1j14L58R9k61jJ26k0J2
$$ 349 -243 23 83 268 -177 78 -175 -197 -167 -64 165 -86 -82 -16 -160 -99 -213 145 244 -17 -18 108 88 100
5256A00j32J45M4j33O1J5m2K7p1k62L66Oj22J78l71J01k06K23L66l45R6N0l63
$$ 100 -32 113 157 24 85 100 58 85 14 -248 118 124 2 180 -191 -90 -296 -73 293 -52 44 94 -269
5279b69K22k49M53k38p9J49l31K59M4M05q3k33%P2P9j43n6k26K24K41j86j45k6
$$ -269 -47 -296 157 -81 -160 -11 -342 -83 -39 366 283 50 50 122 201 58 2 -224 0 241 55 -90 -116
5302a16J65J80r2%N9p7k93L41k28K83k12j25K84K28j69P9k12Q7j43kn7P9J22l29
$$ -116 49 229 137 137 196 119 -174 167 -61 222 10 -115 169 397 228 307 95 182 39 37 -20 59 181 -148
5326a48L1p4j21K93l94L4M25j8N4j92L51m02K31j70L87l78j62L84j41j52J03k0
$$ -148 -117 -191 -312 -19 -413 -379 46 28 82 -110 241 -161 70 -100 287 -91 -253 131 -10 -162 -59 -79
5348g9j16m1J07J95l76M13j0O1J7j2k43q9J82k89K86r6k67L64R4k41J8K43j31
$$ -79 -195 -236 -129 66 -310 103 93 154 171 159 -84 -173 9 -280 6 -90 -357 7 101 -140 -122 121 -10
5371a0K70r0k1r8j75M7K53k75M53n67J20K52LO9L8Rj46j85j08q1K90J23k22K56
$$ -10 260 170 149 51 -124 -77 176 -99 354 -213 -93 159 162 231 269 278 132 -53 -161 -242 48 171 -51 205
5395B05k89n4L82j26j27k0r0L57k4PJ83n43K37k0J68p5j07k35n1K13j12P8N17
$$ 205 -84 -138 244 118 -9 -29 -119 238 214 221 404 -139 98 78 246 171 64 -171 -222 -9 -121 -43 474
5418D74k52j6k83lO7j11K49L0N6j64jk04J48J67R1k28J29k42N07k58m24L96q0
$$ 474 222 206 -77 -80 -13 -124 125 155 211 47 46 -158 -10 157 248 20 149 -93 414 156 -268 128 48
5441D8m42K39K38l09O16l03j54K0j87K12r3Q5J1j36j8K0m2J86%P7l64M96n60K33
$$ 48 -394 -155 83 -226 390 87 -67 -47 -234 -22 -115 -30 -19 -155 -173 -153 -195 -9 -9 68 -296 200 -360 -127
5465a27jn1o4J83p5k9K31o4O3k69K38%k19K27j74K57m59K06R8p0J40k70K86p4
$$ -127 -128 -179 -243 -60 -135 -164 67 3 66 -203 35 35 -184 43 -131 126 -333 -127 -29 -99 41 -229 57 -17
5489a7j89L24l04l2J10K43m41M80J00k47r3J60l5J06J26l94M5k13L74j32P0k61
$$ -17 -206 118 -186 -218 -108 135 -306 174 274 27 -66 94 59 165 291 -103 -58 -271 103 -29 41 -220
5511b20J44j28J85L29k84k16%M91k75q7J66l7j88L8o2J94j21P9l0k13J27K17j32
$$ -220 -76 -204 -19 310 26 -190 -190 301 26 -61 105 68 -120 -82 -144 50 -71 8 -22 -235 -108 109 -23
5534b3j22L92j87m3k95L59j98K58R6l93K45r5K60k61j12J38r6j11M38k70q4J50
$$ -23 -145 247 60 17 -278 81 -117 141 237 -156 89 -6 254 -7 -119 19 -77 -188 250 -20 -104 46
5556D6J08k85L14K4r9j08K0q9j40K63J9k46k1L93N9j07r4M9l6k37J55nK35j96
$$ 46 154 -131 183 207 108 0 20 -69 -209 54 73 -173 -194 199 258 151 57 106 70 -167 -12 -17 218 22
5580B2l6qk47n3K65j84J27j52K74m38L23n5J26O1M5k81k12M48r8j83L96Q1k61
$$ 22 -14 -22 -269 -322 -57 -241 -114 -266 8 -430 -107 -162 -36 25 70 -211 -423 25 -73 -256 140 221 -40
5603d0QJ21j72K68K8k42m7k04J30k8J39Q4O1k18P9j75L80q9R3m46K97K51l66m1
$$ -40 -32 89 -83 185 213 -29 -76 -280 -150 -178 -39 45 106 -112 -33 -208 172 83 176 -270 27 278 -88 -129
5627a29R1lJ59n4j36K21k34M9j23j76M31r8l0j40L04j03P5p4J63Lj80O5l30L11
$$ -129 -38 -41 118 64 -72 149 -85 -36 -159 -335 96 -2 -32 -172 132 29 104 30 193 196 16 81 -249 62
5651F2j67J78l4m03L09p3N25n29Q7J04q7O4R4M8j23o5l5M7k87P1K08J55k82M02
$$ 62 -105 73 39 -364 -55 -128 397 -132 -45 59 -28 36 130 178 55 -10 -45 2 -285 -214 -6 149 -133 269
5675B69m70J11J51j10J8j29J68k42O2L7J48L23m69K85j46P1l19K12J68j05N2l
$$ 269 -201 -90 61 -49 -31 -160 8 -234 -172 -135 13 336 -133 152 6 77 -242 -30 138 33 85 82
5697H2j81J81l41L36jp1l21K32r4nP0K0o2q6K75r3J33Q5k89J87l9J57j15pj73
$$ 82 -99 82 -259 77 76 5 -316 -84 -178 -183 -113 -93 -155 -241 34 -59 74 159 -130 57 18 175 60 53 -120
5722a20P9O9k0L4O1k51K67q8j61M59l39n1k04K30q2M4R5m8j11R2M8m16M72k6p9
$$ -120 -41 28 8 42 103 -148 119 31 -130 329 -10 -61 -265 -35 -117 -73 22 -26 -137 -45 3 -413 59 33 -46
5747d6k19P8QJ82j58K04J18r7k51O3K03r7M1K16l02K1K52k87J85p0N1P0k70R6
$$ -46 -265 -187 -179 3 -155 49 167 70 -181 -118 85 -12 29 245 -57 -36 216 -71 114 44 95 165 -105 -9
5771iol23mK32J20j71J01Q3J71l09K05%P2k95O3P1K15J52l58o0L1K11l28J92Q4
$$ -9 -15 -338 -342 -110 10 -161 -60 23 194 -115 90 90 162 -133 -70 1 216 368 10 -50 -19 192 -136 56 140
5796A40J39k38k7J08j67l63L89P7k8k26K16l94K90O6N0J32j47k6K2j66L42m8l55
$$ 140 279 41 14 122 -45 -408 -19 58 30 -196 20 -374 -84 -18 32 164 17 -9 13 -153 189 141 -214
5819b14M12J02j15J77l69J23j52L30l23J16j95N5K34P7m43O6K25M8n26J61lJ63
$$ -214 198 300 185 362 -7 116 -36 294 -29 87 -108 -53 181 258 -185 -119 106 154 -372 -211 -214 -51
5841e1J13l55K60J52k4k67K26P6j62K48k59Q9K5j28K9j73L73L4k42K9j47n1K48
$$ -51 62 -293 -33 119 95 -172 54 130 -32 216 -43 46 71 -57 -28 -201 172 206 -36 -7 -154 -205 43
5864D3j14J51j42j39J40m55M89J9j78O3O9k43N28j07n9j26J05O0K33o67L46j10
$$ 43 -71 80 -62 -201 -61 -516 -27 -8 -186 -123 -54 -297 231 124 65 -61 44 104 337 -330 16 -94
5886i4k86L19L28o24K81j30K79J83J50k22k43k22K29j10K58k88O3K95j90K06m65
$$ -94 -380 -61 267 -357 -76 -206 73 256 406 184 -59 -281 -52 -162 96 -192 -129 166 -24 182 -283
5907b83M84l30M22k10%J30k98o2K64q5N1j5P7q7M5j15j97L61l12K55O1k24K38
$$ -283 201 -129 293 83 83 213 -85 -147 117 32 83 68 145 58 103 -12 -209 152 -160 95 156 -68 170
5930A70n80L38J03k87N48k73m7k77L44k26K56k8J0J11J26l61P2L9k01O1m1J56
$$ 170 -410 -72 31 -256 292 19 -28 -305 39 -187 69 41 51 162 288 -73 -1 38 -163 -102 -143 13
5952A3j72K96K8j0j86K39k54K72k05J71m2P5j82k66j4N92j64l34J52K53J65m86
$$ 13 -159 137 165 155 -31 208 -46 226 21 192 150 225 43 -223 -237 355 191 -143 9 262 427 -59
5974e9K3R7l96K10J20N4L8m0q8K03k18j41J40j17K75m5k3N0N8j16n3l19M39m13
$$ -59 -36 61 -335 -125 -5 49 87 47 -41 162 -56 -197 -57 -174 101 56 33 83 141 25 -28 -347 92 -321
5998c21O4M11p5J70k64m1P0N8L6k02N32l55j11j89J57q6K42l22K69J40k99Pj02
$$ -321 -257 154 79 249 -15 -56 14 72 108 -94 438 83 -28 -217 -60 -146 96 -226 43 183 -116 -109 -211
6021b11J04K5M8j95J22J39J42l51L84l68Q6j54K33l99N20k20K78Ro6l34J99K12
$$ -211 -107 -82 -34 -229 -107 32 174 -177 207 -161 -75 -229 4 -395 125 -95 183 192 126 -208 -9 203
6043B03l23J2L92k60Q1J27l1J03l43j38K88q0k0k41L67o4K47j5j98J13M0k75m2
$$ 203 -120 -108 284 24 105 232 201 304 -39 -177 111 31 11 -230 137 73 320 305 107 220 260 -15 -57
6066e7K2P5J6j29m3k83L29K68n8l20J21K15j26l6j79n6L81J2k80K50m30M37N7
$$ -57 -35 40 56 -73 -116 -399 -70 198 140 -180 -59 156 30 -6 -185 -241 140 152 -128 122 -308 129 186
6089A86j03j34rO6k45L07j50J00j45J25j24K03j35K62j81j99M01n09N2J46J07
$$ 186 83 -51 -60 6 -239 68 -82 18 -127 -2 -126 77 -58 204 23 -176 225 -284 -232 -86 21
6110B1k80K36r8K34j75p8K34k29k06K06k28K45P1O9j92j44L25k86J38O2J78q8
$$ 21 -259 -23 -121 113 -62 -140 94 -135 -341 -135 -363 -118 -47 22 -170 -314 11 -275 -137 -75 103 15
6132A5r1J27PM7J49k96k6Q8L81m85L1l3n3K46k9j98L05j38p4j22J62J29j98o9
$$ 15 -76 51 58 105 254 -42 -68 20 401 -84 -53 -86 -139 107 78 -120 185 47 -27 -149 13 142 -56 -125
6156a25L65n32K62lj9J9J9Rqn9O7K63k40l2j22L87j49J40k63J24l71J05K45o2
$$ -125 240 -292 -30 -33 -52 -33 -14 -5 -13 -72 -5 258 18 -14 -136 251 102 242 -21 103 -268 -163 82 20
6180B0j36K52J14l19l2L08m1k92L24j58K5k21P1P6j95J21N9j29L03j27k84K99
$$ 20 -116 136 250 -69 -101 207 166 -126 198 40 65 -156 -85 -9 -204 -83 -24 -153 150 23 -261 38
6202C8m7K1NM0K67m77L19j89m85N11r9K73l4j23J49j22J10p7j71J21J76j53r5
$$ 38 -9 12 17 57 324 -153 166 -23 -508 3 -96 177 143 20 169 47 157 80 -91 30 206 53 -42
6225d2J04j96N5k4k84L26P0L33k45NJ06j40k00L42n0k4k66M4J43k60J41OJ08j05
$$ -42 62 -134 -79 -103 -387 -61 9 342 97 102 208 68 -132 210 160 136 -130 -86 57 -203 -62 -56 52 -53
6249e3k06J81k1o9K01L0mj67o9L10k15K3M82n34O4J45l4j66k38J93M64k91r1P7
$$ -53 -259 -78 -99 -168 33 63 59 -108 -177 133 -82 -59 423 -111 -47 98 64 -102 -340 -147 317 26 -65 12
6273A2P6j3l3j49J09O3j48L8J8O0j73J3L33k70J41L69m40k06K36l14L28j98K19
$$ 12 88 75 42 -107 2 65 -83 -45 -27 33 -140 -127 206 -64 77 446 6 -200 36 -278 50 -148 71
6296G1l34J30L63l19M18k99j63O7K03k42L64m62q3K33k16L22j61R3m6J86J04j68
$$ 71 -263 -133 230 -89 329 30 -133 -66 137 -105 259 -203 -286 -53 -269 53 -108 -15 -61 125 229 61
6318F1K50m47k07N36J16j79j94j25M09q9k30j5j45L42J10k20M5K14m73K26Q2k27
$$ 61 311 -136 -343 193 309 130 -64 -189 220 131 -99 -114 -259 83 193 -27 18 232 -241 -15 67 -160
6340a60K22j68L7J70j62k5J58j60Q9r2%N5J7j67J42K13k6k57Q3r9J44QL07k56
$$ -160 62 -106 -69 101 -61 -86 72 -88 1 -91 -91 -36 -19 -186 -44 169 143 -114 -31 -130 14 22 329 73
6364G3J70k72P6P3m1j67J7j80N86l45k4r4M46l95j75Q5L16j90J2m75M52J98Ok96
$$ 73 243 -29 47 120 79 -88 -71 -251 335 -10 -34 -128 318 -77 -252 -167 149 -41 -29 -504 -52 146 152 -144
6388a44K05k91M52l92P5N7K22o4j77Lj94K87K31r8m1P2k88N9qp0K59l7m14K51
$$ -144 61 -230 222 -170 -95 -38 184 120 -57 -54 -248 39 270 172 131 203 -85 -26 -34 -104 155 118 -296 -45
6412d5J4K86j32j99k67K58QJ87j4K29n88J77Q6L0J05k19P3O5J24j43j92k04O30
$$ -45 -31 255 123 -76 -343 -85 -77 110 96 325 -263 -86 0 30 135 -84 -11 54 178 35 -157 -361 269
6435B69l34J29j42p9O6K56j19j12K84l01J2o9%J09J81j82O2m2J61l17K58l06k7
$$ 269 -65 64 -78 -157 -91 165 46 -66 218 -83 -71 -140 -140 -31 150 -32 30 -12 149 -168 90 -216 -243
6458b43N95k67J16l17K50j13J75p4r8J95j16k51j46K02j90lK17K63R2k89K1Rj36
$$ -243 352 85 201 -116 134 21 196 122 24 219 103 -148 -294 -92 -282 -285 -68 195 287 -2 19 28 -108
6481a08K75l17J96j15j0K97k18J69j22q8J04j67K34j90n9L91l12k26L13K05k79
$$ -108 167 -150 46 -69 -79 218 0 169 47 -41 63 -104 130 -60 -119 272 -40 -266 47 252 -27
6502b7J77P5m95J75k8L82m11N57m81j39J53J32J9K27k17j70j66K58P3j88j12K33
$$ -27 150 225 -270 -95 -123 259 -152 405 -76 -215 -62 70 89 316 99 -71 -237 21 94 -94 -206 27
6524B7j17p5K24j86J86j1mM0j34K25N8k74r8M24l65q9P1p4R0K40j68k8K31m56
$$ 27 -90 -165 59 -127 59 48 44 84 -50 175 233 -41 -139 285 -80 -169 -98 -172 -82 158 -10 -38 193 -263
6548b63K8N38p1m23M5K93m1l53L07k64K84k54J46p4K24j18j05K92k07j10L74j09
$$ -263 -235 303 232 -191 -146 147 106 -247 60 -204 80 -174 -28 -102 122 4 -101 191 -16 -126 248 139
6570A39J16k05N6j7k2o2P9l51M76k17j47L91l43K26Lk45N2k3K26j54k0r8j4P8
$$ 139 255 50 106 89 67 5 84 -267 209 -8 -155 236 -107 119 122 -123 -71 -94 132 -22 -42 -140 -154 -76
6594g6M5K5R8r4P3P7L6k72J21N1Qm67K87J57m11J75K66jO5P3l7k13K45k40j66
$$ -76 -31 -6 92 -2 71 148 184 -88 33 84 92 -375 -88 69 -342 -167 99 98 163 236 199 -14 231 -9 -175
6619a75J61p5N7J48J6j38k60K72J30l21J54j10J23P6J35m0p4k08k17M70l07K33
$$ -175 -14 -89 -32 116 132 -6 -266 6 136 -185 -31 -141 -18 58 193 153 79 -129 -346 124 -183 50
6641E0j76J7L6J39Q6l67L08k03m1P2J78j67J8K50j64K06l46J41j33Q6J08k19l5
$$ 50 -126 -109 -73 66 152 -215 93 -110 -151 -79 99 -68 -50 200 36 242 -104 37 -96 -10 98 -121 -156
6664a56J24p5P5M9j63QJ37k91K27N8j71n4Q3N2n6K25q4j51R5L2l7K57k26n7nj14
$$ -156 -32 -107 -32 17 -146 -138 -1 -292 -65 -7 -178 -232 -149 -97 -153 72 -12 -163 -68 -36 -73 184 -42 -99 -104 -218
6690b18K84N3l70M83l21P0k07L92k29J77j77q3L20j74j31r2L07n6l36L15L00j72
$$ -218 66 119 -251 232 -89 -19 -226 166 -63 114 -63 -146 174 0 -131 -223 84 28 -308 7 307 135
6712A35n3%r3j02QJ58j38m0K30r0j46j07J15L01k11k05M62k42j5j46L18m00M5
$$ 135 82 82 -11 -113 -105 53 -85 -125 105 15 -131 -238 -123 178 -33 -238 224 -18 -33 -179 139 -261 -216
6735b16K65k6j66J00K36k70M22m01j98J12j17K01l2l29P57lk35j85K14m4K33l76
$$ -216 49 23 -143 -43 193 -77 345 -56 -254 -142 -259 -58 -90 -419 338 335 100 -85 129 85 318 -58
6757e8J00r1L01j71J70l15j76K64j36j49K92j75J86j78K04j90n7j9P0P0j8M15
$$ -58 42 -49 252 81 251 -64 -240 24 -112 -261 31 -144 42 -136 68 -122 -179 -198 -128 -58 -76 339
6779C39m31jJ76R7J18l47j60K13n1j95L09j17N0R7j94K07m0k28j69N61o6k35l7
$$ 339 -92 -93 83 180 298 -49 -209 4 -47 -242 67 -50 0 97 -97 110 70 -158 -327 234 168 -67 -104
6802a04j59N60l62j31M28j71j81K72p0j19o5o6K59l07J26J00N2j54j09K37l04
$$ -104 -263 297 -65 -196 232 61 -120 152 82 -37 -102 -168 91 -216 -90 10 62 -92 -201 36 -268
6823b68K63KpR2J0J87l48J69j87J88j36J9P7l03J26K90l33L34j38j36M24o01L26
$$ -268 -5 -3 -10 82 92 279 -69 100 -87 101 -35 -16 61 -242 -116 174 -159 175 37 -99 325 -276 50
6846E0nk17L89o8N3j48j8j34J01J28m9K7P0k9n3q5Pl77N91k46j9J65m15J33J9
$$ 50 45 -172 217 149 202 54 36 -98 3 131 82 109 179 150 97 12 19 -358 233 -13 -32 133 -282 -149 -130
6871a30n6J15Nk62Q1K29r6K57j87r7L80m03J48N0J03m02o3j6N06l34j24J29N2
$$ -130 -186 -71 -66 -328 -247 -18 -114 143 -44 -141 239 -164 -16 34 137 -265 -328 -344 162 -172 -296 -167 -115
6894a15R3m33O10L1j14j49m3K00M9q3J66j16J15k03k97K67j4N2l2m31O75l38p4
$$ -115 -22 -455 155 186 72 -77 -120 80 129 46 212 96 211 8 -289 -22 -36 16 -16 -447 228 -110 -184
6917a84J67r5J52Rp3N3j36o7l0N7L84l79L05l47j45L28K21m87J05N7o0K33n6N5
$$ -184 -17 -112 40 49 -24 29 -107 -174 -204 -147 237 -142 163 -184 -329 -1 220 -267 -162 -105 -165 68 12 67
6941F7j84k01K23J31j61N2J82m8j8K67m66J72j71Kj83K80MJ6p7J63J74j3j30L1
$$ 67 -117 -318 -95 36 -125 -73 109 61 43 310 -156 16 -155 -153 -336 -56 -52 -36 -113 50 224 211 81 112
6965A12j52K45j01L9q4RK08q2m54J00K62j86ko8k31L31K78j46R3q8k8L5p4M3k7
$$ 112 -40 205 104 143 59 68 276 194 -260 -160 102 -84 -86 -154 -385 -54 224 78 171 83 55 90 16 59 32
6990C2O0J2K94l37k40l9J05j29L65k31J75kj27L45k68r8K21j15k60J60M8R4k63
$$ 32 92 104 398 61 -179 -218 -113 -242 123 -108 67 65 -62 283 15 -83 138 23 -237 -77 -29 65 -198
7013a98L83l67N0j11N11j10q0J64l16J87k09K05j63J80j11m6j39N8J63j17l1R0
$$ -198 185 -182 -132 -243 268 158 78 242 -74 113 -96 109 -54 126 15 -31 -170 -112 51 -66 -97 -7
7035gJ12j78j2J72l72R3J64j72K85k44L00j20k9K91j77L6O2l05j9j32L31k3j45
$$ -7 105 -73 -85 87 -285 -192 -28 -200 85 -159 141 21 -8 283 106 142 204 -101 -120 -252 79 56 -89
7058h9O6P7r4n8K1K01Q4l97M14l99K69l21M3L26Q2k14j65K82J56l69k1J69l58
$$ -89 -23 54 -40 -98 -77 124 208 -189 225 -174 95 -226 -183 143 225 11 -154 128 284 -85 -106 63 -295
7081b95M51J19m06l1K24n4q8N7J76l8j89J90p0K17m89R8M50k40m1LL12l71J05
$$ -295 156 275 -131 -162 62 8 -80 -23 153 115 -74 116 46 263 -226 -128 322 82 41 44 356 -15 90
7104I0K7K4R7j70j73j3J43k2l9n5j9Q8N4k5J93J08k71j33K52k99J38M52m26o2
$$ 90 117 141 238 68 -105 -118 25 3 -36 -91 -110 -22 32 7 200 308 37 -96 156 -143 -5 447 21 -41
7128d1m1K94k56Q6j9j94J49K53l84K44j22J64k38M9j98j51M25J02j11p7j56M69
$$ -41 -82 212 -44 42 23 -171 -22 231 -153 91 -31 133 -105 -56 -254 -405 20 122 11 -66 -222 247
7150B47q9R4j45j08j22J51k60K12J6M5j11K17l02K40k85J39l7K51j56J63M4Rm1
$$ 247 158 252 107 -1 -123 28 -232 -20 -4 41 -70 147 -155 85 -200 -61 -98 153 -3 160 204 213 172
7173A72m0J25k62K41r5Kj26j41m02L98k3J48J00k11R5R4j98K45l10L74k49J03
$$ 172 132 257 -5 236 141 143 17 -124 -526 -128 -151 -3 97 -114 -19 75 -123 122 -188 186 -63 40
7195D0j2n7k02J78jj30M3J17K37q9m50N05j69L9N6k24J7J20k97M19o6l2Q2l4K04
$$ 40 28 -29 -231 -53 -54 -184 -141 -24 213 124 -326 179 10 49 105 -119 -102 18 -279 140 74 42 124 90 294
7220B94l23j37N9K61j87K14o2m8o7K24r0O6l5K13l95J07m01O10o8j32K05k87K08
$$ 294 -29 -166 -107 154 -33 181 119 71 4 228 138 204 169 382 -13 94 -307 303 235 103 308 21 229
7243B29m07J96l06L69j52J44l6j77M70l8l73j78L54n6P8j81J28j81J23n2K22o4
$$ 229 -178 18 -288 81 -71 73 37 -140 330 292 -81 -259 95 39 117 -64 64 -117 6 -46 176 112
7265A12l38L38j94J18j82K65k60K23r5m8J43l17l6L87J51q5k01J3l61O5L15q0
$$ 112 -226 112 -82 36 -146 119 -141 82 -13 -61 82 -235 -271 116 267 182 -19 -6 -367 -302 13 -67
7287f7j14J93J68r4j9k5K77l45J28n5j69L56l08J74j73J43j55n2K04r4j32J04
$$ -67 -181 12 180 86 67 42 319 -26 102 47 -122 234 -74 100 -73 70 -85 -137 67 -27 -159 -55
7309e5p3J72j21L5J25J58k55r6L39l69J97l8J63q7l46K45k21K72j52K91r0j22
$$ -55 -128 44 -77 -42 83 241 -14 -110 229 -140 57 19 182 95 -251 -6 -227 45 -107 184 94 -28
7331b8O2l28N33l54J74j32L1K19k20J82k79J08o0l7O5L20k7k32j11J94j69J68
$$ -28 34 -294 239 -115 59 -73 -42 177 -43 139 -140 -32 -92 -129 -64 256 229 -3 -114 80 -89 79
7353G9Q1k36J65m6m1j18K14J84m42J71j53n7J08O6j37L51k87L47j81m2K69p5l58
$$ 79 160 -76 89 43 2 -116 98 282 -160 11 -142 -199 -91 -25 -162 189 -98 249 68 26 295 220 -138
7376a38K36j43K16J18m08K94l86J86Q1K62j98l73P1K3K38K5M9k1Q5j9j54j4R6
$$ -138 98 -45 171 289 -119 175 -211 -25 56 318 120 -253 -182 -159 79 104 153 132 217 198 44 30 126
7399A26J67j07j78M9J13l58K29k13J96r1J24R9L9j71j6k3K13p8j76L45j95k87
$$ 126 293 186 8 57 170 -188 41 -172 24 -67 57 156 195 24 8 -15 198 120 -56 289 94 -193
7421a93Q4n0J49J75o3Pk81N48m12N2k86M58m11K79o1r8j99M72P9l43K0K52j50
$$ -193 -109 -159 -10 165 102 109 -172 376 -36 16 -270 188 -223 56 -5 -103 -302 170 249 -94 -74 178 28
7444B8O0k03M3J66j59L4J80j89Pj99K79J70k39J8Jn0J0n8m1K35k40L13k25Q4J11
$$ 28 88 -115 -72 94 -65 -31 149 -40 -33 -232 47 217 -22 -4 -3 -53 -43 -101 -142 93 -147 166 -59 25 136
7469A36r6j51K64m57M44k14j22J72O1m6j6K15k68J72k23J55J00r9l8q3K26n7k63
$$ 136 40 -111 153 -304 140 -74 -196 -24 37 -9 -25 190 -78 94 -129 26 126 27 -11 -94 132 75 -188
7492a88M15p03N78R9J3k7l74J11M6J34j59j20L32o1p4lo7l6M2N3O2n6j73L17m83
$$ -188 227 -476 102 201 214 187 -187 -76 -30 104 -55 -175 157 96 22 19 -48 -84 -42 11 73 17 -156 161 -322
7517c22K05m7k38L85L6q8M26m05n8J9J70r4o5j05K07O6j42J89k64k1J15J01L2
$$ -322 -117 -164 -402 -17 19 -69 357 -48 -106 -87 83 -11 -76 -181 26 92 -50 139 -125 -146 -31 70 102
7540A02m01N61k87m6k03J76m6M52K6n14K39j93M13j81k9j35P3m9j64L15J25N6
$$ 102 -299 262 -25 -71 -274 -98 -144 308 334 -180 59 -134 279 98 69 -66 7 -42 -206 109 234 290
7562B90Mj96p7K04j70K17m88K44J70l49K86m80K24J2L66j64k58J80k28M68k33
$$ 290 294 98 21 225 55 272 -216 28 198 -151 135 -345 -121 -109 257 93 -165 15 -213 255 22
7583B2r7L08l36Q7m23K88M00k47J97l44l6J17K66l90O2J79l5k82P8l1N93j24j4
$$ 22 -75 233 -103 -16 -439 -151 249 2 199 -145 -181 -64 202 -188 -126 53 18 -264 -186 -217 376 252 238
7606B38J42l64J20q1Jj71J0R4J9R1L12k14k78M1o5L80l10n9M11l27lj63J53l7
$$ 238 380 16 136 55 56 -115 -105 -11 8 99 411 197 -81 -40 -105 275 -35 -94 317 -10 -13 -176 -23 -60
7630f0M09m01j47K62m17L31J56l50l6M07l0P6l24R9j80j27L50p7J29j05j4P7J73
$$ -60 349 -52 -199 63 -354 -23 133 -217 -253 154 124 200 -124 -25 -205 -332 18 -59 70 -35 -49 28 201
7653B01l07K26k36M5J62r3k44M4pK46m0J1J0k08j2K78Q3r4L1m36N73m00J94k11
$$ 201 -106 120 -116 -71 91 -2 -246 -202 -209 37 -3 8 18 -190 -202 76 159 65 96 -340 233 -167 27 -184
7677a84J79M05m99k0J6j8j0K41P9k94K6J83j63K66k89j70M87j75k94K30J85o73
$$ -184 -5 400 -99 -119 -103 -121 -131 110 189 -105 -79 104 -59 207 -82 -252 235 60 -234 -4 181 -492
7699d92O80j06q4q4K32l0l49K7K39P9q7K4Ok32K01P6m4J47J18o59nM28m1j65R5
$$ -492 188 82 -2 -86 146 116 -233 -206 33 112 25 49 55 -177 24 100 56 203 321 -338 -343 85 44 -121 -26
7724b6J55j24j73J37j57J01J64j65J7L04j81m67L19L4N9j67J90k90J71KK58j48
$$ -26 129 5 -168 -31 -188 -87 77 -88 -71 233 52 -415 -96 -62 -3 -170 20 -270 -99 -97 161 13
7746A3N5L48k81l66K78K4J66r9j78j13R5j13j3J49J91k43r7p0J66Q1M7k03K31
$$ 13 68 416 135 -231 47 71 237 138 -40 -153 -58 -171 -184 -35 156 -87 -184 -254 -88 -7 40 -163 68
7769F8q7r9M37o6k4k18J66l98K6R5J24K27j69J45j26L4j40l11L14K20j70J56m29
$$ 68 -19 -118 319 253 229 11 177 -221 -195 -100 24 251 82 227 101 135 -5 -316 -2 218 48 204 -225
7792b25Q8N7j6J25j21J86m2j38R9R1p0j63J91q4k25L62k23k1K34r2k16K59n1J44
$$ -225 -137 -80 -96 29 -92 94 52 -86 13 104 34 -129 62 -22 -247 115 -108 -129 105 13 -203 56 5 149
7816A49k90J65j3J14k54N6j07J21K45j96K51m71J90J41j27j28J86j31J17mN4O4
$$ 149 -141 24 11 125 -129 -73 -180 -59 186 -10 241 -230 -40 101 -26 -154 32 -99 18 14 68 132
7838A32j61K3k37J38Rp1J65M7O3r2K8j86M9r9M3J72J77l13K01j06p0K48J67k52
$$ 132 -29 -6 -243 -105 -96 -167 -2 45 108 16 44 -142 -93 -192 -149 23 200 -113 88 -18 -88 160 327 75
7862G5k19J51R1m2l96M07k6j55N20k82j53K5p7M06m82J77J26o3m3J82j59q6k69
$$ 75 -144 7 98 56 -340 67 41 -114 406 124 -29 -4 -81 325 -157 20 146 83 40 222 63 -23 -292
7885b92jJ02L2J89j11J38k16K8J94J82j91J56Q9j74j17k15M83k42K4K39k99j89
$$ -292 -293 -191 -159 30 -81 57 -159 -131 63 245 54 210 299 125 8 -207 276 34 58 297 -2 -191
7907a91K66k07j48M34ml00M02j34m18L99n5k24K30k12J10n9K89j76j45j13J76
$$ -191 75 -132 -280 154 150 -150 252 118 -300 99 44 -180 50 -162 -52 -111 178 2 -143 -256 -80
7928h0k31M80j41o2J36j09J4N5Kk12K21o6K43p7k43K02j25k3K24j13k80J47j78
$$ -80 -311 169 28 -34 102 -7 7 62 64 -148 73 7 250 173 -70 132 7 -16 208 95 -185 -38 -216
7951b16J88o8J12J50o8o8Q3k05j78L84j18R9k73J5J11R0j30q7L79j0j54J32j7
$$ -216 -28 -96 16 166 98 30 113 -92 -270 114 -4 95 -178 -163 -52 38 -92 -179 200 190 36 168 151
7974A51l29K31m3k56L39r7j17K98j94j2j31L7M1L31m30L54j01j88K62Pq5j71L2
$$ 151 -178 53 10 -246 93 -4 -121 177 -17 -29 -160 -123 -82 249 -181 173 72 -116 146 153 68 -103 -71
7997g1o9j9j26J61M50j68j43O8k33J09L04k23p8J88J02l43M70m59K61P4l44J73
$$ -71 -140 -159 -285 -124 326 158 15 83 -150 -41 263 40 -38 150 252 -91 379 -80 181 255 -89 84
8019H4k71L91j59j4j84M3K55j56J45j00J68k92K0K21j06J07j73j27J06j23J51
$$ 84 -187 204 45 31 -153 -110 145 -11 134 34 202 -90 -70 151 45 152 -21 -148 -42 -165 -14
8040a4J38K1k52M2P3j94k1Q3J08k4J80k15J39k3l6j89K07o7J23k42J96J97l23
$$ -14 124 145 -107 -65 8 -186 -207 -124 -16 -40 140 -75 64 41 5 -184 23 -44 79 -163 33 230 -93
8063i3J99M2J22n7j82j79L52j32j34O2J40l5l69J8K73j47N5J8Q3J01k73r0J56
$$ -93 106 148 270 213 31 -148 204 72 -62 0 140 105 -264 -246 27 -120 -65 -47 36 137 -136 -226 -70
8086g0J69k79L03K0m22J86J12R5l49J44M43l11q9L1K0K32l20K48r9j6K27m25j20
$$ -70 99 -180 123 143 -279 -93 19 114 -235 -91 352 41 -48 -17 3 235 -85 163 64 48 275 -150 -270
8109b70K18j55N84k47L0j29j48k07L39J52M6k56o8Q1m19L62R5j05k28L11j08J33
$$ -270 -52 -207 377 130 160 31 -117 -324 15 167 213 -43 -111 -30 -449 -87 8 -97 -325 -14 -122 11
8131A1K20J51l09J41l76J59M8j56J20O3K7j49J24J07L08m78j82J55O0N7j32K4
$$ 11 231 382 73 214 -162 -3 45 -111 9 72 99 -50 74 181 489 11 -171 -16 44 101 -31 -7
8153gJ24j05q6J67J7q5J20k41L02k85K17k46p1k9J73K23k34K97j71n7j65M70l63
$$ -7 117 12 -74 93 110 25 145 -96 206 -79 138 -108 -179 -208 -35 188 -46 251 80 23 -142 328 -35
8176c5Q4q9L7j56jJ98kK01l70K12K03m43J86M0l16
$$ -35 49 -40 -3 -159 -160 38 36 237 -133 79 282 -161 25 65 -251
8191b51
$$ Imaginary data points
##PAGE= N=2
##DATA TABLE= (X++(I..I)), XYDATA
0@%%%%%%Qj6J6j6J6k4L2m0N2o0P2q8J04j20J40j64J90k20K54k92L34l78M28m86
$$ 0 0 0 0 0 0 0 8 -8 8 -8 8 -16 16 -24 28 -32 40 -48 56 -64 76 -88 102 -118 136 -156 178 -200 228 -258
30b58N48o16O91p73Q64r63J073j192J323j470J628j802J995k208K445k711L012
$$ -258 290 -326 365 -408 456 -507 566 -626 697 -773 855 -947 1048 -1160 1285 -1426 1586
47A586l352L739m191M721n352O122p084Q324r996J2395j6140K2869l8742J43589
$$ 1586 -1766 1973 -2218 2503 -2849 3273 -3811 4513 -5483 6912 -9228 13641 -25101 118488
61A18488J28720k25748j12284K0964J04638L280k2320K6341R1979L2037m6065
$$ 118488 247208 21460 -90824 -69860 34778 38058 15738 42079 134058 166095 120030
72A20030p3737j8119O526j2088m2284l115N7731P9722K6337k2474k9679j2944
$$ 120030 46293 28174 34700 22612 -19672 -22787 34944 114666 141003 118529 88850 75906
84G5906k8376m6761k9874K0989M4800K9631J0568K1798L1097j094o3668q5344
$$ 75906 47530 769 -29105 -8116 36684 66315 76883 98681 129778 128684 65016 -20328
96b0328l3516M0323N6122J7998q063J1191L2369J2976l0117n2297l8715p433J5283
$$ -20328 -53844 -13521 42601 60599 52536 63727 96096 109072 78955 26658 -12057 -19490 -4207
109d207J6970J0999K2285L9811K6794k3268n8892m3779p443P103L022J1693L0460
$$ -4207 12763 23762 46047 85858 112652 89384 30492 -13287 -20730 -13627 -10605 1088 31548
122C1548L4088J6050r623k8355l5760k7073r994L638J2719K3915K7018J3473l649
$$ 31548 65636 81686 72063 43708 7948 -19125 -29119 -25481 -12762 11153 38171 51644 47995
135D7995o844q747k5233l9540k3468J4471L6093K5518Q248M856Q831k976l0995
$$ 47995 41151 32404 7171 -32369 -55837 -41366 -5273 20245 28493 33349 42180 39204 8209
148H209m5772k5555J2354L1438J9708O498J2283J6204j724k9447l5051j6898J118
$$ 8209 -37563 -63118 -50764 -19326 382 6880 19163 35367 33643 4196 -30855 -47753 -46635
161d6635N994Q903J6240K2682J8385K627j5862k6484k6509j8278l267J5010K7407
$$ -46635 -40641 -31738 -15498 7184 25569 28196 12334 -14150 -40659 -58937 -62204 -47194 -19787
174a9787K3204Q560j051k751j0834k4573k7256j1185P464J8173K0692K1155J2702
$$ -19787 3417 11977 10926 8175 -2659 -27232 -54488 -65673 -58209 -40036 -19344 1811 14513
187A4513l381j5286j9093j9238j6287m798J0285J9109J8867J6598J0462j752j7183
$$ 14513 11132 -4154 -23247 -42485 -58772 -63570 -53285 -34176 -15309 1289 11751 9999 -7184
200g184k5828k4186j3404M394K2089K6363J7504O098o71p143j7584k2723j7242
$$ -7184 -33012 -57198 -70602 -66208 -44119 -17756 -252 5846 5175 -1968 -19552 -42275 -59517
213e9517m855P795J6992K2707K0786J0232n094j8294k3779j9175r137R34J0770
$$ -59517 -64372 -56577 -39585 -16878 3908 14140 9046 -9248 -33027 -52202 -61339 -60405 -49635
226d9635K0392K4412J5949J736j0167j7237k1659k0460q859Q749K1373K2637J7274
$$ -49635 -29243 -4831 11118 12854 2687 -14550 -36209 -56669 -65528 -56779 -35406 -12769 4505
239D505Q194j738j1568j8716k2386j5983k759J2366K1327K2125J8359R285o940
$$ 4505 12699 10961 -607 -19323 -41709 -57692 -60451 -48085 -26758 -4633 13726 23011 16071
252A6071k1792k5816j6722n050M150J3194K1030K1829J4782J708j1836k0204k0820
$$ 16071 -5721 -31537 -48259 -53309 -49159 -35965 -14935 6894 21676 23384 11548 -8656 -29476
265b9476j5530n873P034J9645K4994K0523P873m822j4712k0099k0825j3355p00
$$ -29476 -45006 -50879 -43845 -24200 794 21317 29190 24368 9656 -10443 -31268 -44623 -45323
278d5323J4099K2832K2435J5379N616p273j8614k3589j9528o324P925J5885J9149
$$ -45323 -31224 -8392 14043 29422 35038 27765 9151 -14438 -33966 -40290 -32365 -16480 2669
291B669K0477J5076K297j3234k1816k0290j4594m695Q631K0143K3740J8785Q355
$$ 2669 23146 38222 40519 27285 5469 -14821 -29415 -34110 -25479 -5336 18404 37189 45544
304D5544m888j5789k1831j9882j0308J411J2193K0376K2123J5855L742q051j7895
$$ 45544 40656 24867 3036 -16846 -27154 -25743 -13550 6826 28949 44804 48546 40495 22600
317B2600k1852j7578o898N323J5397K0342J9672J3006R19j2115k0302k1057j5257
$$ 22600 748 -16830 -23728 -18405 -3008 17334 37006 50012 50931 38816 18514 -2543 -17800
330a7800l754Q823J9259K1991J6688O499m435j4522k0426j9432j0101J717J0850
$$ -17800 -21554 -12731 6528 28519 45207 51706 47271 32749 12323 -7109 -17210 -15493 -4643
343d643J6837K0502J6648L910j0257j7824j8803j5927r121L023J6263K0841J6745
$$ -4643 12194 32696 49344 53254 42997 25173 6370 -9557 -18678 -15655 608 21449 38194
356C8194R220P05r785j9708k0901j2927j732Q083J4809J8233J6147O538n634j3432
$$ 38194 47414 48119 38334 18626 -2275 -15202 -16934 -8851 5958 24191 40338 46876 41242 27810
370B7810j7396j6767j0804o17J0519J7557J7407J2312L233o757j6555j8977j4558
$$ 27810 10414 -6353 -17157 -17774 -7255 10302 27709 40021 43254 36497 19942 965 -13593
383a3593n743M164J1666J6590J6741R677j854j1108j6115j5766j1355l630O503
$$ -13593 -19336 -15172 -3506 13084 29825 39502 37648 26540 10425 -5341 -16696 -20326 -13823
396a3823J4595J7056J2159M255l556j0927j6266j5567q778J716R853J3449J4548
$$ -13823 772 17828 29987 34242 30686 19759 3493 -12074 -20852 -19136 -9283 4166 18714
409A8714J1055K822q020j4735j4794j0694n555K835J1807J5870J2639N301j549
$$ 18714 29769 32591 24571 9836 -4958 -15652 -21207 -18372 -6565 9305 21944 27245 25696
422B5696q449j3787j4112r594p58O520J1842J3734J0580L197m807j0941j3109
$$ 25696 17247 3460 -10652 -20246 -21004 -14484 -2642 11092 21672 24869 20062 9121 -3988
435c988j1950o493J784R545J2993J1664P172M31p255j2476j2822r104k452N139
$$ -3988 -15938 -22431 -20647 -11102 1891 13555 20727 21158 13903 1427 -11395 -20499 -22951 -17812
449a7812J0410J1987R860L626k563q001j2482j2211o369J183P212R912J1222Q311
$$ -17812 -7402 4585 14445 18071 15508 7507 -4975 -17186 -23555 -22372 -15160 -5248 5974 14285
463A4285J823o370j1504j0619q614m249K051J0475J2458Q724L064j708o123j0872
$$ 14285 16108 9738 -1766 -12385 -20999 -25248 -23197 -12722 -264 8460 11524 9816 3693 -7179
477g179j1567p473k09O027R869J1152Q478J815n591q836j0952r706m955K705R652
$$ -7179 -18746 -26219 -26428 -20401 -10532 620 9098 10913 5322 -3514 -14466 -24172 -29127 -26422 -16770
492a6770J1261Q031M181p0n132j0297j1904q062n86N753R382J0755P792K648k995
$$ -16770 -5509 2522 6703 6633 1501 -8796 -20700 -28762 -29348 -23595 -14213 -3458 4334 6982 3987
507C987q753j0605r075m779J106O190J0515J1377P114n41o579q976r775p950l424
$$ 3987 -4766 -15371 -24446 -29225 -28119 -21929 -11414 -37 7077 6536 -43 -9019 -18794 -26744 -30168
522c0168L906J0000J1701Q386K754k810o343q707r643p291r48P321J1760J0664
$$ -30168 -26262 -16262 -4561 3825 6579 3769 -2574 -11281 -20924 -28215 -29163 -21842 -10082 582
536E82N983Q79l666p272j0174r874m355L706R081J0540Q765N568L52o042j0550
$$ 582 6565 7444 3778 -3494 -13668 -23542 -27897 -24191 -15110 -4570 4195 9763 10115 4073 -6477
551f477j0163o239k77M880Q579J0493Q845L150k591p753r856q327m858L61N780
$$ -6477 -16640 -22879 -23156 -18276 -9697 796 9641 12791 10200 2447 -7409 -15736 -20594 -20233 -14453
566a4453J0661J2480P036p05o047q078q129p464m505K847R513J1773Q798L344
$$ -14453 -3792 8688 15724 15019 8972 894 -7235 -14699 -19204 -16357 -6844 4929 13727 17071
580A7071j939o004q053q965p041j300O153J0641R428O446K446k657p255j0330
$$ 17071 15132 9128 1075 -7890 -14931 -16231 -10078 563 9991 16437 18883 16226 8971 -1359
594a359q032m202K291O613R729R165N708L49n201q742r371p219j306L897P791
$$ -1359 -9391 -13593 -11302 -4689 5040 14205 19913 20262 15061 6319 -3052 -10271 -11577 -7680 111
609A11R999Q405L288k913p394q264p283m355n11L954P887J0272Q176J500n066
$$ 111 10110 18515 21803 18890 11496 3232 -4051 -8406 -8917 -4963 2924 13196 21372 22872 17806
624A7806q766q711o805k850K243P228R026Q155L761r38n305p099q072p280k562
$$ 17806 9040 329 -6476 -9326 -7083 145 9171 17326 21087 20149 14844 7745 -327 -7607 -10169
639a0169M687R763R984N300J156k396o518p981p220l942N82N292P986Q067N467
$$ -10169 -5482 4281 14265 19565 20721 18325 11807 3826 -3394 -7336 -6754 -1462 6524 14591 20058
654B0058J593l370q647j0182p093j74M725O050O409O633M679o93n557q763p904
$$ 20058 21651 18281 9634 -548 -7641 -7815 -3090 2960 9369 16002 20681 19988 14431 5668 -2236
669b236m945r8M622P546Q088O433J722m121p359p506n519l092O63N250P575Q058
$$ -2236 -7181 -7279 -2657 4889 12977 19410 21132 17011 9652 2146 -3373 -6465 -5802 -552 7023 15081
685A5081N008M32n761q939p077m484k117K739P919Q850N483n94j573k837n946
$$ 15081 20089 20521 14760 5821 -1256 -5740 -7857 -5118 2801 11651 17134 16540 14967 12130 6184
700F184r266o987N46P580Q445N559K650J136q57n940j0357p731q69M650N439M979
$$ 6184 -3082 -10069 -9523 -1943 6502 12061 14711 15847 14990 9050 -1307 -9038 -9907 -5257 182 5161
716E161M953M960J168m665r585r214l376K025M328L773N494O799L353l983p813
$$ 5161 10114 15074 16242 11577 1992 -7222 -10598 -8573 -4245 -472 5022 11821 15174 11191 3378
731C378o328l343l847k436L415J0280Q810J994l110l619l655o144p191m500L545
$$ 3378 -2950 -6293 -10140 -12576 -9161 1119 9929 11923 8813 5194 1539 -4605 -11796 -16296 -12751
746a2751R271P625J666J37M67j059p310j0503n827L299P299N031K222L957L138
$$ -12751 -3480 4145 5811 5948 6415 5356 -1954 -12457 -18284 -14985 -7686 -2655 -433 3524 6662
761F662m73o946r310n024j500J756M103O324P163M001j799o570n630m325m389
$$ 6662 6189 -757 -10067 -15091 -16591 -14835 -10732 -4408 2755 6756 4957 -1613 -7243 -11568 -15957
776a5957k680L192P217O911L564N44j051l706o058p524l775P07N884P756M734
$$ -15957 -18637 -15445 -8228 -1317 2247 2791 1740 -1966 -8024 -15548 -19323 -18616 -12732 -4976 -242
791b42K145K14j469m803p045o230k464L480O463P059M871J298r79l769o266o047
$$ -242 1903 2117 648 -4155 -11200 -17430 -19894 -16414 -9951 -2892 1979 3277 2298 -1471 -7737 -13784
807a3784l390O32L363N545O408M854J126k197m718n514o408l736K123O040P127
$$ -13784 -17174 -16542 -13179 -7634 -1226 3628 4754 2557 -2161 -7675 -14083 -17819 -15696 -9656 -2529
822b529N037K367k86l303m938n111m672k391K400O999P338M549J61j023k578n304
$$ -2529 2508 4875 4589 1286 -3652 -8763 -13435 -15826 -13426 -6427 911 5460 5621 4598 2020 -3284
838c284o538m520N61N343N676N320L918J832k121n474o750m299j678J453M341
$$ -3284 -9822 -14342 -13781 -8438 -2762 2558 6476 8308 6187 713 -6037 -10336 -12014 -10561 -6220
853f220O639N994K302q26l454m770m689m417k135K615O021O794M731Q50k345l116
$$ -6220 419 6413 8715 7889 4435 -335 -5024 -9441 -11576 -8961 -2940 3854 8585 9435 7090 3974
869C974m754m663m966k49M638O919N344L158N16k528n038n147l398j664P47L600
$$ 3974 -780 -5443 -10409 -10658 -6020 899 6243 9401 9917 7389 2351 -2796 -6194 -7858 -7111 -3511
885c511N974M898K243k19j850m803o224m561l89L178O164N035K749R55n38k764
$$ -3511 2463 7361 9604 9385 7535 2732 -3492 -8053 -8442 -5264 900 5935 8684 9639 9101 6337
901F337n579n241k183O11L142M858M971M552j5l540n405l338j739j317j41K599
$$ 6337 758 -4483 -6666 -6055 -2913 1945 6916 11468 11453 7913 2508 -830 -2569 -3886 -4027 -1428
917a428N365N620K603j551l435l340m054m154p25L305O468L847J324r7l92j808
$$ -1428 3937 9557 12160 10609 7174 3834 -220 -4374 -5099 -1794 4674 8521 9845 9748 9356 7548
933G548m008m279k674R21L439M397L868K098K08k229l898m313k028K02J136K268
$$ 7548 3540 -739 -3413 -2492 947 5344 9212 11310 11518 9289 5391 1078 -950 -748 388 2656
949B656L590M477K155j237l696m544l155j349N85K942L433L147J826j60j790k407
$$ 2656 6246 10723 12878 11641 7945 3401 246 -1103 -518 2424 5857 9004 10830 10670 8880 6473
965F473k853k927j581O47L097L747L400J522j365k832l216k973k000k10K415L353
$$ 6473 3620 693 -888 -241 2856 6603 10003 11525 10160 7328 4112 1139 -861 -1071 1344 4697
981D697L218J330P12j336l271m164k664l77J256K542L115K478J377j105k035l011
$$ 4697 7915 9245 9957 8621 5350 1186 -1478 -1855 -599 1943 5058 7536 8913 7808 5773 2762
997B762k977k752o41K738K787L022K248P18j656l578l798k831n31Q71K372K829
$$ 2762 -215 -2967 -3608 -870 1917 4939 7187 7905 6249 2671 -1127 -3958 -4489 -3618 -1246 1583
1013A583L363J398q97k697l334k841k586m17J907L505K869J810M50l86l346l861
$$ 1583 4946 6344 5447 2750 -584 -3425 -6011 -6428 -4521 -1016 1853 3663 4113 3727 381 -3480
1029c480k996j085K72K138L555L892J610n16k543l349l565k346q04J712L021L603
$$ -3480 -6476 -7561 -7289 -5151 -1596 2296 3906 3390 847 -2502 -6067 -8413 -9217 -7505 -4484 -881
1045h81K753J125j108k822l813l393j672Q5K594L555L318K281O14j801l517l904
$$ -881 1872 2997 1889 -933 -4746 -8139 -9811 -9726 -7132 -3577 -259 2022 2636 835 -2682 -6586
1061f586k939j142J186K985M001L390J376n31k525l699l428k185p12K057L327
$$ -6586 -9525 -10667 -9481 -6496 -2495 895 2271 1740 -785 -4484 -7912 -10097 -10809 -8752 -5425
1076e425M251K693R90j037l095l968l616j406O96K448L613L800K630L22j779l797
$$ -5425 -1174 1519 2509 1472 -1623 -5591 -9207 -10613 -9917 -7469 -3856 -56 2574 2896 1117 -2680
1092b680m083l076n49J298L131M224L260J662m76k328l761m179k070l87K509L006
$$ -2680 -6763 -9839 -10388 -9090 -5959 -1735 1525 3187 2711 383 -3378 -7557 -9627 -10014 -7505 -4499
1108d499L861L858Q78j531l845l515k421k420N5L118M294L473K375L22j818l304
$$ -4499 -638 3220 4098 2567 -1278 -4793 -7214 -9634 -9579 -6461 -2167 1306 3681 4003 2185 -1119
1124a119m446k999m00J421K632L865L618J644K4l037l746l490k658j48K348L441
$$ -1119 -5565 -8564 -8964 -7543 -4911 -1046 2572 4216 4240 1203 -2543 -6033 -8691 -8839 -6491 -3050
1140c050L816K657J303j156k628m292l419j484M70K486L822M113K325j81j672
$$ -3050 766 3423 4726 3570 942 -3350 -6769 -8253 -7783 -5297 -1475 2638 4963 4782 3110
1155C110k985l807k914j166J247L047L562L695K275p70k721l220l062k544n76
$$ 3110 125 -3682 -6596 -7762 -6515 -3468 94 3789 6064 5294 2573 -647 -3709 -6253 -6829
1170f829J996L479L450L236J193r33k505l553l067j356k24J977L661M029K227
$$ -6829 -4833 -1354 2096 5332 6525 5592 3087 -466 -3533 -4889 -5113 -3136 525 4554 6781
1185F781N0j050k693l229k981j536Q60L217L555K923J579p5j176l181l602k403
$$ 6781 6831 5781 3088 -141 -3122 -4658 -3798 -581 2974 5897 7476 7401 6225 3044 -558 -2961
1201b961J36J523K629L247K916J272q81k187k948k492j208l28J485K631L771K667
$$ -2961 -2825 -1302 1327 4574 7490 8762 7881 5694 2746 254 -954 -1282 203 2834 6605 9272
1217I272m8j868k091k129k227j761M52K437L476K279J235m67j331j966k665k393
$$ 9272 9224 7356 5265 3136 909 -852 -400 2037 5513 7792 9027 8560 7229 5263 2598 205
1233B05k73J202K589K508J595P56l80j616k881k207j254N57Q05J953K881J754
$$ 205 -68 1134 3723 6231 7826 8582 8202 6586 3705 1498 244 801 1606 3559 6440 8194
1249H194m5j271j957k070j366j018K19J047K084K317R94r05j372j501j405j560
$$ 8194 8149 6878 4921 2851 1485 467 686 1733 3817 6134 7128 6223 4851 3350 1945 385
1265C85j150R72J700K424J082%p90j326j755j405j735N41J662J900Q29M46j07
$$ 385 -765 207 1907 4331 5413 5413 4623 3297 1542 137 -1598 -1057 605 2505 3334 3780 3673
1282C673m77j558j747j336l97K82J504J316J543K53m48j641j672j335k31L87M00
$$ 3673 3196 1638 -109 -1445 -1842 -1560 -56 1260 2803 3056 2608 967 -705 -2040 -2271 -1884 -1484
1299a484J528J112J163l66j842j334o56r93J79O63Q77R10J531J14p63j600j120
$$ -1484 44 1156 2319 1953 111 -1223 -1879 -2872 -2693 -2030 -1153 -243 1288 1402 639 -961 -2081
1316b081o12n82m44R91J671J692J80l96j301j321j157r09K27Q28J653J220R18
$$ -2081 -2693 -3275 -3719 -2728 -1057 635 815 419 -882 -2203 -3360 -4269 -4042 -3214 -1561 -341 577
1333E77l96n03j719j363r66k32O56J045J423J638M86m68j156j743j581j205O39
$$ 577 181 -322 -2041 -3404 -4370 -4602 -3946 -2901 -1478 160 646 178 -978 -2721 -4302 -5507 -4868
1350d868J476J138J595P83J075j221k465j695o96p07O28R20K055J945P24n14j366
$$ -4868 -3392 -2254 -659 124 1199 -22 -2487 -4182 -4878 -5585 -4957 -4037 -1982 -37 687 173 -1193
1367a193j663j655r07p01R36J514K880J258L79o75j741k086k389q50N55K103K109
$$ -1193 -2856 -4511 -5418 -6119 -5183 -3669 -789 469 848 173 -1568 -3654 -6043 -6893 -6338 -4235 -2126
1384b126J659P35J60o84j740l097j362J22R79R80J860K391J208o20j713k135j889
$$ -2126 -467 268 428 -256 -1996 -5093 -6455 -6333 -5354 -4374 -2514 -123 1085 465 -1248 -3383 -5272
1401e272j168k33R72K261K222J987N32q91k495k099j163j173j48J577K765K231
$$ -5272 -6440 -6673 -5701 -3440 -1218 769 1301 410 -2085 -4184 -5347 -6520 -6668 -5091 -2326 -95
1417i5Q34j86m83j283k449k038j009J016K128K283J652J643N8j405k605k324j077
$$ -95 739 553 70 -1213 -3662 -5700 -6709 -5693 -3565 -1282 370 2013 2071 666 -1939 -4263 -5340
1434e340n9J010J899K784J955N67n45j326k406k268j006L94J672J898K354J709
$$ -5340 -5399 -4389 -2490 294 2249 2816 2271 945 -1461 -3729 -4735 -4341 -2669 -771 1583 3292
1450C292N62p86k262j845j929j005N84K359K698J960J004k11r77k150k223j095
$$ 3292 3854 3068 806 -1039 -2968 -3973 -3389 -1030 1668 3628 4632 4421 3444 1294 -929 -2024
1466b024l14O42K033K744J461J046j95j670j735k078j180M3J068K024K685J396
$$ -2024 -2338 -1696 337 3081 4542 5588 5393 3723 1988 -90 -1270 -1227 -159 1865 4550 5946
1482E946N42o04j559k612j997r11R49J650J977K185Q12L82r14j442k350j989l36
$$ 5946 6488 5884 4325 1713 -284 -1195 -246 1404 3381 5566 6378 6760 5846 4404 2054 65 -271
1499b71N61K003J915K002Q56k96j528k218j435j567r9R27J870K541J061O07j060
$$ -271 290 2293 4208 6210 7066 6770 5242 3024 1589 22 -77 850 2720 5261 6322 6929 5869
1516E869j514k238j104j183K40J415J597J502J029N61q22j531k354j469o76M84
$$ 5869 4355 2117 1013 -170 70 1485 3082 4584 5613 6174 5352 3821 1467 -2 -678 -194
1532a94J670K024J214N24k83p51j810j750j391L37L26R88J965J440P45r72j493
$$ -194 1476 3500 4714 5238 4955 4204 2394 644 -747 -410 -84 904 2869 4309 5054 4082 2589
1549B589j594j695p3L17L87J259J572J125K12j249j536j176j083m45o9J233J756
$$ 2589 995 -700 -773 -456 -69 1190 2762 3887 4099 2850 1314 138 -945 -1390 -1459 -226 1530
1566A530J156K42m63p87j145r95j079j51J87J408J458P36M62l40j016j198j398
$$ 1530 2686 2928 2465 1678 533 -462 -1541 -1692 -1505 -97 1361 2097 2559 2219 1203 5 -1393
1583a393p33K26J065R40J096K80M03m88j250j547l45o3J79R56P37R83N3L20j237
$$ -1393 -2126 -1900 -835 105 1201 1481 1884 1396 146 -1401 -1746 -1809 -1630 -674 63 1046 1099 1419 182
1602A82j146n12n58k02N47O59J247N49K32j004n38o83q52k19K32O55R94M37M5
$$ 182 -964 -1476 -2034 -2236 -1689 -1030 217 766 998 -6 -544 -1227 -2079 -2298 -2066 -1411 -417 20 65
1621F5l72j36r12j076n5q0P12P15L79O02k09k43o47j095n53K95m8M49J060M96
$$ 65 -307 -443 -1355 -2431 -2486 -2566 -1854 -1139 -760 -158 -367 -610 -1257 -2352 -2905 -2610 -2658 -2209 -1149 -653
1641f53K39o99o58l29j034l62M27L90P93M85M77j18p34q80o23n39j07M12J208
$$ -653 -414 -1113 -1771 -2100 -3134 -3496 -3069 -2679 -1886 -1401 -924 -1042 -1776 -2656 -3279 -3818 -3925 -3513 -2305
1660b305L39Q98J43p56n09j074n56j72k18R56O79Q70M64k09q96l61r64m45k2J91
$$ -2305 -1966 -1068 -925 -1681 -2190 -3264 -3820 -3992 -4210 -3254 -2575 -1705 -1241 -1450 -2346 -2707 -3671 -4116 -4138 -3947
1680c947Q30J218Q98R0k76r55r26r39l82M35O18J336Q54L30J33l43j125o03j207
$$ -3947 -3117 -1899 -1001 -911 -1187 -2142 -3068 -4007 -4389 -3954 -3336 -2000 -1146 -816 -683 -1026 -2151 -2754 -3961
1699c961M5P41P64J212P98O60k48o72j065j034m61K68N97R01J118J259J56p61
$$ -3961 -3916 -3175 -2411 -1199 -401 259 11 -661 -1726 -2760 -3221 -2953 -2356 -1455 -337 922 1078 317
1717C17l10j156r91n07L90J008J357R73R32k09l82j058j270n71l02O94R51J092
$$ 317 7 -1149 -2140 -2647 -2257 -1249 108 1081 2013 1804 1422 364 -906 -1477 -1779 -1085 -134 958
1735I58J352L70K9j207q94j112m63q6J062J087R62R48L46r3j087j333j184j30
$$ 958 2310 2680 2709 1502 608 -504 -967 -1053 9 1096 2058 3006 3352 3259 2172 839 -345 -475
1753d75J29N36J329J599N79l28m90q30j262o81o06M58Q38J454J128O04l50p41
$$ -475 -346 190 1519 3118 3697 3369 2879 2049 787 106 -500 -42 796 2250 3378 3982 3632 2891
1771B891r55j126q60rO17J161R41N71R17p10q37q61j344o03M47O82N94J582N27
$$ 2891 1936 810 -50 -59 558 1719 2660 3231 4148 3438 2601 1740 396 -207 240 922 1516 3098 3625
1790C625o5K5j725j139q3n73r1P65J328P05O97n1o92j400p28o68l60O47R65J074
$$ 3625 3560 3585 1860 721 638 65 -26 739 2067 2772 3469 3418 2726 1326 598 -70 -430 217 1182 2256
1810B256N00M04m07q51q76p96p74Q5J023N87J064N62j10J25j552p90r06L19L2
$$ 2256 2756 3160 2753 1902 1026 230 -544 -459 564 1151 2215 2777 2667 2792 1240 450 -456 -137 -105
1829a05N88J011J105M71m78m40j041r50n34L8K77J147O57N99J99j14r74q61p13
$$ -105 483 1494 2599 3070 2592 2152 1111 161 -373 -335 -58 1089 1746 2345 2544 2430 1456 595 -118
1848a18n68J1J041O58J023K87J52p06q62o33q02l30M48R83M36P32M82k19q43p79
$$ -118 -686 -675 366 1024 2047 2334 2486 1780 918 285 -517 -847 -399 584 1020 1752 2234 2015 1172 393
1868C93r70k60n5N08R22R77L56p2l64n42j057o47j69J1P73P60P00j0j65j77o44
$$ 393 -577 -837 -892 -384 538 1515 1871 1799 1435 893 -164 -811 -980 -969 -196 564 1264 1254 1089 912 268
1889B68r65p84J96K06Q29O32K93L75J1j097r99l24n21L34L45O65L69M63L39l52
$$ 268 -697 -1481 -1285 -1079 -250 382 675 1050 1061 -36 -1035 -1359 -1880 -1546 -1201 -536 -167 296 635 283
1909B83j126n71q21k00N54L87Q49O16k48j08k68p91q41n60K70J64P22M48M94K04
$$ 283 -843 -1414 -2235 -2435 -1881 -1494 -645 -29 -277 -385 -653 -1444 -2285 -2845 -2575 -2411 -1689 -1241 -747 -543
1929e43j15n84p84q25m09M17O80K57P72J48L45n21p58r23k87J84K59N57P19M09
$$ -543 -658 -1242 -2026 -2851 -3260 -2843 -2163 -1906 -1134 -986 -641 -1162 -1920 -2843 -3130 -2946 -2687 -2130 -1411 -1002
1949a002M6K6q63n54q1o60K70N44N36P43N46j38m80n71o13m76j19N04N66M82M65
$$ -1002 -956 -930 -1793 -2347 -2428 -3088 -2818 -2274 -1738 -995 -449 -587 -1067 -1638 -2251 -2727 -2846 -2342 -1776 -1294 -829
1970h29M25l21L7r56p16k20L88N11J51Q33P37l4q9o96p77j05m41K47Q16N79K78
$$ -829 -404 -725 -688 -1644 -2360 -2580 -2192 -1681 -1530 -697 40 6 -83 -779 -1556 -1661 -2102 -1855 -1039 -460 -182
1991a82O82K4p12p28k50k75o8M97O31L01P40K13k74j95m18r55J23l55N44J013
$$ -182 500 524 -188 -916 -1166 -1441 -1509 -1012 -381 -80 660 873 599 404 -14 -969 -846 -1201 -657 356
2011C56M35K58Q9l9j135j74o00k9K03O36R30M05M0k05l84l16o12l78N4J5N87P32
$$ 356 791 1049 1138 1099 -36 -210 -810 -839 -636 0 930 1335 1375 1170 786 470 -142 -520 -466 -451 136 868
2033H68K31M59j10q64p60k18k41K36O50L17N60L04K87k75r16n80k36j93K84J38
$$ 868 1099 1558 1448 584 -176 -394 -635 -399 251 568 1128 1432 1719 1444 528 -52 -288 -481 -197 -59
2053e9J091K27L73k17n35k71n54k69j8L72L00P86K38l28j5k57n18o74k13O24J75
$$ -59 1032 1259 1632 1415 880 609 55 -214 -232 140 440 1226 1464 1136 1121 864 346 -328 -541 83 258
2074B58M74O28K16M4m60k56o55o50M24J98J71P40J14K92J01k80o11l39Kl83L40
$$ 258 732 1360 1576 1620 1160 904 249 -401 23 221 392 1132 1246 1538 1639 1359 748 409 411 28 368
2095C68L41Q03K74K25p10l05k37n58K90pL22N20L31N9L9r3m09o45k15L7J59Q91
$$ 368 709 1512 1786 2011 1301 996 759 201 491 484 806 1326 1657 1716 1755 1662 1253 608 393 430 589 1480
2117A480l79P90J80l97k33m00l39j70N47L70k33O19J93l50k0m36k94m82K96K00
$$ 1480 1101 1891 2071 1674 1441 1041 702 532 1079 1449 1216 1835 2028 1678 1658 1222 928 446 742 942
2137I42L45K01K4L38n5q83j08l94L1N9J0O13L15k02J47q0m77o44M7j17r5M16O99
$$ 942 1287 1488 1512 1850 1795 912 804 410 441 500 510 1123 1438 1236 1383 1303 826 182 229 112 17 433 1132
2160A132J93k91k44R1r34l04j06J28L64K21K52M25j30q64j39j78m09%L39JO91
$$ 1132 1325 1034 790 881 -53 -357 -463 -335 29 250 502 927 797 -67 -206 -384 -793 -793 -454 -453 238
2181B38J2J62l91j3q99l18j90K40K45N69J80K19P5l60p50l59k06j25K43K46L44
$$ 238 250 412 21 8 -891 -1209 -1399 -1159 -914 -345 -165 54 129 -231 -981 -1340 -1546 -1671 -1428 -1182 -838
2202h38M97L46l72j84q31k60k10j83M13K86Q16J91J82l65n25n73j24l32K51N93
$$ -838 -341 5 -367 -551 -1382 -1642 -1852 -2035 -1622 -1336 -520 -329 -147 -512 -1037 -1610 -1734 -2066 -1815 -1222
2222a222j7P95K08j71m10o44q3l78o17P40M83O15M86Q7j10m36j85j000J85l20
$$ -1222 -1239 -444 -236 -407 -817 -1461 -1544 -1922 -2539 -1799 -1316 -701 -215 -128 -238 -674 -859 -1859 -1674 -1994
2242a994K98O54O75K27M92l11n41o31l03n31K73J45R07O00K88p9k91m14n60n34
$$ -1994 -1696 -1042 -367 -140 352 41 -500 -1131 -1434 -1965 -1692 -1547 -640 -40 248 169 -122 -536 -1096 -1630
2262a630J8J21N24L61Q46P0k7l70l67n13n61J32L14N18M24O15K24k55l41q33k36
$$ -1630 -1612 -1491 -967 -606 240 310 283 -87 -454 -967 -1528 -1396 -1082 -564 -140 475 699 444 103 -730 -966
2283i66m76J75L90M65L48Q73l48j82m50m30l66l09j67Q44M61M81J94mk90l93l78
$$ -966 -1442 -1267 -877 -412 -64 809 461 279 -171 -601 -967 -1276 -1443 -599 -138 343 537 533 243 -150 -528
2304e28m39k47M10J85N44O78J72k89l20k19j033o4J15J04M03P13L37J25k03j75
$$ -528 -967 -1214 -804 -619 -75 603 775 486 166 -53 -1086 -1150 -1035 -931 -528 185 522 647 444 269
2324B69r19n1j33j6M95Q9P67K34J08o03on90l51K08r1M17N11M75J81R4n81j30
$$ 269 -650 -701 -834 -850 -355 -266 501 735 843 240 234 -356 -707 -499 -590 -173 338 813 994 1088 507 377
2346C77m94m84L86O3M06K18L59K44J5n30l72k80J56j80N62L17K87J45k1L55l61
$$ 377 -117 -601 -215 -152 254 472 831 1075 1090 560 188 -92 64 -116 446 763 1050 1195 1174 1529 1168
2367A168m26p1m33J86K84M12K74p8P5J06m79l27k04J25J91K81L51P4J10k31Rl48
$$ 1168 742 671 238 424 708 1120 1394 1316 1391 1497 1018 691 487 612 803 1084 1435 1509 1619 1388 1397 1049
2389A049l89Q1J60N1L57J13r1oK09m00R9l24j30J77k3N51m3J01l0k08k32l32N
$$ 1049 660 741 901 952 1309 1422 1331 1325 1534 1134 1233 909 779 956 933 1484 1441 1542 1512 1304 1072 740 745
2412G45k77K94L82n3q6M08k88j33p1l87rK22k42M33k65J81j5k0p0k92l16L06l6
$$ 745 468 762 1144 1091 1005 1413 1125 992 921 534 525 747 505 938 673 854 839 819 749 457 141 447 411
2435D11l5K08j48K08jj17l44n07K12N7Pl5M50m4l26J13j18ml98l43O79j2K3k74
$$ 411 376 584 436 644 643 526 182 -325 -113 -56 -49 -84 366 322 -4 109 -9 -13 -411 -754 -75 -87 -64 -338
2459c38m1L58k09j87j58j60N3L28K42J10l04O4l86m2l12M12j15J72J31m2K54l11
$$ -338 -379 -21 -230 -417 -575 -735 -682 -354 -112 -2 -306 -242 -628 -670 -982 -570 -685 -513 -382 -424 -170 -481
2481d81L3o0k60o7K3M10R1q0J30l43J41k79Nj96k4K23K49j04L79J11O0o35l10
$$ -481 -448 -508 -768 -835 -812 -402 -311 -391 -261 -604 -463 -742 -737 -933 -957 -734 -485 -589 -210 -99 -39 -674 -984
2504i84K06q5k03L64o9O07m6p0o6m22m26J84J08K2K60K13K94L4O5m32m1l75j04
$$ -984 -778 -863 -1066 -702 -771 -164 -210 -280 -346 -768 -1194 -1010 -902 -880 -620 -407 -113 -79 -14 -446 -487 -862 -966
2527i66j52J78N59L91N8j1L2l5r07l57P2K35J95L33K38L18l65k09n7m78j23J9
$$ -966 -1118 -940 -381 10 68 57 89 54 -853 -1210 -1138 -903 -708 -375 -137 181 -184 -393 -450 -928 -1051 -1032
2549a032j32M59K04N58N9j88k92l22m00j55k18L50M13N08k93M49J66m82o07pk34
$$ -1032 -1164 -705 -501 57 116 -72 -364 -686 -1086 -1241 -1459 -1109 -696 -188 -481 -32 134 -348 -955 -962 -1196
2570a196J60L5L06N31J82J48m28k10r0n55k06K93J02O91L15J83j97m3m24m81l04
$$ -1196 -1036 -1001 -695 -164 18 166 -262 -472 -562 -1117 -1323 -1030 -928 -237 78 261 64 21 -403 -884 -1188
2591a188j40M70J91K60O45K68k80j79m06l35K01l25j50R09p7N56L22l40m12Mn81
$$ -1188 -1328 -858 -667 -407 238 506 226 47 -359 -694 -493 -818 -968 -59 -136 420 742 402 -10 -6 -587
2612e87J55l42J80P70K21L03J76R8n98m30j55o4M57n8K23N51j9L33k13n80k52
$$ -587 -432 -774 -594 176 397 700 876 974 376 -54 -209 -273 184 126 349 900 881 1214 1001 421 169
2633A69M7l62M8L41N42L46K45J8j77n48m17M8j94K45P58q2N9R9M34m53r6m73l01
$$ 169 216 -146 -98 243 785 1131 1376 1394 1217 669 252 300 106 351 1109 1027 1086 1185 1619 1166 1070 597 296
2656B96L07J65J50J35K86J24L6k43j42p22K32k48K1M92J36K82j0l90q5j16p5n94
$$ 296 603 768 918 1053 1339 1463 1499 1256 1114 392 624 376 397 889 1025 1307 1297 907 822 706 631 37
2678C7L26L2M10J96K66p0m31j43j61l24J40M0pR6K40K98j43j02j49m94K76j10
$$ 37 363 395 805 1001 1267 1197 766 623 462 138 278 318 311 407 647 945 802 700 551 57 333 223
2700B23j78L11K54m5O7k79l71M45l00j12j07J15O4K64J47o3j88J45m00q7j35N1
$$ 223 45 356 610 565 632 353 -18 427 127 15 -92 23 87 351 498 435 247 392 -8 -95 -230 -179
2722a79J22M73l14Kq9K16k01n7l41K30j19Q6K3L79j56K80o17O4j79j49J61O7L34
$$ -179 -57 416 102 104 15 231 30 -27 -368 -138 -257 -171 -148 231 75 355 -262 -198 -377 -526 -365 -298 36
2745C6l59M19k71K13k59J59k71k56L21M11m49L92j00j47J43n35J86K15l00J56
$$ 36 -323 96 -175 38 -221 -62 -333 -589 -268 143 -306 86 -14 -161 -18 -553 -367 -152 -452 -296
2765b96L10p3J46k73p7j4K04o8P6j80J01Q0k35K07L63n00N1m3k48r4O37J2l30
$$ -296 14 -59 87 -186 -263 -277 -73 -141 -65 -245 -144 -64 -299 -92 271 -229 -178 -221 -469 -563 74 86 -244
2788b44K93j65r9L1j36K85l76L01K1R7k13k84q2J53K47l27j72M15Rk8j46j69K70
$$ -244 49 -116 -215 -184 -320 -35 -411 -110 -89 8 -205 -489 -571 -418 -171 -498 -670 -255 -246 -274 -420 -589 -319
2811c19k53k52J86J79K51j59j10J54q3j37q0l2j99J56n7L64q7qm4P7M0l22l91
$$ -319 -572 -824 -638 -459 -208 -367 -477 -323 -406 -543 -623 -655 -854 -698 -755 -391 -478 -486 -530 -453 -413 -735 -1126
2834a126Q4K80k38M34j48O39l77p0K0k94J19j97r1PO94k53M8K97m65j37J65j21
$$ -1126 -1042 -762 -1000 -566 -714 -75 -452 -522 -502 -796 -677 -874 -965 -958 -264 -517 -469 -172 -637 -774 -609 -730
2856g30k0K07j36J04L08J46l30j62L30m37jp6O5N42J18P6J87j90k46q8n0K1o2
$$ -730 -750 -543 -679 -575 -267 -121 -451 -613 -283 -720 -721 -797 -732 -190 -72 4 191 1 -245 -333 -383 -362 -424
2879d24J3L62J35J48Ml4j88J40j79k73j16J86L61J78N44l40l20j78j69K50J27
$$ -424 -411 -49 86 234 238 204 16 156 -23 -296 -412 -226 135 313 857 517 197 19 -150 100 227
2900B27k20K61J01M68j72N10l09n75N6n22O79k19J25J85j06M43J6j12k61k21j15
$$ 227 7 268 369 837 665 1175 866 291 347 -175 504 285 410 595 489 932 948 836 575 354 239
2921B39m6k7M33L67j1r1p9l00o6k07l5l2J59L59J78j76K87p1j82m79M7q6j2L05
$$ 239 193 166 599 966 955 864 785 485 419 212 177 145 304 663 841 665 952 881 699 220 267 181 169 474
2945D74k07L61K22K0l27k6l62k4j74P3L39J10J61k30M51m35m67Q3j42j49L11Q2
$$ 474 267 628 850 870 543 517 155 131 -43 30 369 479 640 410 861 426 -41 42 -100 -249 62 144
2967A44K89n2L53k6l57k56Qk24K2L48j49L21j54k4J26P6k77k65o4J39k51M92L47
$$ 144 433 381 734 708 351 95 103 -121 -99 249 100 421 267 243 369 445 168 -97 -161 -22 -273 219 566
2990E66r1J57k46l96j17K11l49M51j29K30J32j2o7k10j57j15k41L47M4R8M1J65
$$ 566 475 632 386 -10 -127 84 -265 186 57 287 419 407 340 130 -27 -142 -383 -36 8 106 147 312
3012C12Kj58r8O8k04r1Q8L39K14L6q2J48j04k99J24m94j92N56j56J48L8O2p5j49
$$ 312 314 156 58 126 -78 -169 -81 258 472 508 426 574 470 171 295 -199 -391 165 9 157 195 257 182 33
3036C3M25o57J67m6J4J21J25P9o7Qj67l3k35P4J3M8K23L66n24J78J42j4m23r4
$$ 33 458 -199 -32 -78 -64 57 182 261 194 202 35 2 -233 -159 -146 -98 125 491 -33 145 287 273 -150 -244
3060b44j9n2j8K29P6L6n6k55j71K04j47J92j19J51N7j91J67k45k03K04k26L19
$$ -244 -263 -315 -333 -104 -28 8 -48 -303 -474 -270 -417 -225 -344 -193 -136 -327 -160 -405 -608 -404 -630 -311
3082c11p1J15j74J37k54J21k1k24n0J92J00k08K30P8j56q6P2J42k34n36mL53O35
$$ -311 -382 -267 -441 -304 -558 -437 -458 -682 -732 -540 -440 -648 -418 -340 -496 -582 -510 -368 -602 -1138 -1142 -789 -154
3105a54k80r6p2J97l15j59J76o4K76n2J06J40j05K8l41m2R6J42k19J60J45j72
$$ -154 -434 -530 -602 -405 -720 -879 -703 -767 -491 -543 -437 -297 -402 -374 -715 -757 -661 -519 -738 -578 -433 -605
3127f05M27k79J75j54O3r8L23k71K1O9K93N3k16j38L58j4n08K47J7L70m70L32
$$ -605 -178 -457 -282 -436 -373 -471 -148 -419 -398 -329 -36 17 -199 -337 21 7 -501 -254 -237 133 -337 -5
3149eNl31K53q9l1J76j08j26K06K48l76O01l07j37J83k42K36r6o3K15k53P0J76
$$ -5 0 -331 -78 -167 -198 -22 -130 -256 -50 198 -178 423 116 -21 162 -80 156 60 -3 212 -41 29 205
3172B05l3j35j8K6J37j79L08J6r2K23j77j34q7p5J1J08J50J21Q7p7k40J99M6m81
$$ 205 172 37 19 45 182 3 311 327 235 458 281 147 60 -15 -4 104 254 375 462 385 145 344 390 -91
3196i1q5M03J24k88L71l7j03K93l39l4Pj51R9j70K34l01M37J53l0j33j00j50J83
$$ -91 -176 227 351 63 434 397 294 587 248 214 221 70 169 -1 233 -68 369 522 492 359 259 109 292
3219B92j98o5K17q9j6K18r1N8K8k25L76p4l30O8J95k18j70j54J48L6J46k4K7P8
$$ 292 94 29 246 157 141 359 268 326 354 129 505 431 101 169 364 146 -24 -178 -30 6 152 128 155 233
3243B33q9N0J61l56L53k19L2o2n7J50Q6KK76m01J73J94n44J4Q5J00J6K20k7k9
$$ 233 144 194 355 -1 352 133 165 103 46 196 282 284 560 159 332 526 -18 -4 81 181 197 417 390 361
3267C61j82Q0k96J29k67M90j07J34K70j5J4k24j8j65K4k41J55M1K22J73r4L7l11
$$ 361 179 259 -37 92 -175 315 208 342 612 597 611 387 369 204 228 -13 142 183 405 578 484 521 210
3290B10o8K80J81l97k03M27R5j84LJ00o0j0j14j29j63J60J03J02J20N3l85p8J61
$$ 210 142 422 603 206 3 430 525 341 344 444 384 374 260 131 -32 128 231 333 453 506 121 43 204
3313B04j42l09L83j75K96j4J3j12K80p52L36k59j5L97o1j9J33K73m37l17m2K55
$$ 204 62 -247 136 -39 257 243 256 144 424 -328 8 -251 -266 131 70 51 184 457 20 -297 -339 -84
3335h4l28K06l0q8O47n07J9n3j83l9M3L5OL29j58K27l16l0o6K81m43m4J51M7j32
$$ -84 -412 -206 -236 -324 323 -184 -165 -218 -401 -440 -397 -362 -356 -27 -185 42 -274 -304 -370 -89 -532 -576 -425 -378 -510
3360e10M5L27j04j33j97L48m79Q0J17J9o5J65k04L10k43M7j67j05J57j98K80K36
$$ -510 -465 -138 -242 -375 -572 -224 -703 -623 -506 -487 -552 -387 -591 -281 -524 -477 -644 -749 -592 -790 -510 -274
3382b74k1J70l29j44KJ92n1k2K27k29M44l13K8J69q0k96L7K34j88K22R4l2J2N5
$$ -274 -295 -125 -454 -598 -596 -404 -455 -477 -250 -479 -35 -348 -320 -151 -231 -527 -490 -256 -444 -222 -128 -160 -148 -93
3406i3P2j47k60k4L23k04N1K88k82J73l4Q9k80K80J16l93r7N63m9N3j04RJ96l35
$$ -93 -21 -168 -428 -452 -129 -333 -282 6 -276 -103 -137 -48 -328 -48 68 -325 -422 141 92 145 41 50 246 -89
3430h9o2K00j71J75N4K29j78J29j84j68lM6kRJ21Q8l21L72j76J22J09l98M8K20
$$ -89 -151 49 -122 53 107 336 158 287 103 -65 -68 -22 -24 -15 106 194 -127 245 69 191 300 -98 -50 170
3454A70qj02O9J16j07m4M0q6l09K23j79K81J06j50L12M3j96l78K66k39J53k16
$$ 170 162 60 129 245 138 94 134 48 -261 -38 -217 64 170 20 332 375 179 -199 67 -172 -19 -235
3476b35K95J5rJ56k62K24l70K51k52P5N3k1jK18j75j07L00n8k88O6L01k89L3L26
$$ -235 60 75 66 222 -40 184 -186 65 -187 -112 -59 -80 -81 137 -38 -145 155 97 -191 -125 176 -113 -80 246
3500B46L27l57QJ5k50j36M8J55N4K2N3L6j08Q2l11K56k25M73k63o4j44K91L23
$$ 246 573 216 224 239 -11 -147 -99 56 110 132 185 221 113 195 -116 140 -85 388 125 61 -83 208 531
3523E31M0k81j53K5r8K36l7k59M40j69J19P4l14J74J74k75j00K50l93L55K15l7
$$ 531 571 290 137 162 64 300 263 4 444 275 394 468 154 328 502 227 127 377 -16 339 554 517
3545E17k13L8L0p0o0R1j68J15j51L98n59M50k20L76k64K1n9L29j81j24R1k29J32
$$ 517 304 342 372 302 242 333 165 280 129 527 -32 418 198 574 310 331 272 601 420 296 387 158 290
3568B90k22O1O8n9j19K81P3l33J63R7J06r1j33o5K59j67N1k73L99m16j6L42l79
$$ 290 68 129 197 138 19 300 373 40 203 300 406 315 182 117 376 209 260 -13 386 -30 -46 296 -83
3591h3K26l8o5j81J50Q9K5K8k45L35l12l27J95J20p0N1M1J3l17K32j40J62r1K39
$$ -83 143 105 40 -141 9 98 123 151 -94 241 -71 -398 -203 -83 -153 -102 -61 -48 -365 -133 -273 -111 -202 37
3615C7Lk58J47m03K82r8J3R8q8k0o2K93j7j39K17k75J72j31j34J80J63q6k72M27
$$ 37 40 -218 -71 -474 -192 -290 -277 -179 -267 -287 -349 -56 -73 -212 5 -270 -98 -229 -363 -183 -20 -106 -378 49
3639D9n88J38L16j23j77J28J32J40l07k68M44j60K03k53J73K32j35J10r3%j30
$$ 49 -539 -401 -85 -208 -385 -257 -125 15 -292 -560 -116 -276 -73 -326 -153 79 -56 54 -39 -39 -169
3660a69j2M5l55K51J88l14M3K77R6l47K20L6m9J5J1J48l57O22k92Q5j39j53K61
$$ -169 -181 -136 -491 -240 -52 -366 -323 -46 50 -297 -77 -41 -90 -75 -64 84 -273 349 57 142 3 -150 111
3683A11m03%M2l0K37J10l58L27j17J54n01m0L57J35l46K13K52Q9k19j64L66k79
$$ 111 -292 -292 -250 -280 -43 67 -291 36 -81 73 -428 -468 -111 24 -322 -109 143 232 13 -151 215 -64
3705f4k85K26k38J22J35L59l44n2O5k21L4l36N47l28k5Q1K71J36m2j12K62n18
$$ -64 -349 -123 -361 -239 -104 255 -89 -141 -76 -297 -263 -599 -52 -380 -405 -324 -53 83 41 -71 191 -327
3727c27J62j23J97Q9q1q0N4J54L4l44R7j48K59j11J95j11j08O2K63j42j88k2o1
$$ -327 -165 -288 -91 -2 -83 -163 -109 45 79 -265 -168 -316 -57 -168 27 -84 -192 -130 133 -9 -197 -219 -280
3750b80o0J97J38O8j26n0j09J08K04n67L09K42J72m44j4J21J76L6l36l21N33K0
$$ -280 -340 -143 -5 63 -63 -113 -222 -114 90 -477 -168 74 246 -198 -212 -91 85 121 -215 -536 -3 17
3772A7J04n0m36P19l05N0j30QK8p4n4K28l22L65PJ2M9L8q6k00J47r2J26k4r9J40
$$ 17 121 71 -365 354 49 99 -31 -23 5 -69 -123 105 -217 148 155 167 216 254 168 -32 115 23 149 125 26 166
3798A66m4L12j57J8j44J43j23K26j8q0p7J73k09J29J10J43o23O3l4K68J42j21
$$ 166 122 434 277 295 151 294 171 397 379 299 222 395 186 315 425 568 -55 8 -26 242 384 263
3820B63O1m5j65R9N8O1P0j03j11K97j62p4k58J57K26j27K03m20o5M05R4o1k94
$$ 263 324 279 114 213 271 332 402 299 188 485 323 249 -9 148 374 247 450 30 -35 370 464 403 109
3843A09K28k54q1J57p4j04J08K98j52R5l16J84j70K10m30L16j82O5K24r7K63o42
$$ 109 337 83 2 159 85 -19 89 387 235 330 14 198 28 238 -192 124 -58 7 231 134 397 -245
3865b45Q25p07K91J4j6Nk57J35K5K8m05K42j3M2pL8K01k60J42m44j59K25J56K31
$$ -245 580 -127 164 178 162 167 -90 45 70 98 -307 -65 -78 -36 -43 -5 196 -64 78 -366 -525 -300 -144 87
3889H7J02k72j16P1J50j92j21Q5l0K20Q1l89J24k60N81k86O9k73L08m2pR9op7
$$ 87 189 -83 -199 -128 22 -170 -291 -206 -236 -16 65 -324 -200 -460 121 -165 -96 -369 -61 -103 -110 -11 -17 -94
3913i4J63J25p45N54J6j39N5j55Q2j00J42K02j80k80M30q3j80N0K33k24j04L86
$$ -94 69 194 -551 3 19 -120 -65 -220 -138 -238 -96 106 -74 -354 76 -7 -187 -137 96 -128 -232 154
3935A54m21j16O28j07l34OQ5R7J44r9l02O2j6K51p3N1R2m35L30NJ91m47K36p3
$$ 154 -267 -383 245 138 -196 -190 -105 -8 136 37 -265 -203 -219 32 -41 10 102 -333 -3 2 193 -254 -18 -91
3959i1k87K06j14L33j81m7J75J63k32j89j1K79l92M77l15j22N7L79q3o3m12M20
$$ -91 -378 -172 -286 47 -134 -181 -6 157 -75 -264 -275 4 -388 89 -226 -348 -291 88 5 -58 -470 -50
3981e0lMj2K08j4m09K54n4J00k00j60n7N08j20j83O5M2r0J2k21K18j98L1L44m23
$$ -50 -53 -49 -61 147 133 -276 -22 -76 24 -176 -336 -393 115 -5 -188 -123 -81 -171 -159 -380 -162 -360 -329 15 -408
4006d08J62K24J53k58j45m8J7J30j15K25L6j02j41J09K90j53k46J25r4J72q3K19
$$ -408 -246 -22 131 -127 -272 -320 -303 -173 -288 -63 -27 -129 -270 -161 129 -24 -270 -145 -239 -67 -150 69
4028F9k51J75k34J18q6J44q5O7Q7p9J33j50K77k99j27N88l95n0J18n9K36l75K96
$$ 69 -182 -7 -241 -123 -209 -65 -150 -83 4 -75 58 -92 185 -114 -241 347 -48 -98 20 -39 197 -178 118
4051A18J92m96L38j18J0j26K94j63P5j46K11rk44L41j46j62R7L7J23O1k68l1K71
$$ 118 310 -186 152 34 44 -82 212 49 124 -22 189 180 -64 277 131 -31 66 103 226 287 19 -12 259
4074B59j01K53j58l55M4P4J39j19J93J43j67k10K48k9k56L28P5j97o7J93j2N4
$$ 259 158 411 253 -102 -58 16 155 36 229 372 205 -5 243 214 -42 286 361 164 97 290 278 332
4096C32k79K17j10j05r6J04J81k98K36R5K41q5l46J78k32K36J2l51J93J0Lj20
$$ 332 53 270 160 55 -41 63 244 -54 182 277 518 433 87 265 33 269 281 -70 123 133 136 16
4118A6J80n8j39K3R9m6R5k31p6K07O6J44m91L74o8K0J6k26J41k18J1L2j65K39
$$ 16 196 138 -1 22 121 75 170 -61 -137 70 136 280 -211 163 95 115 131 -95 46 -172 -161 -129 -294 -55
4142e5kr0j07L67l22N0J83J70m30L3K79j72k73L50J18k78K02j9K05k0l32r5L15
$$ -55 -57 -147 -254 113 -209 -159 24 194 -236 -203 76 -96 -369 -19 99 -179 23 4 209 189 -143 -238 77
4165G7j94J41j00k38L77P8L3l2k82K38j13j28J19M9k06J96L8%o0K00m41L28q5
$$ 77 -117 24 -76 -314 63 141 174 142 -140 98 -15 -143 -24 25 -181 15 53 53 -7 193 -248 80 -5
4188eK6j01j42j4J64K14Q2j86R2M6o6m1j90k00L59jr8r8J53L9P0j32K23m6P5k01
$$ -5 21 -80 -222 -236 -72 142 224 38 130 176 110 69 -121 -321 38 37 -61 -159 -6 33 103 -29 194 148 223 22
4214B2j51j14P8K41k35L06O7k72r2J48j9j58L2K7Q6j45q0M00j92q8l2L29k05O7
$$ 22 -129 -243 -165 76 -159 147 214 -58 -150 -2 -21 -179 -147 -120 -34 -179 -259 141 -51 -139 -171 158 -47 20
4238B0J08m30N30j47j85q3o6J89l1K1P0k87K83k84K69j82j5K02j79R2j00K57M9
$$ 20 128 -302 228 81 -104 -187 -253 -64 -95 -74 -4 -291 -8 -292 -23 -205 -220 -18 -197 -105 -205 52 101
4261A01n06K15K27M0l44lK37m4R8k71k68L56k9L67n12K41P3l01Pj56M79jk99L37
$$ 101 -405 -190 37 77 -267 -270 -33 -77 21 -250 -518 -162 -191 176 -336 -95 -22 -323 -316 -472 7 6 -293 44
4285D4n8k49M55k43n7l4J4J10o8j6J39k94J22J5j42O28n30L1q9J85N0M1j96K39
$$ 44 -14 -263 192 -51 -108 -142 -128 -18 -86 -102 37 -257 -135 -120 -262 366 -164 -133 -222 -37 13 54 -142 97
4309I7m3k91K54k6o9j1M5J50M8j83j77K71r3M7j42j0P1J16K27j81J26k58l98L12
$$ 97 54 -237 17 -9 -78 -89 -44 106 154 -29 -206 65 -28 19 -123 -133 -62 54 281 100 226 -32 -430 -118
4333a18K8K33n3j62N7m6J59L9j88K60j2J30l84L16n3n2J11k40J31N2k03L01l04
$$ -118 -90 143 90 -72 -15 -61 98 137 -51 209 197 327 -57 259 206 154 265 25 156 208 5 306 2
4356Bo9L8m6o4M00kj17L7j29j86J70oL75k29l31J86K46k5j90L14n39J71R7k3j8
$$ 2 -67 -29 -75 -139 261 259 142 179 50 -136 34 28 403 174 -157 29 275 250 60 374 -165 6 103 80 62
4381F2J20j39M4k37K11M8j97K51o0J0k10J84j32j72kP0J24m4K95Kl26J20M7n4
$$ 62 182 43 87 -150 61 109 -88 163 103 113 -97 87 -45 -217 -219 -149 -25 -69 226 228 -98 22 69 15
4405A5J54o8p1k08J06K19K8j14q6K01l30L05l32K75j29k29Q8K11K67N7k22n4P1
$$ 15 169 101 30 -178 -72 147 175 61 -25 176 -154 151 -181 94 -35 -264 -176 35 302 359 137 83 154
4428A54l35M27k90J66j59L16j83j67J78J1R8k43J82J40k41P7l13K85J08r5l36
$$ 154 -181 246 -44 122 -37 279 96 -71 107 118 216 -27 155 295 54 131 -182 103 211 116 -220
4449b20L12J11j55K11J7j37j03l3j32K38L98m76k9k31j8N13l50K44J79j98M3j26
$$ -220 92 203 48 259 276 139 36 3 -129 109 507 31 2 -229 -247 266 -84 160 339 141 184 58
4471E8k9q4m47O74k94J10J76J6l37j01L1J78k5K68l02%J99K79m07P2N3m21M28
$$ 58 29 -55 -502 172 -122 -12 164 180 -157 -258 -227 -49 -74 194 -108 -108 91 370 -37 35 88 -333 95
4494I5k07J32m0j29N1K34j06j01j29j13K36j64lK27Ll0l66K15k3m0M6L0K04j07
$$ 95 -112 20 -20 -149 -98 136 30 -71 -200 -313 -77 -241 -244 -17 -14 -44 -410 -195 -218 -258 -212 -182 22 -85
4518h5J36ok82K31j70J20j45j94L80q0J24k12K96l6j71k93j25O38j34N9k38O0
$$ -85 51 45 -237 -6 -176 -56 -201 -395 -15 -95 29 -183 113 77 -94 -387 -512 126 -8 51 -187 -127
4540a27L6R0kj71K25l04PK49J33l73M08m02j4J08K13k75K95j88m5J90%j83j56
$$ -127 -91 -1 -3 -174 51 -253 -246 3 136 -237 171 -231 -245 -137 76 -199 96 -92 -137 53 53 -130 -286
4563b86Q1K2j3K35k96L38j94J14J72k87J38RM1j93j17K88J11j82o8K29k38J22
$$ -286 -205 -183 -196 39 -257 81 -113 1 173 -114 24 33 74 -119 -236 52 163 -19 -87 142 -96 26
4585B6j02L02l64K16j82J47J05k00P7j30L92l92K02j55J77K83k97k0r6Q5J12M7
$$ 26 -76 226 -138 78 -104 43 148 -52 25 -105 287 -105 97 -58 119 402 105 85 -11 74 186 233
4607B33p5l01J55J33J12j00P3N7r6j72l31K28P6k20R3J08p7J0M14m29j37M08k83
$$ 233 158 -143 12 145 257 157 230 287 191 19 -312 -84 -8 -228 -135 -27 -104 -94 320 -109 -246 162 -121
4630a21L4j13L53n2j47j01K14O9k67J18j7L9j82J44N28n37k8J78j67j24L22l2
$$ -121 -87 -200 153 101 -46 -147 67 136 -131 -13 -30 9 -173 -29 499 -38 -66 112 -55 -179 143 111
4652A11j16l1J74k16K91k77j21M75j25o7n0P1j96J97l38L10J3j50K46K46l58j52
$$ 111 -5 -36 138 -78 213 -64 -185 290 165 98 48 119 -77 120 -218 92 105 -45 201 447 89 -63
4674f3j12LL20j23K43m44K96P2k84K11Qj12l3j24M7K85o4l2j38j90L11K6P8nk70
$$ -63 -175 -172 148 25 268 -176 120 192 -92 119 127 15 -18 -142 -95 190 126 94 -44 -234 77 103 181 176 -94
4699i4O2M8k89J98O0K85j76j17J15p3q4K40k82L55n3k55L4P5J05pj49j18J21N3
$$ -94 -32 16 -273 -75 -15 270 94 -23 92 19 -65 175 -107 248 195 -60 -26 49 154 147 -2 -120 1 54
4723E4J98j50L5P1J1l73O8M22l53J70K9j54Pj16O7l6K27O0k22J84j54P7r9J20
$$ 54 252 102 137 208 219 -154 -86 336 -17 153 182 28 35 -81 -14 -50 177 237 15 199 45 122 23 143
4747A43p5o7J80J16J00n01K80p6j07N9L2k95J68p2J52r6J95l55J7NJ29Q0k94L67
$$ 143 68 1 181 297 397 -104 176 100 -7 52 84 -211 -43 -115 37 -59 136 -219 -202 -197 -68 12 -282 85
4771H5l37M61k43o9l7J33r8pJ07M5K53n42K17p3q0P4K28j12j78j32M12j01k50
$$ 85 -252 209 -34 -103 -140 -7 -105 -112 -5 40 293 -249 -32 -105 -185 -111 117 5 -173 -305 107 6 -244
4794b44K56k97J26rJ20R0l69M69m11J06K03k69L12n75K51j6J33J13J20j70J86
$$ -244 12 -285 -159 -168 -48 42 -327 142 -269 -163 40 -229 83 -492 -241 -257 -124 -11 109 -61 125
4815A25k11M9J37o1N3m7m12L15n1j56K49j16K26j52J80k87K1lK65l2k27j31K21
$$ 125 -86 -37 100 39 92 45 -367 -52 -103 -259 -10 -126 100 -52 128 -159 -138 -141 124 92 -135 -266 -45
4838d5J13Nj55J22p7m0n0l4K5j8Q2M8k9K94l64K11j25J05L5R3j16j36J79l12Q
$$ -45 68 73 -82 40 -37 -77 -127 -161 -136 -154 -72 -24 -53 241 -123 88 -37 68 103 196 80 -56 123 -189 -181
4863a81J86J01n7R7J7j97Q3j69N5p7P8p7J14j13l0M18m78M97n25L33j10P9j74
$$ -181 5 106 49 146 163 -34 49 -120 -65 -142 -64 -141 -27 -140 -170 248 -230 267 -258 75 -35 44 -130
4886a30P7K47j91K38m90L77l07J82Pk81L78l31J49J00m82M25j57K1J11n2L1oJ47
$$ -130 -53 194 3 241 -249 128 -179 3 10 -271 107 -224 -75 25 -457 -32 -189 -168 -57 -109 -78 -84 63
4909F3ol53J85L13m34M03l36M11k36j64J37N3j05R1j7l09M10r2k29L44j39J02
$$ 63 57 -296 -111 202 -232 171 -165 246 10 -154 -17 36 -69 22 5 -304 106 14 -215 129 -10 92
4931I2R8k00m3j33M83m14Ko6J09k32j14N97P2j80L47o24K24O2lj08K47l00J01
$$ 92 190 -10 -53 -186 297 -117 -115 -181 -72 -304 -418 179 251 71 418 -206 18 80 77 -31 216 -84 17
4954A7J0ko6J01Q3k66J60k2M9K4O2j78m7J62k01R4Pn6J09Lj53P0J69k19K92o1
$$ 17 27 25 -41 60 143 -123 37 15 64 88 150 -28 -75 87 -114 -20 -13 -69 40 43 -110 -40 129 -90 202 141
4980A41j17K9J69k11J51j25k83k2L57j22J36M3l70J28L23j84k82L40k95K70k15
$$ 141 24 53 222 11 162 37 -246 -268 89 -33 103 146 -224 -96 227 43 -239 101 -194 76 -139
5001a39J80m5n4J50m4k02J09j17R9KN3j0j96J30L37k00J51J3k91L8j19J52o5j55
$$ -139 41 -4 -58 92 48 -154 -45 -162 -63 -61 -8 -18 -214 -84 253 53 204 217 -74 -36 -155 -3 -68 -223
5025b23m1L97M3l00J51K94l21k91K92j32K66j90P1k92K06K19k71l2M20m80o7J86
$$ -223 -264 133 176 -124 27 321 0 -291 1 -131 135 -55 16 -276 -70 149 -122 -154 266 -214 -281 -95
5047i5K2j04J96L5k39M6K8RK87j59k53K48o9j96O1L06j17o2J66k41JJ05J70l20
$$ -95 -73 -177 19 54 -185 -139 -111 -102 185 26 -227 21 -48 -244 -183 123 6 -56 110 -131 -130 -25 145 -175
5071a75M8j53J98L8Q7O5Ol3j10K36j34q3N4o1k73K75K56j40r1J54n5q6K01O4k41
$$ -175 -127 -280 -82 -44 43 108 114 81 -29 207 73 -10 44 -17 -290 -15 241 101 10 164 109 23 224 288 47
5096D7k8N4j27K69j31j63l09K85J26O1M3J02n42J51M03J5m39J18PK61r3k90L39
$$ 47 19 73 -54 215 84 -79 -388 -103 23 84 127 229 -313 -162 241 256 -183 -65 -58 203 110 -180 159
5119A59j70j77L53j88j69K35J10j14O1J50k63K45n00K15J18n2K4j02J63j26P4
$$ 159 -11 -188 165 -23 -192 43 153 39 100 250 -13 232 -268 -53 65 13 37 -65 98 -28 46
5140D6K70k28m2l78L47k00M9j45O07m06K38j90k68J25J05N1r8N2jK93l77j71L85
$$ 46 316 88 46 -332 15 -185 -136 -281 326 -80 158 -32 -300 -175 -70 -19 -117 -65 -66 227 -150 -321 64
5163F4l04K68k10K75l6l06K69q1K77k82J99O1j50o2j89Q0r5J15K2m1jL7J52N8
$$ 64 -240 28 -182 93 57 -249 20 -61 216 -66 133 194 44 -18 -207 -127 -222 -107 -85 -126 -127 -90 62 120
5187A20j28m6m8J85l6N5K5O0j8o7l6j38m6K09l2K97l28r3R3l05J75K36l49K17
$$ 120 -8 -54 -102 83 47 102 127 187 169 102 66 -72 -118 91 59 356 28 -65 28 -277 -102 134 -215 2
5211BK62j88J77j16o7N9j36J13P8k75K54l0q0k45J36R3o0l22M82k0j22o9K34k00
$$ 2 264 76 253 137 70 129 -7 106 184 -91 163 133 53 -192 -56 37 -23 -345 137 117 -5 -74 160 -40
5235d0J90k78J84O8k71L55o5m7L8P3k69J18r7K6J09L7j61J30j33J23l2J59j6k03
$$ -40 150 -128 56 124 -147 208 143 96 134 207 -62 56 -41 -15 94 131 -30 100 -33 90 58 217 201 -2
5259bJ50Nm1j01J39j1m42M59q9J46j42j69J59J59r4L3J68m27K04Q3N1j81k51K35
$$ -2 148 153 112 11 150 139 -303 156 67 213 71 -98 61 220 126 159 327 -100 104 187 238 57 -194 41
5283D1J82l23R3J17j77r6J49l7J18k33J50L0r7R2O0J3K39j96j61K34k80J80J78
$$ 41 223 -100 -7 110 -67 -163 -14 -51 67 -166 -16 14 -83 9 69 82 321 125 -36 198 -82 98 276
5306B76m76O90m81J7R5J76m84J64o9K2L5J01j84j9P5m6j58o2K52J06p0J30k67
$$ 276 -200 490 9 26 121 297 -187 -23 -92 -70 -35 66 -118 -137 -62 -108 -266 -328 -76 30 -40 90 -177
5329a77K1M20k64O2mq1Qk36j0J77J34k07L71k53M6lK3o9L8o4m4J72k4Q9j94k95
$$ -177 -156 264 0 62 58 -23 -15 -251 -261 -84 50 -157 214 -39 7 4 27 -42 -4 -68 -112 60 36 125 -69 -364
5355c64M71j97J88J48l98K14p7j16J48j59J06j09M38l55K05J61j74k43oL72r7
$$ -364 107 -90 98 246 -152 62 -15 -131 17 -142 -36 -145 293 -62 143 304 130 -113 -119 253 156
5376A56l13K8J31O8q1j00J77j20J32o9J75k41J38k3p9j53L09l3k41O7R7k80M33
$$ 156 -157 -129 2 70 -11 -111 66 -54 78 9 184 -57 81 58 -21 -174 135 102 -139 -72 25 -255 178
5399A78m4L6l33Q1K5l7r5O6p5j43L03j11K32m57L99M1j14r8l1m8l1N31m09K83
$$ 178 134 170 -163 -82 -57 -94 -189 -123 -198 -341 -38 -149 83 -374 25 66 -48 -146 -177 -225 -256 275 -134 149
5423A49m01J90K4k74N13j04k75L77m11j18K63O3l6M4j47L37n9k75j50Q6j19K92
$$ 149 -252 -62 -38 -312 201 97 -178 199 -212 -330 -67 -4 -40 4 -143 194 135 -140 -290 -204 -323 -31
5445c1j69M3M03m99N20q4k1l76J33k20M87k77L42k39J25o9j77K92L1j72j84qL18
$$ -31 -200 -157 246 -253 267 183 162 -214 -81 -301 186 -91 251 12 137 68 -109 183 214 42 -142 -150 168
5468A68l19K15j27M0J45m19L8J73k9K29j65k01L75l0P2j20p5p9K64l4j99j62K84
$$ 168 -151 64 -63 -23 122 -297 -259 -86 -115 114 -51 -252 123 93 165 45 -30 -109 155 121 -78 -240 44
5491D4l12M16j07Q6P3mj46k20J0J90k44N17m24l6J76k6J94l06K41P4m65M43P6
$$ 44 -268 148 41 127 200 196 50 -170 -160 30 -214 303 -121 -157 19 -7 187 -119 122 196 -269 174 250
5514B50k83k5p6J78ll6J22m9J50p2l67Q9O8m8j10L28j4O2k72L8m2L72m64Q6j65
$$ 250 -33 -58 -134 44 41 5 127 78 228 156 -211 -122 -54 -102 -212 116 102 164 -108 -70 -112 260 -204 -118 -283
$$ [...]
8191d3
##END NTUPLES=NMR FID
##END=
