##TITLE=1H_LR-685B-C1MC2
 DMSO-d6, 8 sc, 
 26.3.2020
##JCAMPDX= 6.0         $$ Bruker NMR JCAMP-DX V2.0
##DATA TYPE= NMR FID
##DATA CLASS= NTUPLES
##ORIGIN= UXNMR, Bruker Analytische Messtechnik GmbH
##OWNER= root
$$ XWIN-NMR		Version 3.5
$$ Thu Mar 26 13:58:24 2020 Russian Standard Time (UT+4h)  she@DPX200
##.OBSERVE FREQUENCY= 200.1315
##.OBSERVE NUCLEUS= ^1H
##.DELAY= (6, 6)
##.ACQUISITION MODE= SIMULTANEOUS
##.ACQUISITION SCHEME= undefined
##.AVERAGES= 8
##.DIGITISER RES= 18
##SPECTROMETER/DATA SYSTEM= spect
##.PULSE SEQUENCE= zg30
##.SOLVENT NAME= CDCl3
##.SHIFT REFERENCE= (INTERNAL, CDCl3, 0, 15.7039)
##AUDIT TRAIL= $$ (NUMBER, WHEN, WHO, WHERE, WHAT)
$$ ##TITLE= Audit trail, XWIN-NMR		Version 3.5
$$ ##JCAMPDX= 5.01
$$ ##ORIGIN= Bruker BioSpin GmbH
$$ ##OWNER= she
$$ F:/spectra/data/she/nmr/H-F/1/audita.txt
$$ ##AUDIT TRAIL=  $$ (NUMBER, WHEN, WHO, WHERE, WHAT)
(   1,<2020-03-26 13:57:27.09 +0400>,<she>,<DPX200>,
      <created by zg, POWCHK disabled, PULCHK disabled
       configuration hash MD5:
       00 E9 B6 7A A2 85 ED C7 34 08 36 98 17 FE 4E 26
       data hash MD5: 16K
       00 9A 3E 51 8D F8 E9 CC 43 32 AC CF 64 76 72 BF>)
$$ ##END=
$$ 
$$ hash MD5
$$ 02 70 F9 EF 0D 05 7C C0 BE BF 8D 25 A1 AF AE 5B
##$RELAX= 
##$RELAX= 
##$RELAX= 
##$RELAX= 
##$RELAX= 
##$RELAX= 
$$ Bruker specific parameters
$$ --------------------------
##$DU= <F:/spectra>
##$EXPNO= 1
##$NAME= <H-F>
##$PROCNO= 1
##$TYPE= <nmr>
##$USER= <she>
##$AMP= (0..31)
100 100 100 100 100 100 100 100 100 100 100 100 100 100 100 100 100 100 
100 100 100 100 100 100 100 100 100 100 100 100 100 100 
##$AQSEQ= 0
##$AQ_mod= 1
##$AUNM= <au_zg>
##$AUTOPOS= <>
##$BF1= 200.13
##$BF2= 200.13
##$BF3= 200.13
##$BF4= 200.13
##$BF5= 200.13
##$BF6= 200.13
##$BF7= 200.13
##$BF8= 200.13
##$BYTORDA= 1
##$CFDGTYP= 0
##$CFRGTYP= 5
##$CHEMSTR= <none>
##$CNST= (0..31)
1 1 145 1 1 1 1 1 1 1 1 1 1 1 1 1 1 1 1 1 1 1 1 1 1 1 1 1 1 1 1 1 
##$CPDPRG= <>
##$CPDPRG1= <>
##$CPDPRG2= <>
##$CPDPRG3= <>
##$CPDPRG4= <mlev>
##$CPDPRG5= <mlev>
##$CPDPRG6= <mlev>
##$CPDPRG7= <mlev>
##$CPDPRG8= <mlev>
##$CPDPRGB= <>
##$CPDPRGT= <>
##$D= (0..31)
0 1.2 0 0 0 0 0 0 0 0.06 0 0.03 0 0 0 0 0.0002 0 0 0 0 0 0 0 0 0 0 0 0 
0 0 0 
##$DATE= 1585216646
##$DBL= (0..7)
120 120 120 120 120 120 120 120 
##$DBP= (0..7)
150 150 150 150 150 150 150 150 
##$DBP07= 0
##$DBPNAM0= <>
##$DBPNAM1= <>
##$DBPNAM2= <>
##$DBPNAM3= <>
##$DBPNAM4= <>
##$DBPNAM5= <>
##$DBPNAM6= <>
##$DBPNAM7= <>
##$DBPOAL= (0..7)
0.5 0.5 0.5 0.5 0.5 0.5 0.5 0.5 
##$DBPOFFS= (0..7)
0 0 0 0 0 0 0 0 
##$DE= 6
##$DECBNUC= <off>
##$DECIM= 24
##$DECNUC= <off>
##$DECSTAT= 4
##$DIGMOD= 1
##$DIGTYP= 9
##$DL= (0..7)
0 120 120 120 120 120 120 120 
##$DP= (0..7)
150 150 150 150 150 150 150 150 
##$DP07= 0
##$DPNAME0= <>
##$DPNAME1= <>
##$DPNAME2= <>
##$DPNAME3= <>
##$DPNAME4= <>
##$DPNAME5= <>
##$DPNAME6= <>
##$DPNAME7= <>
##$DPOAL= (0..7)
0.5 0.5 0.5 0.5 0.5 0.5 0.5 0.5 
##$DPOFFS= (0..7)
0 0 0 0 0 0 0 0 
##$DQDMODE= 0
##$DR= 18
##$DS= 0
##$DSLIST= <SSSSSSSSSSSSSSS>
$$ [...]
##$SUBNAM2= <"">
##$SUBNAM3= <"">
##$SUBNAM4= <"">
##$SUBNAM5= <"">
##$SUBNAM6= <"">
##$SUBNAM7= <"">
##$SUBNAM8= <"">
##$SUBNAM9= <"">
##$SW= 24.9337058887773
##$SWIBOX= (0..15)
0 0 2 0 0 0 0 0 0 0 0 0 0 0 0 0 
##$SW_h= 4990.01996007984
##$TD= 16384
##$TD0= 1
##$TE= 0
##$TE2= 300
##$TE3= 300
##$TEG= 300
##$TL= (0..7)
0 120 120 120 120 120 120 120 
##$TP= (0..7)
150 150 150 150 150 150 150 150 
##$TP07= 0
##$TPNAME0= <>
##$TPNAME1= <>
##$TPNAME2= <>
##$TPNAME3= <>
##$TPNAME4= <>
##$TPNAME5= <>
##$TPNAME6= <>
##$TPNAME7= <>
##$TPOAL= (0..7)
0.5 0.5 0.5 0.5 0.5 0.5 0.5 0.5 
##$TPOFFS= (0..7)
0 0 0 0 0 0 0 0 
##$TUNHIN= 0
##$TUNHOUT= 0
##$TUNXOUT= 0
##$USERA1= <user>
##$USERA2= <user>
##$USERA3= <user>
##$USERA4= <user>
##$USERA5= <user>
##$V9= 5
##$VALIST= <valist>
##$VCLIST= <CCCCCCCCCCCCCCC>
##$VD= 0
##$VDLIST= <DDDDDDDDDDDDDDD>
##$VPLIST= <PPPPPPPPPPPPPPP>
##$VTLIST= <TTTTTTTTTTTTTTT>
##$WBST= 1024
##$WBSW= 4
##$XGAIN= (0..3)
0 0 0 0 
##$XL= 0
##$YL= 0
##$YMAX_a= 492372
##$YMIN_a= -228437
##$ZGOPTNS= <>
##$ZL1= 120
##$ZL2= 120
##$ZL3= 120
##$ZL4= 120
##$ABSF1= 10
##$ABSF2= 0
##$ABSG= 5
##$ABSL= 3
##$ALPHA= 0
##$AQORDER= 0
##$ASSFAC= 0
##$ASSFACI= 0
##$ASSFACX= 0
##$ASSWID= 0
##$AUNMP= <proc_1d>
##$AZFE= 0.1
##$AZFW= 0.1
##$BCFW= 1
##$BC_mod= 2
##$BYTORDP= 1
##$COROFFS= 0
##$CY= 11.3945322036743
##$DATMOD= 1
##$DC= 2
##$DFILT= <>
##$DTYPP= 0
##$F1P= 16.9975609425685
##$F2P= -3.02152046262296
##$FCOR= 0.5
##$FTSIZE= 0
##$FT_mod= 4
##$GAMMA= 1
##$GB= 0.15
##$INTBC= 1
##$INTSCL= 1
##$ISEN= 128
##$LB= 0.24
##$LEV0= 0
##$LPBIN= 0
##$MAXI= 10000
##$MC2= 0
##$MEAN= 0
##$ME_mod= 0
##$MI= 1.114404
##$NCOEF= 0
##$NC_proc= 0
##$NLEV= 6
##$NOISF1= 3.799351
##$NOISF2= 2.8
##$NSP= 1
##$NTH_PI= 0
##$NZP= 0
##$OFFSET= 15.70392
##$PC= 1
##$PHC0= -9784.95
##$PHC1= 6.60082
##$PH_mod= 1
##$PKNL= yes
##$PPARMOD= 0
##$PSCAL= 0
##$PSIGN= 0
##$REVERSE= no
##$SF= 200.130013532006
##$SI= 16384
##$SIGF1= 3
##$SIGF2= 2
##$SINO= 400
##$SIOLD= 16384
##$SREGLST= <1H.CDCl3>
##$SSB= 0
##$STSI= 0
##$STSR= 0
##$SW_p= 3612.71676300578
##$SYMM= 0
##$S_DEV= 0
##$TDeff= 0
##$TDoff= 0
##$TI= <>
##$TILT= no
##$TM1= 0
##$TM2= 0
##$TOPLEV= 0
##$USERP1= <user>
##$USERP2= <user>
##$USERP3= <user>
##$USERP4= <user>
##$USERP5= <user>
##$WDW= 1
##$XDIM= 8192
##$YMAX_p= 0
##$YMIN_p= 0
$$ End of Bruker specific parameters
$$ ---------------------------------
##NTUPLES= NMR FID
##VAR_NAME=  TIME,          FID/REAL,        FID/IMAG
##SYMBOL=    X,             R,               I
##VAR_TYPE=  INDEPENDENT,   DEPENDENT,       DEPENDENT
##VAR_FORM=  AFFN,          ASDF,            ASDF
##VAR_DIM=   8192,          8192,            8192
##UNITS=     SECONDS,       ARBITRARY UNITS, ARBITRARY UNITS
##FACTOR=    0.0002004,     1,               1
##FIRST=     0,             0,               0
##LAST=      1.6414764,     0,               0
##MIN=       0,             -228437,         0
##MAX=       1.6414764,     492372,          0
$$ Real data points
##PAGE= N=1
##DATA TABLE= (X++(R..R)), XYDATA
$$ [...]
$$ plain form
2628 1091 2802 796 -1067 -1279 -1519 -775 1232 2877 2006 -749 -2409 -1915 600 2277 1900 -125
2644 -125 -1290 -395 827 -558 399 1442 1974 -859 -4606 -832 3380 3357 -856 -4117 -1205 897
2660 897 351 -29 275 1777 -265 -2999 -1529 1195 2858 753 -1218 -2295 -2113 850 1861 802
2676 802 161 -567 -1126 -1788 -706 2793 2126 -961 -3318 -935 1956 626 -902 1183 1801 -428 -3069
2693 -3069 -1104 3834 3048 -1270 -3271 -930 1498 2043 333 249 -245 -650 -1229 -511 976 2024 1319
2710 1319 -1764 -2804 -2090 2026 3284 1011 -2007 119 277 -1440 -958 2762 2940 -693 -3743 -1639
2726 -1639 2221 1188 -771 792 2121 -390 -3859 -1722 2787 2376 -814 -1856 -719 633 1425
2741 1425 606 -26 -1309 -738 605 -538 -878 370 1881 -89 -3036 -1485 2627 3090 -1428 -3061
$$ packed form
2628A091J711k006j863k12k40P44K007J645q71k755j660M94K515J677l77k025
2644a25j165Q95J222j385R57J043N32k833l747L774M212k3m213l261K912K102
2660H97n46l80L04J502k042k734J470K724J663k105j971j077J82K963J011j059
2676H02o41p28n59o62J082L499o67l087k357K383K891j330j528K085O18k229k641
2693c069J965M938p86m318k001K341K428N45j710q4m94m05n79P18J487J048p05
2710A319l083j040P14M116J258k273l018K126J58j717M82L720J78l633l050K104
2726a639L860j033j959J563J329k511l469K137M509m11l190j042J137J352P92
2741A425q19o32j283N71J343j143l40J248J511j970k947J551M112M63m518j633
$$ plain form
2757 -3061 -370 759 -710 -528 2900 2861 -2203 -4675 -1180 2651 2245 -141 -256 359 -1170 -1930 472
2774 472 2683 1767 -417 -1566 -2160 -1073 1650 3524 652 -2109 -1349 1249 -167 -2078 499 3028
2790 3028 1196 -3102 -2172 2436 2960 -1517 -2560 388 1659 -794 -1216 1842 1828 -1711 -2301 407
2806 407 2242 783 -692 -695 -1010 -1049 635 2025 1563 -467 -707 -1028 -2165 -1532 3043 4120 -193 -4618
2824 -4618 -1770 2383 1105 -1777 -215 2821 -72 -4305 -2223 3094 3723 -730 -2016 -138 170
2839 170 -1384 -254 2027 1281 -857 -919 533 485 -241 82 123 -1427 -1477 1261 2209 -439 -1949 567
2857 567 1196 -873 -1942 2092 3240 -1452 -4533 -709 4247 2742 -2048 -1023 1087 -833 -2861
2872 -2861 -206 2900 2364 -925 -1917 -940 -382 306 1902 1338 -1237 -2457 -384 786 -543 608
$$ packed form
2757c061K691J129j469J82L428l9n064k472L495L831m06k386j15O15j529p60K402
2774D72K211r16k184j149n94J087K723J874k872k761P60K598j416j911K577K529
2790C028j832m298R30M608N24m477j043K948J271k453m22L058j4l539n90K708
2806D07J835j459j475ll15l9J684J390m62k030k40l21j137O33M575J077m313m425
2824d618K848M153j278k882J562L036k893m233K082N317O29m453j286J878L08
2839A70j554J130K281p46k138o2J452m8p26L23M1j550n0K738R48k648j510K516
2857E67O29k069j069M034J148m692l081L824M956j505m790J025K110j920k028
2872b861K655L106n36l289r92R77N58O88J596n64k575j220K073J170j329J151
$$ plain form
2888 608 2199 53 -2795 -2220 1816 2840 -493 -934 1541 2874 -2160 -2512 1246 2187 -1228 -4073
2904 -4073 525 4153 1204 -757 -248 548 -1324 -1045 -161 1942 299 -966 -636 -1427 -457 2030 2594
2921 2594 -660 -3372 -2582 2069 1728 -424 234 2014 -555 -3601 -1696 2999 4323 -1341 -3557 745
2937 745 696 -920 -398 2754 2303 -2251 -3341 -886 1835 632 448 -1128 -1220 -1766 103 1216 10
2954 10 -1117 -371 1058 -705 -1427 1156 3276 -399 -3942 -1003 2863 1391 -804 -554 1250 -68
2970 -68 -3147 -957 3913 2308 -2204 -3430 -596 643 -164 1327 1504 270 -1679 -2124 388 904
2986 904 1446 1046 -723 -3527 -2223 2272 3316 -190 -1918 576 656 -1816 -1228 2394 3563 -751
3002 -751 -4009 -887 3207 1781 -1261 -830 750 1 -1535 409 1184 1456 -1248 -2599 -190 298
$$ packed form
2888F08J591k146k848N75M036J024l333m41K475J333n034l52L758R41l415k845
2904d073M598L628k949j961N09P96j872K79Q84K103j643j265L30p91R70K487N64
2921B594l254k712P90M651l41k152O58J780k569l046J905M695J324n664k216M302
2937G45m9j616N22L152m51m554j090K455K721j203j84j576r2n46J869J113j206
2954A0j127P46J429j763p22K583K120l675l543K939L866j472k195K50J804j318
2970f8l079K190M870j605m512j226K834J239q07J491J77j234j949m45K512N16
2986I04N42m00j769k804J304M495J044l506j728K494Q0k472N88L622J169m314
3002g51l258L122M094j426l042M31J580p49j536J944P75K72k704j351K409M88
$$ plain form
3018 298 1399 1488 1092 -2444 -1616 323 1633 -10 866 781 -1431 -3565 -454 3606 2943 -748 -3193
3035 -3193 -717 1321 97 75 2456 1899 -1167 -4843 -792 2727 2400 205 -733 -1398 -909 721 1296
3052 1296 994 862 -648 -879 -997 378 2223 1315 -794 -2127 -758 1099 992 95 943 1139 -840
3069 -840 -2594 -467 2794 2716 -2011 -2303 -1201 1257 -746 -246 793 474 -1131 -2327 -146 1415
3085 1415 1954 522 -1510 -2416 -983 1377 2002 728 -1430 -412 -516 -1152 -65 2003 1962 -657 -3426
3102 -3426 -692 1754 1725 -443 -565 82 -1117 -2019 -239 3210 2296 -1299 -2373 -1295 1229 1515 284
3119 284 -483 -366 -683 -930 -486 830 1893 559 -2032 -2567 -640 2849 2442 -50 -1373 -718 352
3136 352 -744 -280 1138 1241 -641 -2139 -1159 2205 1731 13 -935 -424 -1011 -1193 -801 1903 2147 -1157
$$ packed form
3018B98J101Q9l96l536Q28J939J310j643Q76q5k212k134L111M060o63l691k445
3035c193K476K038j224k2K381n57l066l676M051L519l27k195r38o65M89J630N75
3052A296l02j32j510k31j18J375J845r08k109j333J369J857j07q97Q48J96j979
3069h40j754K127L261p8m727k92J102K458k003N00J039l19j605j196K181J561
3085A415N39j432k032r06J433K360O25j274k158J018j04o36J087K068m1k619k769
3102c426K734K446k9k168j22O47j199r02J780L449r14l595j074J078K524K86j231
3119B84p67J17l17k47M44J316J063j334k591n35J927L489m07k492j323O55J070
3136C52j096M64J418J03j882j498R80L364m74j718r48N11n87j82L92K704K44l304
$$ plain form
3154 -1157 -2251 -2150 361 2062 1464 -506 -1429 -568 197 -283 593 1265 1196 -1337 -2540 -1039 2170
3171 2170 2842 -266 -2088 -839 873 261 519 450 985 -627 -2162 -918 1383 1909 227 -1451 -1805
3188 -1805 -569 761 209 -317 361 -880 -1853 -1329 1129 2489 1176 -1202 -2149 -1759 1166 165 -123
3205 -123 -118 490 -965 -2089 -86 2058 2094 -1263 -2449 -1570 741 1003 611 -718 -404 -732 -1972 -125
3223 -125 1335 1706 73 -1803 -1381 -174 929 561 72 -426 -303 -1127 -1040 234 1887 1664 -1099 -2318
3241 -2318 -603 1280 1188 -328 -510 105 -259 -1319 -596 1461 1838 -113 -2279 -1465 733 1782 507
3258 507 -692 -288 -126 -382 -354 466 1254 359 -1129 -2175 -240 1637 1505 -280 -640 -207 -264 -878 -186
3277 -186 1391 1705 -598 -2346 -578 1573 1561 -58 -768 -493 -166 -961 -251 921 1891 902 -1511 -1110
$$ packed form
3154a157j094J01K511J701n98j970r23Q61P65m80Q76O72o9k533j203J501L209
3171B170O72l108j822J249J712o12K58o9N35j612j535J244K301N26j682j678l54
3188a805J236J330n52n26O78j241r73N24K458J360j313k378r47L90K925j001k88
3205a23NO08j455j124K003K144L6l357j186Q79K311K62l92j329L14l28j240J847
3223a25J460L71j633j876M22J207J103l68m89m98J23q24Q7J274J653k23k763j219
3241b318J715J883r2j516j82O15l64j060P23K057L77j951k166Q14K198J049j275
3258E07j199M04J62k56K8Q20P88q95j488j046J935J877j32j785l60M33n7o14O92
3277a86J577L14k303j748J768K151j2j619p10K75L27p95P10J172R70r89k413M01
$$ plain form
3295 -1110 771 2120 421 -500 -1759 -629 548 768 424 1002 1086 -890 -1401 57 1582 1697 -247
3312 -247 -1485 -345 784 554 -296 135 1713 -920 -2433 -1246 2201 1667 -383 -896 -657 92 -114
3329 -114 433 -459 -77 482 -682 -819 -59 1954 1423 -792 -2588 -977 1184 317 194 319 938 -310
3347 -310 -1906 -323 1939 1566 -463 -1749 -471 982 502 -148 511 387 -812 -1365 -658 890 1193
3364 1193 274 -1149 -1339 -166 1275 1422 57 -995 -142 113 -564 -173 1341 1642 -818 -2294 -722
3381 -722 1786 1287 -437 -685 547 -172 -1245 -288 1497 1652 -783 -1729 -337 493 38 82 88 -374 -872
3400 -872 -364 -249 389 349 961 -453 -931 -894 1439 1358 -577 -1340 -310 893 -445 -1570 564 2387
3418 2387 -522 -1961 -303 2534 1165 -1963 -799 -111 -210 -738 80 2048 1190 -556 -1119 138 486
$$ packed form
3295a110J881J349j699r21j259J130J177K20l44N78Q4j976n11J458J525J15j944
3312b47j238J140J129k30q50M31J578k633j513J187L447n34k050n13K39P49k06
3329a14N47q92L82N59j164j37P60K013n31k215j796J611K161q67j23J25O19j248
3347c10j596J583K262l73k029j286J278J453m80o50O59j24j199n53P07J548L03
3364A193r19j423j90J173J441J47j365j052Q53K55o77L91J514L01k460j476J572
3381g22K508m99j724k48J232p19j073R57J785J55k435r46J392Q30m55M4Om62m98
3400h72N08J15O38m0O12j414m78L7K333q1j935p63J030J203j338j125K134J823
3418B387k909j439J658K837j369l128J164O88r9n28Q18J968q58j746n63J257L48
$$ plain form
3435 486 515 528 -794 -1350 -1034 604 551 637 436 1372 -149 -2544 -2078 2265 2040 -907 -1977 485 1417
3454 1417 -420 -833 736 674 -917 -1406 917 2493 1637 -312 -661 -803 -407 662 788 1049 -165
3471 -165 -713 752 499 -56 1310 2170 -224 -2822 -61 2399 1655 -191 -302 808 -198 -2418 -529
3488 -529 1956 1410 -730 -2401 -182 1056 758 239 845 161 -1188 -1444 782 908 730 322 -21 -1503
3506 -1503 -1054 738 1420 131 -1333 -482 253 -275 -608 1197 1930 -919 -2918 -665 1882 1718 -815
3523 -815 -790 1065 -221 -1250 200 2185 1185 -1743 -1996 -255 1098 857 543 -106 -1248 -1569 -404
3540 -404 631 517 535 540 -191 -1922 -915 1918 2061 -867 -1991 -194 702 -528 -339 1629 1944 -1192
3558 -1192 -2862 -721 2326 1417 -709 -1218 -92 -197 -792 395 633 392 -1122 -941 -830 296 1016
$$ packed form
3435D86K9J3j322n56L16J638n3Q6k01R36j521k395M66M343k25k947j070K462R32
3454A417j837m13J569o2j591m89K323J576q56j949l49j42L96J069J26K61j214
3471a65n48J465k53n55J366Q60k394k598K761K460p44j846j11J110j006k220J889
3488e29K485n46k140j671K219J238k98n19O06o84j349k56K226J26j78m08l43j482
3506a503M49J792O82j289j464Q51P35n28l33J805P33k849j999K253K547j64k533
3523h15K5J855j286j029J450J985j000k928k53J741J353k41l14o49j142l21J165
3540d04J035j14J8Np31j731J007K833J43k928j124J797Q96j230J89J968L15l136
3558a192j670K141L047r09k126n09J126j05n95J187K38k41j514J81J11J126P20
$$ plain form
3575 1016 1434 -76 -1565 -1307 1009 854 -231 -172 531 -268 -1740 -7 2069 885 -629 -2833 -157
3592 -157 1209 78 376 980 1094 -1373 -1812 -351 1807 1115 -172 -1130 -877 -517 643 1459 862 -291
3610 -291 -741 -603 -311 -462 1027 1541 -574 -2235 -1003 1295 1443 -352 -444 157 -719 -1522 -305 1995
3628 1995 1555 -1110 -2570 -95 719 141 -292 314 -119 -1319 -1431 391 1363 712 -779 -575 -1953
3645 -1953 -925 1182 1587 -273 -949 -557 601 -334 -488 1864 1259 -938 -2466 -381 1789 1418 793
3662 793 -261 630 -481 -1245 -270 2131 1492 -150 -1772 -453 1203 1031 193 -410 -896 -1021 349
3679 349 458 439 286 1039 -171 -1872 -729 1296 350 -597 -1561 43 449 72 -314 1452 1709 -643
3697 -643 -1718 -1418 660 1261 -14 -1037 -399 -506 618 1304 -396 143 -268 -1069 301 -990 330
$$ packed form
3575A016M18j510j489K58K316j55j085N9P03p99j472J733K076j184j514k204K676
3592a57J366j131K98O04J14k467m39J461K158o92j287r58K53L60J160Q16n97j153
3610b91m50J38K92j51J489N14k115j661J232K298J48j795r2O01q76q03J217K300
3628A995m40k665j460K475Q14n78m33O06m33j200j12J822R72o51j491K04j378
3645a953J028K107M05j860o76L92J158r35j54K352o05k197j528K085K170l71o25
3662G93j054Q91j111p64R75K401o39j642j622J319J656j72q38o03m86j25J370
3679C49J09j9j53P53j210j701J143K025r46r47r64J604M06l77l86J766K57k352
3697f43j075L00K078O01j275j023O38j07J124O86j700N39m11q01J370j291J320
$$ plain form
3714 330 671 -259 -1374 -336 828 1288 -740 -736 -298 -286 -1804 -237 1494 1932 -365 -2405 753 656
3732 656 132 192 585 678 -1007 -1744 206 1066 1342 -110 -771 -1255 -2 288 878 392 -833 -330 -353
3751 -353 319 404 1872 514 -1393 -1564 -545 2367 1873 -929 -38 -598 -573 -1034 -236 1134 1093 -680
3769 -680 -1450 -535 625 866 197 -105 -786 -812 -348 172 1032 807 691 -1100 -821 -1276 1338 1348 -229
3788 -229 132 202 -354 303 -211 1119 2620 -777 -1709 -615 895 1097 -200 -706 50 31 571 141 1321
3807 1321 594 -894 -603 -1481 744 1654 381 -624 -649 -327 587 79 417 118 914 -1027 -1241 829
3825 829 1346 527 -499 -1546 -112 611 994 454 -32 483 -1280 -2376 197 1496 1212 -245 -309 262
3843 262 1019 -427 -745 -103 535 -231 -870 -1064 349 1299 753 -955 -684 278 313 305 521 -398 -285 -1065
$$ packed form
3714C30L41r30j115J038J164M60k028MM38J2j518J567J731M38k297k040L158r7
3732F56n24O0L93R3j685p37J950Q60K76j452o61m84J253K90N90m86j225N03k3
3751c53O72Q5J468j358j907j71J019K912m94k802Q91n60K5m61P98J370m1j773
3769f80p70R15J160K41o69l02o81k6M64N20Q60k25j16j791K79m55K614J0j577
3788b29L61P0n56O57n14J330J501l397r32J094J510K02j297n06P56j9N40m30J180
3807A321p27j488K91q78K225R10j273j005k5L22R14n08L38k99P96j941k14K070
3825H29N17q19j026j047J434P23L83n40m86N15j763j096K573J299k84j457o4N71
3843B62P57j446l18O42O38p66o39j94J413R50n46j708K71R62L5qK16r19J13p80
$$ plain form
3863 -1065 -1141 11 1156 1694 -419 -1369 -819 1027 889 364 -486 -176 -113 -921 -61 1026 521 -192 -1044
3882 -1044 -818 246 942 263 -377 -621 204 -408 -216 -30 286 252 -992 -711 187 1318 1140 -111 351
3901 351 -12 22 -267 -239 807 948 -535 -1600 -793 1175 806 -151 -119 -703 -373 -26 -70 597 580 -475
3921 -475 -1220 -379 167 859 1381 -527 -287 -90 -389 677 -380 898 209 -40 -1080 -517 881 1085
3939 1085 -44 -760 -580 375 587 -13 -9 -20 -53 -1221 -208 689 1226 -314 -525 -678 155 -4 87 -338
3959 -338 332 -216 -1346 -478 388 1273 1270 -757 -726 103 404 62 -105 263 453 -906 -1313 434 447 846
3979 846 299 -889 -561 143 519 -36 70 385 -421 -428 -2 800 1391 247 -636 -872 -573 243 616 111
3999 111 21 348 -488 -627 819 1382 1272 -399 -1297 -437 864 873 -3 -63 58 -270 -582 -287 879 602
$$ packed form
3863a065p6J152J145N38k113r50N50J846j38n25q50L10O3q08Q60J087n05p13q52
3882a044K26J064O96o79o40k44Q25o12J92J86L16l4j244K81Q98J131j78j251M62
3901C51l63L4k89K8J046J41j483j065Q07J968l69r57L2n84L30L47m4O67j7j055
3921d75p45Q41N46O92N22j908K40J97k99J066j057J278o89k49j040N63J398K04
3939A085j129p16J80R55K12o00Mj1l3j168J013Q97N37j540k11j53Q33j59R1m25
3959c38O70n48j130Q68Q66Q85lk027L1Q29L01l42j67L68J90j359m07J747J3L99
3979H46n47j188L28P04L76n55J06L15q06pM26Q02N91j144q83k36K99Q16L73n05
3999A11r0L27q36j39J446N63j10j671q98Q60J301Rq76o0J21l28l12K95J166k77
$$ plain form
4019 602 191 -963 -891 350 605 677 -162 -376 -149 -222 -223 -96 829 575 -594 -1358 -115 1064 853 -182
4039 -182 -302 -99 -288 -462 -137 1051 889 -369 -1508 -589 814 958 -34 -572 -490 -483 -54 125 832 455
4059 455 -21 -702 -1249 -70 1100 903 -175 -1035 -168 230 176 -113 470 829 -688 -1382 -159 1065
4077 1065 750 -272 -563 -397 -110 -895 -70 768 661 -654 -944 -175 400 -497 121 -611 -1662 -381
4095 -381 -907 426 787 779 -131 -789 -1210 377 1160 917 16 -2050 -287 591 177 -620 1233 102 -846
4114 -846 -1845 -766 1410 1293 -353 -477 190 -337 231 107 552 -204 -164 -478 -340 23 670 359 -245
4133 -245 -2246 -609 1067 775 -372 -835 302 -1016 -717 -175 2298 1821 -2 -1706 299 -219 -498
4150 -498 -723 -182 -309 -740 -1371 -501 486 399 230 -323 -835 -284 417 1315 -348 -1474 -842 440 81
$$ packed form
4019F02m11j154P2J241K55P2q39k14K27p3jJ27R25k54j169p64J243J179k11j035
4039a82j20K03j89j74L25J188j62j258j139R19J403J44r92n38Q2PM29J79P07l77
4059D55m76o81n47J179J170j97j078q60Q67L98n4k89N83L59j517o94J223J224
4077A065l15j022k91J66K87p85Q25Q38j07j315k90P69N75q97O18p32j051J281
4095c81n26J333L61qr10o58m21J587P83k43r01k066J763Q78m14p97J853j131r48
4114h46r99J079K176j17j646j24O67n27N68j24M45p56M0l14J38L63O47l11o04
4133b45k001J637J676k92j147m63J137j318K99N42K473m77j823j704K005n18k79
4150d98k25N41j27m31o31Q70R87q7j69n53n12N51P01Q98j663j126O32J282l59
$$ plain form
4169 81 -686 993 1473 -197 -2076 -852 2005 1170 -33 -1011 -66 -338 -486 -402 935 264 -1316 -1317 -259
4188 -259 846 100 789 223 -300 -1654 -459 490 805 635 -500 -299 -1139 -404 547 1086 -330 -1314
4206 -1314 -640 894 111 -119 1300 1360 -264 -1933 -658 1440 620 -1060 38 -170 -307 -397 -116 930
4224 930 808 -1021 -822 524 518 554 538 87 -724 -457 672 1268 -444 -768 369 -329 -1397 -668 1389
4243 1389 1482 -741 -2005 -287 1077 323 -198 432 773 -775 -1408 298 1538 496 -479 -516 -121 -598
4261 -598 -164 1017 592 -388 -856 -38 100 171 -138 1159 87 -1540 -739 1146 721 -343 -725 885
4279 885 535 -1034 -184 1321 1001 -937 -1743 319 1522 355 -181 354 -231 -1174 -1221 856 1740 -687
4297 -687 -458 -39 -639 -1649 468 1923 -163 -1578 -865 326 77 -362 428 1334 -265 -1153 -355 1531
$$ packed form
4169H1p67J679M80j670j879J224K857q35j203r78R45k72j48Q4J337o71j580jJ058
4188b59J105p46O89n66n23j354J195R49L15j70j135K01q40P35R51N39j416r84
4206a314O74J534p83k30J419O0j624j669J275K098q20j680J098k08j37r0K81J046
4224I30j22j829J99J346oL6j6m51q11K67J129N96j712l24J137o98j068P29K057
4243A389R3k223j264J718J364p54n21O30L41j548o33J706J240j042r75l7L95m77
4261e98M34J181m25r80m68Q18J38P1l09J297j072j627Q01J885m25j064l82J610
4279H85l50j569Q50J505l20j938q06K062J203j167n36N35n85r43m7K077Q84k427
4297f87K29M19o00j010K117J455k086j415P13J191k49m39P90R06j599q88P98J886
$$ plain form
4315 1531 848 -775 -725 669 98 -999 -380 995 682 -1085 -1087 390 925 357 116 200 -192 -762 58
4334 58 884 218 -572 -247 79 -96 -463 891 1370 -476 -1227 -153 635 257 -627 285 846 -749 -1338
4353 -1338 93 1618 658 -826 -540 127 239 -596 251 1046 236 -964 -399 216 482 237 364 145
4371 145 -948 -819 379 1018 -553 -883 390 324 -557 -412 979 1200 -1220 -1082 -82 1048 383 -470
4389 -470 334 726 -886 -1252 324 1281 576 -949 -512 225 100 -2 520 90 -738 -364 224 -17 -160
4408 -160 64 634 -280 -1308 -462 1167 939 -606 -983 473 95 -943 -488 923 839 -906 -1465 288
4426 288 1209 231 -334 214 -233 -314 -639 495 797 318 -456 -473 -356 -194 644 813 -203 -860 -445 628
4446 628 240 -510 558 778 -306 -1234 -322 1078 571 -921 -735 266 194 -485 -14 478 367 -948
$$ packed form
4315A531o83j623N0J394n71j097O19J375l13j767kJ477N35n68k41Q4l92n70Q20
4334E8Q26o66p90L25L26j75l67J354M79j846p51J074P88l78q84R12N61j595n89
4353a338J431J525r60j484K86O67J12q35Q47P95q10j200N65O15K66k45J27k19
4371A45j093J29J198O39j571l30J273o6q81J45J391K21k420J38J000J130o65q53
4389d70Q04L92j612l66J576R57p05j525M37P37j25j02N22m30q28L74N88k41j43
4408a60K24N70r14j028Q46J629k28j545l77J456l78j038M55J411q4j745n59J753
4426B88R21r78n65N48m47q1l25J134L02m79p74j7J17J62Q38J69j016o57M15J073
4446F28l88p50J068K20j084r28R12J400n07j492J86J001p2o79M71M92j11j315
$$ plain form
4464 -948 -913 89 816 763 65 258 -243 -157 54 465 402 -72 -149 -167 -597 -217 1088 607 -348 -1265 66
4485 66 542 315 -212 539 509 -466 -1149 59 1087 424 -872 -1182 303 178 55 51 293 124 -638 -383
4505 -383 117 546 424 -117 -481 -623 -276 603 468 -34 -272 281 -176 -696 -272 775 550 -799 -1159
4524 -1159 -90 965 314 -651 187 346 -84 -420 -113 959 594 -144 -656 -42 134 596 447 -41 -417
4543 -417 -456 -23 35 299 470 283 -600 -909 16 561 802 -134 -597 -427 -108 -377 109 708 453 -439 -729
4564 -729 14 771 454 15 -408 -274 -403 -28 175 492 285 -171 -912 -485 216 529 359 -177 -611 -363
4584 -363 244 202 160 497 301 -560 -791 -31 895 607 -244 -682 258 46 251 79 534 139 -538 -609 -151
4605 -151 520 622 32 -403 -545 -308 252 -13 228 107 -93 -200 -566 397 650 468 -227 -720 -4 647
$$ packed form
4464i48L5J002P27n3o98J93n01Q6K11M11o3m74p7j8m30L80J305m81r55r17J331
4485F6M76k27n27P51l0r75o83J208J028o63j296l10J485j25j23mK42j69p62K55
4505c83N00M29j22n41l64j42L47Q79j35n02k38N53m57n20M24J047k25j349l60
4524a159J069J055o51r65Q38J59m30l36L07J072l65p38n12O14J76M62j49m88l76
4543d17l9M33N8K64J71j87q83l09R25N45K41r36m63J70L19k69M86N99k55q92k90
4564g29P43P57l17m39m23J34j29L75K03L17k07m56p41M27P01L13j70n36m34K48
4584c63O07m2m2L37j96q61k31P60R26k88q51m38R40k12K05j72M55l95o77p1M58
4605a51O71J02n90m35j42K37N60k65K41j21k00j07l66R63K53j82o95m93P16O51
$$ plain form
4625 647 99 -83 -131 357 -378 -752 218 773 319 -585 -568 3 154 131 245 199 28 -326 -557 -279 210
4646 210 850 236 -614 -605 -117 801 286 -388 -352 104 -300 -505 74 984 796 -406 -985 -527 494 579 -95
4667 -95 305 -95 -283 -726 -133 660 385 -132 -528 -529 67 842 205 -40 -330 -333 -200 -382 197 607 191 -500
4689 -500 -869 -85 870 797 74 -426 -10 -3 -112 -133 726 695 -204 -842 -44 678 432 112 -17 -141 -441 -503
4711 -503 348 509 223 -158 -412 -372 57 618 444 -122 -654 -291 109 265 141 571 290 -353 -747 -177
4731 -177 952 791 -353 -352 44 165 -76 60 429 533 -183 -600 24 728 580 350 -65 -582 -491 137
4751 137 460 8 58 9 -210 -706 257 742 679 -552 -1122 -193 469 380 -250 100 133 -222 -980 -65 1110
4772 1110 538 -339 -520 -31 65 113 24 -6 -69 -430 -484 129 267 -42 185 -89 -823 -548 422 829 -93 -266
$$ packed form
4625F47n48j82m8M88p35l74R70N55m54r04J7N71J51k3J14m6j71l54k31K78M89
4646B10O40o14q50RM88R18n15o74L6M56m04k05N79R10j88j202n79M58J021Q5o74
4667i5M00m00j88m43N93P93k75n17l96jN96P75o37k45k90lJ33j82N79M10m16o91
4689e00l69P84R55p3p23n00M16Pj09k1Q59l1q99o38P98P22k46l20j29j24l00o2
4711e03Q51J61k86l81k54M0M29N61j74n66n32L63M00J56j24M30k81o43l94N70
4731a77J129j61j144JL96J21k41J36L69J04p16m17O24P04j48k30m15n17R1O28
4751A37L23m52N0m9k19m96R63M85o3j231n70R29O62q9o30L50L3l55p58R15J175
4772A110n72q77j81M89R6M8q9l0o3l61n4O13J38l09K27k74p34K75R70M07r22j73
$$ plain form
4794 -266 -44 38 -578 -233 667 738 -494 -711 -195 437 304 -174 -14 314 -517 -435 265 775 174 -394 -474
4815 -474 -28 52 368 701 110 -330 -387 72 -90 131 225 471 -146 -1038 -446 904 796 -494 -575 220 238
4836 238 -317 -442 859 882 -714 -696 282 965 -43 -320 -108 103 -233 -55 729 340 -281 -452 -27 -472
4856 -472 -218 171 622 -199 -615 -157 354 205 -389 21 412 -593 -1047 -484 1144 729 -792 -809 30
4875 30 310 -468 83 705 175 -838 -470 304 761 166 64 -87 -418 -367 409 963 401 -681 -327 98
4895 98 -178 -231 478 660 -506 -955 -48 868 569 -613 142 445 -406 -862 249 1327 395 -1041 -643
4914 -643 123 96 68 277 232 -415 -582 181 646 78 -117 135 -128 -413 -605 661 870 -129 -627 217 160
4935 160 -274 -308 861 858 -426 -903 313 720 67 -522 333 111 -411 -386 361 791 30 -790 -550 451
$$ packed form
4794b66K22Q2o16L45R00P1j232k17N16O32j33m78J60L28q31Q2P00N10o01n68q0
4815d74M46Q0L16L33n91m40n7M59j62K21R4K46o17q92N92J350j08j290q1P95J8
4836B38n55j25J301K3j596J8R78O83j008k77K12K11l36J78P84l89o21j71M25m45
4856d72K54L89M51q21m16M58N11j49n94M10L91j005m54N63J628m15j521j7Q39
4875C0K80p78N51O22n30j013L68P74M57n95j02j51l31N1P76N54n62j082L54M25
4895I8k76n3P09J82j166m49R07R16k99j182P55L03q51m56J111J078r32j436L98
4914f43P66k7k8K09m5o47j67P63M65n68j95K52k63k85j92J266K09r99m98Q44n7
4935A60m34l4J169lj284m77J216M07o53n89Q55k22n22K5P47M30p61q20K40J001
$$ plain form
4955 451 262 96 181 403 -846 -476 428 441 65 244 429 -68 -654 -38 889 713 -367 -1149 265 457
4975 457 -298 201 659 159 -644 -842 176 804 21 -207 105 117 -183 -145 463 564 -231 -239 -332 117 -26
4996 -26 456 480 -86 -786 -184 598 556 -658 -26 283 -24 -771 223 1030 521 -815 -639 176 395 -150
5016 -150 55 528 -110 -824 -474 440 467 -31 -112 170 -78 -153 244 676 -33 -523 91 409 -132 -240 648
5037 648 591 -329 -1067 -276 836 328 -341 -194 350 -216 -526 41 748 207 -802 -436 126 312 170 -31
5057 -31 318 -408 -529 97 468 235 -1 174 -255 -473 -80 782 747 -339 -555 207 176 20 -288 703 538
5078 538 -468 -1008 69 777 159 -494 -310 189 -350 -254 441 642 -41 -244 -556 144 181 168 388 34
5098 34 -229 -195 262 252 -146 10 287 -328 -713 122 699 626 -182 -473 190 118 -108 -169 591 185 -733 -745
$$ packed form
4955D51j89j66Q5K22j249L70R04J3l76J79J85m97n86O16R27j76j080p82J414J92
4975D57p55M99M58n00q03j98J018O28p83k28L12J2l00L8O08J01p95qr3M49j43
4996b6M82K4n66p00O02P82m2j214O32L09l07p47R94Q07n09j336J76Q15K19n45
5016a50K05M73o38p14L50R14K7m98q1K82k48p5L97M32p09m90O14L18n41j08Q88
5037F48n7r20p38P91J112n08o69J47N44n66l10N67P07n41j009L66N62J86j42k01
5057c1L49p26j21O26L71k33k36J75m29k18L93Q62l5j086k16P62l1j56l08R91j65
5078E38j006n40J077P08o18o53J84M99n39R6O95K01o83k03l12P00L7j3K20l54
5098C4k63L4M57j0l98J56K77o15l85Q35N77p3q08k91O63p2k26o1P60m06r18j2
$$ plain form
5120 -745 -151 548 131 -138 -552 -38 189 415 486 394 -97 -407 -258 -30 435 669 512 -407 -1067 -372 608
5141 608 308 -96 -116 254 -310 -523 101 935 545 -542 -625 -19 44 -121 120 330 116 35 -799 76 611
5162 611 -146 -31 -235 -496 321 741 21 -172 -506 920 374 -47 12 115 318 -987 -169 -330 1098
5181 1098 910 -453 -154 465 -272 -767 260 433 584 -993 -745 -85 420 -104 169 57 10 -223 -234
5200 -234 68 304 432 61 -356 -303 136 379 183 -519 -170 -36 297 -62 -17 269 154 -407 -737 -150 421
5221 421 499 63 -1 -175 -116 -118 31 373 23 -177 -489 -464 222 4 9 -376 -70 -16 -14 408 297 583 -113 -352
5245 -352 -358 -131 291 502 -265 -356 60 148 342 93 267 361 -290 -473 -315 145 334 -269 -301 -60 -82 193
5267 193 173 -18 -13 -349 -337 -148 145 676 69 -48 -521 -38 185 -32 163 85 -339 -186 -299 -20 713 474
$$ packed form
5120g45N94O99m17k69m14N14K27K26P1r2m91l10J49K28M65K34j57r19o60O95R80
5141F08l00m04k0L70n64k13O24Q34l90j087q3O06O3j65K41K10k14q1q34Q75N35
5162F11p57J15k04k61Q17M20p20j93l34J426n46m21N9J03K03j305Q18j61J428
5181A098j88j363K99O19p37m95J027J73J51j577K48O60N05n24K73j12m7k33j1
5200b34L02K36J28l71m17N3M39K43j96p02L49J34L33l59M5K86j15n61l30N87N71
5221D21P8m36o4j74N9kJ49L42l50k00l12K5O86k18Nl85L06N4KM22j11K86o96k39
5245c52oK27M22K11p67r1M16Q8J94k49J74R4o51j83J58M60J89o03l2K41k2K75
5267A93k0j91Nl36J2J89K93N31o07j17m73M83K23k17J95p8m24J53j13K79P33k39
$$ plain form
5289 474 -281 -468 -128 286 262 538 113 -409 331 -344 103 441 147 251 -477 208 258 544 1007 403 245
5310 245 -327 -768 -638 409 251 -33 -105 -152 -486 653 81 -69 115 686 -55 182 44 326 282 169
5330 169 -905 -73 701 -104 78 -181 338 17 354 613 464 -91 -513 -45 -246 398 -170 -704 1018
5349 1018 -529 -95 46 233 342 118 1089 61 -631 -322 453 373 -117 -579 143 26 192 -147 -80 889
5369 889 -611 -629 574 533 215 449 -278 -954 -45 446 -139 -428 203 -26 -497 -383 -217 431 -243 131
5389 131 -392 151 826 97 -31 -45 336 -408 -579 -655 586 1070 -469 -536 -5 246 -51 -157 89 90 -77
5410 -77 -203 685 258 416 65 432 -910 338 151 -523 -91 -207 -72 157 -743 494 925 137 250
5429 250 -781 102 356 72 -78 -234 -401 541 -266 200 454 -34 -345 -298 -296 28 677 94 -59 -84 27
$$ packed form
5289D74p55j87L40M14k4K76m25n22P40o75M47L38k94J04p28O85N0K86M63o04j58
5310B45n72m41J30J047j58k84p2m7l34J139n72j50J84N71p41K37j38K82m4j13
5330A69j074Q32P74q05J82k59N19l21L37K59j49n55m22M68k01O44n68n34J722
5349A018j547M34J41J87J09k24R71j028o92L09P75q0m90m62P22j17J66l39O7R69
5369H89j500j8J203m1l18K34p27o76R09M91n85k89O31k29m71J14J66O48o74L74
5389A31n23N43O75p29j28j4L81p44j71p6J241M84j539o7N31K51k97j06K46Jj67
5410g7j26Q88m27J58l51L67j342J248j87o74M32j16J35K29r00J237M31p88J13
5429B50j031Q83K54k84j50j56j67R42q07M66K54m88l11M7KL24O49n83j53k5J11
$$ plain form
5450 27 -555 181 65 702 181 66 -502 -141 121 456 -181 -177 141 -523 -624 74 903 652 46 -780 -864
5471 -864 279 712 699 -596 -505 -232 -150 207 493 436 208 -298 -934 169 417 625 107 -432 -383 -7 -452
5492 -452 415 142 419 -465 -769 242 569 -80 -240 -335 199 17 6 454 678 -334 -142 -92 141 230 576
5513 576 390 -441 -565 -186 364 358 57 -57 1 -139 -346 166 401 378 -441 -669 56 238 49 64 373 -89
5535 -89 -443 -156 16 259 173 -171 -256 -223 88 282 549 -11 236 -47 -226 232 125 180 347 -690 -640 9
5557 9 833 528 -436 -122 -34 -64 -331 173 617 93 -490 -797 153 245 61 94 74 -255 -521 -387 448 50
5579 50 126 -185 -97 -319 -373 336 231 -45 -539 -271 168 65 -45 194 639 -443 -611 188 484 329 -479
5600 -479 -156 77 -49 -400 127 466 106 -644 -254 65 490 82 112 54 -440 -645 313 626 302 -360 -72
$$ packed form
5450B7n82P36j16O37n21j15n68L61K62L35o37ML18o64j01O98Q29k51o06q26q4
5471h64J143M33j3j295R1K73Q2L57K86n7k28n06o36J103K48K08n18n39M9L76m45
5492d52Q67k73K77q84l04J011L27o49j60r5N34j82j1M48K24j012J92N0K33Q9L46
5513E76j86q31j24L79N50ol01j14N8j40k07N12K35k3q19k28P25J82j89J5L09m62
5535h9l54K87J72K43q6l44q5L3L11J94K67n60K47k83j79M58j07N5J67j037N0O49
5557IQ24l05r64L14Q8l0k67N04M44n24n83l07R50R2j84L3k0l29k66J34Q35l98
5579E0P6l11Q8k22n4P09j05k76m94K68M39j03j10K39M45j082j68P99K96j55q08
5600d79L23K33j26l51N27L39l60p50L90L19M25m08L0n8m94k05R58L13l24o62K88
$$ plain form
5621 -72 -514 -424 -116 829 490 -373 -365 197 192 -340 -362 550 89 -593 -612 216 689 300 -202 38 59 -399 -165
5644 -165 258 198 -69 -199 -71 246 99 331 37 167 -578 -220 696 384 -436 -254 105 -35 -515 102
5664 102 588 265 -285 -745 443 524 176 19 314 391 -195 -231 425 670 205 -38 -69 19 -418 185 585
5685 585 -33 -474 -373 -21 -15 135 -63 710 -42 -657 -179 414 373 -583 -394 431 -125 -467 163 752 157
5706 157 -266 -415 176 479 -286 94 129 -27 -356 -211 556 274 360 148 10 -19 -305 292 472 73 -636
5727 -636 -430 201 168 -268 228 486 89 -1010 91 210 -448 -24 -80 829 -636 -113 349 762 1810
5746 1810 -1446 -695 207 349 453 377 179 -237 -231 508 758 376 -396 -368 -66 -504 -260 39 741 -549
5766 -549 -221 -44 372 248 -306 428 332 -422 -502 261 669 166 -331 257 194 43 -331 259 434 38 -545
$$ packed form
5621g2m42R0L08R45l39q63QN62nn32k2R12m61o82j9Q28M73l89n02K40K1m58K34
5644a65M23o0k67j30J28L17j47K32k94J30p45L58R16l12q20J82L59j40m80O17
5664A02M86l23n50m60J188Q1l48j57K95P7n86l6O56K45m65k43l1Q8m37O03M00
5685E85o18m41J01L52OJ50j98P73p52o15M78N93m1r56J89Q25n56l42O30N89n95
5706A57m23j49N91L03p65L80L5j56l29J45P67k82Q6k12j38k9k86N97J80l99p09
5727f36K06O31l3m36M96K58l97j099J101J19o58M24n6R09j465N23M62M13J048
5746A810l256P51R02J42J04p6j98m16OP39K50l82p72K8L02m38K44K99P02j290
5766e49L28J77M16j24n54P34r6p54q0P63M08n03m97N88o3j51l74N90J75l96n83
$$ plain form
5787 -545 -56 227 -93 -225 186 -49 -565 -17 488 73 248 504 602 -185 -438 -160 531 467 403 -271 -324
5808 -324 155 471 -166 -21 321 -214 -348 732 227 -22 -17 -122 -214 -503 493 989 414 -151 -148 46 -188
5829 -188 -364 707 723 68 -310 -120 337 853 -423 47 199 140 -469 -7 1127 183 -707 -941 -57 1379
5849 1379 272 213 139 165 -36 8 -583 20 -706 -45 1219 -411 178 873 613 296 -51 -475 80 379
5869 379 188 -188 329 -1073 -278 -783 660 768 350 61 36 -661 -112 124 486 362 -545 305 -368 354
5889 354 -165 269 -584 71 -150 894 398 -603 -383 439 -43 -355 133 564 1249 102 -423 119 749
5908 749 365 -274 324 599 -101 -100 -178 265 64 -368 113 -376 -508 -263 48 156 -72 -50 48 209 266 182
5930 182 -54 17 -261 213 596 345 -72 7 71 -267 -206 -66 170 157 1 -36 165 74 467 -21 242 -272
$$ packed form
5787e45M89K83l20j32M11k35n16N48N05m15J75K56R8p87k53K78O91o4o4o74n3
5808c24M79L16o37J45L42n35j34J080n05k49Nj05r2k89R96M96n75n65LJ94k34
5829a88j76J071J6o55l78J90M57N16j276M70J52n9o09M62J134r44q90k34Q84J436
5849A379j107n9p4K6k01M4n91O03p26O61J264j630N89O95k60l17l47m24N55K99
5869C79j91l76N17j402P95n05J443J08m18k89k5o97N49K36L62j24r07Q50o73P22
5889C54n19M34q53O55k21J044m96j001K20Q22m82l12M88M31O85j147n25N42O30
5908G49l84o39N98K75p00Jp8M43k01m32M81m89j32K45L11J08k28K2R8J61N7q4
5930A82k36P1k78M74L83k51m17P9O4l38O1J40K36j3j56l7K01r1L93m88K63n14
$$ plain form
5952 -272 -258 -374 367 440 398 285 -394 -48 241 273 267 -107 -24 115 -70 58 -61 116 162 -210 -495 -84 334
5975 334 178 -90 56 65 -95 6 -178 438 217 -348 -147 3 572 362 19 -216 91 -67 -213 137 375
5996 375 103 84 3 -264 111 148 -3 -256 -219 -208 235 4 261 312 209 -112 -233 93 403 -139 -315 -247
6018 -247 220 30 -72 16 76 -350 -73 -313 102 222 208 -18 -235 -373 -315 123 -90 -13 -65 399 -42 -331
6040 -331 -347 328 553 -307 -651 192 67 280 -62 -42 482 -154 -26 -351 125 399 430 -174 344 427 -225
6061 -225 1111 137 303 -679 391 -189 368 -281 564 -258 -405 -392 180 -428 1036 -63 -380 955 -432
6080 -432 846 260 -160 -120 -957 205 227 120 355 -193 -138 209 -900 -403 3 706 31 -687 -501 542
6100 542 456 -280 231 827 675 566 -44 -25 -21 739 -19 -723 -182 311 531 -623 11 -134 -468 -562 205
$$ packed form
5952b72J4j16P41P3m2j13o79L46K89L2ol74Q3J39j85J28j19J77M6l72k85M11M18
5975C34j56k68J46Rj60J01j84O16k21n65K01J50N69k10l43k35L07j58j46L50K38
5996C75k72j9q1k67L75L7j51k53L7J1M43k31K57N1j03l21j21L26L10n42j76O8
6018b47M67j90j02Q8O0m26K77k40M15J20j4k26k17j38N8M38k13P7n2M64m41k89
6040c31j6O75K25q60l44Q43j25K13l42K0N24o36J28l25M76K74L1o04N18Q3o52
6061b25J336r74J66r82J070n80N57o49Q45q22j47J3N72o08J464j099l17J335j387
6080d32J278n86m20M0q37J162K2j07K35n48N5L47j109M97M06P03o75p18J86J043
6100E42q6p36N11N96j52j09o10J9MP60p58p04N41M93K20j154O34j45l34r4P67
$$ plain form
6121 205 591 447 -342 -488 357 172 -201 5 -48 -175 198 297 269 358 -72 -33 -231 -78 49 235 132 -1
6143 -1 -384 -210 355 -169 -153 -7 200 -470 -263 259 596 163 -278 -150 -116 94 -21 -64 546 113 -69 57
6165 57 373 543 80 207 42 -403 -84 168 294 -308 -117 -29 -156 -169 -82 296 28 -437 -371 -143 555 -101
6187 -101 -187 157 134 -249 -304 298 544 214 -212 -206 -47 5 91 285 228 -443 -121 -297 184 -262 105 137 -197
6210 -197 -277 -204 174 45 -220 -41 192 -32 -276 212 287 64 -560 -466 442 123 -152 -282 -129 -138 -334 57
6232 57 327 386 4 -125 76 -450 19 499 346 -173 -500 137 271 160 -103 -25 304 -420 -338 -170 368
6253 368 244 -164 -96 159 20 -430 138 337 -74 -205 -44 318 235 -297 286 397 -133 -189 -39 321 224
6274 224 -16 218 315 -274 -74 234 502 -146 -532 -287 782 -71 -204 -14 321 -352 -627 9 442 -271
$$ packed form
6121B05L86j44p89j46Q45j85l73K06n3j27L73R9k8Q9m30L9j98J53J27J86j03j33
6143al83J74N65n24J6J46K07o70K07N22L37m33m41J28L4K10j15m3O10m33j82J26
6165E7L16J70m63J27j65m45L19K52J26o02J91Q8j27j3Q7L78k68m65O6K28O98o56
6187a01q6L44k3l83n5O02K46l30m26OJ59N2Q6J94n7o71L22j76M81m46L67L2l34
6210a97q0P3L78j29k65J79K33k24k44M88P5k23o24R4R08l19k75j30J53rj96L91
6232E7K70N9l82j29K01n26M69M80j53n19l27O37J34j11k63P8L29p24Q2J68N38
6253C68j24m08O8K55j39m50N68J99m11j31J61L62q3n32N83J11n30n6J50L60r7
6274B24k40K34R7n89K00L08K68o48l86K45J069q53j33J90L35o73k75O36M33p13
$$ plain form
6294 -271 -378 -99 325 180 79 368 359 -142 -627 -9 345 221 -187 120 -301 -1038 -167 -785 351 428 162
6315 162 860 -809 -573 -416 -1196 696 -181 -336 607 499 -296 -513 314 241 -58 -485 310 451 -170 -685
6335 -685 -374 334 278 456 -71 -574 11 191 108 401 457 742 382 375 -1146 87 590 563 -369 -139 -852
6356 -852 170 755 1042 786 567 -398 -57 -11 159 2 300 -257 -280 4 -708 219 464 -80 -240 108
6376 108 55 -138 84 173 150 -457 -266 277 -2 -147 -184 404 -279 -558 171 373 268 -708 -245 342 -142
6397 -142 -303 216 310 141 -517 -129 37 842 16 49 -263 397 -249 -325 -98 -12 -456 -190 369 -379 363
6418 363 311 387 -70 97 -38 -614 -318 -449 267 432 -371 -227 150 315 -197 -710 -130 4 375 435 -9
6439 -9 67 177 -354 -115 408 444 505 -231 -531 -984 -140 112 -373 -317 399 -227 48 -281 364 -195 -933 -54
$$ packed form
6294b71j07K79M24j45j01K89rn01m85O18L54j24m08L07m21p37Q71o18J136P7k66
6315A62O98j669K36J57p80J892q77j55R43j08p95k17Q27p3k99m27P95J41o21n15
6335f85L11P08n6J78n27n03N85J80q3K93N6K85l60pj521J233N03k7r32K30p13
6356h52J022N85K87k56k19r65L41M6J70j57K98n57k3K84p12R27K45n44j60L48
6376A08n3j93K22Q9k3o07J91N43k79j45l7N88o83k79P29K02j05r76M63N87m84
6397a42j61N19R4j69o58L88J66Q05q26L3l12O60o46p6K27Q6m44K66N59p48P42
6418C63n2P6m57J67j35n76K96j31P16J65q03J44L77J65n12n13N80J34L71O0m44
6439iP6J10n31K39N23L6O1p36l00m53Q44K52m85N6P16o26K75l29O45n59p38Q79
$$ plain form
6461 -54 -608 707 470 -185 -23 944 877 7 -25 0 357 526 423 38 -488 216 -136 389 -207 -497 73
6482 73 401 710 120 -353 -391 -210 -158 -289 708 -77 -449 139 34 174 576 -37 198 76 -367 -167 93
6503 93 293 -111 -174 163 212 -185 -64 128 145 -245 -250 29 -288 206 491 312 19 -165 -147 -77 68 -319 44
6526 44 88 -228 -56 25 240 308 -81 -130 -178 -329 -136 -41 153 -186 -129 -225 98 305 111 -413 144 -105 -229
6549 -229 -56 342 151 -57 -166 -59 80 90 -105 88 -315 -168 226 284 32 -259 14 75 -317 -77 -194
6570 -194 -7 50 -357 -180 183 114 -10 46 98 -164 -182 -20 82 295 113 5 -445 -333 -158 187 318 -118
6592 -118 -167 89 -241 -80 72 207 269 -167 -242 -80 -7 79 92 128 -83 -232 -141 181 229 285 26 -168 -11
6615 -11 -18 154 345 -327 -95 -187 -52 523 210 123 81 -285 -211 -290 502 173 547 305 -172 151 -75 133 -377
$$ packed form
6461e4n54J315k37o55J62R67o7q70l2K5L57J69j03l85n26P04l52N25n96k90N70
6482G3L28L09n90m73l8J81N2j31R97p85l72N88j05J40M02o13K35j22m43K00K60
6503I3K00m04o3L37M9l97J21J92J7l90nK79l17M94K85j79k93j84J8P0J45l87L63
6526D4M4l16J72Q1K15O8l89m9m8j51J93R5J94l39N7r6L23K07j94n24N57k49j24
6549b29J73L98j91k08j09J07J39J0j95J93m03J47L94N8k52k91K73O1l92K40j17
6570a94J87N7m07J77L63o9j24N6N2k62j8J62J02K13j82j08m50J12J75L45J31m36
6592a18m9K56l30J61J52J35O2m36p5J62P3Q6J3L6k11j49R1L22M8N6k59j94J57
6615a1pJ72J91o72K32r2J35N75l13q7m2l66P4p9P92l29L74k42m77L23k26K08n10
$$ plain form
6638 -377 119 67 -404 -297 89 782 13 -312 315 179 529 -558 -156 121 -693 489 11 691 707 297
6658 297 -541 -62 694 -126 -778 -679 -385 103 -702 -1850 -925 32 -292 -915 -246 -53 120 106 569 326
6678 326 848 -144 -172 -340 175 94 -62 -1102 -131 121 -69 51 -207 366 -169 106 399 -361 -31 385
6698 385 -636 -817 -201 -71 -335 921 1247 101 -365 -644 -588 -37 110 48 102 -498 -294 -5 -294 213
6718 213 -170 -177 -273 116 -64 -553 584 -38 -107 220 60 134 661 -502 -573 -546 -319 155 196 -399 -493 98
6740 98 5 -76 -725 -146 -11 -712 1176 57 -265 -121 7 45 -20 -493 -628 -70 -359 163 50 222 -172
6761 -172 96 -57 321 86 323 -188 347 422 33 -170 39 -93 -90 167 -338 -43 376 -31 -88 103 259
6782 259 486 -148 -39 19 218 -8 232 -254 -99 -133 -147 -112 26 -170 10 52 208 -43 -58 239 -44 126
$$ packed form
6638c77M96n2m71J07L86O93p69l25O27j36L50j087M02K77q14J182m78O80J6m10
6658B97q38M79P56q20o52R9K94M88q05j148R25R57l24o23O69J93J73j4M63k43
6678C26N22r92k8j68N15q1j56j040R71K52j90J20k58N73n35K75K93p60L30M16
6698C85j021j81O16J30k64J256L26j146m66k79N6N51J47o2N4o00K04K89k89N07
6718B13l83pr6L89j80m89J137o22o9L27j60P4N27j163p1K7K27M74M1n95r4N91
6740I8r3q1o49N79J35p01J888j119l22J44J28L8o5m73j35N58k89N22j13J72l94
6761a72K68j53L78k35K37n11N35P5l89k03K09j32LK57n05K95M19m07n7J91J56
6782B59K27o34J09N8J99k26K40m86J55l4j4L5J38j96J80M2J56k51j5K97k83J70
$$ plain form
6804 126 24 73 -329 264 3 360 71 -275 -237 -93 12 -97 78 108 -342 -327 265 318 249 -191 -197 -111 100
6827 100 -165 40 -241 170 -16 -274 -122 -58 184 0 118 -170 -397 239 120 -314 25 -165 51 -687
6847 -687 -419 402 763 -808 -165 626 373 458 -51 -161 -516 944 -881 177 -107 717 -58 804 129
6866 129 -802 -449 176 279 -246 -845 110 -380 -690 -255 143 360 63 118 460 -30 -550 -117 -73 -149 578
6887 578 448 107 -300 86 -148 -215 358 79 -223 -99 -653 127 260 300 120 -266 353 -177 -17 -167 -234
6908 -234 152 -159 -415 -301 63 119 -370 325 222 -126 -407 -152 796 -319 -568 99 252 -436 85 441
6928 441 217 48 90 53 415 95 243 539 -87 -273 -82 424 138 38 -214 -134 520 -840 -873 842 -708
6949 -708 -303 -431 -106 107 -792 86 226 -255 507 -1023 -415 355 -421 388 -1033 77 234 537 -115
$$ packed form
6804A26j02M9m02N93k61L57k89l46L8J44J05j09J75L0m50J5N92N3o9m40oQ6K11
6827A00k65K05k81M11j86k58J52O4K42j84J18k88k27O36j19m34L39j90K16p38
6847f87K68Q21L61j571O43P91k53Q5n09j10l55J460j825J058k84Q24p75Q62o75
6866A29r31L53O25J03n25n99R55m90l10M35L98K17k97N5L42m90n20M33M4p6P27
6887E78j30l41m07L86k34o7N73k79l02J24n54P80J33M0j80l86O19n30J60j50o7
6908b34L86l11k56J14L64N6m89O95j03l48k81K55R48j115k49O67J53o88N21L56
6928D41k24j69M2l7L62l20J48K96o26j86J91N06k86j00k52Q0O54j360l3J715j550
6949g08M05j28L25K13q99Q78J40m81P62j530O08P70p76Q09j421J110J57L03o52
$$ plain form
6968 -115 -158 -437 -499 -4 455 516 184 201 -70 -524 -58 103 -56 288 -134 174 -564 -167 -300 350 122
6989 122 -430 133 281 249 -534 645 44 -352 173 252 -170 223 345 -565 -476 -271 -385 315 346 -73 -355
7010 -355 -416 435 -293 -455 -142 -45 8 -355 -731 226 -991 -219 1009 -282 -345 786 173 919 -268 -365
7030 -365 63 128 40 19 307 -200 -325 -28 203 -91 -237 274 346 -37 -794 -45 250 -11 -897 -491 13
7051 13 172 463 -588 125 -610 -184 -199 957 501 460 566 -215 446 -134 114 -262 96 403 -360 94
7071 94 82 -450 -28 146 -313 -30 -172 331 -29 48 239 -64 -151 -160 192 303 85 -522 -174 21 -7 -275
7093 -275 -16 135 -1 -366 -543 -157 -322 -314 293 422 -253 293 1 6 120 747 783 769 -75 287 -436 286
7115 286 344 238 685 520 490 -210 -385 -849 43 289 412 50 -29 -527 -60 2 -355 -404 -109 156 -475 -434
$$ packed form
6968a15m3k79o2M95M59O1l32J7k71m54M66J61j59L44m22L08p38L97j33O50k28
6989A22n52N63J48l2p83J179o01l96N25P9m22L93J22r10Q9K05j14P00L1m19k82
7010c55o1Q51p28j62L13R7N3l63l76R57j217P72J228j291o3J131o13P46j187r7
7030c65M28O5q8k1K88n07j25K97K31k94j46N11P2l83p57P49K95k61q86M06N04
7051A3J59K91j051P13p35M26j5J156m56m1J06p81O61n80K48l76L58L07p63M54
7071I4j2n32M22J74m59K83j42N03l60P7J91l03q7rL52J11k18o07L48J95k8k68
7093b75K59J51j36l65j77L86j65QO07J29o75N46k92NJ14O27L6j4q44L62p23P22
7115B86N8j06M47j65l0p00j75m64Q92K46J23l62p9m98M67O2l57m9K95K65o31M1
$$ plain form
7137 -434 136 2 716 -394 109 132 -36 -87 7 -473 -198 588 34 320 16 -141 -84 167 -229 -75 182
7158 182 714 463 -294 182 168 -131 -602 -313 390 -1012 -790 -405 248 -29 19 -52 146 -118 -94 473 214
7179 214 -421 38 825 -517 -237 -221 597 333 -389 164 565 -739 -127 455 -124 57 -1038 -163 797
7198 797 79 -478 1036 205 870 99 -1339 -687 102 766 -573 198 -513 -762 -90 599 26 90 -9 271
7218 271 71 968 -181 114 118 -412 -69 237 339 -334 -518 71 62 -326 -363 373 -215 -278 61 378 95 -310
7240 -310 -185 -358 219 172 -120 351 100 188 -33 127 131 -329 206 -28 -239 -107 -130 65 -60 222 187 29
7262 29 104 4 51 332 -199 67 235 -387 397 104 -378 530 47 -224 290 135 -254 600 301 -572 -544
7283 -544 -290 -25 587 112 651 -87 -456 -193 -107 215 306 433 -602 73 262 65 -548 282 -295 77
$$ packed form
7137d34N70j34P14j110N03K3j68n1R4m80K75P86n54K86l04j57N7K51l96J54K57
7158A82N32k51p57M76j4k99m71K89P03j402K22L85O53k77M8p1J98k64K4N67k59
7179B14o35M59P87j342K80J6Q18k64p22N53M01j304O12N82n79J81j095Q75R60
7198G97p18n57J514q31O65p71j438O52P89O64j339P71p11k49O72O89n73O4r9K80
7218B71k00Q97j149K95Mn30L43L06J02o73j84N89rl88l7P36n88o3L39L17k83m05
7240c10J25j73N77m7k92M71k51Q8k21J60Mm60N35k34k11J32k3J95j25K82l5j58
7262B9P5j00M7K81n31K66J68o22P84k93m82R08m83k71N14j55l89Q54k99q73K8
7283e44K54K65O12m75N39p38l69K63Q6L22R1J27j035O75J89j97o13Q30n77L72
$$ plain form
7303 77 -87 17 194 -13 -34 -367 155 358 21 -28 199 -87 -179 275 16 -142 132 89 -159 214 179 246
7325 246 62 -186 -98 172 112 126 22 -46 78 57 8 -195 164 -93 43 -379 -70 114 62 129 252 -432 -614
7348 -614 20 324 -267 -132 -553 -554 -798 232 214 -75 35 127 -129 -1079 -204 -227 15 -95 29 -306 301
7369 301 -448 353 -475 237 196 -316 -305 131 640 -553 -261 539 -6 -142 -7 237 -85 -219 -688 238
7389 238 503 5 -266 159 -261 -192 80 103 354 -128 -78 108 395 -118 226 63 20 -99 -200 82 208
7410 208 -79 -206 -95 -190 160 -128 6 157 36 2 -185 -43 -184 582 149 -49 -71 155 -14 192 -209
7431 -209 268 151 -25 -6 -297 262 -7 -154 38 244 -37 85 112 -47 4 46 10 161 6 122 173 -61
7453 -61 -133 -234 -57 315 -24 147 121 128 12 111 347 -5 -123 69 127 -175 -132 -230 -23 -304 -233 44 193
$$ packed form
7303G7j64J04J77k07k1l33N22K03l37m9K27k86r2M54k59j58K74m3k48L73l5O7
7325B46j84k48Q8K70o0J4j04o8J24k1m9k03L59k57J36m22L09J84n2O7J23o84j82
7348f14O34L04n91J35m21jk44J030j8k89J10R2k56r50Q75k3K42j10J24l35O07
7369C01p49Q01q28P12m1n12J1M36N09j193K92Q00n45j36J35K44l22j34m69R26
7389B38K65m98k71M25m20O9K72K3K51m82N0J86K87n13L44j63m3j19j01K82J26
7410B08k87j27J11r5L50k88J34J51j21l4j87J42j41P66m33j98k2K26j69K06m01
7431b09M77j17j76J9k91N59k69j47J92K06k81J22K7j59N1M2l6J51j55J16N1k34
7453f1p2j01J77L72l39J71k6Pj16R9K36l52j18J92N8l02M3r8K07k81P1K77J49
$$ plain form
7476 193 290 62 -259 142 -102 29 -38 82 -49 -252 -39 -86 148 183 48 -70 -52 85 -37 295 123 1
7498 1 -59 -318 -242 -114 -166 594 -51 -193 -516 -61 333 42 239 71 -98 -670 545 287 172 -536 56
7519 56 56 -816 -189 -143 467 6 -813 -439 569 -167 -601 499 -521 -130 101 -18 -105 -190 -435 -213 67
7540 67 -162 -471 -182 93 2 -487 -63 77 393 31 -144 133 -3 -170 10 -53 -204 -264 -135 -26 -115 298
7562 298 268 -94 -14 -8 152 -31 80 -247 -125 -105 -103 -50 257 215 -339 -162 -192 234 204 -36 407 33 191 -105
7586 -105 29 -138 134 -86 -61 -64 17 -254 350 204 -297 38 -34 133 -44 114 222 114 -177 -44 307 230
7608 230 -124 54 106 -2 -160 -152 200 113 12 18 91 -1 -316 39 -64 -274 -81 -310 -6 197 41 10 -25
7631 -25 -86 -131 295 228 -184 -256 -50 145 -58 -6 125 -92 209 -166 261 370 -143 -143 -174 138 13 -412 86
$$ packed form
7476A93R7k28l21M01k44J31o7J20j31k03K13m7K34L5j35j18J8J37j22L32j72j22
7498Ao0k59P6J28n2P60o45j42l23M55L94k91J97j68j69n72J215k58j15p08N92
7519E6%q72O27M6O10m61q19L74J008p36m34J100j020L91K31j19q7q5k45K22K80
7540F7k29l09K89K75r1m89M24J40L16l62j75K77j36j67J80o3j51o0J29J09q9M13
7562B98l0l62Q0OJ60j83J11l27J22K0KN3L07m2n54J77l0M26l0k40M43l74J58k96
7586a05J34j67K72k20K5lQ1k71O04j46n01L35p2J67j77J58J08j08k91J33L51p7
7608B30l54J78N2j08j58QL52q7j01OP3r2l15L55j03k10J93k29L04K03j56l1l5
7631b5o1m5M26o7m12p2K06J95k03N2J31k17L01l75M27J09n13%l1L12j25m25M98
$$ plain form
7654 86 -223 220 -153 115 -104 -213 -806 492 197 -386 -357 -316 352 107 107 36 -19 -102 748 -127 134 -60
7676 -60 -478 -208 100 204 -371 -200 377 -71 155 -247 -46 220 -98 373 105 -740 -627 263 -101 -856
7696 -856 13 -51 199 93 348 892 -619 325 -260 -161 429 -634 -957 -44 -678 510 -24 -51 -196 78
7716 78 992 -535 -128 294 712 -1050 397 93 191 368 -224 -289 266 -435 215 -71 -304 -811 536 93
7736 93 -34 247 -313 77 -287 262 1076 175 217 135 271 -11 360 159 64 -403 -375 444 476 -262 378 629
7758 629 46 98 56 708 14 131 275 364 50 63 184 221 -203 -42 -381 43 217 52 159 54 60 -88
7780 -88 -200 387 199 -48 -73 50 307 676 954 -363 -133 -104 247 62 -235 -419 261 119 -719 -498 -174
7801 -174 -166 223 11 261 345 396 422 -139 -149 409 59 605 220 -477 -11 521 331 -476 -104 -311 156 -32
$$ packed form
7654H6l09M43l73K68k19j09n93J298k95n83K9M1O68k45%p1n5q3Q50q75K61j94
7676f0m18K70L08J04n75J71N77m48K26m02K01K66l18M71k68q45J13Q90l64p55
7696h56Q69o4K50j06K55N44j511R44n85R9N90j063l23R13o34J188n34k7j45K74
7716G8R14j527M07M22M18j762J447l04R8J77n92o5N55p01O50k86k33n07J347m43
7736I3j27K81n60L90l64N49Q14r01M2q2J36k82L71k01r5m67K8Q19L2p38O40K51
7758F29n83N2m2O52o94J17J44Q9l14J3J21L7m24J61l39M24J74j65J07j05Oj48
7780h8j12N87j88k47k5J23K57L69K78j317K30K9L51j85k97j84O80j42q38K21L24
7801a74QL89k12K50Q4N1K6n61j0N58l50N46l85o97M66N32j90q07L72k07M67j88
$$ plain form
7823 -32 -437 145 268 251 150 103 394 -254 -59 34 87 6 -172 193 -42 -126 -11 482 52 -506 -138 -107 185
7846 185 56 119 -27 177 1 181 329 251 -102 158 -29 -211 -122 33 215 243 -73 -188 22 175 95 -7
7868 -7 -154 -150 -16 413 -27 6 -136 261 261 26 -8 128 101 -142 -260 -339 -12 214 -118 -127 239 -22 -77 -211
7892 -211 27 59 -19 -226 217 -21 88 -64 208 -312 -63 -14 159 -144 134 62 -97 -229 -201 -60 258 -67
7914 -67 157 -181 48 70 3 80 -63 -20 -230 12 164 -135 -240 148 -62 -54 -189 130 99 69 -415 -36 -372
7937 -372 160 -298 129 -136 -150 -141 58 -40 -220 -83 -102 149 -186 -166 427 201 51 -187 -122 34 -160 182
7959 182 49 375 -12 -148 130 30 -81 -224 -67 -201 -44 76 131 -81 -126 -112 -219 134 125 -57 232 84
7981 84 -155 -184 -81 202 -94 46 90 -45 -188 -58 107 85 -487 -40 70 145 81 104 -11 -417 226 299 -179
$$ packed form
7823c2m05N82J23j7j01m7K91o48J95R3N3q1j78L65k35q4J15M93m30n58L68L1K92
7846A85j29O3j46K04j76J80J48p8l53K60j87j82Q9J55J82K8l16j15K10J53q0j02
7868gj47MJ34M29m40L3j42L97%k35l4J36k7k43j18p9L27K26l32rL66k61n5j34
7892b11K38L2p8k07M43k38J09j52K72n20K49M9J73l03K78p2j59j32K8J41L18l25
7914f7K24l38K29K2o7P7j43M3k10K42J52k99j05L88k10Qj35L19l1l0m84L79l36
7937c72N32m58M27k65j4RJ99r8j80J37j9K51l35K0N93k26j50k38O5J56j94L42
7959A82j33L26l87j36K78j00j11j43J57j34J57J20N5k12m5J4j07L53rj82K89j48
7981H4k39k9J03K83k96J40M4j35j43J30J65k2n72M47J10P5o4K3j15m06O43P3m78
$$ plain form
8004 -179 125 82 -71 505 -211 -80 512 742 -542 304 -531 286 65 247 292 699 283 30 300 -286
8024 -286 274 -174 -478 -708 24 -516 -398 -545 130 190 -131 113 683 -28 698 97 -588 884 408 -71
8044 -71 490 9 -81 250 -290 18 -90 103 -195 -176 103 70 -40 -357 -325 -119 -57 -35 -268 297 98 -98
8066 -98 -1 103 -31 131 -46 178 -124 16 -324 -228 -368 216 52 389 44 -452 -55 333 227 188 46
8087 46 -57 -241 -388 316 81 466 -202 -312 296 -36 -14 107 -146 47 -342 -148 -46 394 -446 210 197
8108 197 -389 260 -371 -614 46 83 662 -48 -752 -20 112 661 -433 -189 -884 417 531 -1 -31 375
8128 375 105 -404 185 -99 334 -101 -1 27 281 62 92 133 -198 -572 252 529 560 -703 174 -217 10
8149 10 539 -467 303 -69 -219 109 191 -238 -276 -9 116 -134 -258 112 -176 -56 -388 30 112 106 200 191 -158
$$ packed form
8004a79L04m3j53N76p16J31N92K30j284Q46q35Q17k21J82M5M07m16k53K70n86
8024b86N60m48l04k30P32n40J18j47O75O0l21K44N70p11P26o01o85J472m76m79
8044g1N61m81r0L31n40L08j08J93k98J9K79l3j10l17L2K06O2K2k33N65j99j96
8066i8R7J04j34J62j77K24l02J40l40R6j40N84j64L37l45m96L97L88j06l9j42
8087D6j03j84j47P04k35L85o68j10O08l32K2J21k53J93l89J94J02M40q40O56j3
8108A97n86O49o31k43O60L7N79p10p04P32J32N49j094K44o95J301J14n32l0M06
8128C75k70n09N89k84M33m35J00K8K54k19L0M1l31l74Q24K77L1j263Q77l91K27
8149A0N29j006P70l72j50L28Q2m29l8K67J25k50j24L70k88J20l32M18Q2oR4rl49
$$ plain form
8172 -158 -263 -138 49 277 77 141 253 -199 26 55 135 -309 -13 -2 -373 210 112 225 0
$$ packed form
8172a58j05J25J87K28k00O4J12m52K25K9Q0m44K96J1l71N83r8J13k25
8191@
$$ Imaginary data points
##PAGE= N=2
##DATA TABLE= (X++(I..I)), XYDATA
$$ plain form
0 0 0 0 0 -8 8 0 8 -8 16 -16 24 -32 37 -40 52 -64 76 -89 105 -126 148 -172 197 -228 263 -300 342 -389 440
29 440 -499 560 -628 706 -789 878 -980 1091 -1211 1343 -1488 1649 -1824 2018 -2236 2480
45 2480 -2747 3057 -3408 3809 -4278 4834 -5500 6323 -7366 8739 -10633 13428 -17978 26674
59 26674 -49298 231266 492372 -24577 -228437 -128739 -18385 -92614 20119 219174 188172
70 188172 -90005 -173291 -22190 95930 73006 99039 109754 -18723 -145758 -31613 143208
81 143208 116009 -10716 16351 75988 -15414 -105416 1668 94568 -23418 -117732 50559
92 50559 216341 93745 -88059 -21532 91863 -22100 -143490 24032 236301 124217
102 124217 -137410 -153982 18123 74180 25240 49572 69372 -51283 -153383 -54785 101242
$$ packed form
0@%%%qJ6qQj6K4l2M0n6O9p7R2j16J40j65J94k31K74l20L69m25M91n63O42p31Q29
29D40r39J059j188J334j495J667j858K071k302K554k831L137l473L842m254M716
45B480n227N804o465P217q087R112j0334J1823j3689J6105j9372K4061l1406M4652
59B6674p5972K80564K61106n16949k03860R9698J10354p4229J12733J99055l1002
70A88172k78177q3286J51101J18120k2924K6033J0715j28477j27035J14145J74821
81A43208k7199j26725K7067N9637r1402r0002J07084R2900j17986r4314J68291
92E0559J65782j22596j81804O6527J13395j13963j21390J67522K12269j12084
102A24217k61627j6572J72105N6057m8940K4332J9800j20655j02100R8598J56027
$$ plain form
113 101242 117806 78441 83604 11675 -160341 -182222 32297 178873 71756 -57666 -22228
124 -22228 4546 -87597 -86279 86197 146482 -31195 -148656 -21064 93982 6861 -64373
135 -64373 42731 106866 -31745 -141350 -37845 77559 9308 -90480 -46868 32455 23101
146 23101 5493 31441 -4388 -96272 -79754 42650 74506 -6252 -21111 38052 -8499 -128736
158 -128736 -91059 82777 112151 -43421 -121938 -36455 14583 -33833 -7885 98171 77341
169 77341 -85326 -141213 -17500 68810 14873 -24776 16897 11957 -71467 -85610 7927 59230
181 59230 11479 -31772 -28711 -36616 -36516 28500 78469 8919 -80115 -40384 47190 15475 -66486
194 -66486 -30943 55848 15520 -84983 -51595 69446 68246 -46516 -75752 -288 30569 -9105
$$ packed form
113A01242J6564l9365N163p1929j72016k1881K14519J46576j07117j29422L5438
124b2228K6774r2143J318J72476O0285j77677j17461J27592J15046q7121p1234
135f4373J07104O4135j38611j09605J03505J15404o8251r9788M3612P9323r354
146B3101j7608K5948l5829r1884J6518J22404L1856q0758j4859N9163m6551j20237
158a28736L7677J73836K9374j55572p8517Q5483N1038m8416K5948J06056k0830
169G7341j62667n5887J23713Q6310n3937l9649M1673m940q3424j4143R3537N1303
181E9230m7751m3251L061p905J00O5016M9969o9550q9034L9731Q7574l1715q1961
194f6486L5543Q6791m0328j00503L3388J21041j200j14762k9236P5464L0857l9674
$$ plain form
206 -9105 1379 50754 23481 -60119 -62978 15686 47381 9918 -13107 -8396 -26918 -39652 169
219 169 45898 29906 -4867 -1397 -5836 -43284 -30922 53701 83288 -10725 -85362 -24898 56424
232 56424 26617 -39753 -10667 43494 8480 -58575 -28465 55876 59831 -6413 -32880 -3391
244 -3391 10794 3329 13599 23732 -1298 -29313 -16959 13579 18457 15514 13428 -4734 -29968
257 -29968 -15638 33072 40462 -952 -13940 17159 15390 -27640 -21426 43309 57150 -22368 -72983
270 -72983 -14129 58146 38995 -17782 -16171 17679 10683 -20656 -10726 28219 36596 4965 -22749
283 -22749 -21819 430 25066 29233 2876 -23555 -17245 5925 9310 3164 15920 25215 -2690
296 -2690 -33424 -10511 35900 30374 -15699 -24478 10448 16816 -15212 -16832 26798 39168 -12254
$$ packed form
206i105J0484M9375k7273q3600k859P8664L1695l7463k3025M711j8522j2734L9821
219A69M5729j5992l4773L470m439l7448J2362Q4623K9587r4013p4637O0464Q1322
232E6424k9807o6370K9086N4161l5014o7055L0110Q4341L955o6244k6467K9489
244c391J4185p465J0270J0133k5030k8015J2354L0538M878k943k086j8162k5234
257b9968J4330M8710P390m1414j2988L1099j769m3030O214O4735J3841p9518n0615
270g2983N8854P2275j9151n6777J611L3850o996l1339R930L8945Q377l1631k7714
283b2749R30K2249K4636M167k6357k6431O310K3170L385o146J2756R295k7905
296b690l0734K2913M6411n526m6073q779L4926O368l2028j620M3630J2370n1422
$$ plain form
309 -12254 -51413 -17788 37925 38400 -4927 -26199 -6767 13057 7725 -5103 -1317 12506 10066
322 10066 -14330 -29181 -5530 32852 32560 -9585 -35422 -12872 17264 12400 -4238 2764 13046
335 13046 -5759 -28043 -9365 28771 27128 -12030 -30006 -7177 12445 1435 -8199 7616
347 7616 20034 -2354 -31981 -21871 19649 36946 4854 -32591 -26308 9614 23953 3160
359 3160 -14618 -2110 11122 -5350 -27676 -11632 27331 30663 -10911 -38539 -15595 19876
371 19876 19597 -4508 -10709 -386 -2207 -15431 -8817 17430 24513 -4329 -30101 -18649 11012
384 11012 17231 33 -7260 1808 1040 -15726 -17839 10246 32249 10542 -31744 -36089 3541
397 3541 31633 14307 -15517 -14272 4836 2383 -16254 -10892 19288 27508 -6032 -37359 -20967
$$ packed form
309a2254l9159L3625N5713M75m3327k1272J9432J9824n332j2828L786J3823k440
322A0066k4396j4851K3651L8382k92m2145k5837K2550L0136m864j6638P002J0282
335A3046j8805k2284J8678L8136j643l9158j7976K2829J9622j1010r634J5815
347G616J2418k2388k9627J0110M1520J7297l2092l7445O283L5922J4339k0793
359C160j7778J2508J3232j6472k2326J6044L8963L332m1574k7628K2944L5471
371A9876k79k4105o201J0323j821j3224O614K6247P083k8842k5772J1452K9661
384A1012O219j7198p293R068p68j6766k113K8085K2003k1707m2286m345L9630
397C541K8092j7326k9824J245J9108k453j8637N362L0180Q220l3540l1327J6392
$$ plain form
410 -20967 20408 30726 2601 -19738 -12568 1083 -1195 -3812 9754 19956 2174 -25880 -24362
423 -24362 7388 26482 10447 -12484 -12580 -622 -1485 -7326 4665 23025 12618 -23242 -36185
436 -36185 -2260 34537 25642 -12159 -25311 -3813 10527 -699 -7667 10013 21955 -1907
448 -1907 -32653 -22188 20185 38303 9659 -24392 -23305 -117 10325 5120 4882 11171 2956
461 2956 -18642 -23500 3397 30558 21018 -12093 -25437 -7259 10382 7365 2949 11509 11248 -14748
475 -14748 -32529 -7691 33687 33938 -7196 -32453 -12469 14468 12033 -1412 1586 11740 -1189
488 -1189 -23663 -19019 15389 34628 14610 -21036 -29917 -5362 19332 17100 460 -3998 180
501 180 -5804 -14609 -1029 26605 26196 -11341 -35144 -13435 19668 20422 1611 -1326 3576 -9991
$$ packed form
410b0967M1375J0318k8125k2339P170J3651k278k617J3566J0202j7782k8054J518
423b4362L1750J9094j6035k2931r6J1958q63n841J1991J8360j0407l5860j2943
436c6185L3925L6797q895l7801j3152K1498J4340j1226o968J7680J1942k3862
448a907l0746J0465M2373J8118k8644l4051J087K3188J0442n205k38O289q215
461B956k1598m858K6897K7161r540l3111j3344J8178J7641l017m416Q560k61k5996
475a4748j7781K4838M1378K51m1134k5257J9984K6937k435j3445K998J0154j2929
488a189k2474M644L4408J9239k0018l5646q881K4555K4694k232j6640m458M178
501A80n984q805J3580K7634m09l7537k3803K1709L3103P54j8811k937M902j3567
$$ plain form
515 -9991 -25367 -7038 31321 34389 -6957 -34769 -19035 12185 20405 9458 456 -1974 -7526
528 -7526 -14369 -11383 9153 28560 21274 -14850 -35589 -14478 24026 28478 -928 -16042 -2434
541 -2434 4038 -10089 -9484 18472 26917 -8019 -36032 -14687 22619 22457 -2040 -10806 -21 -2993
555 -2993 -11179 -179 21308 19431 -8150 -27653 -16791 11951 27075 17516 -7385 -22822 -14139
568 -14139 1659 4651 4965 16998 19175 -11405 -41242 -19885 31554 41276 -2662 -30076 -13361
581 -13361 5340 -3085 -4716 18375 26158 -6768 -36205 -19487 15332 22116 4967 -4267 -5155
594 -5155 -5574 -5535 3788 11249 5672 -3734 -12693 -14625 -1465 21182 22938 -7742 -30310 -10769 18422
609 18422 12977 -10819 -4549 14507 -690 -29505 -11274 34936 36240 -12606 -40032 -16146 10765
$$ packed form
515i991j5376J8329L8359L068m1346k7812J5734L1220Q220j0947r002k430n552
528g526o843K986K0536J9407p286l6124k0739K1111L8504M452k9406j5114J3608
541b434O472j4127O05K7956Q445l4936k8013K1345L7306j62k4497q766J0785k972
555b993q186J1000K1487j877k7581j9503J0862K8742J5124r559k4901j5437Q683
568a4139J5798K992L14J2033K177l0580k9837K1357N1439R722m3938k7414J6715
581a3361J8701q425j631K3091P783l2926k9437J6718L4819O784j7149r234q88
594e155m19L9R323P461n577r406q959j932J3160K2647J756l0680k2568J9541K9191
609A8422n445k3796O270J9056j5197k8815J8231M6210J304m8846k7426K3886K6911
$$ plain form
622 10765 10987 3467 12729 10055 -13937 -25673 -8070 16400 20266 7990 -8800 -20819 -15697
635 -15697 7008 22648 12451 -4035 -5581 -6968 -19495 -14285 18694 33162 -6 -31304 -11304
648 -11304 23219 14162 -15099 -9566 14743 4707 -23722 -12920 24296 27733 -7758 -26680 -9000
661 -9000 9401 7588 1471 -189 -4984 -7849 890 10347 8541 4592 3374 -9216 -26585 -14841
675 -14841 22080 32192 770 -22092 -5894 7864 -7366 -11471 16516 27683 -9079 -38509
687 -38509 -10092 31968 25584 -7164 -11254 2453 -4918 -20568 -7561 19500 21064 -181 -12646
700 -12646 -8562 -1137 7394 11013 -307 -15829 -9601 11749 13017 -4093 -2820 13491 4611 -23003
714 -23003 -18681 16447 23606 -10352 -25148 4264 24565 4448 -11768 4322 12311 -13192 -29088
$$ packed form
622A0765K22p520R262k674k3992j1736J7603K4470L866j2276j6790j2019N122
635a5697K2705J5640j0197j6486j546j387j2527N210L2979J4468l3168l1298K0000
648a1304L4523r057k9261N533K4309j0036k8429J0802L7216L437l5491j8922J7680
661i000J8401j813o117j660m795k865Q739R457j806l949j218j2590j7369J1744
675a4841L6921J0112l1422k2862J6198J3758j5230m105K7987J1167l6762k9430
687c8509K8417M2060o384l2748m090J3707p371j5650J3007K7061J564k1245j2465
700a2646M084P425Q531L619j1320j5522O228K1350J268j7110J273J6311q880k7614
714b3003M322L5128P159l3958j4796K9412K0301k0117j6216J6090P989k5503j5896
$$ plain form
727 -29088 -1136 29289 20381 -6832 -12979 -4513 -3125 -1798 5331 6921 -1843 -5324 -2325 -3105
741 -3105 -281 16125 22356 -3583 -31323 -17101 15504 15625 -8619 -5530 17362 9695 -20452
754 -20452 -18778 15430 20461 -11077 -22917 2893 20143 5150 -7758 3661 8640 -6316 -15340
767 -15340 -1719 8951 3198 -4008 -3549 -2433 2679 12242 10758 -8435 -20597 -5489 9390 2577
781 2577 -5708 12140 21557 -5753 -31303 -11590 23373 16473 -13802 -15078 7139 7300 -10225
794 -10225 -4295 19768 17027 -11279 -23187 -5816 9880 5485 2007 5006 1807 -4315 -3864 -690
808 -690 -3059 -4033 3635 2477 -8130 -4773 16808 16254 -10518 -20255 1006 17772 -83 -17926
822 -17926 -852 15556 -1158 -19885 -918 24940 12682 -18745 -21743 -50 8377 2576 5371
$$ packed form
727b9088K7952L0425q908k7213o147Q466J388J327P129J590q764l481K999p80
741c105K824J6406O231k5939k7740J4222L2605J21k4244L089K2892p667l0147
754b0452J674L4208N031l1538j1840K5810J7250j4993j2908J1419M979j4956r024
767a5340J3621J0670n753p206M59J116N112R563j484j9193j2162J5108J4879o813
781B577q285J7848R417k7310k5550J9713L4963o900l0275j276K2217J61j7525
794a0225N930K4063k741k8306j1908J7371J5696m395l478K999l199o122M51L174
808f90k369r74P668j158j0607L357K1581n54k6772r737K1261J6766j7855j7843
822a7926J7074J6408j6714j8727J8967K5858j2258l1427k998K1693Q427n801K795
$$ plain form
835 5371 12158 5747 -10353 -13935 -3938 4435 7830 5967 -4846 -14430 -6424 11454 11612 -2534
849 -2534 -4267 5917 -314 -18397 -11400 18006 23440 -4903 -19864 1095 15840 -2020 -17527
862 -17527 -3169 13066 1697 -12868 -1615 15770 9356 -9026 -11902 -1158 5646 4873 1875
875 1875 -3011 -6171 -2246 3623 2916 870 5069 4717 -11546 -21301 -2448 22750 17843 -6831 -10746
890 -10746 3878 2543 -12876 -7447 16568 18323 -9214 -22972 -3321 15750 8491 -4832 -3374
903 -3374 1776 -3817 -8935 -1954 9404 10572 2836 -5419 -8652 -2362 7675 6580 -5918 -10676
917 -10676 515 8427 -311 -5823 5219 11831 -4586 -18928 -3663 18731 12235 -10825 -12904
930 -12904 4992 9072 -4031 -5413 7013 7843 -8533 -16480 -2661 13790 13394 917 -7748 -6610
$$ packed form
835E371O787o411j6100l582R997Q373L395j863j0813r584Q006J7878J58j4146
849b534j733J0184o231j8083O997K9406N434k8343j4961K0959J4745j7860j5507
862a7527J4358J6235j1369j4565J1253J7385o414j8382k876J0744O804p73k998
875A875m886l160L925N869p07k046M199l52j6263r755J8853K5198m907k4674l915
890a0746J4624j335j5419N429K4015J755k7537j3758J9651J9071p259j3323J458
903c374N150n593n118O981J1358J168p736q255l233O290J0037j095j2498m758
917a0676J1191P912q738n512J1042O612j6417j4342J5265K2394o496k3060k079
930a2904J7896M080j3103j382J2426Q30j6376p947J3819J6451l96j2477q665J138
$$ plain form
944 -6610 -2354 3144 4371 2576 4072 2761 -5804 -12934 -3127 15333 13921 -6289 -16347 -3360
958 -3360 7558 1852 -5099 5393 11981 -2711 -16700 -6372 14563 12507 -5283 -12054 -1797
971 -1797 5414 846 -1270 3160 5387 -2378 -9376 -6265 4961 12097 6531 -7422 -11810 -882
985 -882 9888 5675 -3078 -2316 3404 -1941 -11265 -2353 14062 14398 -6471 -17560 -4593 10720
999 10720 6443 -2672 344 4143 -1865 -11097 -3797 11417 13786 -1298 -13541 -9371 2311 8666
1013 8666 4094 -689 -1090 118 -4097 -7158 659 11800 9804 -7045 -16275 -3485 10710 8926
1027 8926 -3282 -5020 1332 -154 -7294 -3573 10127 12911 -2891 -14605 -6534 8210 10071 -71
1041 -71 -4100 -976 -1209 -5044 -4019 5647 11479 2919 -10922 -12535 1669 12265 7777 -4766 -6741
$$ packed form
944f610M256N498J227j795J496j311q565p130R807J8460j412k0210j0058J2987
958c360J0918n706o951J0492O588j4692j3989J0328K0935k056j7790o771J0257
971a797P211m568k116M430K227p765o998L111J1226P136n566j3953m388J0928
985h82J0770m213q753P62N720n345r324Q912J6415L36k0869j1089J2967J5313
999A0720m277r115L016L799o008r232P300J5214K369j5084j2243M170J1682O355
1013H666m572m783m01J208m215l061P817J1141j996j6849r230J2790J4195j784
1027H926j2208j738O352j486p140L721J3700K784j5802j1714Q071J4744J861j0142
1041g1m029L124k33l835J025R666N832q560j3841j613J4204J0596m488j2543j975
$$ plain form
1056 -6741 -389 735 -4038 -1075 9054 8368 -5843 -16180 -5605 11583 12416 -778 -8113 -2771
1070 -2771 1614 -3100 -2389 5104 9291 -46 -12978 -9900 6511 13575 4389 -7401 -7091 -509 943
1085 943 -1655 1960 7374 4883 -8661 -13420 -695 12997 9881 -4980 -10925 -2550 4140 1245
1099 1245 -676 4534 6903 -2672 -12002 -6271 8890 13584 1285 -9770 -7557 1234 3457 -578
1113 -578 1373 4392 1279 -9256 -9245 4015 13570 6481 -7315 -11568 -1528 5483 3225 -311 2220
1128 2220 2677 -3930 -10363 -1626 11977 12058 -3995 -13499 -5077 6911 6540 1000 -1403 2206 -1481
1143 -1481 -8525 -5101 6572 11982 2276 -11063 -9896 2127 8656 5706 -1955 -1006 429 -3657
1157 -3657 -6764 1411 11888 8258 -5979 -12754 -3228 8807 7383 -1776 -3668 1844 -321 -5594
$$ packed form
1056f741O352J124m773K963J0129o86j4211j0337J0575J7188Q33j3194p335N342
1070b771M385m714P11P493M187r337j2932L078J6411P064r186j1790L10O582J452
1085I43k598L615N414k491j3544m759J2725J3692l116j4861n945Q375O690k895
1099A245j921N210K369r575r330N731J5161M694j2299j1055K213Q791K223m035
1113e78J951L019l113j0535J1J3260R555p089j3796m253J0040P011k258l536K531
1128B220M57o607o433Q737J3603Q1j6053r504Q422J1988l71n540k403L609l687
1143a481p044L424J1673N410r706j3339J167J2023O529k950p661R49J435m086
1157c657l107Q175J0477l630j4237o775R526J2035j424r159j892N512k165n273
$$ plain form
1171 -5594 -2411 9466 10732 -3289 -14325 -7933 7168 10012 1309 -4496 -2973 -448 -2163 -2101
1185 -2101 3657 8865 2008 -8813 -9887 981 11656 8707 -3461 -7467 -1929 772 -1541 -343
1199 -343 7319 7730 -5571 -14279 -3459 12083 11256 -3226 -9205 -1838 2806 -921 -586 6361 7964
1214 7964 -2618 -12022 -7040 5799 10833 3447 -5696 -7452 -1555 3871 2715 463 1742 2753
1228 2753 -3435 -8765 -625 12583 10355 -5121 -13471 -2841 6743 2815 -2821 2513 5561 -3726
1242 -3726 -12087 -2287 13060 11581 -4156 -11070 -4590 2761 3514 2630 3103 1467 -3164 -6278 -3969
1257 -3969 2269 8333 6184 -4922 -12166 -3694 9930 8584 -2453 -5049 1604 -151 -8241 -3662
1271 -3662 11236 11854 -6219 -14634 -1818 10423 4741 -4111 -1478 2067 -3821 -6960 1515 11199
$$ packed form
1171e594L183J1877J266j4021j1036O392J5101K844q703n805J523K525j715O2
1185b101N758N208o857j0821j074J0868J0675k949j2168m006N538K701k313J198
1199c43P662M11j3301q708J0820J5542q27j4482n979P367M644l727L35O947J603
1214G964j0582r404M982J2839N034p386r143j756N897N426j156k252J279J011
1228B753o188n330Q140J3208k228j5476q350J0630R584l928n636N334L048r287
1242c726q361R800J5347j479j5737o914O480P351P53q84M73j636m631l114K309
1257c969O238O064k149j1106p244Q472J3624j346j1037k596O653j755q090M579
1271c662J4898O18j8073q415J2816J2241n682q852K633L545n888l139Q475R684
$$ plain form
1285 11199 6841 -4666 -9864 -6181 820 6856 6606 -1038 -6826 -3999 2222 873 -1073 5714 7778
1300 7778 -5487 -16784 -4791 15240 13101 -5338 -9366 1594 2007 -7622 -4170 10403 9864 -7217
1314 -7217 -13486 36 10779 4613 -2346 -1820 -2104 -5441 -2729 4873 6087 852 -1940 -2975 -5740
1329 -5740 -2182 8549 9573 -5721 -14511 -1949 11222 4994 -4533 2093 7837 -5929 -17997
1342 -17997 -3360 17631 12379 -8297 -11222 1172 3523 -3267 -71 8772 3083 -10378 -10329 2148
1356 2148 8209 5855 3399 -644 -8140 -8519 2457 8156 609 -3523 2390 3011 -6956 -5887 10333
1371 10333 12896 -7713 -18268 -393 14582 4160 -7562 1310 9277 -3408 -14275 -1158
1383 -1158 14263 6179 -9822 -8104 2628 4300 2147 5446 4710 -5380 -10404 -2922 4437 3014
$$ packed form
1285A1199m358j1507n198L683P001O036k50p644n788K827O221j349j946O787K064
1300G778j3265j1297J1993K0031k139j8439m028J0960M13r629L452J4573n39j7081
1314g217o269J3522J0743o166o959N26k84l337K712P602J214n235k792j035k765
1329e740L558J0731J024j5294q790J2562J3171o228r527O626N744j3766j2068
1342a7997J4637K0991n252k0676k925J2394K351o790L196Q843n689j3461M9J2477
1356B148O061k354k456m043p496l79J0976N699p547m132N913O21r967J069J6220
1371A0333K563k0609j0555J7875J4975j0422j1722Q872P967j2685j0867J3117
1383a158J5421q084j6001J718J0732J672k153L299p36j0090n024P482P359j423
$$ plain form
1397 3014 4035 7205 -465 -12839 -7268 11413 11536 -5827 -10270 3002 5115 -7290 -4550 14313
1411 14313 14377 -9510 -19691 -981 12678 2886 -6274 2518 6806 -3950 -8663 3263 10246 1210
1425 1210 -7493 -4590 -1344 -1447 4558 10512 3110 -9796 -6982 4725 3014 -5624 -82 9973
1439 9973 254 -14294 -4487 16137 12003 -9808 -12063 4061 5093 -7858 -4132 12752 11182
1452 11182 -8992 -13171 2872 9963 448 -4848 -82 -762 -5008 110 9225 6016 -3961 -3788 -536
1467 -536 -5473 -6122 7156 13686 -1373 -14831 -3539 11222 4085 -7633 175 9178 -3822 -17141
1481 -17141 -2977 17793 11950 -8000 -8734 3172 1359 -7903 -2344 10030 5518 -7188 -6244 2759
1495 2759 4366 397 1545 1012 -6372 -7125 3928 8514 -1030 -5730 3352 5449 -5966 -8700 6147
$$ packed form
1397C014J021L170p670j2374N571J8681J23j7363m443J3272K113j2405K740J8863
1411A4313O4k3887j0181J8710J3659r792r160Q792M288j0756m713J1926O983r036
1425A210q703K903L246j03O005N954p402j2906K814J1707j711q638N542J0055
1439I973r719j4548R807K0624m134k1811k255J6124J032j2951L726J6884j570
1452A1182k0174m179J6043P091r515n296M766o80m246N118R115l209r977J73L252
1467e36m937o49J3278O530j5059j3458J1292J4761p137j1718P808R003j3000j3319
1481a7141J4164K0770n843j9950p34J1906j813r262N559J2374m512j2706R44R003
1495B759J607l969J148n33p384p53J1053M586r544m700R082K097j1415k734J4847
$$ plain form
1510 6147 11091 -6040 -15245 1170 15150 4583 -8054 -972 6017 -4805 -12616 401 14589
1523 14589 6475 -7785 -7076 1190 929 -412 3911 4870 -3738 -8689 -2284 2870 1836 4157 8129
1538 8129 72 -13565 -10079 7002 9702 -3022 -5509 5698 5543 -8217 -8313 8073 11627 -5628
1552 -5628 -13417 -33 9409 997 -5375 1716 6021 -2376 -6965 484 5841 7 -4628 -1600 519
1567 519 667 3735 6248 -918 -9159 -4865 4886 3400 -2393 2214 7946 -1530 -13152 -4992 12579
1582 12579 10109 -5747 -9146 1640 3069 -4707 -2049 10271 9220 -5893 -11637 -2570 5407 2975
1596 2975 664 1983 47 -3958 -2704 2572 2893 333 822 -118 -4412 -4014 5298 8505 -1459 -8662
1612 -8662 -1035 6943 717 -6424 158 7058 -748 -9676 -2027 10893 7403 -6113 -8245 57
$$ packed form
1510F147M944j7131r205J6415J3980j0567j2637P082O989j0822p811J3017J4188
1523A4589q114j4260P09Q266k61j341M323R59q608m951O405N154j034K321L972
1538H129q057j3637L486J7081K700j2724k487J1207j55j3760r6J6386L554j7255
1552e628p789J3384R442q412o372P091M305q397m589P449N357n834m635L028K119
1567E19J48L068K513p166q241M294R751j486n793M607N732r476j1622Q160J7571
1582A2579k470j5856l399J0786J429p776K658J2320j051j5113n744R067P977k432
1596B975k311J319j936m005J254N276L21k560M89r40m294L98R312L207r964p203
1612h662P627P978o226p141O582O900p806q928P649J2920l490j3516k132Q302
$$ plain form
1626 57 3081 -647 390 4991 2668 -4522 -6025 -700 3637 4731 2788 -1951 -6661 -4088 3565
1641 3565 5690 932 -1373 1522 -533 -7157 -4281 7594 10134 -2380 -9979 -2269 6195 2276
1655 2276 -3506 624 5049 -892 -7722 -2709 6783 6212 -1616 -5863 -2289 1367 1885 1677 678 -1372
1671 -1372 -1991 -1660 -569 942 4077 3759 -3391 -8426 -2231 6783 6068 -1885 -4000 535 437 -4424
1687 -4424 -2104 6572 7552 -3833 -9965 -3222 6264 5121 -824 -1849 87 -1425 -3770 -920 4141
1702 4141 4940 260 -5197 -5469 -13 5062 4400 -1347 -4039 -1641 598 -456 -104 3852 4765 -2916
1718 -2916 -7927 -2463 6720 6121 -2059 -5291 -926 1587 -937 -1124 4029 4793 -2183 -7381 -3527 4830
1734 4830 6828 1099 -4071 -3885 -434 1098 1127 1511 2689 748 -4436 -5624 -32 6978 5863 -2091
$$ packed form
1626E7L024l728J037M601k323p190j503N325M337J094j943m739m710K573P653
1641C565K125m758k305K895k055o624K876J1875K540j2514p599P710Q464l919
1655B276n782M130M425n941o830N013R492n71p828m247L574L656N18k08r99k050
1671a372o19L31J091J511L135l18p150n035O195R014p15p953k115M535r8m861
1687d424K320Q676R80j1385o132O743R486j143n945j025J936j512k345K850N061
1702D141P99m680n457k72N456N075o62n747k692K398K239j054L52L956R13p681
1718b916n011N464R183n99q180l232M365K513k524j87N153P64o976n198L854Q357
1734D830J998n729n170J86L451J532K9L84J178j941n184j188N592P010j115p954
$$ plain form
1750 -2091 -6561 -1972 2879 1939 61 2016 2410 -2700 -6823 -1944 6373 7151 -899 -6093 -3116 2093
1766 2093 2192 210 745 2168 -1167 -5151 -3671 3324 7314 2485 -4722 -6157 -370 4282 2814 -184
1782 -184 -317 509 -2117 -4103 48 6444 5230 -2662 -7361 -2750 3905 4181 689 -887 -132 -1720
1798 -1720 -4163 -1603 4977 6058 48 -6411 -4689 2072 5449 2100 -1311 -1351 -675 -1962 -2221 2144
1814 2144 5799 3020 -4572 -6925 -632 5599 4537 -895 -2855 -1025 -527 -1621 -4 4796 4277
1829 4277 -2687 -7364 -3054 4309 6007 654 -2818 -1903 -429 -700 -383 2989 4537 9 -5905 -5269
1845 -5269 1806 6419 3071 -2630 -4272 -1058 747 -49 619 3782 2592 -3679 -6415 -1296 6089
1860 6089 5855 -1427 -5366 -2296 1522 567 547 2643 2824 -1736 -5559 -2775 4222 6534 1221 -3920
$$ packed form
1750b091m470M589M851r40j878J955L94n110m123M879Q317P78q050n194K977N209
1766B093R9j982N35J423l335l984J480O995L990m829p207j435N787M652j468k998
1782a84j33Q26k626j986M151O396j214p892m699M611O655K76l492j576P55j588
1798a720k443K560O580J081o010o459J722O761L377l349l411m0O76j287k59M365
1814B144L655k779p592k353O293O231j062n432j960J830M98j094J617M800n19
1829D277o964m677M310P363J698n353l472R15J474k71L17L372J548m528n914O36
1845e269P075M613l348n701j642L214J805p96O68L163j190o271k736N119P385
1860F089k34p282l939L070L818r55k0K096J81m560l823K784O997K312n313n141
$$ plain form
1876 -3920 -3674 345 1846 1085 1167 1569 -500 -3959 -4592 1096 6954 3960 -3090 -6367 -1405 3266
1892 3266 2634 -696 604 1527 -2223 -5271 -1265 5601 5738 -1339 -6207 -2816 2066 2851 1001 290
1908 290 180 -1393 -3470 -1464 2630 5169 1663 -4361 -5484 -500 4121 3115 -794 -1770 42 -1022
1924 -1022 -2968 195 5558 4286 -3695 -7476 -1185 5450 4430 -902 -1479 -207 -999 -2853 -409
1939 -409 4523 4350 -1532 -5215 -3171 1915 4481 2636 -1339 -2560 -1714 -452 346 1414 3415 1910
1955 1910 -2792 -5881 -812 5781 3996 -2639 -4129 553 1699 -1541 -551 3818 3654 -3514 -6860
1970 -6860 -904 5846 4418 -1412 -2934 -1265 -121 94 953 2402 1436 -1272 -3749 -2595 1827 5652
1986 5652 3843 -2319 -5735 -1829 2915 1902 29 1537 2473 -2202 -5979 -1259 6303 5141 -2983
$$ packed form
1876c920K46M019J501p61Q2M02k069l459o33N688N858k994p050l277M962M671
1892C266o32l330J300R23l750l048M006O866J37p077m868L391M882P85j850p11
1908B90j10j573k077K006M094K539l506o024j123M984M621j006l909r76J812j064
1924a022j946L163N363j272p981l781O291O635j020n332n77J272p92j854K444
1939d09M932j73n882l683K044N086K566j845l975j221Q46J262P98J068K001j505
1955A910m702l089N069O593j785o635j490M682J146l240R90M369j64p168l346
1970f860N956O750j428n830j522J669J144K15Q59J449r66k708k477J154M422L825
1986E652j809o162l416L906M744j013j873J508R36m675l777M720P562j162q124
$$ plain form
2001 -2983 -5646 -74 2205 -360 -656 2832 3248 -2347 -5247 -1083 3708 3582 -408 -2651 -1869 100
2017 100 2369 2022 -827 -1918 -532 -547 -1888 -138 4517 3707 -3107 -6928 -705 5582 2942 -2390
2033 -2390 -1795 1240 -1454 -4075 443 6985 4186 -4281 -6849 -1368 2625 2349 1296 1732 353 -3079
2049 -3079 -3458 -498 2253 3380 1609 -2306 -4862 -1516 4288 3952 -1332 -2837 828 894 -3014 -2826
2065 -2826 3656 5200 -1664 -5746 -60 5335 2094 -3973 -2720 1453 358 -1694 826 4365 1695
2080 1695 -3738 -4265 -470 2726 2721 1015 -1494 -4051 -1878 1074 2359 985 1640 902 -3717 -6739
2096 -6739 -1247 7365 6468 -2012 -5017 -662 1715 -1969 -1978 3836 4910 -2410 -6316 -1192 4509 3350
2112 3350 -1020 -1014 -315 -1414 -2049 -332 2084 1689 258 135 -572 -329 1997 1352 -2297 -3748 91
$$ packed form
2001b983k663N572K279k565k96L488M16n595k900M164M791j26l990k243P82J969
2017A00K269l47k849j091J386j5j341J750M655q10o814l821O223O287k640n332
2033b390N95L035k694k621M518O542k799q467k568N481L993k76j053M36j379l432
2049c079l79K960K751J127j771l915k556L346N804l36n284j505L665O6l908J88
2065b826O482J544o864m082N686N395l241o067J253M173j095k052K520L539k670
2080A695n433n27L795L196nj706k509k557K173K952J285j374O55p38m619l022
2096f739N492Q612q97q480l005M355K377l684rN814J074p320l906N124N701j159
2112C350m370OO99j099o35J717K416l95j431j23p07K43K326o45l649j451L839
$$ plain form
2129 91 4573 2190 -1851 -936 2088 -1031 -4578 -721 6526 4069 -4679 -6249 345 4377 1852 -100
2145 -100 1615 456 -4105 -5306 275 5320 4829 1018 -2434 -3768 -2379 933 2755 1493 -90
2160 -90 -195 -748 -2720 -1089 4238 5130 -1401 -5991 -1881 2979 1056 -2114 869 4125 778 -4540
2176 -4540 -2515 3280 2796 -3300 -4421 1085 3706 2043 -602 -294 -1004 -1925 -1245 650 1760 1727 757
2193 757 -2689 -3463 -156 4754 3799 -1552 -4403 -1442 674 -977 695 4836 5076 -2621 -7295 -2718
2209 -2718 4002 3520 -949 -806 1390 -622 -3536 -406 3822 3149 -1392 -4168 -2454 752 2060 1908
2225 1908 813 -578 -267 971 -633 -1099 240 1618 -561 -3602 -469 4667 3163 -2067 -4926
2240 -4926 302 1495 -409 -763 2451 3089 -2202 -4823 -313 4148 3529 -1219 -3570 -2424 -1231 59
$$ packed form
2129I1M482k383m041R15L024l119l547L857P247k457q748j570O594M032k525j952
2145a00J715j159m561j201N581N045m91l811l452j334J389L312J822j262j583
2160i0j05n53j972J631N327Q92o531m590M110M860j923l170K983L256l347n318
2176d540K025N795m84o096j121N506K621j663k645L08p10r21O80J895J110l3r70
2193G57l446p74L307M910r55n351k851K961K116j651J672M141K40p697m674M577
2209b718O720m82m469J43K196k012k914L130M228o73m541k776J714L206J308j52
2225A908j095j391L11J238j604m66J339J378k179l041L133N136j504n230k859
2240d926N228J193j904l54L214O38n291k621M510M461o19m748k351J146J193J290
$$ plain form
2256 59 1701 2736 2134 -929 -3636 -2940 891 4549 3708 -845 -3684 -1426 2183 1256 -1312 1216
2272 1216 2194 -1356 -4593 -1882 3969 4527 -1514 -3649 -192 1965 -589 -1920 902 1411 -236 -2580
2288 -2580 147 3301 2535 -279 -2561 -2249 -418 2156 3057 58 -962 -867 -896 -1824 370 3696 2887
2305 2887 -2829 -5789 -1147 3849 2980 -492 -365 1081 -1207 -3919 -1233 4394 4280 -726 -4398 -2268
2321 -2268 1585 2096 1505 -156 -338 213 -921 -289 2184 2233 1142 -1799 -3807 -945 2555 2773 -723
2338 -723 -1500 -565 629 -1111 -501 2750 2304 -2183 -5876 -578 3979 3887 -1075 -1504 25 594 -363
2355 -363 59 2836 2146 -1995 -3489 -2589 1327 3374 1953 -2087 -2770 -1143 242 599 407 1639 1674
2372 1674 -2025 -4052 -440 3319 3296 -339 -3256 -552 1039 468 100 1527 1525 -1943 -3434 -689 2537
$$ packed form
2256E9J642J035o02l063k707O96L831L658q41m553k839K258L609r27k568K528
2272A216R78l550l237K711N851N58o041k135L457K157k554j331K822N09j647k344
2288b580K727L154p66k814k282L12J831K574R01k999j020R5k9r28K194L326q09
2305B887n716k960M642M996q69l472J27J446k288k712K686N627j14n006l672K130
2321b268L853N11n91j661j82N51j134O32K473M9j091k941k008K862L500K18l496
2338g23p77R35J194j740O10L251m46m487l693N298M557r2m962m29J529N69r57
2355c63M22K777o90m141j494R00L916K047j421m040o83J627J385L57j92J232L5
2372A674l699k027L612L759k3l635k917K704J591n71l68J427kl468j491K745L226
$$ plain form
2389 2537 3704 -152 -2790 -749 623 91 -119 -30 1249 -43 -2303 -2552 1545 3447 1264 -2424
2405 -2424 -4453 -95 2591 1168 -703 -1049 402 -1418 -3473 161 3520 3424 -1451 -3217 -1438 1480
2421 1480 1587 738 139 -169 -1463 -3166 -562 3079 3175 -94 -3502 -2516 836 2019 1258 -396 -83
2438 -83 -517 -1823 -3065 1527 3492 1510 -2300 -4304 -1859 2562 2364 -1182 -1627 -948 -499 -1706 1336
2455 1336 1331 3241 -1145 -3295 -1796 2187 3164 242 -691 -1125 -154 -572 -146 592 3344 78 -3286
2472 -3286 -2879 1209 3503 1734 -2000 -1657 -701 80 -450 631 2204 1689 -2563 -4351 -1297 4774
2488 4774 1529 -13 -3235 -918 779 144 141 253 1389 -688 -3184 -1808 1519 3185 1708 -2558
2504 -2558 -3408 -93 775 274 779 1593 138 -2248 -2826 574 3186 2050 -2075 -3523 -410 2031
$$ packed form
2389B537J167l856k638K041J372n32k10Q9J279j292k260k49M097J902k183l688
2405b424k029M358K686j423j871l46J451j820k055L634L359r6m875j766J779K918
2421A480J07q49n99l08j294j703K604L641R6l269l408R86L352J183p61j654L13
2438h3m34j306j242M592J965j982l810k004K445M421j98l546m45O79M49j207L042
2455A336nJ910m386k150J499L983R77k922r33m34R71m18M26P38K752l266l364
2472c286M07M088K294j769l734L43R56P81n30J081J573n15m252j788L054O071
2488D774l245j542l222K317J697o35lJ12J136k077k496J376L327J666j477m266
2504b558q50L315Q68n01N05Q14j455k386n78L400K612j136m125j448L113K441
$$ plain form
2520 2031 439 535 1379 -286 -898 -2232 -316 3360 4257 -28 -4244 -1982 666 2435 333 148
2536 148 -236 262 -1612 -1939 2403 4012 205 -2858 -4083 -33 2487 2389 -289 107 -191 -1888 -1055
2553 -1055 994 3394 1189 -1139 -3666 -727 2888 2253 -1713 -30 404 -1478 -1118 -711 2632 3352
2569 3352 -24 -4283 -3322 1127 3085 933 -1489 -1816 389 113 -956 1306 3303 2758 -2545 -3785
2585 -3785 -981 2731 3101 -290 -519 -920 -706 -571 239 2691 1178 -2485 -3129 -1561 2822 2392 462
2602 462 -1998 -1551 352 421 -510 2191 3092 1037 -3038 -3000 321 3795 2806 -1252 -2847 -893 481
2619 481 59 -55 1139 391 -1496 -2668 -1185 2967 2380 -749 -1934 -230 -264 149 699 871 745 -1455
2637 -1455 -2297 -729 2074 2191 -374 -2313 -2399 93 615 957 -760 940 131 -2281 -3094 445 4934
$$ packed form
2520B031j592R6Q44j665o12j334J916L676Q97m285m216K262K648J769k102j85
2536A48l84M98j874l27M342J609l807l063j225M050K520r8k678L96k98j697Q33
2553a055K049K400k205k328k527K939L615o35l966J683M34j882L60M07L343P20
2569C352l376m259R61M449J958k152k422l27K205k76j069K262J997n45n303j240
2585c785K804L712L70l391k29m01K14J35Q10K452j513l663o44J568M383m30j930
2602D62k460M47J903O9r31K701R01k055m075L8L321L474r89m058j595J954J374
2619D81m22j14J194p48j887j172J483M152n87l129j185J704l4M13N50J72j26k200
2637a455q42J568K803J17k565j939q6K492N22L42j717J700q09k412q13L539M489
$$ plain form
2654 4934 2207 -3065 -4895 161 2325 754 -154 810 710 -1498 -2808 -111 2464 1893 -917 -1915
2670 -1915 -2009 -135 1416 1373 54 222 -998 -1602 -1565 1393 1536 1656 -1844 -2294 255 1754 1447 -580
2688 -580 146 1095 -1161 -3515 -336 3530 2457 -2953 -3705 356 2111 912 -761 -88 -579 -176 -757
2705 -757 82 1710 1905 392 -2800 -2840 -709 3328 3491 200 -2308 -622 294 -343 -489 2657 2197
2722 2197 -2328 -3901 148 3176 2038 -1183 314 1516 -680 -2641 -57 3263 3005 -1237 -2526
2737 -2526 -837 1391 843 235 -916 -1581 -177 731 154 24 405 998 -214 -2199 -958 3224 2524
2754 2524 -1832 -3110 -46 2070 165 -237 1567 1408 -3100 -4040 362 3936 2042 -1475 -1394 219
2770 219 -800 -1007 731 2507 944 -1668 -2326 -1488 497 2428 2262 -435 -3008 -1369 1569 630
$$ packed form
2654D934k727n272j830N056K164j571r08R64j00k208j310K697K575n71k810r98
2670a915r4J874J551m3j319J68j220o04L7K958J43J20l500m50K549J499l07k027
2688e80P26R49k256k354L179L866j073n410p52M061J755j199j673O73m91M03n81
2705g57Q39J628J95j513l192m0K131M037J63l291k508J686R16o37j46L146m60
2722B197m525j573M049L028j138l221J497J202k196j961K584L320k58m242j289
2737b526J689K228n48o08j151o65J404R08n77j30L81N93j212j985J241M182p00
2754B524m356j278L064K116j905m02J804j59m508r40M402L574j894l517Q1J613
2770B19j019k07J738J776j563k612o58Q38J985J931j66k697k573J639K938r39
$$ plain form
2786 630 -1253 423 2672 770 -3494 -1680 3056 2721 -2071 -3040 856 2169 -444 -899 1400 1371
2802 1371 -1971 -2271 1186 2338 81 -1819 -996 -276 103 1248 1932 366 -1932 -1524 -362 -403 341
2819 341 3200 3067 -1639 -4832 -742 3316 1771 -2074 -730 1835 -490 -3671 -1044 4133 3188 -1937
2835 -1937 -3198 -325 713 -602 309 2120 947 -1317 -1084 778 728 -550 315 23 -1316 -665 1711
2852 1711 2192 -926 -2498 224 1506 -793 -1595 1750 2559 -2261 -4175 1214 4532 1608 -3632 -1781
2868 -1781 1020 -374 -2696 980 3855 1173 -2378 -2736 52 793 834 1429 593 -1888 -2244 735 1716
2885 1716 -76 -274 1620 -462 -3505 -1426 2569 3380 -1825 -1935 1459 636 -2166 -1907 2318 2686
2901 2686 -2263 -3886 1315 4149 1341 -1913 -1928 1475 251 -916 656 956 -644 -1267 -1056 6
$$ packed form
2786F30j883J676K249j902m264J814M736l35m792r69L896J313k613m55K299k9
2802A371l342l00L457J152k257j900Q23P20L79J145O84j566k298M08J162m1P44
2819C41K859j33m706l193M090M058j545l845J344K565k325l181K627N177r45n125
2835a937j261K873J038j315R11J811j173k264K33J862n0j278Q65k92j339O51K376
2852A711M81l118j572K722J282k299q02L345Q09m820j914N389L318k924n240J851
2868a781K801j394k322L676K875k682l551l58K788P41M1N95q36k481l56K979R81
2885A716j792j98J894k082l043K079L995Q11n205j10L394q23k802K59M225L68
2901B686m949j623N201K834k808l254j5L403j224j167J572L00j600o23K11J062
$$ plain form
2917 6 796 1323 1103 -1770 -3961 -1248 2913 2564 -1401 -850 623 -1078 -4067 -989 4342 2625 -1919
2934 -1919 -2361 296 1504 -1418 -754 1760 1468 -2007 -3832 803 2641 855 -817 -344 -378 -253 301
2951 301 1232 231 -1834 173 723 131 -449 1247 2544 -1500 -3777 -335 3278 1856 -2535 -1769
2967 -1769 1060 -270 -1821 14 3107 1175 -3028 -3426 280 2199 700 788 865 -707 -2225 -902
2983 -902 1308 1465 838 -294 -1379 -1831 -353 2459 2689 -1245 -3328 -500 1260 -563 -856 1762
2999 1762 2718 -1455 -5086 229 3321 1691 -2253 -1396 543 -163 -754 418 2267 105 -2743 -2261
3015 -2261 173 1496 1247 54 -160 -1922 -2042 671 2248 -719 -585 -981 -1183 -1588 707 3732 1571
3032 1571 -2635 -3822 -253 1860 -270 -1491 571 1065 -2109 -3298 -8 3133 2320 -1502 -1987 -76
$$ packed form
2917FP90N27k20k873k191K713M161l49l965N51J473j701k989L078N331j717m544
2934a919m42K657J208k922O64K514k92l475j825M635J838j786j672M73l4J25N54
2951C01R31j001k065K007N50n92n80J696J297m044k277L442L613j422m391P66
2967a769K829j330j551J835L093j932m203l98L706J919j499Q8P7j572j518J323
2983i02K210J57o27j132j085m52J478K812K30l934k083K828J760j823k93K618
2999A762R56m173l631N315L092j630l944Q57J939p06n91J172J849k162k848M82
3015b261K434J323k49j193k14j762j20K713J577k967J34l96k02m05K295L025k161
3032A571m206j187L569K113k130j221K062M94l174j189L290L141q13l822m85J911
$$ plain form
3048 -76 47 322 1109 1355 -497 -1826 -930 713 1858 1404 514 -2047 -2871 -832 2155 1759 -517 -502
3066 -502 192 -1613 -1136 -33 3159 1261 -2327 -3420 -695 2104 -84 -1200 198 560 -1491 -2647
3082 -2647 480 1779 1378 -586 -2195 -1684 643 1850 1350 -571 -1941 -924 -546 112 417 1785
3098 1785 1312 -2006 -2393 -135 2164 1334 -549 -1403 -118 -239 -884 868 2512 1002 -1667 -2883
3114 -2883 -468 994 1727 -495 -1002 -373 -500 -790 501 1289 1444 -474 -1760 -1807 812 3005 1767
3131 1767 -1301 -1518 -262 714 531 136 708 192 -1939 -2735 122 2637 1034 -953 -2385 -792 318
3148 318 -471 686 1458 713 -1417 -2396 -1094 1939 2082 313 -1901 -1600 -488 944 641 520 788
3165 788 -363 -1240 -2013 -28 2849 1986 -1830 -2804 -324 1537 790 103 71 336 -874 -1449 -209 1940
$$ packed form
3048g6J23K75P87K46j852j329Q96J643J145m54q90k561q24K039K987l96k276J5
3066e02O94j805M77J103L192j898l588j093K725K799k188j116J398L62k051j156
3082b647L127J299m01j964j609N11K327J207n00j921j370J017L78O58L05J368
3098A785m73l318l87K258K299q30j883q54J285j21o45J752J644j510k669j216
3114b883K415J462P33k222n07O29j27k90J291P88J55j918j286m7K619K193j238
3131A767l068k17J256R76j83l95N72n16k131p96K857K515j603j987j432J593J110
3148C18p89J157P72p45k130r79J302L033J43j769k214L01J112J432l03j21K68
3165G88j151q77p73J985K877q63l816r74K480J861p47o87l2K65j210n75J240K149
$$ plain form
3183 1940 2076 -733 -2111 -1048 135 332 1271 -387 -1055 -533 -2348 -453 1242 1811 128 -2270
3199 -2270 -2864 424 2169 460 -351 156 -52 -1278 -1041 435 1837 1517 -1015 -2888 -488 1503
3215 1503 1191 308 -1060 -578 -730 -1205 250 1000 1270 -169 -1806 -997 348 1773 1105 -958 -514
3232 -514 -187 -795 -348 1334 2086 637 -1897 -2318 432 2185 991 -629 -561 398 39 -937 135 1472
3250 1472 1386 -1020 -2292 -870 1515 1657 172 -995 -531 50 -150 38 544 781 140 -1430 -1272 634
3268 634 1726 1173 -1043 -1335 -303 128 -32 76 1289 676 -1309 -1779 197 2025 1357 -876 -1108
3285 -1108 -389 390 -458 -483 1445 978 -536 -1623 -882 783 1942 425 -534 -745 248 778 886 -647
3303 -647 758 1102 -520 -1063 175 1330 1604 -1512 -751 643 755 838 -426 405 108 -1005 -1881 -1082
$$ packed form
3183A940J36k809j378J063J183J97R39j658o68N22j815J895J695N69j683k398
3199b270n94L288J745j709q11N07k08j226K37J476J402l20k532j873K400J991
3215A503l12q83j368M82j52m75J455P50K70j439j637Q09J345J425o68k063M44
3232e14L27o08M47J682P52j449k534m21K750J753j194j620O8R59l59r76J072J337
3250A472q6k406j272J422K385J42j485j167M64N81k00J88N06K37o41j570J58J906
3268F34J092n53k216k92J032M31j60J08J213o13j985m70J976J828o68k233k32
3285a108P19P79q48k5J928m67j514j087P41J665J159j517r59k11R93N30J08j533
3303f47J405L44j622n43J238J155K74l116P61J394J12Q3j264Q31k97j113q76P99
$$ plain form
3321 -1082 2024 1365 -280 -1628 -231 340 508 73 312 8 -168 -425 -758 584 2064 1120 -996
3338 -996 -1769 -231 1332 1002 -417 -908 284 -356 -1065 -162 1739 1373 -1261 -1624 120 1222 526
3355 526 -573 171 448 -381 -937 424 1002 957 -375 -1136 -769 483 1422 510 -681 -1088 -201 314 -133
3374 -133 -242 1438 1044 -1221 -2178 -264 2280 1124 -977 -994 457 -153 -849 -15 1162 939 -939
3391 -939 -1393 -265 1103 666 259 -163 32 -574 -107 687 444 -232 351 -1000 -973 183 1941 1442 -1290
3410 -1290 -1557 -23 1250 34 -833 1067 1126 -1019 -1845 30 1615 563 -2025 -1868 197 416 -480
3427 -480 578 1793 -10 -1436 -659 -188 946 837 83 579 -1665 -317 65 1578 -558 -735 192
3444 192 -554 -2104 305 2499 1023 -1113 -2966 21 1417 -530 -500 183 1749 -608 -1578 574
$$ packed form
3321a082L106o59j645j348J397N71J68m35K39l04j76k57l33J342J480r44k116
3338i96p73J538J563l30j419m91J192o40p09R03J901l66k634l63J744J102o96
3355E26j099P44K77q29n56J361N78m5j332p61L67J252R39r12j191m07Q87N15m47
3374a33j09J680l94k265r57J914K544j156k101j7J451o10o96Q34J177k23j878
3391i39m54J128J368m37m07m22J95o06M67P94k43o76N83j351K7J156J758m99k732
3410a290k67J534J273j216q67J900N9k145q26J875J585j052k588J57K065K19q96
3427d80J058J215j803j426P77M71J134j09p54M96k244J348L82J513k136j77R27
3444A92p46j550K409K194j476k136j853K987J396j947L0O83J566k357r70K152
$$ plain form
3460 574 1530 548 -193 -1588 45 931 821 531 626 -848 -429 353 435 526 1095 1291 -431 -1497 -112
3479 -112 2280 1665 -620 -448 477 200 -1796 104 2496 1233 -2206 -2739 -28 1095 592 -446 -55
3496 -55 -75 -893 -634 1118 1353 478 -632 -985 -1339 -691 1177 1606 -663 -1574 -149 542 112 -654 1167
3515 1167 843 -1217 -2063 -50 2922 1142 -1667 -1241 739 630 -911 165 1400 484 -2200 -1038
3531 -1038 806 1687 735 206 -564 -1237 -1009 504 1153 509 -179 50 -885 -1007 80 1981 1440 -1347
3549 -1347 -2038 -207 1399 259 -328 841 1050 -1856 -2497 313 2166 1221 -1333 -1604 329 506 75
3566 75 724 736 166 -1459 -760 260 955 902 265 -1136 -2118 -656 1399 955 -474 -975 214 -216 -1019
3585 -1019 -229 1686 2132 -1329 -1321 145 1590 712 -117 875 390 -1180 -1647 402 2077 892 -949
$$ packed form
3460E74R56r82p41j395J633Q86j10k90R5j474M19P82Q2R1N69J96j722j066J385
3479a12K392o15k285J72R25k77j996J900K392j263l439n33K711J123n03j038L91
3496e5k0q18K59J752K35q75j110l53l54O48J868M29k269r11J425O91m30p66J821
3515A167l24k060q46K013K972j780k809M26J980j09j541J076J235r16k684J162
3531a038J844Q81r52n29p70o73K28J513O49o44o88K29r35j22J087J901n41k787
3549a347o91J831J606j140n87J169K09k906o41K810J853r45k554k71J933J77m31
3566G5O49J2n70j625O99J020O95n3o37j401r82J462K055m44j429n01J189m30q03
3585a019P90J915M46l461QJ466J445q78q29R92m85j570m67K049J675j185j841
$$ plain form
3602 -949 -1355 -647 222 600 1234 413 -875 -1073 -271 83 565 1136 1209 -1082 -2337 -245 2183 1092
3620 1092 -901 -1330 147 -300 -1329 247 2095 963 -1675 -2149 3 1528 1044 123 -61 -174 -1055
3637 -1055 -442 1110 1511 9 -654 -857 -760 -205 1072 1772 -291 -2377 -708 1153 296 -168 652 249
3655 249 -749 -2036 77 1621 1639 -1205 -1715 -542 104 -811 328 1030 -722 -1895 -2650 281 211 1910
3673 1910 315 -1423 -1586 -1199 982 162 442 -494 619 -650 -1203 102 443 2539 -1535 -1566 63
3690 63 1659 1132 561 709 774 -645 -927 -105 1592 902 -1305 -2442 606 -412 892 759 1147 77
3708 77 -886 -1646 551 581 528 -646 -690 -2086 -707 641 408 -691 143 143 -937 -1883 897 2243 1864
3727 1864 -2133 -2471 -437 591 601 224 304 775 -577 -320 514 674 416 277 -423 -494 686 489 429
$$ packed form
3602i49m06P08Q69L78O34q21j288j98Q02L54M82N71P3k291j255K092K428j091
3620A092j993m29J477m47j029J576J848j132k638m74K152J525m84r21j84j13q81
3637a055O13J552M01j502o63k03R7N55J277P00k063k086J669J861q57m64Q20m03
3655B49r98j287K113J544J8k844n10J173O46r15J139P02j752j173p55K931p0J699
3673A910j595j738j63L87K181q20K80r36J113j269n53J305L41K096m074l1J629
3690F3J596n27n71J48O5j419k82Q22J697o90k207j137L048j018J304j33L88j070
3708G7r63p60K197L0n3j174m4j396J379J348k33j099Q34%j080r46K780J346l79
3727A864l997l38K034J028J0l77Q0M71j352K57Q34J60k58j39p00p1J180j97o0
$$ plain form
3746 429 -344 -371 -809 -10 -155 -335 295 505 -815 -1271 702 1576 1456 -396 -229 -830 11 -1071 433
3765 433 1945 424 -931 -1284 246 1244 668 -775 -1301 -117 -139 282 398 302 625 -219 -1248 -1145
3783 -1145 117 2426 442 -319 -1403 -245 4 -475 1003 64 791 -1047 -1662 64 1620 726 -435
3800 -435 -1379 161 285 350 -308 729 198 -183 -598 -264 1118 1648 -77 -1130 -363 -301 114 850 161
3819 161 55 233 -1012 -605 1059 980 1076 -555 -869 178 -169 141 -915 -157 549 -364 -904 766 1296
3838 1296 1196 -1001 -2190 -293 602 953 34 97 -633 -357 -841 -105 416 934 468 -1436 -791 267
3856 267 1800 -90 -1239 -196 616 292 187 581 730 451 -1215 -1723 -522 1202 209 140 -504 -436
3874 -436 338 -160 201 1209 208 -293 -973 -1137 748 1175 98 -1287 -62 -214 137 -404 -628 1450
$$ packed form
3746D29p73k7m38P99j45j80O30K10j320m56J973Q74j20j852J67o01Q41j082J504
3765D33J512j521j355l53J530R98n76j443n26J184k2M21J16r6L23q44j029J03
3783a145J262K309j984p61j084J158K49m79J478r39P27j838o15J726J556q94j161
3800d35r44J540J24O5o58J037n31l81m15L34J382N30j725j053P67O2M15P36o89
3819A61j06J78j245M07J664p9R6j631l14J047l47L10j056P58P06r13n40J670N30
3838A296j00k197j189J897Q95L51r19O3p30K76m84P36N21N18m66j904O45J058
3856B67J533j890j149J043Q12l24j05L94J49k79j666n08J201J724r93o9o44O8
3874d36P74m98L61J008j001n01o80j64J885M27j077j385J225j52L51n41k24K078
$$ plain form
3892 1450 221 -486 -864 251 1818 -11 -563 -343 39 -487 -587 724 714 489 -366 -805 811 1557
3910 1557 757 206 -1868 918 -607 200 686 -360 559 -724 -1044 -222 -201 1244 48 -1143 -508
3927 -508 -74 62 -380 179 332 232 -1218 -29 537 1411 929 -961 -990 -702 226 48 -324 -261 -301 -548
3947 -548 -419 -51 1364 1169 -47 -980 -197 -149 717 44 68 -269 -758 97 -506 91 834 42 -517 -1093
3967 -1093 455 217 1382 -1138 -303 573 -260 -895 -273 1372 1456 -512 -1221 -287 823 212 -43 94
3985 94 -170 -106 -357 184 471 1091 127 -1339 -1723 1203 652 -324 -49 -31 -158 -373 -357 636 1068 732 -743
4006 -743 -1338 -259 1025 862 -300 -381 -301 -24 -239 205 821 452 190 -1122 -903 648 1034 382 -517
4025 -517 -871 -322 12 -29 668 444 301 -809 -923 215 1223 565 -605 -895 89 14 -469 290 806
$$ packed form
3892A450j229p07l78J115J567j829n52K20L82n26j00J311j0k25q55m39J616P46
3910A557q00n51k074K786j525Q07M86j046R19j283l20Q22K1J445j196j191O35
3927e08M34J36m42N59J53j00j450J189N66Q74m82j890k9K88R28j78l72O3m0k47
3947e48J29L68J415j95j216r33P83M8Q66o73K4l37m89Q55o03N97P43p92n59n76
3967a093J548k38J165k520Q35Q76q33o35O22J645Q4j968p09R34J110o11k55J37
3985I4k64O4k51N41K87O20r64j466l84K926n51r76K75J8j27k15J6R93M32l36j475
4006g43n95J079J284j63j162q1Q0K77k15M44O16l69k62j312K19J551L86o52q99
4025e17l54N49L34m1O97k24j43j110j14J138J008o58j170k90R84p5m83P59N16
$$ plain form
4044 806 617 -1075 -1351 -154 1185 706 -286 -605 -539 -62 68 413 499 183 -296 -732 -717 542 1016 623
4064 623 -761 -977 270 748 409 -236 382 -118 -933 -1112 446 944 344 -769 -728 66 -12 -390 187
4083 187 1060 293 -1559 -810 -164 1463 1032 -397 -507 -1146 -170 970 4 -444 -234 -62 -28 -781 -783 1451
4103 1451 1002 -218 -2165 -210 645 -290 25 -494 787 -1025 -1012 406 1207 811 -1264 -685 -262 -158
4121 -158 427 223 69 -563 -548 -235 -309 485 1107 660 -519 -1556 19 958 810 -612 -1041 535 -409
4140 -409 -1056 -1 1067 1106 -642 -1582 -23 635 32 6 -51 1645 -1432 -210 218 898 214 -898
4158 -898 -1398 -943 -19 819 1056 -439 -1395 130 -223 878 34 -138 176 -394 -1973 -364 2159 1420
4176 1420 -1067 -1722 -85 966 -777 -862 1203 -149 -915 -2023 1408 490 667 -348 -111 -571 -407
$$ packed form
4044H06j89j692k76J197J339m79r92l19O6M77J30L45Q6l16m79m36J5J259M74l93
4064F23j384k16J247M78l39o45O18n00q15j79J558M98o00j113M1P94p8l78N77
4083A87Q73p67j852P49O46J627m31j429j10o39R76J140r66m48K10J72L4p53kK234
4103A451m49j220j947J955Q55r35L15n19J281j812J3J418Q01l96k075N79M23J04
4121a58N85k04j54o32J5L13p4P94O22m47j179j037J575R39j48j422m29J576r44
4140d09o47J055J068L9j748r40J559O58o03k6n7J696l077J222M28O80o84j112
4158h98n00M55R24Q38K37j495r56J525l53J101q44j72L14n70j579J609K523p39
4176A420k487o55J637J051j743q5K065j352p66j108L431r18J77j015K37m60J64
$$ plain form
4193 -407 551 581 629 -339 -503 -158 -604 -117 1337 1426 -1393 -2215 21 720 -128 -639 125 510 -77 -1694
4213 -1694 374 1931 963 -879 -1321 578 787 -141 375 1399 510 -1202 -752 575 511 -38 119 194
4231 194 -452 -31 764 459 -672 -1003 316 434 -760 -41 1678 1047 -1242 -1969 183 1457 338
4248 338 -730 139 550 -625 -1251 423 1684 348 -961 -614 186 36 216 831 581 -574 -903 -63
4266 -63 511 98 38 558 -102 -1096 -314 1329 1013 -1097 -544 567 253 -1100 -59 1570 1114 -1318
4284 -1318 -1396 959 1184 456 -210 229 439 -73 -527 975 1719 -359 -633 396 466 127 953 1379 201
4303 201 -1065 -669 1298 446 -490 71 406 -582 -1479 -140 1671 611 -1392 -962 929 440 -795
4320 -795 -63 1219 632 -1392 -895 605 1016 -60 -260 -56 -201 -375 -44 686 531 -799 -420 -19
$$ packed form
4193d07R58L0M8r68j64L45m46M87J454Q9k819q22K236O99q48n11P64L85n87j617
4213a694K068J557r68j842m42J899K09r28N16J024q89j712M50J327o4n49J57P5
4231A94o46M21P95l05j131l31J319J18j194P19J719o31k289p27K152J274j119
4248C38j068Q69M11j175o26J674J261j336j309L47Q00j50J80O15k50j155l29Q40
4266f3N74m13o0N20o60r94P82J643l16k110N53J111l14j353J041J629m56k432
4284a318p8K355K25p28o66M39K10n12m54J502P44k078k74J029P0l39Q26M26j178
4303B01j266L96J967q52r36N61L35r88q97J339J811j060k003M30J891m89j235
4320g95P32J282n87k024M97J500M11j076k00K04j45j74L31P30j55j330L79M01
$$ plain form
4338 -19 -415 -355 892 951 -866 -1347 -65 1343 382 -471 -144 1018 -602 -1599 502 1679 242 -1500
4356 -1500 -903 665 387 -238 103 820 -128 -1017 -474 729 622 -14 -62 -20 -831 -240 654 1069 -352
4375 -352 -824 -15 -15 -362 -327 904 822 -921 -1504 332 1433 64 -869 42 571 -368 -719 521 1073
4394 1073 102 -785 -484 529 465 -107 414 -86 -581 -406 472 586 -196 24 -9 -532 -1253 -3 1453
4413 1453 721 -869 -1182 355 530 -292 -24 930 635 -745 -1356 692 1314 5 -566 2 -29 -467
4431 -467 -498 434 589 -168 -617 -484 366 236 306 731 -450 -760 150 742 467 -419 61 371 -579 -590 180
4452 180 1317 249 -1194 -491 432 269 -368 -89 401 -74 -1044 -554 422 945 218 -352 -383 -416 -480 67
4472 67 588 82 -274 -177 -123 -245 115 656 452 -1108 -1163 83 1185 248 -718 -204 156 -395 -658 -1
$$ packed form
4338a9l96O0J247N9j817m81J282J408r61q53L27J162j620r97K101J177j437j742
4356a500N97J568k78o25L41P17r48q89N43J203j07o36m8M2q11N91Q94M15j421
4375c52m72Q09%l47L5J231q2j743n83J836J101j369r33R11N29r39l51J240N52
4394A073r71q87L01J013o4n72N21n00m95J75Q78J14p82K20l3n23p21J250J456
4413A453p32j590l13J537J75q22K68R54k95j380o11K048O22j309n71N68l1m38
4431d67l1R32J55p57m49J33Q50j30P0M25j181l10R10N92k75q86M80L10r50j1P70
4452A80J137j068j443P03R23j63o37K79M90m75r70M90R76N23p27n70l1l3o4N47
4472F7N21n06l56R7N4j22L60N41k04j560n5J246J102r37r66N14L60n51k63O57
$$ plain form
4492 -1 856 540 -1005 -961 429 714 296 15 506 31 -690 -194 236 631 32 -190 -328 -334 241 566 287
4513 287 -403 -385 24 -63 -281 124 747 228 -604 -985 155 726 75 -273 -464 109 -194 -160 374 854 80
4534 80 -622 -616 -222 712 210 160 -113 -495 -384 105 4 190 241 -162 -674 -709 483 1190 208 -642 -716 137
4556 137 -13 -79 -91 432 95 -840 -708 462 992 129 -537 -342 -328 45 334 167 501 26 -298 -592 -396
4577 -396 281 490 -11 -1017 -657 213 340 191 81 16 123 -559 -643 18 1151 469 -450 -550 50 192
4597 192 -201 173 670 32 -637 -254 -74 875 387 -275 -721 -767 -4 433 64 -6 -463 -418 -112 -14 152
4618 152 687 265 -795 -748 188 793 292 -204 163 -74 -623 -447 475 722 360 -103 -924 96 684 346
$$ packed form
4492aQ57l16j545M4J390K85m18k81M91m75p21M96M30L95n99k22j38oN75L25k79
4513B87o90J8M09q7k18M05O23n19q32l81J140N71o51l48j91N73l03L4N34M80p74
4534H0p02OL94R34n02n0k73l82J11M89j01J86N1m03n12l5J192P07r82q50p4Q53
4556A37j50o6j2N23l37r35J32J170N30q63o66J95J4L73K89j67L34m75l24k94J96
4577c96O77K09n01j006L60Q70J27j49j10o5J07o82q4O61J133o82r19j00O00J42
4597A92l93L74M97o38o69L83J80R49m88o62m46m6P63M37l69p0m57M5L06R8J66
4618A52N35m22j060M7R36O05n01m96L67k37n49J76R22K47l62m63q21J020N88l38
$$ [...]
8191F2
##END NTUPLES=NMR FID
##END=
