##TITLE=1H_LR-685B-C1M
 CDCl3, 8 sc, 
 29.7.2019
##JCAMPDX= 6.0         $$ Bruker NMR JCAMP-DX V2.0
##DATA TYPE= NMR FID
##DATA CLASS= NTUPLES
##ORIGIN= UXNMR, Bruker Analytische Messtechnik GmbH
##OWNER= root
$$ XWIN-NMR		Version 3.5
$$ Mon Jul 29 16:31:59 2019 Russian Standard Time (UT+4h)  she@DPX200
##.OBSERVE FREQUENCY= 200.13155
##.OBSERVE NUCLEUS= ^1H
##.DELAY= (6, 6)
##.ACQUISITION MODE= SIMULTANEOUS
##.ACQUISITION SCHEME= undefined
##.AVERAGES= 8
##.DIGITISER RES= 18
##SPECTROMETER/DATA SYSTEM= spect
##.PULSE SEQUENCE= zg30
##.SOLVENT NAME= CDCl3
##.SHIFT REFERENCE= (INTERNAL, CDCl3, 0, 15.7039)
##AUDIT TRAIL= $$ (NUMBER, WHEN, WHO, WHERE, WHAT)
$$ ##TITLE= Audit trail, XWIN-NMR		Version 3.5
$$ ##JCAMPDX= 5.01
$$ ##ORIGIN= Bruker BioSpin GmbH
$$ ##OWNER= she
$$ F:/spectra/data/she/nmr/H-F/1/audita.txt
$$ ##AUDIT TRAIL=  $$ (NUMBER, WHEN, WHO, WHERE, WHAT)
(   1,<2019-07-29 16:30:51.62 +0400>,<she>,<DPX200>,
      <created by zg, POWCHK disabled, PULCHK disabled
       configuration hash MD5:
       00 E9 B6 7A A2 85 ED C7 34 08 36 98 17 FE 4E 26
       data hash MD5: 16K
       C0 71 42 97 A3 58 EB 75 16 44 1B 60 F4 A5 34 BF>)
$$ ##END=
$$ 
$$ hash MD5
$$ 61 F2 E9 CC 3F C4 20 E6 08 D2 26 63 93 5D 6F F4
##$RELAX= 
##$RELAX= 
##$RELAX= 
##$RELAX= 
##$RELAX= 
##$RELAX= 
$$ Bruker specific parameters
$$ --------------------------
##$DU= <F:/spectra>
##$EXPNO= 1
##$NAME= <H-F>
##$PROCNO= 1
##$TYPE= <nmr>
##$USER= <she>
##$AMP= (0..31)
100 100 100 100 100 100 100 100 100 100 100 100 100 100 100 100 100 100 
100 100 100 100 100 100 100 100 100 100 100 100 100 100 
##$AQSEQ= 0
##$AQ_mod= 1
##$AUNM= <au_zg>
##$AUTOPOS= <>
##$BF1= 200.13
##$BF2= 200.13
##$BF3= 200.13
##$BF4= 200.13
##$BF5= 200.13
##$BF6= 200.13
##$BF7= 200.13
##$BF8= 200.13
##$BYTORDA= 1
##$CFDGTYP= 0
##$CFRGTYP= 5
##$CHEMSTR= <none>
##$CNST= (0..31)
1 1 145 1 1 1 1 1 1 1 1 1 1 1 1 1 1 1 1 1 1 1 1 1 1 1 1 1 1 1 1 1 
##$CPDPRG= <>
##$CPDPRG1= <>
##$CPDPRG2= <>
##$CPDPRG3= <>
##$CPDPRG4= <mlev>
##$CPDPRG5= <mlev>
##$CPDPRG6= <mlev>
##$CPDPRG7= <mlev>
##$CPDPRG8= <mlev>
##$CPDPRGB= <>
##$CPDPRGT= <>
##$D= (0..31)
0 1.2 0 0 0 0 0 0 0 0 0 0.03 0 0 0 0 0 0 0 0 0 0 0 0 0 0 0 0 0 0 0 0 
##$DATE= 1564403450
##$DBL= (0..7)
120 120 120 120 120 120 120 120 
##$DBP= (0..7)
150 150 150 150 150 150 150 150 
##$DBP07= 0
##$DBPNAM0= <>
##$DBPNAM1= <>
##$DBPNAM2= <>
##$DBPNAM3= <>
##$DBPNAM4= <>
##$DBPNAM5= <>
##$DBPNAM6= <>
##$DBPNAM7= <>
##$DBPOAL= (0..7)
0.5 0.5 0.5 0.5 0.5 0.5 0.5 0.5 
##$DBPOFFS= (0..7)
0 0 0 0 0 0 0 0 
##$DE= 6
##$DECBNUC= <off>
##$DECIM= 24
##$DECNUC= <off>
##$DECSTAT= 4
##$DIGMOD= 1
##$DIGTYP= 9
##$DL= (0..7)
0 120 120 120 120 120 120 120 
##$DP= (0..7)
150 150 150 150 150 150 150 150 
##$DP07= 0
##$DPNAME0= <>
##$DPNAME1= <>
##$DPNAME2= <>
##$DPNAME3= <>
##$DPNAME4= <>
##$DPNAME5= <>
##$DPNAME6= <>
##$DPNAME7= <>
##$DPOAL= (0..7)
0.5 0.5 0.5 0.5 0.5 0.5 0.5 0.5 
##$DPOFFS= (0..7)
0 0 0 0 0 0 0 0 
##$DQDMODE= 0
##$DR= 18
##$DS= 0
##$DSLIST= <SSSSSSSSSSSSSSS>
##$DSPFIRM= 0
$$ [...]
##$SUBNAM2= <"">
##$SUBNAM3= <"">
##$SUBNAM4= <"">
##$SUBNAM5= <"">
##$SUBNAM6= <"">
##$SUBNAM7= <"">
##$SUBNAM8= <"">
##$SUBNAM9= <"">
##$SW= 24.9336996594482
##$SWIBOX= (0..15)
0 0 2 0 0 0 0 0 0 0 0 0 0 0 0 0 
##$SW_h= 4990.01996007984
##$TD= 16384
##$TD0= 1
##$TE= 0
##$TE2= 300
##$TE3= 300
##$TEG= 300
##$TL= (0..7)
0 120 120 120 120 120 120 120 
##$TP= (0..7)
150 150 150 150 150 150 150 150 
##$TP07= 0
##$TPNAME0= <>
##$TPNAME1= <>
##$TPNAME2= <>
##$TPNAME3= <>
##$TPNAME4= <>
##$TPNAME5= <>
##$TPNAME6= <>
##$TPNAME7= <>
##$TPOAL= (0..7)
0.5 0.5 0.5 0.5 0.5 0.5 0.5 0.5 
##$TPOFFS= (0..7)
0 0 0 0 0 0 0 0 
##$TUNHIN= 0
##$TUNHOUT= 0
##$TUNXOUT= 0
##$USERA1= <user>
##$USERA2= <user>
##$USERA3= <user>
##$USERA4= <user>
##$USERA5= <user>
##$V9= 5
##$VALIST= <valist>
##$VCLIST= <CCCCCCCCCCCCCCC>
##$VD= 0
##$VDLIST= <DDDDDDDDDDDDDDD>
##$VPLIST= <PPPPPPPPPPPPPPP>
##$VTLIST= <TTTTTTTTTTTTTTT>
##$WBST= 1024
##$WBSW= 4
##$XGAIN= (0..3)
0 0 0 0 
##$XL= 0
##$YL= 0
##$YMAX_a= 21832
##$YMIN_a= -12448
##$ZGOPTNS= <>
##$ZL1= 120
##$ZL2= 120
##$ZL3= 120
##$ZL4= 120
##$ABSF1= 10
##$ABSF2= 0
##$ABSG= 5
##$ABSL= 3
##$ALPHA= 0
##$AQORDER= 0
##$ASSFAC= 0
##$ASSFACI= 0
##$ASSFACX= 0
##$ASSWID= 0
##$AUNMP= <proc_1d>
##$AZFE= 0.1
##$AZFW= 0.1
##$BCFW= 1
##$BC_mod= 2
##$BYTORDP= 1
##$COROFFS= 0
##$CY= 11.3945322036743
##$DATMOD= 1
##$DC= 2
##$DFILT= <>
##$DTYPP= 0
##$F1P= 20.1537800932815
##$F2P= 0.134698688090026
##$FCOR= 0.5
##$FTSIZE= 0
##$FT_mod= 4
##$GAMMA= 1
##$GB= 0.15
##$INTBC= 1
##$INTSCL= 1
##$ISEN= 128
##$LB= 0.24
##$LEV0= 0
##$LPBIN= 0
##$MAXI= 10000
##$MC2= 0
##$MEAN= 0
##$ME_mod= 0
##$MI= 1.114404
##$NCOEF= 0
##$NC_proc= 0
##$NLEV= 6
##$NOISF1= 3.799351
##$NOISF2= 2.8
##$NSP= 1
##$NTH_PI= 0
##$NZP= 0
##$OFFSET= 15.70392
##$PC= 1
##$PHC0= -9488.536
##$PHC1= 10.40097
##$PH_mod= 1
##$PKNL= yes
##$PPARMOD= 0
##$PSCAL= 0
##$PSIGN= 0
##$REVERSE= no
##$SF= 200.130013532006
##$SI= 16384
##$SIGF1= 3
##$SIGF2= 2
##$SINO= 400
##$SIOLD= 16384
##$SREGLST= <1H.CDCl3>
##$SSB= 0
##$STSI= 0
##$STSR= 0
##$SW_p= 3612.71676300578
##$SYMM= 0
##$S_DEV= 0
##$TDeff= 0
##$TDoff= 0
##$TI= <>
##$TILT= no
##$TM1= 0
##$TM2= 0
##$TOPLEV= 0
##$USERP1= <user>
##$USERP2= <user>
##$USERP3= <user>
##$USERP4= <user>
##$USERP5= <user>
##$WDW= 1
##$XDIM= 8192
##$YMAX_p= 0
##$YMIN_p= 0
$$ End of Bruker specific parameters
$$ ---------------------------------
##NTUPLES= NMR FID
##VAR_NAME=  TIME,          FID/REAL,        FID/IMAG
##SYMBOL=    X,             R,               I
##VAR_TYPE=  INDEPENDENT,   DEPENDENT,       DEPENDENT
##VAR_FORM=  AFFN,          ASDF,            ASDF
##VAR_DIM=   8192,          8192,            8192
##UNITS=     SECONDS,       ARBITRARY UNITS, ARBITRARY UNITS
##FACTOR=    0.0002004,     1,               1
##FIRST=     0,             0,               0
##LAST=      1.6414764,     0,               0
##MIN=       0,             -12448,          0
##MAX=       1.6414764,     21832,           0
$$ Real data points
##PAGE= N=1
##DATA TABLE= (X++(R..R)), XYDATA
0@%%%%%%%%%%%%%%%%%%%%Nj3J6j6J6j6J6j6J9k7L2l2L5m2M7n1N7o2O9p7Q5r6J05
$$ 0 0 0 0 0 0 0 0 0 0 0 0 0 0 0 0 0 0 0 0 0 5 -8 8 -8 8 -8 8 -8 11 -16 16 -16 19 -23 24 -27 30 -32 37 -40 45 -51 54
43E4j15J28j42J58j78K00k24K51k83L25l77M44n38O73q85J278k235Q656J4642
$$ 54 -61 67 -75 83 -95 105 -119 132 -151 174 -203 241 -297 376 -509 769 -1466 7190 21832
62B1832j3691j2474J691R769q92o580j39P747K615l960j788N200L293m191o212
$$ 21832 8141 -4333 -2642 7127 6235 -345 -484 7263 9878 5918 4130 9330 12623 8432 2220
77B220N50N222K628k721l039o13m95k943l155r71J59n59M92K823K141k358m553
$$ 2220 2770 7992 10620 7899 4860 4247 3752 809 -2346 -3317 -3158 -3717 -3225 -402 1739 -619 -5172
94e172j313K905K364j066k060L55J817M30j975k704j914p46j25K93J261K549K136
$$ -5172 -6485 -3580 -1216 -2282 -4342 -3987 -2170 -1740 -3715 -6419 -8333 -9079 -9204 -8911 -7650 -5101 -2965
111b965l60k154o38K105K200K72K7K084K894O82j893k078o11N19L46o4J47J133
$$ -2965 -3325 -5479 -6117 -4012 -1812 -1540 -1513 571 3465 4147 2254 176 -435 84 430 366 513 1646
129A646J580P80l00k76N3k33j13J474K769J368r38j271n03j034k302j588P96J104
$$ 1646 3226 4006 3706 3430 3483 3250 3137 4611 7380 8748 7810 6539 6036 5002 2700 1112 1908 3012
147C012q14j372K72R34j023k429q83J398J478m8l03Q49R49q17k417j977n52Po1
$$ 3012 2198 826 1098 2032 1009 -1420 -2303 -905 573 525 222 1071 2020 1203 -1214 -3191 -3743 -3736 -3797
166c797O3M54O9r20j189k31M52K29K37J093J654R74K13K00J85p18j273m30Q17
$$ -3797 -3734 -3280 -3211 -4131 -5320 -5551 -5099 -4870 -4633 -3540 -1886 -912 -699 -499 -314 -1032 -2305 -2735 -1918
185a918J029L43O1J14k33o53m63K72Q51J120J418J223M54k7o0j5l39n12k51K53
$$ -1918 -889 -546 -485 -371 -604 -1257 -1720 -1448 -597 523 1941 3164 3618 3591 3531 3516 3177 2665 2414 2667
205B667L65J14k61m77o28q28q62l67P44J332R04K0k78j3k04o89o33q0J54k39m00
$$ 2667 3032 3146 2885 2408 1780 952 90 -277 467 1799 2703 2723 2445 2432 2228 1539 906 826 980 741 341
226C41j95j61p36j166q72l51O1K89P41Q85M78j23m43l76k02J22K07L29J68K4k67
$$ 341 146 -15 -751 -1917 -2789 -3140 -3079 -2790 -2049 -1164 -686 -809 -1252 -1628 -1830 -1708 -1501 -1172 -1004 -980 -1247
247a247n05m79n15l74j35M59Q00P91N60L92L17n1k14J00M34N69L68L48K91k25
$$ -1247 -1752 -2231 -2746 -3120 -3255 -2796 -1996 -1205 -645 -253 64 13 -201 -101 333 902 1270 1618 1909 1684
267A684o73p24l65K8J67L71M42M94L89J79k0j38j02M2K05L45M39K24k58p62q37
$$ 1684 1011 287 -78 -50 117 488 930 1424 1813 1992 1972 1834 1732 1774 1979 2324 2763 2987 2729 1967 1130
288A130p02m20k17L1K15J63K3o1j19k82k29q8O8K64L35K15j30m37o49m76n31m96
$$ 1130 428 8 -209 -178 37 200 223 162 43 -239 -468 -556 -488 -224 111 326 196 -241 -890 -1366 -1897 -2393
310b393k17J97L76K60O6o3j09j96j9K98N56O59M16J99O9j71k52l60l39k6K78M41
$$ -2393 -2610 -2413 -2037 -1777 -1711 -1774 -1883 -2079 -2098 -1800 -1244 -585 -169 30 99 -72 -324 -684 -1023 -1049 -771 -330
332c30L40K29M8l6j53K8K63M54M76N42M93J54j21l90l09l43k15o5J50J47n8j35
$$ -330 10 239 287 251 98 126 389 843 1319 1861 2354 2508 2387 1997 1688 1345 1130 1065 1215 1362 1304 1169
354A169j84k60l42k08P0K40L30L37K05j39m26n53m14l11k12j7O9k6j77l08k80
$$ 1169 985 725 383 175 245 485 815 1152 1357 1218 792 239 -175 -486 -698 -715 -646 -672 -849 -1157 -1437
375a437l01k52j2J98M35M35L00J66k5k30k41k37mJ61K40J61J21L1j78k69j25Q7
$$ -1437 -1738 -1990 -2002 -1804 -1369 -934 -634 -468 -493 -723 -964 -1201 -1205 -1044 -804 -643 -522 -491 -669 -938 -1063 -976
397i76J99L66N34N16L61R2q1j21j38p5J62J97K19L8o2j60k85l67j92l4J50K61
$$ -976 -777 -411 123 639 1000 1092 1011 890 752 677 839 1036 1255 1293 1231 1071 786 419 227 193 343 604
419F04L66K43P9j70k41j87j91j22O5J56qj23k45l13l96l40k32M7J86J94J98J01
$$ 604 970 1213 1292 1122 881 694 503 381 446 602 594 471 226 -87 -483 -823 -1055 -1008 -822 -628 -430 -329
441c29M3q6j78j65j9Q4J87J63J64l3k10l88l07r5M7J79K83K90J63O3K2K2j6n2
$$ -329 -286 -372 -550 -715 -734 -650 -463 -300 -136 -169 -379 -767 -1074 -1169 -1122 -943 -660 -370 -207 -144 -122 -100 -116 -168
465a68P0K56K70J62R9o0k69l34j75j4P8J14J90K20M4j8q6n5j08J4J85K73J55K2
$$ -168 -98 158 428 590 689 629 360 26 -149 -163 -85 29 219 439 483 465 379 324 216 230 415 688 843 865
489H65r3j75k70k60j74p6N5J31J24O8l6j19j14j38K8J51K05J58O7l4p1k15k45
$$ 865 772 597 327 67 -107 -183 -128 3 127 195 159 40 -74 -212 -184 -33 172 330 397 363 292 77 -168
512a68j56r3m2RJ56J33k9j30j16q5m3J04J76J79J45J07jj24k44j64p2j0M8J00
$$ -168 -324 -417 -459 -450 -294 -161 -190 -320 -436 -521 -564 -460 -284 -105 40 147 146 22 -222 -386 -458 -468 -420 -320
536c20J35%o4p3q1l0K3J89K37J99J44R5p4j15j24l5l0L0O1J27J18p5j00p9n3k9
$$ -320 -185 -185 -249 -322 -403 -433 -410 -221 16 215 359 454 380 265 141 106 76 106 167 294 412 337 237 158 105 76
562G6Q0J85J70J30O2k6l9q5j32j60n7L9Q8J3j07p6j48k10j62K3J30J03OL4P0k5
$$ 76 156 341 511 641 703 677 638 553 421 261 204 243 331 344 237 161 13 -197 -359 -336 -206 -103 -97 -63 7 -18
588a8j53j79j09J2lJ9N8ln6r2j70r9j8J10J11J04J88J76Lr0o6N1J15K5P9J20R6
$$ -18 -171 -350 -459 -447 -450 -431 -373 -376 -432 -524 -694 -793 -811 -701 -590 -486 -298 -122 -119 -209 -275 -224 -109 -84 -5 115 211
615B11L2o9n5j5n4k8O6K12K32R3Ml0n6rjJ4O0P7Pl0j05q2j52j78r7qM4K1M8K4
$$ 211 243 174 119 104 50 22 88 300 532 625 629 599 543 534 533 547 607 684 691 661 556 474 322 144 47 39 83 104 152 176
645A76p9j02r9n1k7l1M7%pl5j40r7j33j21l1O2P6R0M6j4K0qj2J0j1J46J92Q6L3
$$ 176 97 -5 -104 -155 -182 -213 -166 -166 -173 -208 -348 -445 -578 -699 -730 -668 -592 -502 -456 -470 -450 -458 -470 -460 -471 -325 -133 -47 -14
674a4m5J7n6q5OJ03J27R8N7J2P9K6j5o2K9J30J64O9k6J4n5j11j12p4Jj0J1L2o
$$ -14 -59 -42 -98 -183 -177 -74 53 151 208 220 299 325 310 248 277 407 571 640 614 628 573 462 350 276 277 267 278 310 304
703C04Lq2j20o9o0k7J11L6L3r6m9o2j27q5q1k4L5QO4lr0m7j8%pN4J15J22R5m4
$$ 304 307 225 105 36 -24 -51 60 96 129 33 -16 -78 -205 -290 -371 -395 -360 -352 -288 -291 -381 -428 -446 -446 -453 -399 -284 -162 -67 -111
733a11m5Kl3J3l7J6J47O9K7n6K5nj1l0K9J34J65K0mJ0j1r1l7j4N4K0k8L8k2m2
$$ -111 -156 -154 -187 -174 -211 -195 -48 21 48 -8 17 12 1 -29 0 134 299 319 315 325 314 223 186 172 226 246 218 256 234 192
763A92q6q0qLM1M2K3O9Ko6j10k4m8O8n3l0M7O5n2j58o0M7L5n4k4Q9J14M8m1k2
$$ 192 106 26 18 21 62 104 127 196 198 132 22 -2 -50 18 -35 -65 -18 47 -5 -163 -223 -176 -141 -195 -219 -130 -16 32 -9 -31
793c1j5m9k2k0M1R3K2l6n4%m1k1m7N4O9M0O8j9K2r7l3J6L5J1L0j4M6k9j0l8r9
$$ -31 -46 -95 -117 -137 -96 -3 19 -17 -71 -71 -112 -133 -180 -126 -57 -17 51 32 54 -43 -76 -60 -25 -14 16 2 48 19 9 -29 -128
824a28LP0KL9J6N5M7m8m9K9K5K1nL0N0M7r5k8J2l9mkK6M4L4J4m3prj5J0jM0O0
$$ -128 -125 -55 -53 -14 2 57 104 56 7 36 61 82 77 107 157 204 109 81 93 54 50 48 74 118 152 166 123 116 107 92 102 101 141 201
858B01j03j8k5l0l9q2OJ2k4j5J9K0Lq6l9J9LM9om0K1Mj0o5j5NK5K4JM2M2j2k6
$$ 201 98 80 55 25 -14 -96 -90 -78 -102 -117 -98 -78 -75 -161 -200 -181 -178 -129 -135 -175 -154 -150 -160 -225 -240 -235 -210 -186 -185 -143 -101 -113 -139
891a39L6M6K9K6K4O3L4L3nk9JK2j4P8K0j5J5J9J3nk6k3JL7K0K2n5j2mn8p3j5M
$$ -139 -103 -57 -28 -2 22 85 119 152 147 118 119 141 127 205 225 210 225 244 257 252 226 203 204 241 261 283 228 216 212 154 81 66 70
924G0m9k0Nk9k9r1J2k0n4L3lL0l7l0Nk6j0l7j1L3k0J2N4J1n1L4K5M7JL6L5O2K2
$$ 70 21 1 6 -23 -52 -143 -131 -151 -205 -172 -175 -145 -182 -212 -207 -233 -243 -280 -291 -258 -278 -266 -212 -201 -252 -218 -193 -146 -145 -109 -74 -12 10
957A0L9k3K7K6j0M4K4J8J6J5J5j6K4J6mj0K9OmNol9qk5m4mk2K0kn3n1Rj2o5j5
$$ 10 49 26 53 79 69 113 137 155 171 186 201 185 209 225 221 211 240 246 242 247 241 202 194 169 125 121 99 119 117 64 13 22 10 -55 -70
992g0qj0k3k4nj6Jj9J3Lo0K3L2k8L2j9m0PM2kL0M4PN0oK8L1Pj0K2mM8K3M4m4Q
$$ -70 -78 -88 -111 -135 -140 -156 -155 -174 -161 -158 -218 -195 -163 -191 -159 -178 -218 -211 -169 -171 -141 -97 -90 -40 -46 -18 13 20 10 32 28 76 99 143 99 107
1028A07jj0J1PJ5J8K0m2J7J4l3mMk5k1J8j4Ql7J0n2k3J3j1%n6K7j2K4k8j0rj3
$$ 107 106 96 107 114 129 147 167 125 142 156 123 119 123 98 77 95 81 89 52 62 10 -13 0 -11 -11 -67 -40 -52 -28 -56 -66 -75 -88
1061h8oJ9Qk1lr%jrM8l2K3J8L4mJ5k8M3K6m2K0L4J3k2j5J2l7J5nL5Ol4J7J4lL
$$ -88 -94 -75 -67 -88 -91 -100 -100 -101 -110 -62 -94 -71 -53 -19 -23 -8 -36 7 33 -9 11 45 58 36 21 33 -4 11 6 41 47 13 30 44 41 44
1097D4Kk4J7lqkj6N0m1l3j5J0K2qL3j7k9%omkK9J5oJ3RPm2RLk1NJ1L2pKm6J7J7
$$ 44 46 22 39 36 28 26 10 60 19 -14 -29 -19 3 -5 28 11 -18 -18 -24 -28 -30 -1 14 8 21 30 37 -5 4 7 -14 -9 2 34 27 29 -17 0 17
1136A7mK3j7J8kJ3k1k0J6l6Pj2LJ5j0J2j9j7k6Mk5L3qj0k0O3Jm3l7K6J9K3j2l
$$ 17 13 36 19 37 35 48 27 7 23 -13 -6 -18 -15 0 -10 2 -17 -34 -60 -56 -81 -48 -56 -66 -86 -23 -22 -65 -102 -76 -57 -34 -46 -49
1170d9M6j1Jn0J9L1j4J8J8L0rL7n0M8l4M3jO%MJ0l1J5lm3mM6j3rLkJ2j1m9J0j
$$ -49 -3 -14 -13 -63 -44 -13 -27 -9 9 39 30 67 17 65 31 74 73 79 79 83 93 62 77 74 31 27 73 60 51 54 52 64 53 4 14 13
1206A3j4Mk2oJ1m3nnj2pK0j8J6qjj4oK2oOj8L5J7nMk7J5oJ4J3K0L0KL4k7LkL9
$$ 13 -1 3 -19 -25 -14 -57 -62 -67 -79 -86 -66 -84 -68 -76 -77 -91 -97 -75 -81 -75 -93 -58 -41 -46 -42 -69 -54 -60 -46 -33 -13 17 19 53 26 29 27 66
1244F6k4J3J3j6K5K1K4j2ml7n%PMJJ6n2j1L5%l6j5l3N2j4j2k2j6j7j4j3k1M6P
$$ 66 42 55 68 52 77 98 122 110 106 69 64 64 71 75 76 92 40 29 64 64 28 13 -20 32 18 6 -16 -32 -49 -63 -76 -97 -51 -44
1278d4j5Ok6j0j3J2MM0m4J8K4j2lQOJ2j3J2M1K8J0k4k5K9j3K0j1M8K0%J5j8j6
$$ -44 -59 -53 -79 -89 -102 -90 -86 -46 -90 -72 -48 -60 -63 -55 -49 -37 -50 -38 3 31 41 17 -8 21 8 28 17 65 85 85 100 82 66
1311F6J7k7K4l5M1kk6j2j7K5j2%j4%Qnm7J7j8j2j4J4%nrJ6mnk3QOj1J0J2oJ6j6
$$ 66 83 56 80 45 86 84 58 46 29 54 42 42 28 28 36 31 -16 1 -17 -29 -43 -29 -29 -34 -43 -27 -31 -36 -59 -51 -45 -56 -46 -34 -40 -24 -40
1348d0K5J8l8J8%mJ3lN9n3k2K2k3O2j6L5k1Lj6K3j3Rl4K5j0jK6j6KMj6J5m2%K6
$$ -40 -15 3 -35 -17 -17 -21 -8 -11 48 -5 -27 -5 -28 34 18 53 32 35 19 42 29 38 4 29 19 18 44 28 30 34 18 33 -9 -9 17
1383A7k0J9j7Lk2K7l5NJ4j4j5K3M5m3J4l2MpK1K3Pj4J7j6j4j3J8K0j0oL4l2K9
$$ 17 -3 16 -1 2 -20 7 -28 -23 -9 -23 -38 -15 30 -13 1 -31 -27 -34 -13 10 17 3 20 4 -10 -23 -5 15 5 -1 33 1 30
1416C0j5Pj1m3L2JJ2L9n3jj1k1N1m6J8rj0J3NK1k8m1K8K3j8POJ3Pom6J6PL1Jj0
$$ 30 15 22 11 -32 0 1 13 52 -1 -2 -13 -34 17 -29 -11 -20 -30 -17 -12 9 -19 -60 -32 -9 -27 -20 -14 -1 6 0 -46 -30 -23 8 9 -1
1452aK7k1K0nMm9M0J0j8pM6n6M6j1qj9L1jJK6j8K4j9j9j6k7LK8mPPj6kl5KqK0
$$ -1 26 5 25 20 24 -25 15 25 7 0 46 -10 36 25 17 -2 29 28 29 55 37 61 42 23 7 -20 -17 11 7 14 21 5 3 -32 -30 -38 -18
1489a8j7K1j1Lk0mK1j1Mj1M1n2M3k5Ll9J2M3l5N6j3J6moLL8l9RK1Kk4L3k2nK5
$$ -18 -35 -14 -25 -22 -42 -46 -25 -36 -32 -43 -2 -54 -11 -36 -33 -72 -60 -17 -52 4 -9 7 3 -3 0 38 -1 8 29 31 7 40 18 13 38
1524C8oj7j6M4k0N2k6k5RJ2k9Kj8mK5J2Ol2j3oNRl1K4MOqm9K9J0k0j5LJ2J3Nj7
$$ 38 32 15 -1 43 23 75 49 24 33 45 16 18 0 -4 21 33 39 7 -6 -12 -7 2 -29 -5 -1 5 -3 -52 -23 -13 -33 -48 -45 -33 -20 -15 -32
1561c2KK2k9qOJ5OL3j2k3J7j5J2PlmK2J1J1J4k0j0J6POJ0j7Oj7pL1m7j9L3NJ0
$$ -32 -30 -8 -37 -45 -39 -24 -18 15 3 -20 -3 -18 -6 1 -2 -6 16 27 38 52 32 22 38 45 51 61 44 50 33 26 57 10 -9 24 29 39
1597C9k7j5K7l0j1k1L3k5L1j3kRnk3L7n0rJ5lK2Kjj0L4k1n0K8J6KL3qJk6PRL2
$$ 39 12 -3 24 -6 -17 -38 -5 -30 1 -12 -14 -5 -10 -33 4 -46 -55 -40 -43 -21 -19 -20 -30 4 -17 -67 -39 -23 -21 12 4 5 -21 -14 -5 27
1633B7k4L4j1PJ3k9lQlMj7J4J2qK%pm3J3J1oJ9m0L4J2l6L0k5k9L2Jj7L1l1J2%
$$ 27 3 37 26 33 46 17 14 22 19 23 6 20 32 24 26 26 19 -24 -11 0 -6 13 -27 7 19 -17 13 -12 -41 -9 -8 -25 6 -25 -13 -13
1669a3rj5J8kJ7qJ1j9J2Mkj1J0J6k2K9k3oJ9k9K8MJJ5LJ0l1M0l4j8J3m2L7k0N3
$$ -13 -22 -37 -19 -21 -4 -12 -1 -20 -8 -4 -6 -17 -7 9 -13 16 -7 -13 6 -23 5 9 10 25 28 38 7 47 13 -5 8 -34 3 -17 36
1704C6l4K9l1Pk3jJ9l6KK4OLJm0K5Pk8K6Nm0N1m5J0jJ5K4j4J6J5k0nj3RQ%J5k6
$$ 36 2 31 0 7 -16 -17 2 -34 -32 -8 -2 1 2 -38 -13 -6 -34 -8 -3 -43 8 -37 -27 -28 -13 11 -3 13 28 8 3 -10 -1 7 7 22 -4
1741dK8kMj2MkJ3Ml4J5L0l8L2j5KjpK2m0J5K1l5j7J7j7J2j2J7l1K7k3J7Jk5K0
$$ -4 24 22 26 14 18 16 29 33 -1 14 44 6 38 23 25 24 17 39 -1 14 35 0 -17 0 -17 -5 -17 0 -31 -4 -27 -10 -9 -34 -14
1776a4l4lJ4LK8kl8L2J1n0M1J1J5k3K3J5j7j0LOj9L3l5L6K4k9J1k4J7l0qL5MP
$$ -14 -48 -51 -37 -34 -6 -8 -46 -14 -3 -53 -12 -1 14 -9 14 29 12 2 5 11 -8 25 -10 26 50 21 32 8 25 -5 -13 22 26 33
1810C3j3K1j4J5k3n3M2j0j0K6j0qOn7K5K4l9j1K7OK7j3k8kL2l0k0K3NMpK4l6N
$$ 33 20 41 27 42 19 -34 8 -2 -12 14 4 -4 2 -55 -30 -6 -45 -56 -29 -23 4 -9 -37 -39 -7 -37 -57 -34 -29 -25 -32 -8 -44 -39
1844c9M2k1L4Rl4KLL2k2oj3M6rK4qrJ8j9kj3J8j0K2j0l2K8j5J5j8j4%J3j9J5l9
$$ -39 3 -18 16 25 -9 -7 -4 28 6 0 -13 33 24 48 40 31 49 30 28 15 33 23 45 35 3 31 16 31 13 -1 -1 12 -7 8 -31
1879c1J6L4k2l8L7j6lnRk1r%K4kj9J3Jk0O9k3j0j3M8j6oJJj2L1pj2mj6M4oJ1R
$$ -31 -15 19 -3 -41 -4 -20 -23 -28 -19 -40 -49 -49 -25 -27 -46 -33 -32 -52 17 -6 -16 -29 19 3 -3 -2 -1 -13 18 11 -1 -5 -21 23 17 28 37
1916C7k3J9j4j4OpK3k8rO0pk2k9L0m0P4n5J4j8L3j1n3K9j8Pj2nK6JJ3l0pK3l1
$$ 37 14 33 19 5 11 4 27 -1 -10 50 43 21 -8 22 -18 56 1 15 -3 30 19 -34 -5 -23 -16 -28 -33 -7 -6 7 -23 -30 -7 -38
1950c8o%%K7MK9m2L2J5k0j9J1lj7M5j9j3KJ6%Rk5J5L3k0J4l0%jJ4J2O%j0Rj7p
$$ -38 -44 -44 -44 -17 -13 16 -26 6 21 1 -18 -7 -10 -27 18 -1 -14 -12 4 4 13 -12 3 36 16 30 0 0 -1 13 25 31 31 21 30 13 6
1987Fj4Qk1K4J6j2j0OJ8l5oK0j3nnpJ2MJ7mk3j0NK3J5j1Pj6Ljj8L7j2j0K5lk%
$$ 6 -8 0 -21 3 19 7 -3 3 21 -14 -20 0 -13 -18 -23 -30 -18 -14 3 -1 -24 -34 -29 -6 9 -2 5 -11 -8 -9 -27 10 -2 -12 13 10 8 8
2025HOrj1L7JrJ9K6m5Pj1jqJ6rlRml7LK2j6J5Mj0l3N1Pj6j1l2kJ1j8LK3pK0k3
$$ 8 14 5 -6 31 32 23 42 68 23 30 19 18 10 26 17 14 23 19 -18 -15 7 -9 6 10 0 -33 18 25 9 -2 -34 -36 -25 -43 -40 -17 -24 -4 -27
2064b7K0k0L1k9K9k4QnJ6K3j5j9KQK7k1j4K9oj3QLlj2OpK8J0j7k1J6k9L0j7KN
$$ -27 -7 -27 4 -25 4 -20 -12 -17 -1 22 7 -12 -10 -2 25 4 -10 19 13 0 8 11 8 -4 2 -5 23 33 16 -5 11 -18 12 -5 -3 2
2100Bj2L7k4nj2J9j4J3pOJ1j9J1l8OnK3PNJj4J0j4Rj4%JK3k7K4J8n2K8lJQNj7
$$ 2 -10 27 3 -2 -14 5 -9 4 -3 3 14 -5 6 -32 -26 -31 -8 -1 4 5 -9 1 -13 -4 -18 -18 -17 6 -21 3 21 -31 -3 -6 -5 3 8 -9
2138iK6Mj3N1n0QmrnL4j5JmJ0j7Mk0MJ0J6k3L2n4J7Oj0jKl8P8m2mJ8j4mPj8MJ9
$$ -9 17 21 8 59 9 17 13 4 -1 33 18 19 15 25 8 12 -8 -4 6 22 -1 31 -23 -6 0 -10 -11 -9 -47 31 -11 -15 3 -11 -15 -8 -26 -22 -3
2177cj6J9PJj6mk5K4K4l2N7o2KM9l0J8jKj1J8%mrl0N1kj9lQrjJ5Rm0pJ6K3m8N5
$$ -3 -19 0 7 8 -8 -12 -37 -13 11 -21 36 -26 -24 25 -5 13 12 14 3 21 21 17 8 -22 29 27 8 5 13 4 3 18 27 -13 -20 -4 19 -29 26
2216B6k4Pk5K9k3k0K4j0J0l0N7k5J6j9K0k2j3OJ7k0j3M6l0pJ6j0K4%Ok0K1m0M2
$$ 26 2 9 -16 13 -10 -30 -6 -16 -6 -36 21 -4 12 -7 13 -9 -22 -16 1 -19 -32 14 -16 -23 -7 -17 7 7 13 -7 14 -26 16
2249A6l4M7j6J1r%mQK5l6k5%J8KJpK0j6qL1o1J0K6k0L7k7k1M0Lj7J6j9qM4pn0
$$ 16 -18 29 13 24 15 15 11 19 44 8 -17 -17 1 3 4 -3 17 1 -7 24 -37 -27 -1 -21 16 -11 -32 8 11 -6 10 -9 -17 27 20 -30
2285c0K5jnJ3rk4kOL2l6K4qL6m7K0JNLPj2jj0PJ8Mj3K2j7j6J0LL6k2k6K1k8J9
$$ -30 -5 -6 -11 2 -7 -31 -33 -27 5 -31 -7 -15 21 -26 -6 -5 0 3 10 -2 -3 -13 -6 12 16 3 25 8 -8 2 5 41 19 -7 14 -14 5
2322Ej2J2j2NJk9N0k1lj1Pk8K1L3k3j7L7j7j7kK3PqK1j3j4k5J6K4lk4OK1j7mQ
$$ 5 -7 5 -7 -2 -1 -30 20 -1 -4 -15 -8 -36 -15 18 -5 -22 15 -2 -19 -21 2 9 1 22 9 -5 -30 -14 10 7 -17 -11 10 -7 -11 -3
2358cl%pK4l4J2K9k3J0j3j6M6l0J2Pk8KJ4j8QOmok1L1j8L5j8qqM1l0J0k1QJ3j3
$$ -3 -6 -6 -13 11 -23 -11 18 -5 5 -8 -24 22 -8 4 11 -17 -15 -1 -19 -11 -5 -9 -15 -36 -5 -23 12 -6 -14 -22 19 -11 -1 -22 -14 -1 -14
2395a4ooN7m7oJ4pK9j4j7nJ1kK4j6L9l1L3k9k6NL5pPPk7OMJl6N2k3l0K9j3j0K8
$$ -14 -20 -26 31 -16 -22 -8 -15 14 0 -17 -22 -11 -13 11 -5 34 3 36 7 -19 -14 21 14 21 28 1 7 11 12 -24 28 5 -25 4 -9 -19 9
2432Ij4J3Pj6LKkRm5J0K0mk6K3npJ3Ok2nK1k3L0m2N7k0j1QJ1LJ8k9J3J7qmk6L3
$$ 9 -5 8 15 -1 2 4 2 11 -34 -24 -4 -8 -34 -11 -16 -23 -10 -4 -26 -31 -10 -33 -3 -45 12 -8 -19 -11 0 3 21 -8 5 22 14 10 -16 17
2470A7LllJ7k7k8N5ok8%K4k6oNJ1j9K9n4MM1j1Oj4K3l1K1jj3mK8j0Rol5L7k1J7
$$ 17 20 17 14 31 4 -24 31 25 -3 -3 21 -5 -11 -6 5 -14 15 -39 -35 6 -5 1 -13 10 -21 0 -1 -14 -18 10 0 9 3 -32 5 -16 1
2507An2K5L9rk2J9j4jJ4J0j2K5mpnPrQj6j8N1Knk6NK0j7pj5K8J3k5Pj5RJ3k4J7
$$ 1 -51 -26 13 4 -18 1 -13 -14 0 10 -2 23 19 12 7 14 5 13 -3 -21 30 32 27 1 6 26 9 2 -13 15 28 3 10 -5 4 17 -7 10
2545A0k9L1j6J3J6m6J6J8m3%%J7J3l3M5m5L7%l5L3Pl2J3OMKOl0QJ6K7k5NQJ0j2
$$ 10 -19 12 -4 9 25 -21 -5 13 -30 -30 -30 -13 0 -33 12 -33 4 4 -31 2 9 -23 -10 -4 0 2 8 -22 -14 2 29 4 9 17 27 15
2581A5oOj7J3K3m5J1J2Pl1pJ5NMK5l9J3j1NNJ4nl0K6J9k2rK2J1l8nJ6j1pJ0J6
$$ 15 9 15 -2 11 34 -11 0 12 19 -12 -19 -4 1 5 30 -9 4 -7 -2 3 17 12 -18 8 27 5 -4 18 29 -9 -14 2 -9 -16 -6 10
2617A0n2N5l1J0krj4J2L2k4K6j5%kNnkL0l4Oj7O8m0K4j7pRmRpLk0J2m7M5J5m0
$$ 10 -42 13 -18 -8 -10 -19 -33 -21 11 -13 13 -2 -2 -4 1 -4 -6 24 -10 -4 -21 47 7 31 14 7 16 12 21 14 17 -3 9 -38 7 22 -18
2654a8J2Kj8J6lrK7j5lL0Lj1k8NlQk0O2m4kK5k3j7M6l8jJ9K0lok1K1k3%J2J2K2
$$ -18 -6 -4 -22 -6 -9 -18 9 -6 -9 21 24 13 -15 -10 -13 -5 -25 37 -7 -9 16 -7 -24 22 -16 -17 2 22 19 13 -8 13 -10 -10 2 14 36
2691C6n5L8oJk1mK8%Jk2J1j0k2K9J8j8%%k8K1J5j8JlpJ4k8K3j8J3Lj6K1k9rJ2
$$ 36 -19 19 13 14 -7 -11 17 17 18 -4 7 -3 -25 4 22 4 4 4 -24 -3 12 -6 -5 -8 -15 -1 -29 -6 -24 -11 -8 -24 -3 -32 -41 -29
2727b9K3j4L6l4J1MLPj0K6nj2K3k6j5K1K8J0m4Qlj4J7j1K2Kk6J9lLrqL0k8Qj0
$$ -29 -6 -20 16 -18 -7 -3 0 7 -3 23 18 6 29 3 -12 9 37 47 3 11 8 -6 11 0 22 24 -2 17 14 17 8 0 30 2 10 0
2763@K8j4j0K7k6J7m2J2qJ0J0k4MMNk1J0j0J3K6n1M6j9NkPK4k1RRl3lK5j1J7L
$$ 0 28 14 4 31 5 22 -20 -8 -16 -6 4 -20 -16 -12 -7 -28 -18 -28 -15 11 -40 6 -13 -8 -10 -3 21 0 9 18 -15 -18 7 -4 13 16
2799A6OOm0KJ8L0KJ6o4J3K3j7R%nJ0k4j2M2m8M5k3mRJ8l6KlJ9k9j2J9J0k3jK2
$$ 16 22 28 -12 -10 8 38 40 56 -8 5 28 11 20 20 15 25 1 -11 31 -17 28 5 1 10 28 -8 -6 -9 10 -19 -31 -12 -2 -25 -26 -4
2835dm1M2Lrj3j6PJ6jk4L4J1%j1j0KK7qk0L4k3K1k4L4k0kJ9qL7n8K1Jj%K2k9J6
$$ -4 -45 -3 0 -9 -22 -38 -31 -15 -16 -40 -6 5 5 -6 -16 -14 13 5 -15 19 -4 17 -7 27 7 5 24 16 53 -5 16 17 16 16 38 9 25
2872B5m2K9jMj9J6mLK7m1Lj1j8K6l4L1j8pKj2O1o0NL4j0l1J2J4LQj3lQJ6JrJ0
$$ 25 -17 12 11 15 -4 12 8 11 38 -3 0 -11 -29 -3 -37 -6 -24 -31 -29 -41 20 -40 -35 -1 -11 -42 -30 -16 -13 -5 -18 -21 -13 3 4 -5 5
2909EPrkLj2MjJ5KKj1J3j4J6Nl6O0m5rM0l0j6L4Nk4K8k1Pj4JJ2k5j5lL6j5nKJ4
$$ 5 12 3 1 4 -8 -4 -5 10 12 14 3 16 2 18 23 -13 47 2 -7 33 3 -13 21 26 2 30 9 16 2 3 15 -10 -25 -28 8 -7 -12 -10 4
2948DJ4l0j2K1j7J6MJ1l6kjK0j2J4k5K2mM0n0oN3mk1L3k0J4k2j4J1M1j4l2J5j9
$$ 4 18 -12 -24 -3 -20 -4 0 11 -25 -27 -28 -8 -20 -6 -31 -9 -13 27 -23 -29 24 20 -1 32 12 26 4 -10 1 42 28 -4 11 -8
2982hJ1J5k0J6Mj7k6M2j5j2J9pLk9jJ2J3%J0l6L1Pj4Ml3oM2%pl3L4%mnkqM0j4
$$ -8 3 18 -2 14 18 1 -25 17 2 -10 9 2 5 -24 -25 -13 0 0 10 -26 5 12 -2 2 -31 -37 5 5 -2 -35 -1 -1 -5 -10 -12 -20 20 6
3020Fk9L0j3j7L8k5J6j5J2m2P0j2j2J0K6k9K1j0J0j8j0J0qJ1k0kMqJ1Km8N1J4
$$ 6 -23 7 -6 -23 15 -10 6 -9 3 -39 31 19 7 17 43 14 35 25 35 17 7 17 9 20 0 -2 2 -6 5 7 -41 10 24
3053B4l2Qj1J2k7L7j9ljK2m5K7k2J7omJ4k0K4k1MK4j8k1N7j9l2K4J8k9K2J7j6
$$ 24 -8 0 -11 1 -26 11 -8 -11 -12 10 -35 -8 -30 -13 -19 -23 -9 -29 -5 -26 -22 2 -16 -37 20 1 -31 -7 11 -18 4 21 5
3086Ej7J1M1m5L2j1jnJ0Rj1k7J8Jj4L2k3J5j5M0m4rJ6%j1kk4K4j7J1Lj3PpJ5N
$$ 5 -12 -1 40 -5 27 16 15 10 20 29 18 -9 9 10 -4 28 5 20 5 45 1 -8 8 8 -3 -5 -29 -5 -22 -11 -8 -21 -14 -21 -6 -1
3122ajj6j5L0Jj5qj3M6lj5j9K1qJ2pkL0j4L1m2L9jm8L0k1L4k3Oj4POJ8j4lPqJ1
$$ -1 -2 -18 -33 -3 -2 -17 -25 -38 8 5 -10 -29 -8 -16 -4 -11 -13 17 3 34 -8 31 30 -18 12 -9 25 2 8 -6 1 7 25 11 8 15 7 18
3160A8j1oRJ7j1j1j8mK0j5K7l9LnL0k4jOQj4nK5j0k1L2j6M3j8l9rK9mmlML4k7
$$ 18 7 1 10 27 16 5 -13 -17 3 -12 15 -24 -21 -26 4 -20 -21 -15 -7 -21 -26 -1 -11 -32 0 -16 27 9 -30 -39 -10 -14 -18 -21 -17 17 -10
3197a0K6j6K0j8mj6J5J4Mj6K7Qm3J4K4kLqkj2J5m1L9l2J4k0K4pOJ0l3L1k0mmR
$$ -10 16 0 20 2 -2 -18 -3 11 15 -1 26 34 -9 5 29 27 30 22 20 8 23 -18 21 -11 3 -17 7 0 6 16 -17 14 -6 -10 -14 -5
3233eJ9j3j0NK3k7k3K4j9J9jpk0J4K0lj1J4K4k5k1J2J1J2j9k5N2k5J5jmJ0kJ9
$$ -5 14 1 -9 -4 19 -8 -31 -7 -26 -7 -8 -15 -35 -21 -1 -4 -15 -1 23 -2 -23 -11 0 12 -7 -32 20 -5 10 9 5 15 13 32
3267C2j9Pj3%J9j4moJ1%j3j6N3n9L5mPl1L9l0jlk4K3J3Ol0K3k0L4k3J4Qpjm2L2
$$ 32 13 20 7 7 26 12 8 2 13 13 0 -16 37 -22 13 9 16 -15 24 -6 -7 -10 -34 -11 2 8 -22 1 -19 15 -8 6 14 7 6 -36 -4
3304dpj3L7j8J7l2L5l4K4J1j4Ok0K7m5M8jk0ROj1Jk5K8J1%l3L5j7jJ3j3K1n0M9
$$ -4 -11 -24 13 -5 12 -20 15 -19 5 16 2 8 -12 15 -30 18 17 -3 6 12 1 2 -23 5 16 16 -17 18 1 0 13 0 21 -29 20
3339B0l4rkOK4Qj0qJ2rk0nj3N1Jj4kK9k7nJ2pkjlqK4j0k1J9Qj8K9qMPj4k0K2J
$$ 20 -14 -23 -25 -19 5 13 3 -5 7 -2 -22 -27 -40 11 12 -2 -4 25 -2 -7 5 -2 -4 -5 -8 -16 8 -2 -23 -4 4 -14 15 7 11 18 4 -16 6 7
3379Gk7K7J7k6k5K8l6K8jRpRk0L3k2J2nJ1L0m1J2nmj7LJ8j2j4OK7rj6Ql6K5K1
$$ 7 -20 7 24 -2 -27 1 -35 -7 -8 1 -6 3 -17 16 -6 6 1 12 42 1 13 8 4 -13 -10 8 -4 -18 -12 15 6 -10 -2 -38 -13 8
3415Hj0K8m4%rK9jk3Lj0K5j9M3k2jKKJ0k2j2L2L5l1j6K6n0K4rJ6JNqK6k9j7K7
$$ 8 -2 26 -18 -18 -27 2 1 -22 -19 -29 -4 -23 20 -2 -3 -1 1 11 -11 -23 9 44 13 -3 23 -27 -3 -12 4 5 10 2 28 -1 -18 9
3451Ij6J9k6J8rJJ2k0L3mj5kK0j6Kj1K8k8J6k1KJ4qJ6lj6JLJ8k7K7l2J8J6k6M
$$ 9 -7 12 -14 4 -5 -4 8 -12 21 17 2 0 20 4 6 -5 23 -5 11 -10 -8 6 -2 14 11 -5 -4 -1 17 -10 17 -15 3 19 -7 -3
3487cnm5N6j3k6K8QL2m3QJ2rJ1lPj9oJ4oJ8k6J9oJ8k1J0LOMk8J9l2M0j4mK7l2
$$ -3 -8 -53 3 -10 -36 -8 0 32 -11 -3 9 0 11 8 15 -4 -10 4 -2 16 -10 9 3 21 0 10 13 19 23 -5 14 -18 22 8 4 31 -1
3524amNJ2l4J7J9k1mKk0M0j3J4r%qK6j2j8L9l7J2nQj3Nl1L4j5J0j9K6J6K8m1j6
$$ -1 -5 0 12 -22 -5 14 -7 -11 -9 -29 11 -2 12 3 3 -5 21 9 -9 30 -7 5 0 8 -5 0 -31 3 -12 -2 -21 5 21 49 8 -8
3560hJ3J7qk6J9l4M9j9OnPJ5Lj9Kk6J0jjlJ2PL1pll6K6Jj2lj4J0LmJ0j0Kjj7k
$$ -8 5 22 14 -12 7 -27 22 3 9 4 11 26 29 10 12 -14 -4 -5 -6 -9 3 10 41 34 31 -5 21 22 10 7 -7 3 6 2 12 2 4 3 -14 -16
3600a6J6J5l0K0Lj2J2J%%j1k4J5oK9jj1lrJ2K3n0K9j5J1J6J1ql7J2L1j5L3k9j9
$$ -16 0 15 -15 5 8 -4 8 9 9 9 -2 -26 -11 -17 12 11 0 -3 -12 0 23 -27 2 -13 -2 14 25 17 -20 -8 23 8 41 12 -7
3635gL8k0Rj7nJ9%jj8QJ1j7j8K6l2Mj0O2n3L6l2KnK0Lk3L6m3K5jL6o3K0L0k7P
$$ -7 31 11 20 3 -2 17 17 16 -2 6 17 0 -18 8 -24 -20 -30 32 -21 15 -17 -15 -20 0 3 -20 16 -27 -2 -3 33 -30 -10 20 -7 0
3671@k7J8K0k6MM1n7N0jj8J8l9L4k9J4pK2lKm0K0J1k2K9Rl7L1pmJ2l6K3J0j2N
$$ 0 -27 -9 11 -15 -11 30 -27 23 22 4 22 -17 17 -12 2 -5 17 14 16 -24 -4 7 -15 14 23 -14 17 10 6 18 -18 5 15 3 8
3706HPk9K9k5J4j2J1Rj6n%k0NN1n0J6n%jJ7j1QRk0jK1qKj8K6j3j3QK1mMlJ5rK3
$$ 8 15 -14 15 -10 4 -8 3 12 -4 -9 -9 -29 -24 27 -23 -7 -12 -12 -13 4 -7 1 10 -10 -11 10 2 4 -14 12 -1 -14 -6 15 11 15 12 27 18 41
3746D1n1MPj8K9j0jK3mk0lK5J0j7j3J8Kl8L5k2JK1k6K3l5PJ1j6L3m6pL2lmk6Q
$$ 41 -10 -6 1 -17 12 2 1 24 20 0 -3 22 32 15 2 20 22 -16 19 -3 -2 19 -7 16 -19 -12 -1 -17 16 -30 -37 -5 -8 -12 -38 -30
3782c0K3j6K2Ok2NJ7j0j1J8Pj6K4j9oL0j8J8j9J7k7kL1Kk7J5k2J4j1K7l1J5J7
$$ -30 -7 -23 -1 5 -17 -12 5 -5 -16 2 9 -7 17 -2 -8 22 4 22 3 20 -7 -9 22 24 -3 12 -10 4 -7 20 -11 4 21
3815B1jk2lNj2K9l3M8k3k0J1m2K7L6l6J8LJ3k1j6L3ok5L5j5j1qLjj1J0K6n3J1
$$ 21 20 -2 -5 0 -12 17 -16 32 9 -11 0 -42 -15 21 -15 3 6 19 -2 -18 15 9 -16 19 4 -7 -15 -12 -13 -24 -14 12 -41 -30
3849c0L8lj9J6j8K0K2k5Pk1K7%%j1l6L4K7j4k2PJ0K4l6jK4k2J2j1J8J3k7l%Mj9
$$ -30 8 5 -14 2 -16 4 26 1 8 -13 14 14 14 3 -33 1 28 14 -8 -1 9 33 -3 -4 20 -2 10 -1 17 30 3 0 0 4 -15
3884a5J2K3j1k1j9L2j8k1M3Qk2l9L9J7lk3K3rmj6K6l2K7K4kn0M2k4rM3j7%KJ6
$$ -15 -3 20 9 -12 -31 1 -17 -38 5 13 -9 -48 -9 8 5 -18 5 -4 -8 -24 2 -30 -3 21 19 -31 11 -13 -22 21 4 4 6 22
3918B2k6J9Rj0J7k7K3j0j5k2M6k7l0N2jqj4L1l8qK2Rj5QQnj9j9J2K0ojkpQj6J5
$$ 22 -4 15 24 14 31 4 27 17 2 -20 26 -1 -31 21 20 12 -2 29 -9 -17 5 14 -1 7 15 10 -9 -28 -16 4 -2 -3 -5 -12 -4 -20 -5
3955eL0p3O8m2%L2j5j7j8N1Kmj9j0J1J0nK5j2j1L8j4k4J0K7pk4qK1j3MMJ7J1j2
$$ -5 25 -48 20 -22 -22 10 -5 -22 -40 11 13 9 -10 -20 -9 1 -4 21 9 -2 36 22 -2 8 35 28 4 -4 17 4 8 12 29 40 28
3990B8p%j0J9k0j2J4J5l2J2k8KL6m7J0N4m2LJ0lj5J9loKPnOK7m1J8k6J4mknJ8
$$ 28 21 21 11 30 10 -2 12 27 -5 7 -21 -19 17 -30 -20 34 -8 -5 5 2 -13 6 3 -3 -1 6 1 7 34 -7 11 -15 -1 -5 -7 -12 6
4027FKm1N7l4K3j9K7j7oK2lM6l9K2k6j2LPj0Lk4J1k1K6j0J4j8OJ6m9L3J5J7k2
$$ 6 8 -33 24 -10 13 -6 21 4 -2 20 17 63 24 46 20 8 11 18 8 11 -13 -2 -23 3 -7 7 -11 -5 11 -38 -5 10 27 5
4061EOk8K3lj4J5%k2J9Pj8%nJ6qj6J1j4J7nJ1MJ4ORm8L3k0K3j2LrkJ3qK5k6J0
$$ 5 11 -17 6 3 -11 4 4 -18 1 8 -10 -10 -15 1 -7 -23 -12 -26 -9 -14 -3 1 15 21 30 -18 15 -5 18 6 9 0 -2 11 3 28 2 12
4099A2PJ1qmmNJ0rKj9J9k4J0prJ6k9J6J0k4J2nJ3k4NJ3l9K9K9l0j6L0l0J2PpK6
$$ 12 19 30 22 18 14 19 29 20 22 3 22 -2 8 1 -8 8 -21 -5 5 -19 -7 -12 1 -23 -18 -5 -44 -15 14 -16 -32 -2 -32 -20 -13 -20 6
4136FJ2k7MJ2m6RL0NLOJ6k7L0l4j9K9J9l2K4%l6M8k0L7k6LNj7rMJj9MLPKnMjK0
$$ 6 18 -9 -5 7 -39 -30 0 5 8 14 30 3 33 -1 -20 9 28 -4 20 20 -16 32 12 49 23 26 31 14 5 9 10 -9 -5 -2 5 7 2 6 5 25
4176B5j3J9l6j7NL3k0k0L3k7OJ0j6ONOJ2k1K9k7K1Pm9M5JLjk9K5j3PL4l0jJnj6
$$ 25 12 31 -5 -22 -17 16 -4 -24 9 -18 -12 -2 -18 -12 -7 -1 11 -10 19 -8 13 20 -29 16 17 20 19 -10 15 2 9 43 13 12 13 8 -8
4213hK8l5j7O5j1j3M8o2j9K9J8j1NJ3m3L2%k6qRrL2j6j9K0j1qjK0j5J5J3j0k3
$$ -8 20 -15 -32 33 22 9 57 -5 -24 5 23 12 17 30 -13 19 19 -7 -15 -6 -15 17 1 -18 2 -9 -17 -18 2 -13 2 15 5 -18
4247a8K2j9K3jj1oK0ooRK1l2J3j3Rk1j4M5l2N6k6j3J8%ok7M6jl1K2k2%lL0m9K2
$$ -18 4 -15 8 7 -4 -10 10 4 -2 7 28 -4 9 -4 5 -16 -30 15 -17 39 13 0 18 18 12 -15 31 30 -1 21 -1 -1 -4 26 -23 -1
4283aJ2n2L0KJ2Ll1KJ8JJ9nj0J5k3Mj9L9kj6ml6KL9oPl1K0jl5O0Kk2NJ9J9l1j6
$$ -1 11 -41 -11 -9 3 6 -25 -23 -5 -4 15 10 0 15 -8 -4 -23 16 14 -2 -6 -42 -40 -1 -7 0 -31 -11 -12 -47 13 15 -7 -2 17 36 5 -11
4321a1KL0l2M5l2l2N7k6NkQJ5k9ROLkp%m0J3N2j5k2%QJ9k0rnMk9L0LPnRn3L5J
$$ -11 -9 21 -11 34 2 -30 27 1 6 4 12 27 -2 7 13 16 14 7 7 -33 -20 32 17 -5 -5 3 22 2 -7 -12 -8 -37 -7 -4 3 -2 7 -46 -11 -10
4361a0K0j1lOJ4k7L1j2l4K8k2jJ8jK0J4l3k3J0J6J1J7j7k4K7%jk2J3J8j4L4n9
$$ -10 10 -1 -4 2 16 -11 20 8 -26 2 -20 -21 -3 -4 16 30 -3 -26 -16 0 11 28 11 -13 14 14 13 -9 4 22 8 42 -17
4394a7J2M9l5M1m6j4K9rl6K2oM0j5k3J6m0L5mK1pPl1J1Mljj6j9M4k5J9Jk4mLP
$$ -17 -5 44 9 50 4 -10 19 10 -26 -4 -10 30 15 -8 8 -32 3 -1 20 13 20 -11 0 4 1 0 -16 -35 9 -16 3 4 -20 -24 -21 -14
4430a4Pk3J8Nj6K2j5RlKL6Lj7jK0l1j2kL1k0L2m2LL4n0L7J1j8rK8jn3K5M3n6K2
$$ -14 -7 -30 -12 -7 -23 -1 -16 -7 -10 -8 28 31 14 13 33 2 -10 -12 19 -1 31 -11 -8 26 -24 13 24 6 -3 25 24 -29 -4 39 -17 5
4466Ej1p%J3LJ2%j5nOjk0QnLj5RmK2Lj3NK6k3pkOJ0k2L1m0L5K0K7m2j4L5k0oN
$$ 5 -6 -13 -13 0 3 15 15 0 -5 1 0 -20 -12 -17 -14 -29 -20 -24 -2 1 -12 -7 19 -4 -11 -13 -7 3 -19 12 -28 7 27 54 12 -2 33 13 7 12
4506A2Nk3J1l3J2J3PK0Ql0j8M3l1L0l8PPj2LJ0Rk6J2PJj6Rj9J7J2NJ3j0j0k4L2
$$ 12 17 -6 5 -28 -16 -3 4 24 32 2 -16 27 -4 26 -12 -5 2 -10 -7 3 12 -14 -2 5 6 -10 -1 -20 -3 9 14 27 17 7 -17 15
4542A5k9OJ4j4J8k7Rj5J3L4k9J4k0J8KJ6rm2N7n4K0lJrJ3KJ1j8J9k5K1k2L7j5
$$ 15 -14 -8 6 -8 10 -17 -8 -23 -10 24 -5 9 -11 7 9 25 16 -26 31 -23 -3 -6 -5 -14 -1 1 12 -6 13 -12 9 -13 24 9
4576Ik0J8j7JoM3n6L9pl5QJ5J0k5J3pJ5NJ4k7NOj6J0mk3L0qj1N0k0k6J2j6QrJ6
$$ 9 -11 7 -10 -9 -15 28 -28 11 4 -31 -23 -8 2 -23 -10 -17 -2 3 17 -10 -5 1 -15 -5 -9 -32 -2 -10 -21 29 9 -17 -5 -21 -13 -22 -6
4613fJ0K7m5J4pK3J2l6%KOKj6K9ol5K8j5L2JrpJ9lk7J3oQK0m3K5k0J7k3J9j8L6
$$ -6 4 31 -14 0 -7 16 28 -8 -8 -6 0 2 -14 15 9 -26 2 -13 19 20 11 4 23 20 -7 6 0 8 28 -15 10 -10 7 -16 3 -15 21
4650B1J3j2Mm2J4j4L5j4k6kK5LJ9n0lJ2M2k3K4Pn4K8m2M4ML1k4n0K5OK5j8Qj5
$$ 21 34 22 26 -16 -2 -16 19 5 -21 -23 2 5 24 -26 -29 -17 25 2 26 33 -21 7 -35 9 13 44 20 -30 -5 1 26 8 16 1
4684Aj0rN1l5K4%j8k6K3L0j3j3J1j6j3K5K3m9J5j1L6k8J3l5LK8j5PmK5k7j5M0
$$ 1 -9 -18 33 -2 22 22 4 -22 1 31 18 5 16 0 -13 12 35 -14 1 -10 26 -2 11 -24 -21 7 -8 -1 -5 20 -7 -22 18
4717A8J2n3J2PLqJ8j3l4O3k7Kmj7M8Lk0lK4k0nJoJ7Pj1ooQpK7n4L6J4j3nqQOq
$$ 18 30 -23 -11 -4 -1 -9 9 -4 -38 25 -2 0 -4 -21 27 30 10 7 31 11 6 7 1 18 25 14 8 2 10 3 30 -24 12 26 13 8 0 8 14 6
4757Fl0L2K2j6o1O8o9N6Jrk5J2J3j0jJ0j9K3LLJ5l9K2n7J6K1PnpOKrN1m8J5MJ9
$$ 6 -24 8 30 14 -47 21 -48 8 9 0 -25 -13 0 -10 -11 -1 -20 3 6 9 24 -15 7 -50 -34 -13 -6 -11 -18 -12 -10 -19 32 -16 -1 3 22
4794B2j5l2L8k0L5l4L1k4l6N6k9j3K3lK0lj5NJ7rK9n8J6j1nj1L9k8PJ5LJ3j0j3
$$ 22 7 -25 13 -7 28 -6 25 1 -35 21 -8 -21 2 -1 19 16 1 6 23 14 43 -15 1 -10 -15 -26 13 -15 -8 7 10 23 13 0
4828@m4P5Jm4NJ1j2k2J8Qj2j5L8j9lJ0j7K8LJ0k3j9j6K6K5j3Rm4M7j9j6K7Mj9
$$ 0 -44 31 32 -12 -7 4 -8 -30 -12 -4 -16 -31 7 -12 -15 -5 -22 6 9 19 -4 -23 -39 -13 12 -1 8 -36 11 -8 -24 3 7 -12
4862a2RK9kKol3k6N1J0k9J9k%J3nK0m3pQj8J6Pj0mQqN5l9kl1J0MJ2J7m2J6mMk0
$$ -12 -3 26 24 26 20 -13 -39 12 22 -7 12 10 10 23 18 38 -5 -12 -4 -22 -6 1 -9 -13 -5 -13 42 3 1 -30 -20 -16 -4 13 -29 -13 -17 -13 -33
4901c3J4L9k7J0k3K7l3K1M%NRj9J9j9k6K9Jl5M5Lj1O%K0k0J0r%Rl3J9j1K8k2Q
$$ -33 -19 20 -7 3 -20 7 -26 -5 -1 -1 4 13 -6 13 -6 -32 -3 -2 -37 8 11 0 6 6 26 6 16 7 7 16 -17 2 -9 19 -3 5
4937EJ8j3j1Rl1L6nl0J3KnJ5lnJ1k1RLoKK5J0l6J9rj0qN2n5K0k4J0L9k9J4pJ1
$$ 5 23 10 -1 8 -23 13 8 -22 -9 -7 -12 3 0 -5 6 -15 -6 -3 -9 -7 18 28 -8 11 2 -8 -16 36 -19 1 -23 -13 26 -3 11 4 15
4974A5j5Kj9PJ3MKj3J4Qj8J8j0pmJK5j0j2l5M9K0j1l1j3L7k8Pj3J3J2oj7J9k7
$$ 15 0 2 -17 -10 3 7 9 -4 10 18 0 18 8 1 -3 -2 23 13 1 -34 15 35 24 -7 -20 17 -11 -4 -17 -4 8 2 -15 4 -23
5009b3K2j3L4k7j8L5k1j5NL3j7prK2pj2kJ2Pj3K6j6Mj0L3j9L0j0k6J2OrLQl2J1
$$ -23 -1 -14 20 -7 -25 10 -11 -26 -21 12 -5 -12 -21 1 -6 -18 -20 -8 -1 -14 12 -4 0 -10 23 4 34 24 -2 10 16 7 10 18 -14 -3
5045cj0M8rJm7K9JJ5k4MJ0l6L6Rj7NLj6K7n7L5L2l2J0lplrqj4PJ5JkjJ6j4LJ4
$$ -3 -13 35 26 27 -20 9 10 25 1 5 15 -21 15 24 7 12 15 -1 26 -31 4 36 4 14 11 4 1 -8 -16 -30 -23 -8 -7 -9 -10 6 -8 -5 9
5084Ik0L3k8lmL0k4jJ7QRj4j3lJ9K6j6j9J0qPpjJ0j8J2j3%j7J7QJ0k1kJ8nnPm
$$ 9 -11 22 -6 -9 -13 17 -7 -8 9 17 26 12 -1 -4 15 41 25 6 16 8 15 8 7 17 -1 11 -2 -2 -19 -2 6 16 -5 -7 11 6 1 8 4
5123Dj7QjkJ1J0k4K1lm4K2Rk8J3RJ5j0K3j5mk7L5l5M5l3PKJ5QJ1pKjk4N0j5kl7
$$ 4 -13 -5 -6 -8 3 13 -11 10 7 -37 -15 -6 -34 -21 -12 3 -7 16 1 -3 -30 5 -30 15 -18 -11 -9 6 14 25 18 20 19 -5 45 30 28 -9
5161iL0Jl5oK3Pj5J4rK3k0oJ2J3l7K0k3K4rl4NmL7k1%OKj0oL1l1j7O3k8J9pj6
$$ -9 21 22 -13 -19 4 11 -4 10 1 24 4 -2 10 23 -14 6 -17 7 -2 -36 -31 -35 2 -19 -19 -13 -11 -21 -27 4 -27 -44 19 -9 10 3 -13
5198a3J9Rok2J4Rj0Nl4K2rpM1ojjNk0L3l4K6KMRnk4j8j6O3l2MPk1RJ5m1K2Ol5
$$ -13 6 15 9 -13 1 10 0 5 -29 -7 -16 -23 18 12 11 10 15 -5 28 -6 20 22 26 35 30 6 -12 -28 35 3 7 14 -7 2 17 -24 -2 4 -31
5237c1M9Mn0LOQNk9K1k5M9j3%qJ6Lj2L9m9oK0j2Q%K1n4M7j2qJ7K3j1j0K7j5J2
$$ -31 18 22 -28 -25 -19 -11 -6 -35 -14 -39 10 -3 -3 -11 5 8 -4 35 -14 -20 0 -12 -4 -4 17 -37 10 -2 -10 7 30 19 9 36 21 33
5273C3k7K5j9k%mnK6k9Lj6MOJ6rk6K6k0RJ5j1j6K7k8lJ6JK8l8K1lOnj1j7JK2m
$$ 33 6 31 12 10 10 6 1 27 -2 1 -15 -11 -5 11 2 -24 2 -18 -9 6 -5 -21 6 -22 -25 -9 -8 20 -18 3 0 6 1 -10 -27 -26 -4 -8
5311hK6l0K3k4PlK4qJ0j7K2lroK1j7%k1K2pL2k2K0k2J5rOj6mK4m2M2Pom1M2k7
$$ -8 18 -12 11 -13 -6 -9 15 7 17 0 22 19 10 4 25 8 8 -13 9 2 34 12 32 10 25 16 22 6 2 26 -16 26 33 27 -14 28 1
5348Ak6J9k0OK2j8J2rlJ0rjQoQmjJKPjqkOlJ1L2l3j3pJ3LQnOmrK5j0j7K0j9L1
$$ 1 -25 -6 -26 -20 2 -16 -4 -13 -16 -6 -15 -16 -8 -14 -6 -10 -11 -10 -8 -1 -2 -10 -12 -6 -9 2 34 1 -12 -19 -6 -3 5 0 6 2 -7 18 8 -9 11 -8 23
5391B3j3k7N5j7k5NOj6QKJ5nK7j5n7K5jK9pn%J1k1l1K4pqJ1kOlOj2NkJ5oK5k0
$$ 23 10 -17 38 21 -4 1 7 -9 -1 1 16 11 38 23 -34 -9 -10 19 12 7 7 18 -3 -34 -10 -17 -25 -14 -16 -10 -13 -7 -19 -14 -16 -1 -7 18 -2
5430bKrL1j6J3ql7K9omK2kknMQj3J8j7L4m3J9oJ1J4l2K3Jj1J7l2kJ7lrJL8l6j8
$$ -2 0 -9 22 6 19 11 -26 3 -3 -7 15 13 11 6 10 18 5 23 6 40 -3 16 10 21 35 3 26 27 16 33 1 -1 16 13 4 5 43 7 -11
5469a1jnJ8J2Nm7J3L0kk1K0n4N4j4j3L1j5j4N4n9K1k6QK3J5j1oJ6j0j7Rj6Q%M5
$$ -11 -12 -17 1 13 18 -29 -16 14 12 -9 11 -43 11 -3 -16 15 0 -14 40 -19 2 -24 -16 7 22 11 5 21 11 -6 3 -13 -5 -5 40
5504D0j3J4pl5J2j9K4k1j4LM6l5K4j6k0K5k5J7j0J4K6l4j9L9l1j9L9mlJ4k1jK2
$$ 40 27 41 34 -1 11 -8 16 -5 -19 -16 30 -5 19 3 -17 8 -17 0 -10 4 30 -4 -23 16 -15 -34 5 1 -2 12 -9 -10 12
5537A2pj2OPmJ4k8NJ1m5J2K1K9k3j4rL3Mj0Qk5K0pJ5qJ4l2L1mj1K6J1kpl5%pN
$$ 12 5 -7 -1 6 2 16 -12 -7 4 -41 -29 -8 21 -2 -16 -25 8 12 2 10 -15 5 -2 13 5 19 -13 18 14 3 29 40 38 31 -4 -4 -11 -6
5575fJ4J6l0njK0K0m1K6J1k7J2qqPk7M3Mk1Rj7L5n2K3Ml6M4l6J1J5L1m6oQJ8J7
$$ -6 8 24 -6 -11 -12 8 28 -13 13 24 -3 9 1 -7 0 -27 16 20 -1 8 -9 26 -26 -3 1 -35 9 -27 -16 -1 30 -16 -22 -14 4 21
5611B1o0K0K8lrmj6JK6nqqQkK4l4QML5j7K8l1Nrj%kj0j1nK2lL5k6Jm1M2K3l0l2
$$ 21 -39 -19 9 6 -3 -7 -23 -22 4 -1 -9 -17 -9 -11 13 -21 -13 -9 26 9 37 6 11 2 1 1 -1 -11 -22 -27 -5 -8 27 1 2 -39 3 26 -4 -36
5651c6N3n7J2K9j7pP%J4K5k2J2j4m0K5K4Jmk6K4KjK7n1L3l4K4Qk2J9Opq%MJ5p
$$ -36 17 -40 -28 1 -16 -23 -16 -16 -2 23 1 13 -1 -41 -16 8 9 5 -21 3 5 4 31 -20 13 -21 3 11 -11 8 14 7 -1 -1 3 18 11
5688A1LJpj5OK0k3J4K8l7J4J8m7K9j0k1oJ2nJ2j8J2J0k9M0J1m1L1Pk1l7L7k9K8
$$ 11 14 15 8 -7 -1 19 -4 10 38 1 15 33 -14 15 5 -16 -22 -10 -15 -3 -21 -9 1 -28 12 23 -18 13 20 -1 -38 -1 -30 -2
5722bl9L6Qk7K2J4j7pNlJ2oPM1o2K5J1m2J2K0K3lomj8J7Jj4j8MK5j2kj8J8mJ1
$$ -2 -41 -5 3 -24 -2 12 -5 -12 -7 -10 2 -4 3 44 -18 7 18 -24 -12 8 31 28 22 18 0 17 18 4 -14 -10 15 3 1 -17 1 -3 8
5759Hj9OPoJ5k8K2Jk9L4k0OOk7LJ6OK%k7L9m4J6J1%Kk2KKJ7K8j4k3L5n5N3m6L6
$$ 8 -11 -5 2 -4 11 -17 5 6 -23 11 -9 -3 3 -24 -21 -5 1 3 3 -24 15 -29 -13 -2 -2 0 -22 -20 -18 -1 27 13 -10 25 -30 23 -23 13
5797A3j8J2J1j0l4L8l0M1qj4K6k8L6l9MJ4lm2J6K0Nm3P3o8L6j3Ok9L7j4lj0K0
$$ 13 -5 7 18 8 -26 12 -18 23 15 1 27 -1 35 -4 0 14 11 -31 -15 5 10 -33 40 -28 8 -5 1 -28 9 -5 -8 -18 2
5830BqKj9J8J3Lk8j5RJ6k1M9m8L8mKPj8JNj0J0j6J6Qk4J3KJj0L5o0N3j4%L1n7
$$ 2 -6 -4 -23 -5 8 11 -17 -32 -23 -7 -28 21 -27 11 7 9 16 -2 -1 4 -6 4 -12 4 12 -12 1 3 4 -6 29 -31 22 8 8 39 -18
5867a8N1j0j9Kj7K4j2LK1j8LMj4l2N9m7RnK6k2j8L5lnjLLpOOrnl3K9KK1j1k6P
$$ -18 33 23 4 6 -11 13 1 4 25 7 10 14 0 -32 27 -20 -11 -16 10 -12 -30 5 2 -3 -4 -1 2 -5 1 7 -2 -7 -40 -11 -9 12 1 -25 -18
5906a8J3KJ5j3nJ4k4M9j9j5j0J1K0m1L9prJ5oJjpj4K7j6jK2j3mj3MJ4j0j9K9m
$$ -18 -5 -3 12 -1 -6 8 -16 33 14 -1 -11 0 20 -21 18 11 2 17 11 12 11 4 -10 17 1 0 22 9 5 -8 -4 10 0 -19 10 6
5942FJMj5Ql9K8J1k3M6n3%M4j4mk3Ljj0L2j3KkNK4Pk7J4oMj9J2JJ8j3l5J6J8J3
$$ 6 7 11 -4 4 -35 -7 4 -19 27 -26 -26 18 4 0 -23 -20 -21 -31 1 -12 -10 -12 -7 17 24 -3 11 5 9 -10 2 3 21 8 -27 -11 7 20
5980B0k1J6lJ4lj2j3NrJ2j4J5L0qk1%j3kL2j3lL0m3LJ3Mk5nJ2J6k2%K3n1J5K8
$$ 20 -1 15 12 26 23 11 -2 3 -6 6 -8 7 37 29 8 8 -5 -7 25 12 9 39 -4 -1 12 16 -9 -14 -2 14 -8 -8 15 -36 -21 7
6016Gk6K4kj7J8QQk4J5j8J6l0J5qK5pNJ3oj4Mj2lOJ8j8k1O1m9JK2m6L2RnNpmp
$$ 7 -19 5 3 -14 4 12 20 -4 11 -7 9 -21 -6 -14 11 4 9 22 16 2 6 -6 -9 -3 15 -3 -24 37 -12 -11 11 -35 -3 6 1 6 -1 -5 -12
6055a2M8l1OJj0k9K7Lj0pklM4k6nj3K2o%Qj3qrQK7k3J0j2l3N1rj7K2j4L2pMRJ
$$ -12 36 5 11 12 2 -27 0 3 -7 -14 -16 -19 25 -1 -6 -19 3 -3 -3 5 -8 -16 -25 -17 10 -13 -3 -15 -48 3 -6 -23 -1 -15 17 10 14 23 24
6094B4k0pK3pJ8l1QJ1oj6L4m7L5k3rL0J1Mqk7L9l4j2K4j8Lk8K7Rj9KL0l4J6j7
$$ 24 4 -3 20 13 31 0 8 19 13 -3 31 -16 19 -4 -13 17 28 32 24 -3 36 2 -10 14 -4 -1 -29 -2 7 -12 -10 20 -14 2 -15
6129a5Qqkj6PK2K2k6nJ7j3LJ1lLnK9j6J8m1OJ9oj7M6j8l3M3j1jRm1jL3j0J6L3
$$ -15 -7 -15 -17 -33 -26 -4 18 -8 -13 4 -9 -6 5 2 5 0 29 13 31 -10 -4 15 9 -8 38 20 -13 30 19 18 27 -14 -15 18 8 24 57
6166E7k8l0L3l1J6k6L5k8L2l5j5rJ5J1k8L8Jl5K2k2j2L0J9k6nqkO4l3rJ7j4J2
$$ 57 29 -1 32 1 17 -9 26 -2 30 -5 -20 -29 -14 -3 -31 7 8 -27 -5 -27 -39 -9 10 -16 -21 -29 -31 33 0 -9 8 -6 6
6199Fj4lJ3Oj8J0oJ1Jj2K6k5K3j7NK1j7Lj1NoJJ7J1l0K0J3nj6j2LJ1Mj6lj6L3
$$ 6 -8 -11 2 8 -10 0 -6 5 6 -6 20 -5 18 1 6 27 10 13 2 7 1 2 19 30 0 20 33 28 12 0 3 14 18 2 -1 -17 16
6236A6k0K0k3QlKNk5K0M7n6%K5k6QJ7j3jL7m1J6Nj5kj3MK0rj3J1nK9k2jKmkM3
$$ 16 -4 16 -7 1 -2 0 5 -20 0 47 -9 -9 16 -10 -2 15 2 1 38 -3 13 18 3 1 -12 -8 12 3 -10 1 -4 25 3 2 4 0 -2 41
6274D1l9OLk8L7j4k7N1l2J9jk1J1Mk8K5OJ1l7j3K2J8Pk9Pj0J9kOm1J6NJ3qQkj6
$$ 41 2 8 11 -17 20 6 -21 30 -2 17 16 -5 6 10 -18 7 13 24 -13 -26 -4 14 21 -8 -1 -11 8 6 12 -29 -13 -8 5 -3 5 3 -13
6311a3J0q%J4%Kmj0L4l9%OkJ7Lj1J5JN%Ql8L3j3kqQOk4OoJ6j3K9kq%J8l5j0nJ0
$$ -13 -3 -11 -11 3 3 5 1 -9 25 -14 -14 -8 -10 7 10 -1 14 15 20 20 28 -10 23 10 8 0 8 14 -10 -4 -10 6 -7 22 20 12 12 30 -5 -15 -20 -10
6353a0k5L1OkLJ2k6J3llJj0OJ8LOj6Nj8K0j3k0L5l9K6mlQ%pN3n0K9l7K1J0j9O
$$ -10 -35 -4 2 0 3 15 -11 2 -1 -4 -3 -13 -7 11 14 20 4 9 -9 11 -2 -22 13 -26 0 -4 -7 1 1 -6 47 -3 26 -11 10 20 1 7
6391GPj7J2J3l4K2J8j7PL5k3nk3K4k5k3K9Pk9L3j7j6Rj9J6J5PJ5k9kJ1K1n0jK6
$$ 7 14 -3 9 22 -12 10 28 11 18 53 30 25 2 26 1 -22 7 14 -15 18 1 -15 -6 -25 -9 6 13 28 -1 -3 8 29 -21 -22 4
6426Dk6K1kkJ1rKk0K9j9j2K6j2K9l4J4J0qJ9j9L3l6J5nkNQj4PjJ9mj5%l1J6nK3
$$ 4 -22 -1 -3 -5 6 -3 -1 -21 8 -11 -23 3 -9 20 -14 0 10 2 21 2 35 -1 14 9 7 12 20 6 13 12 31 27 12 12 -19 -3 -8 15
6464A5qK9k3J9Ol6k6K7j6J0k6pJ1kJ0J0J0ONpm8K7J4noJ5l3M9k7jK8j8Pk7J3k5
$$ 15 7 36 13 32 38 2 -24 3 -13 -3 -29 -36 -25 -27 -17 -7 3 9 14 7 -41 -14 0 -5 -11 4 -29 20 -7 -8 20 2 9 -18 -5 -30
6500c0J9J4PK4n1J2L2j8%kJ3k4K0%m1L9j7kJ0m0OJ5j1N6k4K0ooOrNrrnJ4l6M1
$$ -30 -11 3 10 34 -17 -5 27 9 9 7 20 -4 16 16 -25 14 -3 -5 5 -35 -29 -14 -25 31 7 27 21 15 21 12 17 8 -1 -6 8 -28 13
6537A3m3J8J7L3l3j5KKJ5j8J8l9K4J2Jl4L0K1prLJK7k5J3Q%l3J2j2K2j3kK5m7
$$ 13 -30 -12 5 38 5 -10 -8 -6 9 -9 9 -30 -6 6 7 -27 3 24 17 8 11 12 39 14 27 35 35 2 14 2 24 11 9 34 -13
6572a3%MJ7K2k8ljQkJ2k0K4l7K6j2k1M0n5K5lJ6rNLnQqlJ2knJ6k6K4lNl2RK4j1
$$ -13 -13 -9 8 30 2 -1 -2 6 4 16 -4 20 -17 9 -3 -24 16 -39 -14 -17 -1 -10 -5 -2 -7 1 -7 -10 2 0 -5 11 -15 9 6 11 -21 -12 12 1
6612AjmJL8Rm2J4j9OQJ3m8J0j3M9k6%J7k1%L5k2J4Qn0M4m5M9k6j9K3K6o6L5J5
$$ 1 0 -4 -3 35 44 2 16 -3 3 11 24 -24 -14 -27 22 -4 -4 13 -8 -8 27 5 19 27 -23 21 -24 25 -1 -20 3 29 -37 -2 13
6647A3l0J7KjpqmLLjLJ8l9L9l0J1nK0%%k8oL6qkL0oKm4L2J8j8j6k4L9j1LL2l1
$$ 13 -17 0 2 1 -6 -14 -18 -15 -12 -13 -10 8 -31 8 -22 -11 -16 4 4 4 -24 -30 6 -2 -4 26 20 22 -22 10 28 10 -6 -30 9 -2 1 33 2
6686BJ2J4l7L0l2K0k1LK1rJ%J4pj7K0J0k9pQj5K6k4J1j0J6k1K2L0pm2J1J4J2k6
$$ 2 14 28 -9 21 -11 9 -12 -9 12 3 4 4 18 11 -6 14 24 -5 -12 -4 -19 7 -17 -6 -16 0 -21 1 31 24 -18 -7 7 19 -7
6721gl0J9J8mj2n%L6ok1L9j2j0j3QJKomPJ3j4lj0L4mkj7J6l9M4j2j0L1j3Oj4o
$$ -7 -37 -18 0 -4 -16 -21 -21 15 9 -12 27 15 5 -8 0 1 3 -3 -7 0 13 -1 -4 -14 20 16 14 -3 13 -26 18 6 -4 27 14 20 6 0
6759@kj5L2k8J9MJ0m3JJ1rK3k1J4QOl0L5k1NpM2l9j3K7k1j0L3oj9K4Kj0l0L9k5
$$ 0 -2 -17 15 -13 6 10 20 -23 -22 -11 -20 3 -18 -4 4 10 -20 15 -6 -1 -8 34 -5 -18 9 -12 -22 11 5 -14 10 12 2 -28 11 -14
6795a4K6j7J2jqM2l2l9K6J5j4PL0qj1lPm5L3J5m1J3J7Kj3Lj4kK6j0j1OR%Om7L5
$$ -14 12 -5 7 6 -2 40 8 -31 -5 10 -4 3 33 25 14 11 18 -27 6 21 -20 -7 10 12 -1 2 -12 -14 12 2 -9 -3 6 6 12 -35 0
6832@Nl0K1oj9J6J1J7n1K4M5l8K8k9k3K7n1N0J7l3K0NJ0l0kJ7koK5j0LlK2jk3
$$ 0 5 -25 -4 -10 -29 -13 -2 15 -36 -12 33 -5 23 -6 -29 -2 -53 -3 14 -19 1 6 16 -14 -16 1 -1 -7 18 8 11 8 30 29 6
6867Fj2kK2J2l7J3Jok2K7J1lj4jK2k3K0j9Kk0K8j1K9j8kqK5k9K4j1k2LK1j2K2
$$ 6 -6 -8 14 26 -11 2 3 -3 -25 2 13 10 -4 -5 17 -6 14 -5 -3 -23 5 -6 23 5 3 -5 20 -9 15 4 -18 -15 6 -6 16
6902A6m3J5J8rKQLj4J9k7K0j0K8m4K4j4Kj7L6j2l1K3K0J0k5OJ4lm3K4J4j0J8k4
$$ 16 -27 -12 6 -3 -1 7 10 -4 15 -12 8 -2 26 -18 6 -8 -6 -23 13 1 -30 -7 13 23 -2 4 18 15 -28 -4 10 0 18 -6
6936fJ8j8QnKJ4l5N5j4j1j3J4rk0LK4%JpoMj3M1m1J4m7M3J1KrK4p%k0MmJ1j1%
$$ -6 12 -6 2 -3 -1 13 -22 33 19 8 -5 9 0 -20 -17 7 7 8 1 -5 -1 -14 27 -14 0 -47 -4 7 9 0 24 17 17 -3 1 -3 8 -3 -3
6975cj0J5j0%L0k1J0l0J7J7q%qlJ8J6k5NJ3l3J6jj0J5k5J8k2J1J8MJrl1J7LnJ7
$$ -3 -13 2 -8 -8 22 1 11 -19 -2 15 7 7 -1 -4 14 30 5 10 23 -10 6 5 -5 10 -15 3 -19 -8 10 14 15 6 -25 -8 -5 -10 7
7012GpNJ1Mj7j3K0Jm4L0ML1p%k2J0k1L0Lk7Qj7RK0nj3L8m8J6K8j5l2J0RK0j1K
$$ 7 0 5 16 20 3 -10 10 11 -33 -3 1 32 25 25 3 13 -8 22 25 -2 6 -11 -2 18 13 0 38 -10 6 34 19 -13 -3 6 26 15 17
7049A7pj9JJ4j0K8j0pJnj2lJL0mj7K1j8K7k8NrkJ5j8L9l9j7L3k0qJ0J5nj4K8l2
$$ 17 10 -9 -8 6 -4 24 14 7 8 3 -9 -12 -11 19 15 -2 19 1 28 0 5 -4 -6 9 -9 30 -9 -26 7 -13 -21 -11 4 -1 -15 13 -19
7086a9PM5m7L3j0j4K5oj9j9L4kJ7lj8j1mM6j9Mj9K6j3J2lpkkp%K3m3K5oj2KqJ1
$$ -19 -12 33 -14 19 9 -5 20 14 -5 -24 10 8 25 22 4 -7 -11 35 16 20 1 27 14 26 23 16 14 12 5 5 28 -15 10 4 -8 -6 -14 -3
7124cnlOJ5j4lK5k9LJ7J0n1QJ0J4k7L1lj9M2pj7J0oKj6PKLK0l9K6pJ3l2K0K9r
$$ -3 -8 -11 -5 10 -4 -7 18 -11 -8 9 19 -32 -24 -14 0 -27 4 1 -18 24 17 0 10 4 6 -10 -3 -1 2 22 -17 9 2 15 -17 3 32 23
7162B3%Ql3jJ4lJ5j1LRj5J0k4K1k0mJ1%j6M7l8K8jl7L9k0K7k1Ok6J3k3RL0k5K
$$ 23 23 31 -2 -3 11 8 23 12 15 24 9 19 -5 16 -4 -8 3 3 -13 34 -4 24 23 -14 25 5 32 11 17 -9 4 -19 -10 20 -5 -3
7198cJ1lj8nK3k1J8jLpl9M1Qk3N5n3J5M4k0Nk5Lj9KK4m0K6MlK8k8j0J7J3k7Np
$$ -3 8 5 -13 -18 5 -16 2 1 4 -3 -42 -1 7 -16 39 -14 1 45 25 30 5 8 -11 -9 15 -25 1 5 2 30 2 -8 9 22 -5 0 -7
7235gkMpkoJ1j0K4rj9M7l3K8kk6j0j6J5J8Pj3Qj3L5rj4K2j5J6j0qKNj1K0k9J2
$$ -7 -9 -5 -12 -14 -20 -9 -19 5 -4 -23 24 -9 19 17 -9 -19 -35 -20 -2 5 -8 0 -13 22 13 -1 21 6 22 12 4 6 11 0 20 -9 3
7272COj4Pj9M6l5M8k5rQk6j4N5j6%j8LRJJ1Ll5j6K9j2J0j8MRkl9K8nK7k9J6%k6
$$ 3 9 -5 2 -17 29 -6 42 17 8 16 -10 -24 31 15 15 -3 0 9 10 21 24 -11 -27 2 -10 0 -18 -14 -5 -7 -46 -18 -23 4 -25 -9 -9 -35
7310c5L0kJ8j2nj7L0j1K0l5JQJL9l6J6oRJ2j5l8M1J6k0k1M4k8J1L0m2kK1oJ8j
$$ -35 -5 -7 11 -1 -6 -23 7 -4 16 -19 -18 -10 -9 30 -6 10 4 13 25 10 -28 13 29 9 -12 32 4 15 45 3 1 22 16 34 33
7345C3k3j7K7m2J7J3L0k5kJ0l1OL5k4qjJj1kj7pL1mJ8k0NjkJJ7pj3kK4pj0K6j3
$$ 33 10 -7 20 -22 -5 8 38 13 11 21 -10 -4 31 7 -1 -2 -1 -12 -14 -31 -38 -7 -11 7 -13 -8 -9 -11 -10 7 0 -13 -15 9 2 -8 18 5
7383E%J7k9J1J0k0K9k5oK3j5qK5jrnJJ3JNqk0kM7j0k1Lpmk4RL7k1k2K6kj7j7L8
$$ 5 5 22 -7 4 14 -6 23 -2 -8 15 0 -8 17 16 7 2 3 16 17 22 14 -6 -8 39 29 8 11 4 0 -24 -15 22 1 -21 5 3 -14 -31 7
7422Gk7RK3j7LK7l1KJ7j4%Qk3LJ7pnj7J7j4J9K3rmRmj8K0lnOnpmK7k4L7rk3j4
$$ 7 -20 -11 12 -5 -2 25 -6 -4 13 -1 -1 7 -16 -13 4 -3 -8 -25 -8 -22 -3 20 11 7 16 12 -6 14 11 6 12 7 0 -4 23 -1 36 27 4 -10
7462a0K4mj4lkL0mpk4RQJk0OJ1Lk0J5rJ0kk0opL1JRj7oM2j4j7kJ0j9J6j2LKK7
$$ -10 14 10 -4 -7 -9 21 17 10 -14 -5 3 4 -16 -10 1 4 -16 -1 -10 0 -2 -22 -28 -35 -4 -3 6 -11 -17 25 11 -6 -8 2 -17 -1 -13 -10 -8 19
7502A9j8JL2j8J6ml5OK9l4J6Pj1j7L1j7kNj1rNK8j8J9Knk1qJ4J5n4L0Lj3mQnN
$$ 19 1 2 34 16 32 28 -7 -1 28 -6 10 17 6 -11 20 3 1 6 -5 -14 -9 19 1 20 22 17 -4 -12 2 17 -37 -7 -4 -17 -21 -13 -18 -13
7540a3k1K2oPk7O3m1J1j6PK0j4J9omk0K2K0l0kJ1k3N9m5J7qK6k3J9j5K8j5j5%
$$ -13 -34 -12 -18 -11 -38 25 -16 -5 -21 -14 6 -8 11 5 1 -19 3 23 -7 -9 2 -21 38 -7 10 2 28 5 24 9 37 22 7 7
7574GJ1KklJ8k1l5J0K9m9M7j2Q%K9j4k4Pj7J2kj9K4O%k7J4l2K9j0K4l1J3MKL9
$$ 7 18 20 18 15 33 12 -23 -13 16 -33 14 2 10 10 39 25 1 8 -9 3 1 -18 6 12 12 -15 -1 -33 -4 -14 10 -21 -8 -4 -2 37
7610C7n4K1j3J1k6N3j4j7kk2M9j5lRk7J4K7mKjj9K2k6K2%j2mJ7j4k8L8j4j5J6
$$ 37 -17 4 -9 2 -24 29 15 -2 -4 -26 23 8 5 14 -13 1 28 24 26 25 6 28 2 24 24 12 8 25 11 -17 21 7 -8 8
7644HLk4J1j5J9J1j5k3K4Kj9J8lJ2l8J6RnKJ5k9J5j9M4l7L9k2J1k8K5k6J0J2j6
$$ 8 11 -13 -2 -17 2 13 -2 -25 -1 1 -18 0 -3 9 -29 -13 -4 -9 -7 8 -21 -6 -25 19 -18 21 -1 10 -18 7 -19 -9 3 -13
7678a3L3j0K1j9j2RKj%k0K9k9L2rj6J7k5L0k4j5JNJ4JK1nj3J2m2J9Jk0L6l0JK3
$$ -13 20 10 31 12 0 9 11 10 10 -10 19 -10 22 13 -3 14 -11 19 -5 -20 -19 -14 0 1 22 17 4 16 -26 -7 -6 -26 10 -20 -19 4
7714Dj1j8J6k2K3k2M1qj9K2j8J3Rk1L9l6mLqL9k8L5l5j2J1L3k6lL4l3pK7k2mK1
$$ 4 -7 -25 -9 -31 -8 -30 11 3 -16 6 -12 1 10 -11 28 -8 -12 -9 -17 22 -6 29 -6 -18 -7 26 0 -3 31 -2 -9 18 -4 -8 13
7749A3rqRQpj1M8m4MK2k4K5j0l1J7rnlK3L4m7MLj2J0%kppJ2%J2oj2nK2j4J2k4
$$ 13 4 -4 5 13 6 -5 43 -1 3 25 1 26 16 -15 2 -7 -12 -15 8 42 -5 -1 2 -10 0 0 -2 -9 -16 -4 -4 8 2 -10 -15 7 -7 5 -19
7788a9M1Ml1J6rL1n2J4%mJ7mJ1m8L9nJ2nj9K7Kk5K0Lm4L6Kk6P2p4j0J4ORl6L3
$$ -19 22 26 -5 11 2 33 -19 -5 -5 -9 8 4 15 -33 6 1 13 8 -11 16 18 -7 13 16 -28 8 10 -16 56 -18 -28 -14 -8 1 -35 -2
7824bj5J8Mjl2J3J1OpLoJmp%MqJK4J3l4J6kJ5LJ1k0QLQl2OM6o3K3J1Kj9J2j5O
$$ -2 -17 1 5 4 -28 -15 -4 2 -5 -2 -8 -7 -11 -18 -18 -14 -22 -21 3 16 -18 -2 -4 11 14 25 5 13 16 24 -8 -2 44 -19 4 15 17 -2 10 -5 1
7865AlJ1rLJ3j3k6M8j2Jk0k0L4J1m1L5OQl7nLmQJ3Nlk6L7oMk2lMkRpNoj2rL9o
$$ 1 -2 9 0 3 16 3 -23 25 13 14 -6 -26 8 19 -22 13 19 27 -10 -15 -12 -16 -8 5 10 7 -19 18 12 16 -6 -9 -5 -7 2 -5 0 -6 -18 -27 12 6
7907FloQMJ6k6K9l7JL8m0K3MrQj3nJ3NK9n5K2J0k4j0K4j4%K8ok7J7Nj4rmoK0p
$$ 6 3 -3 5 9 25 -1 28 -9 -8 30 -10 13 17 8 16 3 -2 11 16 45 -10 12 22 -2 -12 12 -2 -2 26 20 -7 10 15 1 -8 -12 -18 2 -5
7946ek9L7K1j8j7Qoj5J2K4m5QK4kPKj1K7LJ1n7K1k2N2m7K0JlmJ1j0KpK3j1j5K3
$$ -5 -34 3 24 6 -11 -3 -9 -24 -12 12 -33 -25 -1 -3 4 6 -5 22 25 36 -21 0 -22 30 -17 3 4 1 -3 8 -2 0 -7 16 5 -10 13
7983A3m2L0MJ8Qk4MpJ7lkr%kLnk0jlJ6J2nJ1k8J4pM4o0K1k9J3Njk0M5k1j7L5j6
$$ 13 -29 1 5 23 31 7 11 4 21 18 16 7 7 5 8 3 -17 -18 -21 -5 7 2 13 -15 -1 -8 36 -24 -3 -32 -19 -14 -15 -35 10 -11 -28 7 -9
8022iK6Jj0pk4K4RoJ3j0J8kk8NK4J9k9k5L4kl6K8j6lK1k1J5j3K4j7Lk8RnK2oO
$$ -9 17 18 8 1 -23 1 10 4 17 7 25 23 -5 0 24 43 14 -11 23 21 -15 13 -3 -6 15 -6 9 -4 20 3 6 -22 -13 -18 4 -2 4
8059DLk8L3k7MJ9j6mMk9K0M%J8kj2qL5k0j4j1J4J6K0j9k3M2Kk4J3rj0LM4l2k1
$$ 4 7 -21 12 -15 -11 8 -8 -12 -8 -37 -17 -13 -13 5 3 -9 -17 18 -2 -16 -27 -13 3 23 4 -19 23 25 1 14 5 -5 -2 42 10 -11
8095a1Lj2J4J6J0mRkk8L0k6k3rM5poONJ0j0K3k1m2L9Nn4RK1OmK4ln6M3k1K1Jk2
$$ -11 -8 -20 -6 10 20 16 25 23 -5 25 -1 -24 -33 12 5 -1 5 10 20 10 33 12 -30 9 14 -40 -31 -10 -4 -8 16 13 -43 0 -21 0 1 -21
8133b1Rl0M0k3K4KK6l1j6M5m1J6j0K0k6J3J3Qj6J4OmNm3J2J1J1k0N2p%m8L3k6
$$ -21 -12 -42 -2 -25 -1 1 27 -4 -20 25 -16 0 -10 10 -16 -3 10 18 2 16 22 18 23 -20 -8 3 14 -6 46 39 39 -9 24 -2
8167bK0j4J3jj6j9nkKj1L8K6n3K2j6K2rJ5k3pOj9K4r
$$ -2 18 4 17 16 0 -19 -24 -26 -24 -35 3 29 -24 -2 -18 4 -5 10 -13 -20 -14 -33 -9 -18
8191a8
$$ Imaginary data points
##PAGE= N=2
##DATA TABLE= (X++(I..I)), XYDATA
0@%%%%%%%%%%%%%%%%%qJ6j6J6j6J6j6K4l2L2l2M0m8N1n9O6p4Q4r2J04j17J27j40
$$ 0 0 0 0 0 0 0 0 0 0 0 0 0 0 0 0 0 0 -8 8 -8 8 -8 8 -8 16 -16 16 -16 24 -24 27 -32 34 -40 44 -48 56 -61 66 -74
40g4J56j72J91k12K35k61K90l22L59m04M55n14N86o78P94r48J167j505K099l445
$$ -74 82 -90 101 -111 124 -137 153 -169 190 -214 241 -273 313 -365 429 -519 648 -857 1242 -2203
60b203J2423k84j6668Q122R151p15j0000j52N080N31p692l052L113K020n365m309
$$ -2203 10220 9936 -6732 1390 10541 9826 -174 -326 4754 5285 -2407 -5459 -2346 -326 -5691 -10000
76a0000K968P224J940l372l144P08N65j520k074O12J156p8m40R77l50l622l998
$$ -10000 -7032 192 2132 -1240 -4384 -3676 -3111 -4631 -6705 -6093 -4937 -5015 -5455 -4478 -4828 -8450 -12448
93a2448Q12M723L301n51p95K018L212R87j345j253M04J427J393R45Q31Q11k79
$$ -12448 -11636 -6913 -3612 -4163 -4958 -2940 272 1259 -86 -1339 -935 492 1885 2830 3661 4472 4193
110D193k349k897l53K576K283J11K7J928K297k03k124j273Q81J523O15l86o21
$$ 4193 1844 -1053 -1406 1170 3453 3564 3591 5519 7816 7613 5489 4216 5097 6620 7235 6849 6228
127F228k25l23j477k321j864p92m27m1J225J822J77j889j477J51J26q08o1J734
$$ 6228 6003 5680 4203 1882 18 -774 -1201 -1242 -17 1805 1982 93 -1384 -1233 -1107 -1915 -1976 -242
145b42J161j325k083n04K8j768k511l62J949J435l37l85R00J050m28j169R2J696
$$ -242 919 -406 -2489 -2993 -2965 -4733 -7244 -7606 -5657 -4222 -4559 -4944 -4044 -2994 -3422 -4591 -4499 -2803
163b803J884J040M48K96l97j289j178j00N99K68J30P82J166M22l26L9N08J43j1
$$ -2803 -919 121 569 865 468 -821 -1999 -2099 -1500 -1232 -1102 -320 846 1268 942 981 1489 1632 1621
182A621R48J858J290k0o94o68q58j119p07N7L12K89J32j93o28p85k93J72J84J53
$$ 1621 2569 4427 5717 5697 5003 4335 3477 2358 1651 1708 2020 2309 2441 2248 1620 835 542 714 898 1051
202A051M89P48N12j74p40r11r88r92p91k38N00N39k63j018r22j74Q5m2K56Q31
$$ 1051 1540 2288 2800 2626 1886 975 -13 -1005 -1796 -2034 -1534 -995 -1258 -2276 -3198 -3372 -3287 -3329 -3073 -2242
222b242R83M05M8J36Pn62q20m57J42L59K54K60J45k87o65m37J01O48R38J015Q70
$$ -2242 -1259 -854 -806 -670 -663 -1225 -2045 -2502 -2360 -2001 -1747 -1487 -1342 -1629 -2294 -2731 -2630 -1982 -1044 -29 841
243H41N37K27l5k07j64o3q5J14L07L49j8l90n04l04l36j11L60Q56P73M76K70P0
$$ 841 1378 1605 1570 1363 1199 1136 1051 1165 1472 1821 1803 1413 909 605 269 158 518 1374 2147 2623 2893 2963
265B963l01o03m19n0K18N0j29k53m01n93o70n82m09r9K29M32M84M02Q2l47n69
$$ 2963 2662 2059 1640 1590 1808 1858 1729 1476 1075 482 -188 -770 -1179 -1278 -1049 -617 -133 269 351 4 -565
286e65m06m9J29J63Q8k2l10n42n48m78l19j70J84M66N07N50L52O8j94oJ48K57
$$ -565 -971 -1020 -891 -728 -640 -662 -972 -1514 -2062 -2540 -2859 -3029 -2845 -2379 -1872 -1322 -970 -902 -1096 -1102 -954 -697
308f97K15L10M47L06j25m26m59l09j55J26M85O66N35K57R5J4M7P2P0J88L61M18
$$ -697 -482 -172 275 581 456 30 -429 -738 -893 -767 -282 384 919 1176 1271 1285 1332 1404 1474 1662 2023 2441
330B441K24j40m08n02n67m64k11J20K45J52R3L7j69l59k29j01J31J35K26J72r0
$$ 2441 2665 2525 2117 1615 1048 584 373 493 738 890 983 1020 851 492 263 162 293 428 654 826 736
351G36m14n38m90m83m22k13O9J97J81N1k8j84k79j19K24L31M43L91K84nk20l31
$$ 736 322 -216 -706 -1189 -1611 -1824 -1755 -1558 -1377 -1326 -1354 -1538 -1817 -1936 -1712 -1381 -938 -547 -263 -268 -488 -819
373h19k42j73p1J06L32L68K20N7j5r1NJ26L11N19N68L46J62l1j79k88l22j44K8
$$ -819 -1061 -1234 -1305 -1199 -867 -499 -279 -222 -237 -328 -323 -197 114 633 1201 1547 1709 1678 1499 1211 889 745 773
396G73J48J22J15K4j61l01k78j20P1K13L76K89J14j28l00k90l68l54j86L7J1K
$$ 773 921 1043 1158 1182 1021 720 442 322 393 606 982 1271 1385 1257 957 667 299 -55 -241 -204 -193 -191
418a91m0j61l21l77k53N7J38K54L29K81J09j23k11j50j68j25M7J68J63Q6p0j75
$$ -191 -231 -392 -713 -1090 -1343 -1286 -1148 -894 -565 -284 -175 -298 -509 -659 -827 -952 -905 -737 -574 -488 -558 -733
440g33j02j36p6J14K91M34L77K37J58k5j86j77o6J65K03J19J12n0j64k28j68p8
$$ -733 -835 -971 -1047 -933 -642 -208 169 406 564 539 353 176 110 275 478 597 709 659 495 267 99 21
462B1k6O3K07L18K78Q7o6j63k06j53L1J13J02M2o3j22k53l32k05j42JP5K46K19
$$ 21 -5 58 265 583 861 948 882 719 513 360 391 504 606 648 585 463 210 -122 -327 -469 -468 -393 -147 72
486G2J06k8j50j19r8k2P7J19J10O4n0j78k53k30j94p1J26K12K35R8k0k2o2k6j7
$$ 72 178 150 0 -119 -217 -239 -162 -43 67 131 81 -97 -350 -580 -774 -845 -719 -507 -272 -174 -194 -216 -278 -304 -321
511c21O1J61J12R7P9o7j82k37j48r3QJ43J82J95O0Lk3r1p0R8J67K11J33Q9K7j01
$$ -321 -260 -99 13 110 189 122 -60 -297 -445 -538 -530 -387 -205 -10 50 53 30 -61 -131 -33 134 345 478 567 594 493
537D93j97k28q1pO3J27J33R3k7p2o4q7K9J20J22J19P3Q5j24j57k01j66r6m9K2
$$ 493 296 68 -13 -20 43 170 303 396 369 297 233 146 175 295 417 536 609 694 570 413 212 46 -50 -99 -77
562g7J15%j02p1p8p7n6l8O5Q8J79J16p3j68j47j40j68j0K3J45O1q3k4j1j8q5j4
$$ -77 38 38 -64 -135 -213 -290 -346 -384 -319 -231 -52 64 -9 -177 -324 -464 -632 -642 -619 -474 -413 -496 -520 -531 -549 -634 -648
589f48J29K15K15J25Q3j9k8q1o6PQ9J38O0M9L6Qp9j06k5J73J80Q2J05Q3Q6p7j33
$$ -648 -519 -304 -89 36 119 100 72 -9 -75 -68 21 159 219 268 304 312 233 127 102 275 455 537 642 725 811 734 601
616F01j14k5l5m3J6P4j3j23j73j74r3J3rO5J07oK8j25q8q8r2j49oQ7M5p6l4q8
$$ 601 487 462 427 384 400 474 461 338 165 -9 -102 -89 -98 -33 74 68 96 -29 -117 -205 -297 -446 -452 -365 -320 -396 -430 -518
644e18j31j08k4P7P1J09R0J29M3J9m6j8JN9Q3J38Q9K7j7n1n0K1L7N2Q1J78J29
$$ -518 -649 -757 -781 -704 -633 -524 -434 -305 -262 -243 -289 -307 -306 -247 -164 -26 63 90 73 22 -28 -7 30 82 163 341 470
671D70O9l7j2mm6NN5R2J06l8j41j15n8m5j40p0N1P6O5m5q9p6l2p9p1k4M9O8m6
$$ 470 539 502 490 486 440 445 500 592 698 660 519 404 346 301 161 91 142 218 283 238 149 73 41 -38 -109 -133 -84 -16 -62
700f2m7p0q7j76r6m0L2O3Q6O9l7k9Rj9kJ9J03Q1O7M6M4k6q5r1O5O6K7M9J38J15
$$ -62 -109 -179 -266 -442 -538 -578 -546 -483 -397 -328 -365 -394 -385 -404 -406 -387 -284 -203 -136 -90 -46 -72 -157 -248 -183 -117 -90 -41 97 212
730B12j1n8o2N9N8L9O8N7R8Lm3j32p6k1K0p8PJ11L4n4q9n5j7o8kN3O8JLnq5r7
$$ 212 201 143 81 140 198 237 305 362 460 463 420 288 212 191 211 133 140 251 285 231 142 87 70 2 0 53 121 122 125 120 35 -62
762f2r2n1PkO7J2k7j1k5n1n8J3P6Q6K5L7O2M5r0j53nQ8K0j7k5Q9jml5m9RM6O6
$$ -62 -154 -205 -198 -200 -133 -121 -148 -159 -184 -235 -293 -280 -204 -118 -93 -56 6 51 -39 -192 -197 -109 -89 -106 -131 -42 -43 -47 -82 -131 -122 -76 -10
795a0J0N9J16l1q5m1kL4m1J0NP4l6l1Jn6n0qL2J00J8N9k3OPo6Qm6J7Q4j0Ql2o
$$ -10 0 59 175 144 59 18 16 50 9 19 24 98 62 31 32 -24 -74 -82 -50 50 68 127 104 110 117 51 59 13 30 114 104 112 80 74
829G4Rj23j4M7Q5%K0LL0J8n6o4k7M6rk3J6j0qr2o2j9PJ1%K7L1MOp9J2pl5JK9K9
$$ 74 83 -40 -54 -7 78 78 98 101 131 149 93 29 2 48 39 16 32 22 14 -78 -140 -159 -152 -141 -141 -114 -83 -79 -73 -152 -140 -147 -182 -181 -152 -123
865a23K6n9kPk0k1JL8M4M1M3KK4J8QQK5L7O3J0M1m0J4j2m6K1M1nJ1M6Lj5K9k6
$$ -123 -97 -156 -158 -151 -171 -192 -191 -153 -109 -68 -25 -23 1 19 27 35 60 97 160 170 211 171 185 173 127 148 189 184 195 241 244 229 258 232
899B32l5k2LK6L3o5n2j6k3m2n2m1j2k4J0jm2j8j8k9m6KK3J4j2kl4L6m5rj8lL5
$$ 232 197 175 178 204 237 172 120 104 81 39 -13 -54 -66 -90 -80 -81 -123 -141 -159 -188 -234 -232 -209 -195 -207 -209 -243 -207 -252 -261 -279 -282 -247
932b47L1K7J5J6K0J8L8k3Q2PL5N1N2K3J2k5j5L1K3j9L4M9lPJ2k3Rl0N2j2Rm8j1
$$ -247 -216 -189 -174 -158 -138 -120 -82 -105 -23 -16 19 70 122 145 157 132 117 148 171 152 186 235 232 239 251 228 237 207 259 247 256 208 197
965A97j7j6pl5m1j7n5oJ5o7j5l9rk5l1L0j5j8J5Nj0k3k5m0K1jM0k9L4J2j3L9j8
$$ 197 180 164 157 122 81 64 9 3 18 -49 -64 -103 -112 -137 -168 -138 -153 -171 -156 -151 -161 -184 -209 -249 -228 -229 -189 -218 -184 -172 -185 -146 -164
998a64L8QL6jR1QK0JPKjJ7M2L7m3J9%J7O%K5JLL7m7M0l1n6J4rj5j7ql9J4pl6Q
$$ -164 -126 -118 -82 -83 8 16 36 37 44 46 45 62 104 141 98 117 117 134 140 140 165 166 169 206 159 199 168 112 126 117 102 85 77 38 52 45 9 17
1036A7n0Lj5Mj2j7mQl5K6l9k2M2k2J0nJ8opkOj0L9qM1J7M0l1mN4l4K8QJ8j0OO
$$ 17 -33 -30 -45 -41 -53 -70 -74 -66 -101 -75 -114 -136 -94 -116 -106 -111 -93 -99 -106 -108 -102 -112 -73 -81 -40 -23 17 -14 -18 36 2 30 38 56 46 52 58
1073E8j2K4m6J2poK0RK6j4nk6pK0k0J4J6k0rj9Nm3Lj6K0k3L4J0jllj0k0oJ1M5
$$ 58 46 70 24 36 29 23 43 52 78 64 59 33 26 46 26 40 56 36 27 8 13 -30 -27 -43 -23 -46 -12 -2 -3 -6 -9 -19 -39 -45 -34 11
1109A1k1J0j5J1j8j2J7J1lj6K4K6l4N0n0N0m4KK6k6MK4kRo0j0M0j2j2K2k5Mk4
$$ 11 -10 0 -15 -4 -22 -34 -17 -6 -9 -25 -1 25 -9 41 -9 41 -3 -1 25 -1 3 27 25 34 -26 -36 4 -8 -20 2 -23 -19 -43
1142d3jJ5j6J5k6L7l5J6J8l0L1k4Kj3M1Qj1K8j5j6J9QK1L3kj1ROKJ9q1O1k5J9
$$ -43 -44 -29 -45 -30 -56 -19 -54 -38 -20 -50 -19 -43 -41 -54 -13 -5 -16 12 -3 -19 0 8 29 62 60 49 58 64 66 85 4 65 40 59
1176E9K3%qPok6oL7l0%L7m8Qpk7k1lj4j1qJ9pm4JK7k8Rk9QK6j5k6L7rk4LK3Jj2
$$ 59 82 82 74 81 75 49 43 80 50 50 87 39 47 40 13 -8 -11 -25 -36 -44 -25 -32 -76 -75 -48 -76 -67 -96 -88 -62 -77 -103 -66 -75 -99 -96 -73 -72 -84
1215h4L3k0J4O1j6j4J8%j5J0M6J0K3j5L6j6J3K6m3J9M4Ln4K8%l5k6J3M6n6J6k7
$$ -84 -51 -71 -57 4 -12 -26 -8 -8 -23 -13 33 43 66 51 87 71 84 110 67 86 130 133 79 107 107 72 46 59 105 49 65 38
1247C8j4L4k9n0K0k1J7j6j9J1J6n2Pl8%j0QJ6J5J0k4J9j5J1kj5J6M5PNk1kk2J7
$$ 38 24 58 29 -21 -1 -22 -5 -21 -40 -29 -13 -65 -58 -96 -96 -106 -98 -82 -67 -57 -81 -62 -77 -66 -68 -83 -67 -22 -15 -10 -31 -33 -55 -38
1281c8R%N2J4NJ2oK6k6j0J7k3L3L1j0Olrl2QJ6k2J7l6K2kKno8J4J3QJ5k9Ql8R
$$ -38 -29 -29 23 37 42 54 48 74 48 38 55 32 65 96 86 92 89 80 48 56 72 50 67 31 53 51 53 48 -20 -6 7 15 30 1 9 -29 -20
1318b0m9J1J5ok6P7n2k%k0MRkJ0K1K0j2KQl1J8PPKQK9k6L1n%j8J9J2j0qJ9kK3
$$ -20 -69 -58 -43 -49 -75 2 -50 -52 -52 -72 -68 -59 -61 -51 -30 -10 -22 -20 -12 -43 -25 -18 -11 -9 -1 28 2 33 28 28 10 29 41 31 23 42 40 63
1356F3l2LK8n2K1nJ1Lj3Knn8QK0LK9j4k9LJ1l1MNJ4j8J3K1nrl2J7rk2K8M2m2N9
$$ 63 31 34 62 10 31 26 37 40 27 29 24 -34 -26 -6 -3 26 12 -17 -14 -3 -34 -30 -25 -11 -29 -16 5 0 -9 -41 -24 -33 -55 -27 15 -27 32
1393C2Qm2K1n9K3RmK2L8l3j3J1ll3M1qQK8l1K3%l2j6pK6k7K0rK1m4J6L1m8j3m
$$ 32 40 -2 19 -40 -17 -8 -12 10 48 15 2 13 10 -23 18 10 18 46 15 38 38 6 -10 -17 9 -18 2 -7 14 -30 -14 17 -31 -44 -48
1428d8L1jJ7k1nJ3kj2J3J2J9L2k9k9K7j2J8n0K7K0jOJ3K5l5%oLRk9J2M7j9k7K6
$$ -48 -17 -18 -1 -22 -27 -14 -16 -28 -15 -3 16 48 19 -10 17 5 23 -27 0 20 19 25 38 63 28 28 22 25 34 5 17 64 45 18 44
1463D4k6lj7J3K5j1j7kjk9J7Lj5K7k9J2j1pJ4k4qmK0j4K7onLj8j5OL0j0M4kPj
$$ 44 18 15 -2 11 36 25 8 6 5 -24 -7 -4 -19 8 -21 -9 -20 -27 -13 -37 -45 -49 -29 -43 -16 -22 -27 -24 -42 -57 -51 -21 -31 13 11 18 17
1500A7Mj4J6k9L3Pj6L5Pj2j8Pj2Oj5OL9j0K6n2j5J4k0rK1n%k1M7j8k4j2k9J7K1
$$ 17 21 7 23 -6 27 34 18 53 60 48 30 37 25 31 16 22 61 51 77 25 10 24 4 -5 16 11 11 -10 37 19 -5 -17 -46 -29 -8
1535hk9J0K4j1j0rqMnLOPPk5LjN0m5J1M7m5N1l2K1J6J8n5PRK6Qj0M6n3K6k2Kl
$$ -8 -37 -27 -3 -14 -24 -33 -41 -37 -42 -39 -33 -26 -19 -44 -41 -42 8 -37 -26 21 -24 27 -5 16 32 50 -5 2 11 37 45 35 81 28 54 32 34 31
1573C1K7J1j3j7J3k0k5L4n4K7j4ML3j3j4m2J0Pqk2L2RJ3Qk6J9k7m2M3m4L8rNM0
$$ 31 58 69 56 39 52 32 7 41 -13 14 0 4 37 24 10 -32 -22 -15 -23 -45 -13 -4 9 17 -9 10 -17 -59 -16 -60 -22 -31 -26 14
1607A4l8j3lL5l4JK8L1k3N2r6L4J6LkJ8J8Jl5J8j3J9j2j9J8JJ5J2j4j6Lj4J8j
$$ 14 -24 -37 -40 -5 -39 -38 -10 21 -2 50 -46 -12 4 7 5 23 41 42 7 25 12 31 19 0 18 19 34 46 32 16 19 5 23 22
1641B2rj5J5ok5M5j6m6J4L2jm0L0nqj6L3j6l6N6l6K3J6l9M6k3k3NK5k0J7J2KQ
$$ 22 13 -2 13 7 -18 27 11 -35 -21 11 10 -30 0 -5 -13 -29 4 -12 -48 8 -28 -5 11 -28 18 -5 -28 -23 2 -18 -1 11 13 21
1675B1j1rPLj1jK7k9PJ6Oj1J5j3l0K5oK6j6mQl5j5RjL0j7kOJl7O3m2j2N6o6J4
$$ 21 10 1 8 11 0 -1 26 -3 4 20 26 15 30 17 -13 12 6 32 16 12 20 -15 -30 -21 -22 8 -9 -11 -5 -4 -41 22 -20 -32 24 -42 -28
1712b8nK8Lj4mQOj4J1K4J6n3mJ9PLOk8N4pk2QRk3RL6k7nJ3%j7ORk6k4L6kKj9J0
$$ -28 -33 -5 -2 -16 -20 -12 -6 -20 -9 15 31 -22 -26 -7 0 3 9 -19 35 28 6 14 23 0 9 45 18 13 26 26 9 15 24 -2 -26 10 8 10 -9 1
1752Aj3kmKl5M1lk1MMr%K6k1K6Pj0Jqoj0M2k3kJ4kNj1J7J7k7L0k1Nl3N5Jkl6j7
$$ 1 -12 -14 -18 -16 -51 -10 -13 -34 -30 -26 -35 -35 -9 -30 -4 3 -7 -6 -14 -20 -30 12 -11 -13 1 -1 4 -7 10 27 0 30 9 14 -19 36 37 35 -1 -18
1792a8K6J8n8N2Rj5MrJ5j1nj4PJ1Nl0LoKj3K6j3j3pL1k7kJpoP1p2j9L5qJ5K5j1
$$ -18 8 26 -32 20 29 14 18 9 24 13 8 -6 1 12 17 -13 -10 -16 -14 -27 -1 -14 -27 -34 -3 -30 -32 -31 -38 -44 27 -45 -64 -29 -37 -22 3 -8
1830hk1Qjj9J6L7j5K7j4QkPJ2m4K8j0N2m1PNj1k2L0oooJ4LJk0j0J2k8K3k4M6j1
$$ -8 -29 -21 -22 -41 -25 12 -3 24 10 18 16 23 35 -9 19 9 61 20 27 32 21 -1 29 23 17 11 25 28 29 9 -1 11 -17 6 -18 28 17
1867A7k4j4J0j0NnJ8j5K4m8%J4kK4m0QMJ2nJ5j8J9j6%M2rJ1Rk1K9mk7L1j4K8j4
$$ 17 -7 -21 -11 -21 -16 -21 -3 -18 6 -42 -42 -28 -30 -6 -46 -38 -34 -22 -27 -12 -30 -11 -27 -27 15 6 17 26 5 34 30 3 34 20 48 34
1903C4qj8JK7k8J6qJ4jj1L2j7k6J1JpK3m4JL3l5MJ7k1j2Nj2L9k9J4j6K4j3k4J
$$ 34 26 8 9 36 8 24 16 30 29 18 50 33 7 18 19 12 35 -9 -8 25 -10 -6 11 -10 -22 -17 -29 10 -19 -5 -21 3 -10 -34 -33
1938c3ROJ7l1J7k2L0J4k3NK1j4Qkk6K8%lJ3k3J0RJ0L6l4J2k5Nj0j3J4l%K2j3l
$$ -33 -24 -18 -1 -32 -15 -37 -7 7 -16 -11 10 -4 4 2 -24 4 4 1 14 -9 1 10 20 56 22 34 9 14 4 -9 5 2 2 24 11 8
1974HRk7qM3k7j1K1j5j4J2mJ5oMrk9K4J4k6K8l8K6j5KJ8j4j2K5k0PMQj1mjJK1
$$ 8 17 -10 -18 25 -2 -13 8 -7 -21 -9 -13 2 -4 0 -9 -38 -14 0 -26 2 -36 -10 -25 -23 -5 -19 -31 -6 -26 -19 -15 -7 -18 -22 -23 -22 -1
2011aqK8l4L3j2k0OK3k0K4lj7k4L5l0L7k0J3pKJ2j9Pk6K9k2K5k9rrM4l3qJ4j0
$$ -1 -9 19 -15 18 6 -14 -8 15 -5 19 16 -1 -25 10 -20 17 -3 10 3 5 17 -2 5 -21 8 -14 11 -18 -27 -36 8 -25 -33 -19 -29
2046b9NQJj1K4J0Nl3j2M1j9M1pj2j0J6lj8RnoK7mk0J4j5N3j5k1J2j9oK6%l0Lp
$$ -29 -24 -16 -15 -26 -2 8 13 -20 -32 9 -10 31 24 12 2 18 15 -3 6 1 -5 22 18 -2 12 -3 50 35 14 26 7 1 27 27 -3 0 -7
2083gJ3k1j6M7J7o8L1j6J2pk1K3J3J6k0k1Mj0J0rM9j0j3j5L0j8Nk3k6N0Qj6K5
$$ -7 6 -15 -31 16 33 -35 -4 -20 -8 -15 -36 -13 0 16 -4 -25 -21 -31 -21 -30 19 9 -4 -19 11 -7 -2 -25 -51 -1 7 -9 16
2116A6m6J0J6M3p3N8k1oL0mol1L7%ojMJ8j6k8QJ4j2k9K6jK0k2J8j2Oool9M9l5
$$ 16 -30 -20 -4 39 -34 24 3 -3 27 23 17 -14 23 23 17 16 20 38 22 -6 2 16 4 -25 1 0 20 -2 16 4 10 4 -2 -41 8 -27
2152b7L1nj4mNJ1j9J3j7K7j8NJ4QoJ6j6Mj4Jj0j6L9J2k5pK4qKkL9j8mJ5qPl3K6
$$ -27 4 -1 -15 -19 -14 -3 -22 -9 -26 1 -17 -12 2 10 4 20 4 8 -6 -5 -15 -31 8 20 -5 -12 12 4 6 4 43 25 21 36 28 35 2 28
2190B8l9K9k0J1l1L3lKLj3j0L1l4jMk6K0J6Kk3j9J0oM0J3l8KJ7l9OL1j3kj2M1
$$ 28 -11 18 -2 9 -22 11 8 10 13 0 -10 21 -13 -14 -10 -36 -16 0 2 -21 -40 -30 -36 4 17 -21 -19 -2 -41 -35 -4 -17 -19 -31 10
2225A0k7J6Qj7K8llm7N6k7L7k5K0qj4pjJ9Mjk6K9qk2j4OK6j9nJ6k2L2omOJ0Kk2
$$ 10 -17 -1 7 -10 18 15 12 -35 21 -6 31 6 26 18 4 -3 -4 15 19 18 -8 21 13 -9 -23 -17 9 -10 -15 1 -21 11 5 1 7 17 19 -3
2263ck0MPK6Nj4j1J2k1K0k7J2JQk2kK5kJ2kj9NmLjRmK3k4PL8j1l2J4qrM5k9Nm3
$$ -3 -23 -19 -12 14 19 5 -6 6 -15 5 -22 -10 -9 -1 -23 -25 0 -2 10 8 -11 -6 -10 -7 -8 1 -3 20 -4 3 41 30 -2 12 4 -5 40 11 16 -27
2303b7N6k4j5J2K3l7K6j6j9jM3m0M5l6RpMprj4K3J9k8K9j9J2J0j3m0M5j5L0k2
$$ -27 29 5 -10 2 25 -12 14 -2 -21 -22 21 -19 26 -10 -1 -8 -4 -11 -20 -34 -11 8 -20 9 -10 2 12 -1 -41 4 -11 19 -3
2336cJ4k3K1Mk5K8JNMl5K2JNk0N1k4j2oL2l3LPqK4k5J7opk8M8m9J7j1k9K8K0%
$$ -3 11 -12 9 13 -12 16 17 22 26 -9 13 14 19 -1 50 26 14 8 40 7 10 17 9 33 8 25 19 12 -16 32 -17 0 -11 -40 -12 8 8
2373Hk9KNL0j4k8M2k0K2j1j5K2l4K3JKj4j1MJ8RlnJ0Rj4M0k1ql2K0qj7M7l1K4
$$ 8 -21 -19 -14 16 2 -26 16 -4 18 7 -8 14 -20 3 4 6 -8 -19 -15 3 12 9 4 14 23 9 49 28 20 -12 8 0 -17 30 -1 23
2409B3k4Oj4j9N4j9j4JML4l2kk5Q%LJ1j4L2j8Nm0N5l9J1K4j3J7On0J1OlJK4k0
$$ 23 -1 5 -9 -28 26 7 -7 -6 -2 32 0 -2 -27 -19 -19 -16 -5 -19 13 -5 0 -40 15 -24 -13 11 -2 15 21 -29 -18 -12 -15 -14 10 -10
2445a0K7j0J5j0l2NJ8Olnj1L3j8J7J6l7RK6l9J9J1j2nk5K5Qj0lK4j5kj7k2L1O
$$ -10 17 7 22 12 -20 -15 3 9 6 1 -10 23 5 22 38 1 10 36 -3 16 27 15 10 -15 10 18 8 5 29 14 12 -5 -27 4 10
2480A0j6j0KjK5KmNm7J8J7J2l2J3Mj6J0K4Pk4kqJjJ9oLJ6j1Rk8J0L7k0ol6L7Q
$$ 10 -6 -16 -14 -15 10 12 8 13 -34 -16 1 13 -19 -6 -2 -18 -8 16 23 -1 -3 -11 -10 -11 8 2 5 21 10 19 -9 1 38 18 12 -24 13 21
2518B1m2O6n8J0rM9k1kJ7j4Kk3J4j0J1j4nkROj4Qj2J0%j1k1L7j8K7j4J0l8KL9
$$ 21 -21 45 -13 -3 -12 37 16 14 31 17 19 -4 10 0 11 -3 -8 -10 -1 5 -9 -1 -13 -3 -3 -14 -35 2 -16 11 -3 7 -31 -29 10
2553A0j3Mk1%K8Jjj4M1m7RK5k9K8j7j3M0k1RLk4PJ3k3K9mjPjpJ0oJj5J2l4J9k5
$$ 10 -3 1 -20 -20 8 9 8 -6 35 -12 -3 22 -7 21 4 -9 31 10 19 22 -2 5 18 -5 24 20 19 26 25 18 28 22 23 8 20 -14 5 -20
2591b0J4K1j4MJj3J1J4j9qoj4N4m7j1nL0j0qJL1k6mK9j4J7Oj6RNj9Nj4L0Kj0Q
$$ -20 -6 15 1 5 6 -7 4 18 -1 -9 -15 -29 25 -22 -33 -38 -8 -18 -26 -25 6 -20 -24 5 -9 8 14 -2 7 12 -7 -2 -16 14 16 6 14
2628A4K1nj1K3m0rJ9k0N0k8Rn3N6j6Mk2mMmpL1l4QL4m6LJ8j1ROj7RJ7l7pL8%j6
$$ 14 35 30 19 42 2 -7 12 -8 42 14 23 -30 26 10 14 -8 -12 -8 -12 -19 12 -22 -14 20 -26 -23 -5 -16 -7 -1 -18 -9 8 -29 -36 2 2 -14
2666a4K5J2j0OJ0rk3J6j5KL2m8K6qRj7K2j8k1K0O%L2l8J5k0jJ0OmQPlj0Pj3QJ5
$$ -14 11 23 13 19 29 20 -3 13 -2 0 32 -16 10 2 11 -6 16 -2 -23 -3 3 3 35 -3 12 -8 -9 1 7 3 11 18 15 5 12 -1 7 22
2704B2m6L2j6J1om0LMJJ6loKJ6K7l9MrK9mk8M8j6K2Kk3L3j0l6mLK0LqKJ3kmj0
$$ 22 -24 8 -8 3 -3 -43 -40 -36 -35 -19 -22 -28 -26 -10 17 -22 -18 -27 2 -2 -30 18 2 24 26 3 36 26 -10 -14 -11 9 12 4 6 19 17 13 3
2743CMoJ9j0OJ7n7K4K5m9J2K2Jklj6K0k6J7Jk2L9j3l6L5j0J5k1qj0J6J5k3J8K7
$$ 3 7 1 20 10 16 33 -24 0 25 -24 -12 10 11 9 6 -10 10 -16 1 2 -20 19 6 -30 5 -5 10 -11 -19 -29 -13 2 -21 -3 24
2778B4k4J3lj0J1j8K1j6rM6l1J4k8K7QRm3L3nj7M2j8j6K5k8QJ3lj1l6J8J1lJ1
$$ 24 0 13 10 0 11 -7 14 -2 -11 35 4 18 -10 17 25 34 -9 24 19 2 44 26 10 35 7 15 28 25 14 -22 -4 7 4 15
2812A5j2k9PJ9k3K5kppkK5j9j4J2ljOpK%J3l0QK0Qjj1J9rPjlnlK1k7mL2L5m3R
$$ 15 3 -26 -19 0 -23 2 0 -7 -14 -16 9 -10 -24 -12 -15 -16 -10 -17 -15 -15 -2 -32 -24 -4 4 3 -8 11 2 9 8 5 0 -3 18 -9 -13 19 54 11 20
2853B0K9j5k3J0k2JJ8Oj4KJ8j3Jkj4J5l8L7nj6rK6k0Kj8K0J4k4K7l7K7rj6JL4
$$ 20 49 34 11 21 -1 0 18 24 10 12 30 17 18 16 2 17 -21 16 11 -5 -14 12 -8 -6 -24 -4 10 -14 13 -24 3 -6 -22 -21 13
2888A3l3K6j9J5k3L9Mk0M6l6j6Pj1J3J9nk4J3J0j3k1L0j8MM5k9pj4K6kj3MJJ2
$$ 13 -20 6 -13 2 -21 18 22 2 48 12 -4 3 -8 5 24 19 -5 8 18 5 -16 14 -4 0 45 16 9 -5 21 19 6 10 11 23
2922B3j9Jk2J4j5j9L3J1k6L1%j9L5m8J0KK9k4oK6m1RlNJ4K3mj4pJJ7lj7j8N1l3
$$ 23 4 5 -17 -3 -18 -37 -4 7 -19 12 12 -7 28 -20 -10 -8 21 -3 -9 17 -24 -15 -18 -13 1 24 20 6 -1 0 17 14 -3 -21 30 -3
2958cJ2QNj9J3JJ2j8K6l9J9k3j0L4LJ6m4J4J5k4J6j6%lJ5j8L6l3OqJ5j3j8kjK0
$$ -3 9 17 22 3 16 17 29 11 37 -2 17 -6 -16 18 21 37 -7 7 22 -2 14 -2 -2 -5 10 -8 28 -5 1 -7 8 -5 -23 -25 -26 -6
2994fk4K5j1K1m4L4JK9roj9qNJnk1N3k9LL9m1J6j2QNJ2rk8J8J3j%j7O4o2KMK8
$$ -6 -30 -5 -16 5 -39 -5 -4 25 16 10 -9 -17 -12 -11 -16 -37 16 -13 -10 29 -12 4 -8 0 5 17 8 -20 -2 11 10 10 -7 57 -5 -3 1 29
3032B9ol2J1LK2m8J8j3J6J1nRpm5PNNnJ4J9j7k5J5jPJ1k2M0l0K8mj0J5m2M2k3
$$ 29 23 -9 2 5 27 -21 -3 -16 0 11 6 15 8 -37 -30 -25 -20 -25 -11 8 -9 -34 -19 -20 -13 -2 -24 16 -14 14 10 0 15 -27 15 -8
3068hOQqK2lomK0l4K2J3n0M9k7QJ4J2lk0KJ8k3j2M7J5l5o1M6Kj8L7k0ORj6l2k
$$ -8 -2 6 -2 20 17 11 7 27 -7 15 28 -22 27 0 8 22 34 31 11 13 31 8 -4 43 58 23 -38 8 10 -8 29 9 15 24 8 -24 -26
3105b6%J7Mj2j4K8Ml0KJ9J4k3M8l2j1K5kl8L7ok5OJ6J9j5J3j8OK4l6J8J1j3Lk3
$$ -26 -26 -9 -5 -17 -31 -3 1 -29 -27 -8 6 -17 31 -1 -12 13 11 -27 10 4 -21 -15 1 20 5 18 0 6 30 -6 12 23 10 13 -10
3140a0J2oJ7j4K2k5mKMMPk2J3K7k6k4K0%j2mJ3Jj1MPK6k4qOJ3j9L7l9JK3l5RJ5
$$ -10 2 -4 13 -1 21 -4 -8 -6 -2 2 9 -13 0 27 1 -23 -3 -3 -15 -19 -6 -5 -16 -12 -5 21 -3 -11 -5 8 -11 26 -13 -12 11 -24 -15 0
3178@J4j0MNlrj8M7j9%j5jMk0M9l7rJ9J5K5n6L3Pj3j2j3KkJ3qPj1J2j2J6L%mj7
$$ 0 14 4 8 13 10 1 -17 30 11 11 -4 -5 -1 -21 28 -9 -18 1 16 41 -15 18 25 12 0 -13 -11 -13 0 -8 -1 -12 0 -12 4 7 7 3 -14
3217a4K5j5K1k8J3mOJ1kj5nj2j9L7j0K7k1mPLK1n1L7jj7L4k5K6j1%kk1J7j8L6
$$ -14 11 -4 17 -11 2 -2 4 15 13 -2 -7 -19 -38 -1 -11 16 -5 -9 -2 1 22 -29 8 7 -10 24 -1 25 14 14 12 -9 8 -10 26
3252B6l8mK4K1l9J6%j%kkJ3J5j6jOk6K4pj0J7k6J6J3l8pJ2J2rk5K0K7k6j2L5k3
$$ 26 -12 -16 8 29 -10 6 6 5 5 3 1 14 29 13 12 18 -8 16 9 -1 16 -10 6 19 -19 -26 -14 -2 -11 -36 -16 11 -15 -27 8 -15
3288a5J3J8k9K2kJ3j5pJ0j9J3l1M4k5LNK2lKk2JJ4n5L2K2K0n7N3j5k0N8p2L7l8
$$ -15 -2 16 -13 9 7 20 5 -2 8 -11 2 -29 15 -10 -7 -2 20 17 19 -3 -2 12 -43 -11 11 31 -26 27 12 -8 50 -22 15 -23
3322b3J5Rl3L3qK7k5J2Rnj0J9k5qJ8Qk0J6lj9L0j5l4L2lqK0jpL2l0j0J0QPj3k2
$$ -23 -8 1 -32 1 -7 20 -5 7 16 11 1 20 -5 -13 5 13 -7 9 6 -13 17 2 -32 0 -3 -11 9 8 1 33 3 -7 3 11 18 5 -17
3359a7J3J6k5K6j8K2j7j0K1J4j6ONk9K8l9J3MkLJqJ0pJ3j2K3J3j7m5N2kLk0k3
$$ -17 -4 12 -13 13 -5 17 0 -10 11 25 9 15 20 -9 19 -20 -7 -3 -5 -2 -1 -9 1 -6 7 -5 18 31 14 -31 21 19 22 2 -21
3394b1K0nOpJrJ5Qj8J3rK7m3JJ1lJj9N3k9j6L3Nm2K2K0j9%J3K3j3Jm6N7l7%nj8
$$ -21 -1 -6 0 -7 -6 -15 0 8 -10 3 -6 21 -22 -21 -10 -13 -12 -31 22 -7 -23 10 15 -27 -5 15 -4 -4 9 32 19 20 -26 31 -6 -6 -11 -29
3432b9J9j8J4L1k5KPJ3Oj4jj2lqJ3K%j1k1P4k0j9j2JL0j1Kj3NnK2j4mj5qM1l6
$$ -29 -10 -28 -14 17 -8 -6 1 14 20 6 5 -7 -10 -18 -5 -3 -3 -14 -35 39 19 0 -12 -11 19 8 10 -3 2 -3 19 5 1 -14 -22 19 -17
3469a7L4l3pO7m5k4J2k5L0J8J1j8j4J9k6K2K3k2J0m6M5qOJ8l7K4j5knJ1nRrnj8
$$ -17 17 -16 -23 44 -1 -25 -13 -38 -8 10 21 3 -11 8 -18 4 27 5 15 -31 14 6 12 30 -7 17 2 0 -5 6 1 10 1 -4 -22
3504b2K7nj6M3m0j2K5J2j9J8k2K2J3l6J7mj7K7Ql7L9k0J2j0KJ0j2K4m1MK2k2J2
$$ -22 5 0 -16 27 -13 -25 0 12 -7 11 -11 11 24 -12 5 1 -16 11 19 -18 21 1 13 3 5 15 3 27 -14 -10 12 -10 2
3537BJ0k9J3K9l0KlnJ1Pj8kJ8%rL8n5MQK6j1k1J4RoPj0j4J8kJ9Ok0Pj4pK6k8K6
$$ 2 12 -17 -4 25 -5 -3 -6 -11 0 7 -11 -13 5 5 -4 34 -21 -17 -9 17 6 -15 -1 8 2 9 -1 -15 3 1 20 26 6 13 -1 -8 18 -10 16
3576A6j6Rj3jrK0lK5l1oJ8l0L9j4ok9M4m0PJ5k7N1l6L5m2J7J3j7J6k6j0L1m5M2
$$ 16 0 9 -4 -5 -14 6 3 28 -3 -9 9 -21 18 4 -2 -31 13 -27 -20 -5 -32 19 -17 18 -24 -7 6 -11 5 -21 -31 0 -45 -3
3610crqKL4j0JpnK1k2J3j3OK8j3JRk4J6jk5K5l1K3k3K6L0j2m3K9j4j5j3K4Mj6
$$ -3 -12 -20 -18 16 6 7 0 -5 16 -6 7 -6 0 28 15 16 25 1 17 16 -9 16 -15 8 -15 11 41 29 -14 15 1 -14 -27 -3 1 -15
3646a5K7K8j9l6L3l2j8L0k8J8K5j6J1Okj5k1K6Nl1L8k7nK7m5M7k0k2K7K7pk0j7
$$ -15 12 40 21 -15 18 -14 -32 -2 -30 -12 13 -3 8 14 12 -3 -24 2 7 -24 14 -13 -18 9 -36 11 -9 -31 -4 23 16 -4 -21
3679b1J8K5j7k0M4k5%K0mK6m2j0K8j0J1j6K2l0J1J2Pm6J8M3l6rj4qL6l8J6J3l1
$$ -21 -3 22 5 -15 29 4 4 24 20 46 4 -6 22 12 23 7 29 -1 10 22 29 -17 1 44 8 -1 -15 -23 13 -25 -9 4 -27
3712b7K7mNJj6J1m6O1l3K8k2J3%NkP%J2k7Oj1QnQL4m6PL0lk6J2K3m2K2K1l6KJ6
$$ -27 0 -4 1 2 -14 -3 -49 12 -21 7 -15 -2 -2 3 1 8 8 20 -7 -1 -12 -4 -9 -1 33 -13 -6 24 21 -5 7 30 -12 10 31 -5 -3 13
3750A3pjMK0k2j9J3J4m1K6LMrm3L9k1J2J2J5j3qK0m2JK8pK0j1j8J4K0Pj9k9J9
$$ 13 6 5 9 29 7 -12 1 15 -26 0 3 7 -2 -45 -6 -27 -15 -3 12 -1 -9 11 -31 -30 -2 -9 11 0 -18 -4 16 23 4 -25 -6
3785fRQk8LK5Oj6Oj2J5NJ7k8RRk0OrK0k6j3L0l6J8L1mLl0L2l8J5K2m6K1k7L1r
$$ -6 3 11 -17 -14 11 17 1 7 -5 10 15 32 4 13 22 2 8 -1 19 -7 -20 10 -26 -8 23 19 22 -8 24 -14 1 23 -23 -2 -29 2 -7
3822gjj5L2k1QMj1j1J9j9J4j8L3k9K1L3o2K2PJ8k3KNL8n2J3L1l7J3J1k5JoK2M
$$ -7 -8 -23 9 -12 -4 0 -11 -22 -3 -22 -8 -26 7 -22 -1 32 -30 -8 -1 17 -6 -4 1 39 -13 0 31 -6 7 18 -7 -6 -12 10 14
3857A4j0%L2k7J1j9RJ1Nj0rk2LK6k8LJ3j4Rk8M0j9nj0J8oJ1Jmj9RJ1JRlQl5L1
$$ 14 4 4 36 9 20 1 10 21 26 16 7 -15 -12 14 -14 -11 2 -12 -3 -31 9 -10 -15 -25 -7 -13 -2 -1 -5 -24 -15 -4 -3 6 3 11 -24 7
3895Gl8K7k1K5%qqJ5rK7K8n4NJ1rj1%jJ6J2Pk5Nj1K9l5LMON8l2k3j8L9k9lL2J7
$$ 7 -31 -4 -25 0 0 -8 -16 -1 -10 17 45 -9 -4 7 -2 -13 -13 -14 2 14 21 -4 1 -10 19 -16 -13 -9 -3 55 23 0 -18 21 -8 -11 21 38
3933C8l6k3K6K0l9PRJ4k8NJ4l0J9J3%ljMj1mJ4l0j7M3k2pM0k3LrK4k5J3K0j4k9
$$ 38 2 -21 5 25 -14 -7 2 16 -12 -7 7 -23 -4 9 9 6 5 9 -2 -6 8 -22 -39 4 -18 -25 15 -8 -5 -14 10 -15 -2 18 4 -25
3969b5M1qnK5k4%RnLk4klQL3j1j7kj0ML6m5L3k7M3m3J1J9l7J4LK3k9nN1o4L7p
$$ -25 16 8 3 28 4 4 13 8 11 -13 -15 -18 -10 23 12 -5 -7 -17 -13 23 -22 11 -16 27 -16 -5 14 -23 -9 -6 17 -12 -17 34 -30 7 0
4006@Ok1J5KJ2j6J8poj0mrM2j1j0k0L8Jj1qKlJ4K7l0jj5lK1Kk1K6j9mkQK2nj3
$$ 0 6 -15 0 2 14 -2 16 9 3 -7 -11 -20 22 11 1 -19 19 20 9 1 3 0 14 41 11 10 -5 -8 13 15 -6 20 1 -3 -5 3 25 20 7
4045Gj1k0K4k6J1J2K9o3L4J5k0j5rM5Mnk1j2K3j2Rl3L5l2L4j1J2k0oOJ6j3L1J3
$$ 7 -4 -24 0 -26 -15 -3 26 -37 -3 12 -8 -23 -32 13 17 12 -9 -21 2 -10 -1 -34 1 -31 3 -8 4 -16 -22 -16 0 -13 18 31
4079C1n4K6MoJ1j4kk1L6PJ1Nl2J6j5L5k8JJRj2j1pJ5kqJ1j9J9j0K5l2MK3nj6J7
$$ 31 -23 3 7 1 12 -2 -4 -25 11 18 29 34 2 18 3 38 10 11 12 21 9 -2 -9 6 4 -4 7 -12 7 -3 22 -10 -6 17 12 -4 13
4116A3k9j5L5k0L7m9J5K6l5PK4j8J5Kql8N2j9QJ0jM3n0j5LM0k9MJ8j7rKj3K8k1
$$ 13 -16 -31 4 -16 21 -28 -13 13 -22 -15 9 -9 6 8 0 -38 14 -5 3 13 12 55 5 -10 -7 33 4 8 26 9 0 2 -11 17 -4
4151dK8j6LJ0l0L1opOmMl2K7k3kM7m1kj3NK4J2n5K1KKJ4J6j7J9Pl9lJ9okJ9Pr
$$ -4 24 8 11 21 -9 22 16 9 15 11 15 -17 10 -13 -15 32 -9 -11 -24 -19 5 17 -38 -17 -15 -13 1 17 0 19 26 -13 -16 3 -3 -5 14 21 12
4190A2j5K8ll2LLLL0j0jj3JJ4m2J6L3l8nK5mJ3j8j1K7l0J9k2J1K7l8K6j1oj0K3
$$ 12 -3 25 22 -10 -7 -4 -1 29 19 18 5 6 20 -22 -6 27 -11 -16 9 5 18 0 -11 16 -14 5 -17 -6 21 -17 9 -2 -8 -18 5
4225Ej0NK2J9k6j4J3j4J7k2k2K4P%Nk7POjJ6j1j0lJ1J8j2L4l9Mj5M1rm0L1k1J7
$$ 5 -5 0 22 41 15 1 14 0 17 -5 -27 -3 4 4 9 -18 -11 -5 -6 10 -1 -11 -14 -3 15 3 37 -2 2 -13 28 19 -21 10 -11 6
4261FJ1k0K2qlqK6Pl8L4qj7K5l3qL6m5NK0k0J7l3K3oMK6k6j5J5lK3j9NMLj6pL4
$$ 6 17 -3 19 11 8 0 26 33 -5 29 21 4 29 -4 -12 24 -21 -16 4 -16 1 -32 -9 -15 -11 15 -11 -26 -11 -14 9 -10 -5 -1 2 -14 -21 13
4299A3J5Jn4J1mK7K5k3k5J2l0N0j1j5K4j6OK4l4L3km4M0rk1OJ1J4k1L1k9qj7k
$$ 13 28 29 -25 -14 -18 9 34 11 -14 -2 -32 18 7 -8 16 0 6 30 -4 29 27 -17 23 14 -7 -1 10 24 3 34 5 -3 -20 -22
4333b2J2J0oK7l7L6mj1olJ1J0m4M2k4M5m3J7l1L8m6J5K5nJ1l7L8plJ6lm7M3k4
$$ -22 -10 0 -6 21 -16 20 16 5 -1 -4 7 17 -27 15 -9 36 -7 10 -21 17 -29 -14 11 6 17 -20 18 11 8 24 21 -26 17 -7
4367gJ3j4PQo1J4L9QqMPpRl7M4ol2K5Rml3L8k1lJ7j2j0lMj2J6J6Pj9J0k6M0l1
$$ -7 6 -8 -1 7 -54 -40 -1 7 -1 3 10 3 12 -25 19 13 -19 6 15 11 -22 16 -5 -8 9 -3 -13 -16 -12 -24 -8 8 15 -4 6 -20 20 -11
4405a1JQNj6l1J6NK5pj0K5l3K3lL0J0k3k2JPlRK7Nj1k3J6k7J0J5jn3M0j2J8%l6
$$ -11 -10 -2 3 -13 -44 -28 -23 2 -5 -15 10 -23 0 -3 27 37 14 -8 -7 0 -3 6 33 38 27 4 20 -7 3 18 17 -36 4 -8 10 10 -26
4442b6RK1l1L8oJ6j2J1mk0J6n3L7nRPk6K5K1k5k2K8j7PLQj3j9K1j6j3J5K6k1L9
$$ -26 -17 4 -27 11 5 21 9 20 16 -4 12 -41 -4 -9 0 7 -19 6 27 2 -20 8 -9 -2 1 9 -4 -23 -2 -18 -31 -16 10 -11 28
4477B8k8poL0Jn0K4K4k2lK9l0j2JpL6Nl4L6l0NJ6J5j3Nj7J6Kk7J9k9J5qK0k6L3
$$ 28 0 -7 -13 17 18 -32 -8 16 -6 -9 20 -10 -22 -21 -28 8 13 -21 15 -15 -10 6 21 8 13 -4 12 14 -13 6 -23 -8 -16 4 -22 11
4513A1Qm0L1Qk1jkM1k8k4K8l6J3M4k3j7K0%Mj6jJ9j0lpj1N4o0k0L1nL0lk3L7l2
$$ 11 19 -21 10 18 -3 -4 -6 35 7 -17 11 -25 -12 32 9 -8 12 12 16 0 -1 18 8 5 -2 -13 41 -19 -39 -8 -13 17 14 -9 28 -4
4549dJ0J4On2J7Nj7L4l4K4Pj7J0qKL6l5KMMJ6m3K6Ljj4nK5j3Mkk1K3k5M1j2m%
$$ -4 6 20 26 -26 -9 -4 -21 13 -21 3 10 -7 3 -5 -3 33 -2 0 4 8 24 -19 7 10 9 -5 -10 15 2 6 4 -17 6 -19 22 10 6 6
4587FJJ0rj3Rj7L5k7K9m1QRj3J9k4J9%rL4m2L1j2M5n8oL3j2oL8k3m2J7nK2l5L4
$$ 6 7 17 8 -5 4 -13 22 -5 24 -17 -9 0 -13 6 -18 1 1 -8 26 -16 15 3 48 -10 -16 17 5 -1 37 14 -28 -11 -16 6 -29 5
4623EMpK0k1rJ3Rj3QK6k6J7j4k4kOJ1J4l3K4J2l9K4j9J0K7Pj4mRKMn0J9k0L4j5
$$ 5 9 2 22 1 -8 5 14 1 9 35 9 26 12 -12 -14 -8 3 17 -16 8 20 -19 5 -14 -4 23 30 16 12 21 23 27 -23 -4 -24 10 -5
4660eJ6j4j4K0LmMl8L6ok3QK3j3L1j0pj7qL9k8rL5j2RJl7M2l2K1m1O2j6j5j1J4
$$ -5 11 -3 -17 3 6 2 6 -32 4 -2 -25 -17 6 -7 24 14 7 -10 -18 21 -7 -16 19 7 16 17 -20 22 -10 11 -30 32 16 1 -10 4
4696DoL3k4j5RrJ7k3nJ5J4j9PL6m7MJ6j5J5j7J9l8J8L2kJ8l2oOJ0j3J5k3M2n3
$$ 4 -2 31 7 -8 1 -8 9 -14 -19 -4 10 -9 -2 34 -13 -9 7 -8 7 -10 9 -29 -11 21 19 37 5 -1 5 15 2 17 -6 36 -17
4731a7M2m4K6rJ1rpQM2k7j4nOqL3k3k3J4QLjPoOl1J6L3n3K3J7rrm1L8PJ2oOl1
$$ -17 25 -19 7 -2 9 0 -7 1 43 16 2 -3 3 -5 28 5 -18 -4 4 7 6 13 7 13 -18 -2 31 -22 1 18 9 0 -41 -3 4 16 10 16 -15
4770a5L1l4nL3j8J2j5j1QK1Mnk8J3J2J2l1M5j0k0j5K2lNnkL0k3JJ9m7OQj2K5M
$$ -15 16 -18 -23 10 -8 4 -11 -22 -14 7 11 6 -22 -9 3 15 -16 29 19 -1 -16 6 3 8 3 1 31 8 9 28 -19 -13 -5 -17 8 12
4806A2k1J2Rkl0K4Ojj7K0K2m4nJ5J3qj9K4j3L5l6lJk9K8j5NJ8%k1K4j7%NL4l7
$$ 12 -9 3 12 10 -20 4 10 9 -8 12 34 -10 -15 0 13 5 -14 10 -3 32 -4 -7 -6 -35 -7 -22 -17 1 1 -20 4 -13 -13 -8 26 -11
4842a1%OK4j1n2M8NPj4rmK9Nk8RoK2k0K2Pl5K8Ll2K8k5J3j8mMJjJ1lj3JlM3l2
$$ -11 -11 -5 19 8 -44 4 9 16 2 -7 -11 18 23 -5 4 -2 20 0 22 29 -6 22 25 -7 21 -4 9 -9 -13 -9 -8 -9 2 -1 -14 -13 -16 27 -5
4881ej9K1j0pK1j4K4nj9lnLJ9OmJ0j8K1j9pK3k8K1j9L6l1oPK8Ln7L1LJ9NPl7J0
$$ -5 -24 -3 -13 -20 1 -13 11 6 -13 -16 -21 -18 1 7 3 13 -5 16 -3 -10 13 -15 6 -13 23 -8 -14 -7 21 24 -33 -2 1 20 25 32 -5 5
4919ELJ4l0qJ9rJ5j6mMJK7k2J7j9%l8M7Ok5K0L1n2L4j3k8J6J2Nn3M2j1JK2l5K8
$$ 5 8 22 -8 -16 3 -6 9 -7 -11 -7 -6 21 -1 16 -3 -3 -41 6 12 -13 7 38 -14 20 7 -21 -5 7 12 -41 1 -10 -9 13 -22 6
4955Fj0j7RmPlrL0k6M0j2pJ8j2K0m3K5k9K9j6j3L1pj3LpjJ1lj4J0J5j7L9l4KL
$$ 6 -4 -21 -12 -16 -9 -12 -21 9 -17 23 11 4 22 10 30 -13 12 -17 12 -4 -17 14 7 -6 -3 -10 -11 0 -3 -17 -7 8 -9 30 -4 -2 1
4992Aj4jJ0lKOK2k8JJ7l5LK4jlJ4l2K1j6K4rmRm1N7lnj0j0J2Jj3l4J2L0Nnj5K8
$$ 1 -13 -14 -4 -7 -5 1 23 -5 -4 13 -22 -19 5 4 1 15 -17 4 -12 12 3 -1 8 -33 24 21 16 6 -4 8 9 -4 -38 -26 4 9 4 -11 17
5031A7Ol0K1lkl7%L7loqJ5Ok7nJ8j3K0Rk3K7n8K0K5k1K3l3L0K2k4j0J3j7K8l7
$$ 17 23 -7 14 11 9 -28 -28 9 6 0 -8 7 13 -14 -19 -1 -14 6 15 -8 19 -39 -19 6 -15 8 -25 5 27 3 -7 6 -11 17 -20
5066b0J5J7l0K1j6L0n0M1k5K8j1K8j8J2j1l5K6k8K9k5K3NJ0OooMj8K1Kk1K5j4
$$ -20 -5 12 -18 3 -13 17 -33 8 -17 11 0 28 10 22 11 -24 2 -26 3 -22 1 6 16 22 16 10 14 -4 17 19 -2 23 9
5099IJ3qj8nK8j2KJk9J2L3j8J3n7L3LQoj6J7k1K2proJ1j0J4PprL0m5J6J1oOj2
$$ 9 22 14 -4 -9 19 7 9 10 -19 -7 26 8 21 -36 -3 0 8 2 -14 3 -18 4 -3 -12 -18 -7 -17 -3 4 -3 -12 18 -27 -11 0 -6 0 -12
5137a2LJ9nmJ1j3J2k2L7rk5K3rJ7k1J3J6k0J5k8J7%k5OK0j4K7j2l2RjkRkj2J0
$$ -12 -9 10 5 1 12 -1 11 -11 26 17 -8 15 6 23 2 15 31 11 26 -2 15 15 -10 -4 16 2 29 17 -15 -6 -7 -9 0 -2 -14 -4
5173dk8L1%mR%qNPk7J2L0l5J9J2j1l2J0J7K0k5MKJ1l5JM4k3L2j3lk3OpmK5nj3
$$ -4 -32 -1 -1 -5 4 4 -4 1 8 -19 -7 23 -12 7 19 8 -24 -14 3 23 -2 2 4 15 -20 -19 25 2 34 21 18 -5 1 -6 -10 15 10 -3
5211cJ5k5J5Ll1K3K6k5kLjk9M4l1j2M7k7MplL1j9jj3pK2JlNk2J9pRpK9kj5j1M0
$$ -3 12 -13 2 5 -26 -3 23 -2 -4 -1 -2 -31 13 -18 -30 17 -10 -6 -13 -16 15 -4 -5 -18 -25 -3 -2 -5 0 -22 -3 -10 -1 -8 21 19 4 -7 33
5250C3k4J4nm3K0K5J1k5l2M6Ponk0nRM5j1l5Qk9O0j4m0jK2j7K8K3o0J9j6J9l1
$$ 33 9 23 18 -25 -5 20 31 6 -26 20 27 21 16 -4 -9 0 45 34 -1 7 -22 38 24 -16 -17 5 -12 16 39 -21 -2 -18 1 -30
5284c0J7oK4J6l4L9oj5nJ2jnrj1nK3OKk4L3l1LJ3oJ7j2klnoJ4J1j5J0j9KJ3J5
$$ -30 -13 -19 5 21 -13 26 20 5 0 12 11 6 -3 -14 -19 4 10 12 -12 21 -10 -7 6 0 17 5 3 0 -5 -11 3 14 -1 9 -10 -8 5 20
5322B0j9jK9l9j3L2Poj4J3l3M1k8j1L3m6K3OonJjK6m2L8J3j8J5k6L2Lj7j2Rj6
$$ 20 1 0 29 -10 -23 9 16 10 -4 9 -24 17 -11 -22 11 -35 -12 -6 -12 -17 -16 -17 9 -33 5 18 0 15 -11 21 24 7 -5 4 -12
5357a2K0lj5lJ4lLkjK7m7K0jj2L5lk5NJ4pJ4k6NL3k5j3nL4j3j3K2l1%J5lj8L3
$$ -12 8 5 -10 -13 1 -2 1 -1 -2 25 -22 -2 -3 -15 20 17 -8 -3 11 4 18 -8 -3 30 5 -8 -13 21 8 -5 17 -14 -14 1 -2 -20 13
5394A3J3j6l2J9m7N2j2Jj0NnmK2%J7pK4k8MrpJ2ojj2J3mj0J5mkJ2Pk4J0J5jm8
$$ 13 26 10 -22 -3 -50 2 -10 -9 -19 -14 -19 -23 -1 -1 16 9 33 5 9 0 -7 5 -1 -2 -14 -1 -5 -15 0 -4 -6 6 13 -11 -1 14 13 -35
5432c5M7l3J4J0KLok4J7J3k9L3l7%L3K2k0pL1l4pJ3mj3NkJ8Krm1K9J6j6ok0M2
$$ -35 12 -21 -7 3 5 8 2 -22 -5 8 -21 12 -25 -25 8 30 10 3 34 0 -7 6 2 -11 -6 -8 10 12 3 -38 -9 7 -9 -15 -35 7
5468Gj3mMK4k9LJ1j0Oj7K8k1Qj9O7m6LK5l4k7L8L1n6M0k6L8m2OnK2l2K5Ll2J9
$$ 7 -6 -10 -6 18 -11 -8 3 -7 -1 -18 10 -11 -3 -22 45 -1 2 27 -7 -34 4 35 -21 19 -7 31 -11 -5 -10 12 -20 5 8 -24 -5
5503eOj0j5L1k5J5k4PNj1L2m%k4J6J2J4l0L9n0K4j8J4j1J9nk5K5K1n0OK1J3j3
$$ -5 1 -9 -24 7 -18 -3 -27 -20 -15 -26 6 2 2 -22 -6 6 20 -10 29 -21 3 -15 -1 -12 7 2 -23 2 23 -27 -21 0 13 0
5537@j7jQj1J7qjK8k0lk0K4Oj7K7J8n4K3Qk5K3jMRj9Ol7J8M3l2Lomj2L4k0J8r
$$ 0 -17 -18 -10 -21 -4 -12 -13 15 -5 -8 -28 -4 2 -15 12 30 -24 -1 7 -18 5 4 8 17 -2 4 -33 -15 28 -4 -1 -7 -11 -23 11 -9 9 0
5575@nl7K9J3k8L8nk6PJ4KqJKMK1k8K0k9JJ3kj8M0l2Qj0PMj9N2m3Rj8j1M0k2J2
$$ 0 -5 -42 -13 0 -28 10 5 -21 -14 0 2 -6 -5 -3 1 22 -6 14 -15 -14 -1 -3 -21 19 -13 -5 -15 -8 -4 -23 29 -14 -5 -23 -34 6 -16 -4
5613dmJ9J0j0k1J2K2j3j2lK7l3K0j2j8K2nj5L3m6L4k3Nk0L3Rj3l5K4J4l0L5K0
$$ -4 -8 11 21 11 -10 2 24 11 -1 -4 23 -10 10 -2 -20 2 -3 -18 15 -31 3 -20 -15 -35 -2 7 -6 -41 -17 -3 -33 2 22
5646B2k4%j7K8J3l8L7Ml5J7Kk8JL0j9lJ1k6N2l7j7N5nm5J3Rk6M0k5L0oLl0pjJ9
$$ 22 -2 -2 -19 9 22 -16 21 25 -10 7 9 -19 -18 12 -7 -10 1 -25 27 -10 -27 28 23 -22 -9 0 -26 14 -11 19 13 16 -14 -21 -22 -3
5682cj2K2j5J1J7l2L9j1k2NNj5K6jom0K4Ml0J7RK6mol4ML6j5J0mqoNPj2j7RN3
$$ -3 -15 7 -8 3 20 -12 27 16 -6 -1 4 -11 15 14 8 -32 -8 -4 -34 -17 -8 18 14 8 -26 -22 14 -1 9 5 -3 -9 -4 3 -9 -26 -17 36
5720C6o5J2K3mj4J9j1J4j0j3mJ8j8j9M7j9lK5j4K4k8J3Qm6N5m0J0pjJ5J2m4K6
$$ 36 -29 -17 6 2 -12 7 -4 10 0 -13 -17 1 -17 -36 11 -8 -11 14 0 24 -4 9 17 -29 26 -14 -4 -11 -12 3 15 -29 -3
5753cJk7J9Oqk6L6Nk8J2J0j9J7MOK0j4%pm1N3ql2K3j1J6J4k9J6j3KJ7j1j3Pqm
$$ -3 -2 -29 -10 -4 -12 -38 -2 3 -25 -13 -3 -22 -5 -1 5 25 11 11 4 -37 16 8 -24 -1 -12 4 18 -11 5 -8 -6 11 0 -13 -6 -14 -18
5790a8lM1k2L0j6JKj9qjJ6l6L3j5pK4j1jlJK0m1J3L2l5jJ3M2j5j7Rj0j4oPoM2
$$ -18 -21 20 -2 28 12 13 15 -4 -12 -13 3 -33 0 -15 -22 2 -9 -10 -13 -12 8 -33 -20 12 -23 -24 -11 31 16 -1 8 -2 -16 -22 -15 -21 21
5827B1J1m7J9K0j3Qj7jJ1J3l6j9K1KkKJ2j3k2K2L9ol2J8k9OL7l9J0K8kk0J2qj2
$$ 21 32 -15 4 24 11 19 2 1 12 25 -11 -30 -9 -7 -9 -7 5 -8 -30 -8 31 25 -7 11 -18 -12 25 -14 -4 24 22 2 14 6 -6
5862fmPNnpJ1j6Qj2K4mj2QJopj2K7QpJJ3qk9KqL7j3MkMJl0J7Rj1OlK7nj8j9L0
$$ -6 -10 -3 2 -3 -10 1 -15 -7 -19 5 1 -11 -3 -2 -8 -15 -27 0 8 1 2 15 7 -22 -20 -28 9 -4 0 -2 2 3 -27 -10 -1 -12 -6 -9 18 13 -5 -24 6
5905Fj7qJ7Qm4M8j8J7j2K4lm2J7rL7l2J9%mKKnm0K3J2lJj2M2l8J0JJ2l8L3%j0
$$ 6 -11 -19 -2 6 -38 10 -8 9 -3 21 18 -24 -7 -16 21 -11 8 8 4 6 8 3 -37 -14 -2 -5 -4 -16 26 -12 -2 -1 11 -27 6 6 -4
5942djJ3k0J0L8l7kK0k7J9k3K0J3ln4M7K5m4J1j6K4j3J8OKk2J5k7NK4nKj6J3l
$$ -4 -5 8 -12 -2 36 -1 -3 17 -10 9 -14 6 19 16 -38 9 34 -10 1 -15 9 -4 14 20 22 0 15 -12 -7 17 12 14 -2 11 8
5977Hk5J3MJ6l2M7k7OJ0rj3j7J7J%j2QJ2k0jONNj3k5J1J8qj2K0j0J4jj8J8mJ1
$$ 8 -17 -4 0 16 -16 31 4 10 20 11 -2 -19 -2 -1 -1 -13 -5 7 -13 -14 -8 -3 2 -11 -36 -25 -7 -15 -27 -7 -17 -3 -4 -22 -4 -8 3
6014Cnj5M4m2L1J1l5ok4N3j6J9j9j1L5j8pJ6k2MK3Lj0m1K9J4J2k5k0KL3Jk8K1
$$ 3 -2 -17 27 -15 16 27 -8 -14 -38 15 -1 18 -1 -12 23 5 -2 14 -8 -4 19 22 12 -29 0 14 26 1 -19 -17 16 17 -11 10
6048A0j1j7J6j1K9Nk3K2mj6jj6J1KOrk1J9L6k6j6K7l5J5Qj4j8J7JL8k2j2nRk6
$$ 10 -1 -18 -2 -13 16 21 -2 20 16 0 -1 -17 -6 -4 2 -7 -28 -9 27 1 -15 12 -23 -8 0 -14 -32 -15 -14 24 2 -10 -15 -6 -32
6083c2M2jkj3K3j5j5L6Ok9K3j8L%k9J8Qj8J2k4K1oJJ3Lj9k7K6k4M2k1K9j4Noj
$$ -32 10 9 7 -6 17 2 -13 23 29 0 23 5 8 8 -21 -3 5 -13 -1 -25 -4 -10 -9 4 7 -12 -39 -13 -37 5 -16 13 -1 4 -2 -3
6119ck6M6j3J9k0Lj5pRj8K6j2K5j4J8j1l5qJ2M6kqj4RJj9J4j1QJ8rj0RrQkLLp
$$ -3 -29 17 4 23 3 6 -9 -16 -7 -25 1 -11 14 0 18 7 -28 -36 -24 22 20 12 -2 7 8 -11 3 -8 0 18 9 -1 8 -1 7 5 8 11 4
6158DL6j9rMj7L4o7J0J4Oj1JjL6l5j1Mj0L7j5j7J5J8Joj6MQj6K1jk3K5Mk7RM6
$$ 4 40 21 12 16 -1 33 -34 -24 -10 -4 -15 -14 -15 21 -14 -25 -21 -31 6 -9 -26 -11 7 8 2 -14 -10 -2 -18 3 2 -21 4 8 -19 -10 36
6195C6m7K1k7K0K0j4l2j0M2mjoj1QoJ0knOJ2l8J5k6L4oJ4j8L1k9pj7L9Pm8L0K7
$$ 36 -11 10 -17 3 23 9 -23 -33 9 5 4 -2 -13 -5 -11 -1 -3 -8 -2 10 -28 -13 -39 -5 -11 3 -15 16 -13 -20 -37 2 9 -39 -9 18
6231A8k3k6L1%JqjQ%k4J3J0J1l6K5kqOqj2N8l5j3K6k2OK2Jk0j8RRj0J1j3K5k8
$$ 18 -5 -31 0 0 1 -7 -8 0 0 -24 -11 -1 10 -26 -1 -3 -11 -5 -13 -25 33 -2 -15 11 -11 -5 17 18 -2 -20 -11 -2 -12 -1 -14 11 -17
6268a7J6mQj1j5OmK4J6J5l1j3l6L1K8j6j6K5j8j9J5JK4j9K5m2M1j6j6j2J8kj7
$$ -17 -1 -5 3 -8 -23 -17 -21 3 19 34 3 -10 -46 -15 13 -3 -19 6 -12 -31 -16 -15 9 -10 15 -27 14 -2 -18 -30 -12 -14 -31
6301c1K6Jl5K0J1rL4m7L3pK4jj7K3j3k2j3M6jl1NK3NRl0j7J3pL5l0j2L7npl0J5
$$ -31 -5 -4 -39 -19 -8 -17 17 -30 3 -4 20 19 2 25 12 -10 -23 23 22 -9 -4 19 24 33 3 -14 -1 -8 27 -3 -15 22 17 10 -20 -5
6337ePj5L9k8k4L1J0poJjPj1LrJ6QLj9j6J4j9rN2k0pj3L3l5L4k7RK4Pj4k0K3Q
$$ -5 2 -13 26 -2 -26 5 15 8 2 3 2 9 -2 1 -8 8 16 19 0 -16 -2 -21 -30 22 2 -5 -18 15 -20 14 -13 -4 20 27 13 -7 16 24
6375B4j2RLm5K1nL5l4L8l1JJ3K3k8K8l3J4qj6jj9J6qJ9nMl8K9J7l5L6k7J3KRr
$$ 24 12 21 24 -21 0 -5 30 -4 34 3 4 17 40 12 40 7 21 13 -3 -4 -23 -7 -15 4 -1 3 -35 -6 11 -24 12 -15 -2 0 9 0
6411@k9JL5J2j7K3l0Kj0K4j0P%Mj8J8Nnj5K0k7J0mK8k5Pl2M0j6K0pRoj0Rj9J0
$$ 0 -29 -28 7 19 2 25 -5 -3 -13 11 1 8 8 12 -6 12 17 12 -3 17 -10 0 -4 24 -1 6 -26 14 -2 18 11 20 14 4 13 -6 4
6448DknJ5Lj0j3K5Rk0k8K4Rj6M8o8N1kk0k1J6J3J1n4L4Qm2L8k8JL8%j6J0J2l1
$$ 4 2 -3 12 15 5 -8 17 26 6 -22 2 11 -5 43 -25 26 24 4 -17 -1 12 23 -31 3 11 -31 7 -21 -20 18 18 2 12 24 -7
6483gJ0J1oLQJ0m2L6l1L5k4j5M9l4j0rK8OJ3n8L7l0L5jJ4K5o9J8qORpJJ7l9L5
$$ -7 3 14 8 11 19 29 -13 23 -8 27 3 -12 37 3 -7 -16 12 18 31 -27 10 -20 15 14 28 53 -16 2 -6 0 9 2 3 20 -19 16
6519A6qjk7QKPlj1pK9K5pk0qJ1j9RMJ4m%k3J8kJ5j6Pj3L4j1l4RoO1l9j3K2qj1
$$ 16 8 7 -20 -12 -10 -3 -6 -17 -24 5 30 23 3 -5 6 -13 -4 0 14 10 10 -13 5 3 18 2 9 -4 30 19 -15 -6 -12 49 10 -3 19 11 0
6558@j8K5J9l5jL0ml6K4L4l7j5L8m8J3K3j8oqK8qJ4k7j7J6j6K9j3pK6j3MK6j9
$$ 0 -18 7 26 -9 -10 20 16 -20 4 38 1 -14 24 -24 -11 12 -6 -12 -20 8 0 14 -13 -30 -14 -30 -1 -14 -21 5 -8 -4 22 3
6592CPpk7L5k6L6k4j4j9O1n6J5J8Lj1J0ML9m6K2k9K2l2kJ5kJ4j3J7l1K6MRj5k
$$ 3 10 3 -24 11 -15 21 -3 -17 -36 25 -31 -16 2 5 -6 4 8 47 1 23 -6 16 -16 -18 -3 -5 9 -4 13 -18 8 12 21 6 4
6627Dk8kM0J1lj5k1J7nK0k0QoM1n2J5lmLQNm1L3j2k1J4J6Lk3PMJ7j9J3j7LPJ1
$$ 4 -24 -26 14 25 22 7 -14 3 -2 18 -2 6 0 41 -11 4 1 -3 0 8 13 -28 5 -7 -28 -14 2 5 -18 -11 -7 10 -9 4 -13 -10 -3 8
6665Hkj6Jj3M1m8K1J3j4J8J9k5J5j1n4M8j7j2K6L3j8j1j2L1m1J1K7j9%kJ5J0l0
$$ 8 6 -10 -9 -22 19 -29 -8 5 -9 9 28 3 18 7 -47 1 -16 -28 -2 31 13 2 -10 21 -20 -9 18 -1 -1 -3 12 22 -8
6698hK2j1l5O0n3K9k6J3J4k9K1K0%l6L6m%%m5L0j9kO1l8%mj1RK7J5j4k8KOK0j6
$$ -8 14 3 -32 28 -25 4 -22 -9 5 -24 -3 17 17 -19 17 13 13 13 -32 -2 -21 -23 38 0 0 -4 -15 -6 21 36 22 -6 -4 2 22 6
6734Fj3J8j9L1l6J7J5j3k8K3JMNrK5k5J0pj7kL7l4kmL0nJOl0K4j5Pj5k2J5J7O
$$ 6 -7 11 -8 23 -13 4 19 6 -22 1 2 6 11 2 27 2 12 5 -12 -14 23 -11 -13 -17 13 8 9 15 -15 9 -6 1 -14 -36 -21 -4 2
6771BkJ3Jqk2LK2L3k6j9K6k8RLnJ3PNmmj4Jk1oJK7rJ8Ll2K0l6M2k3Nj7jJ7Oj5
$$ 2 0 13 14 6 -16 -13 9 42 16 -3 23 -5 4 7 2 15 22 27 23 19 5 6 -15 -21 -20 7 -2 16 19 -13 7 -29 13 -10 -5 -22 -23 -6 0 -15
6811a5J1J3j4J3J3j2m2J5QQk2K7j1J1oK1n2N0j7j0lJ1Jl0L0Mmj5L7l0J6k2MLK9
$$ -15 -4 9 -5 8 21 9 -33 -18 -10 -2 -24 3 -8 3 -3 18 -34 16 -1 -11 -14 -3 -2 -32 -2 2 -2 -17 20 -10 6 -16 -12 -9 20
6846B0jj5OpJ6lj6J9K1l9pJ7nJj6J9k7QML1j8k0RK5m5NL4k5j3QK3n2M6qJ3Jl0
$$ 20 19 4 10 3 19 16 0 19 40 1 -6 11 6 7 -9 10 -17 -9 -5 26 8 -12 -3 22 -23 -18 16 -9 -22 -14 9 -43 3 -5 8 9 -21
6883b1nM7j5k2nL1j0Pk6L1nppnnL1j8j0PnL2k5J3k3L1poJ1j5oQK7j8m2M9j6jL
$$ -21 -26 21 6 -16 -21 10 0 7 -19 12 7 0 -7 -12 -17 14 -4 -14 -7 -12 20 -5 8 -15 16 9 3 14 -1 -7 1 28 10 -32 17 1 0 3
6921Cj0L2l9J5K2j6k5JJ6lPJ6l0k0L0J3j3K0l2J7L4l8nmPJ6Lkl8L8pj9K3j4J6
$$ 3 -7 25 -14 1 23 7 -18 -17 -1 -4 3 19 -11 -31 -1 12 -1 19 -13 4 38 0 -5 -9 -2 14 17 15 -23 15 8 -11 12 -2 14
6956A4J6j0Mjm3QJ3Pk1J8k8K2PJ0mk2OM2Ln8lM7jn3L8k3mK5j4NL0l6oJ9nJ3k9
$$ 14 30 20 24 23 -20 -12 1 8 -13 5 -23 -1 6 16 12 -10 -4 38 41 -17 -20 27 26 -27 11 -12 -16 9 -5 0 30 -6 -12 7 2 15 -14
6993a4K8Jj6mNl0N4k1J1j5j5K9k4J1Ooj6J0J2K2j5k4J4lJkK4k1RL2l2k9%J6K5
$$ -14 14 15 -1 -5 0 -30 24 3 14 -1 -16 13 -11 0 6 0 -16 -6 6 28 13 -11 3 0 1 -1 23 2 11 43 11 -18 -18 -2 23
7028B3k5KK5rOj0l9K6j6J0J9k0K6Jm5J1M9m5OJ0pLnM0l9RPJ2k7oK4l5K7j5kK5
$$ 23 -2 0 25 16 22 12 -27 -1 -17 -7 12 -8 18 19 -26 -15 34 -11 -5 5 -2 1 -4 36 -3 6 13 25 -2 -8 16 -19 8 -7 -9 16
7064A6lm5K6K1Mrl6NM3k1K6n8K0plK7k7L5Pj7LMmj7J4k1K3J1K4n4j7L1LQNj8%
$$ 16 13 -32 -6 15 19 10 -26 -21 22 1 27 -31 -11 -18 -21 6 -21 14 21 4 7 11 7 -10 4 -17 6 17 41 -13 -30 1 4 12 17 -1 -1
7101aJ4qk7K8Om6L7Jk0j2M8l4K8l1K9j9Mj0RMkPJ1l3mJ0J8j4k1J7J5OQl6nJ5O
$$ -1 13 5 -22 6 12 -34 3 4 -16 -28 20 -14 14 -17 12 -7 -3 -13 -4 0 -2 5 16 -17 -21 -11 7 -7 -28 -11 4 10 18 -18 -23 -8 -2
7138bONl1K7j4K9k5K7%n3MN8l5R%PNmjm1J7J9j1l2L5ml1N0Rk5K2m2K7Rm1L1j7
$$ -2 4 9 -22 5 -9 20 -5 22 22 -31 -27 31 -4 5 5 12 17 13 12 -29 -12 7 -4 -36 -1 -5 -36 14 23 -2 20 -22 5 14 -27 4 -13
7175a3rJ4JL1j5kj4mRNl1%K0QMj1lJ7j0K1l2QlK0%J0k5KnLJ3Kk0J4K9l0RnK5m5
$$ -13 -22 -8 -7 24 9 7 -7 -11 -2 3 -28 -28 -8 0 4 -7 -10 7 -3 18 -14 -6 -9 11 11 21 -4 -2 -7 -4 9 11 -9 5 34 4 13 8 33 -12
7215a2J1J%j3K1kJ6kj3l6L1NJ7m1J7KpK7j2rj2%L3j4j9RKj3K8k2rK6k1J6j2K2
$$ -12 -1 0 0 -13 8 6 22 20 7 -29 2 7 24 -17 0 2 -5 22 10 1 -11 -11 22 8 -11 -2 0 -13 15 -7 -16 10 -11 5 -7 15
7251A5j1J5Mj6KoPpK1rjl2J3K0j6%J6j3rJ0Pj2pQPj5j9L6j2K5rJrmj5L6j3mj3
$$ 15 4 19 23 7 9 3 10 3 24 15 14 -18 -5 15 -1 -1 15 2 -7 3 10 -2 -9 -1 6 -9 -28 8 -4 21 12 13 4 0 -15 21 8 4 -9
7290iJK5Kk7OkpJ8k3QK8l8L1om3N0j5k3K0J3knj8kM3k8P%nkK1k3QqNOK9k7%KJ
$$ -9 -8 17 19 -8 -2 -4 -11 7 -16 -8 20 -18 13 7 -36 14 -1 -24 -4 9 7 2 -16 -18 25 -3 4 4 -1 -3 18 -5 3 -5 0 6 35 8 8 10 11
7331A1nJ4k2J0j3k2M9l2L1m0J8kK8m1K2rRlqJ5J1j4n%Rj4K1j4k9M8n6L4L1l7j
$$ 11 6 20 -2 8 -5 -27 22 -10 21 -19 -1 -3 25 -16 6 -3 6 3 -5 10 21 7 2 2 11 -3 18 4 -25 23 -33 1 32 -5 -6
7366fnK2k7K9jk5Rk1L1j0J2j3KK1KPnl6L9JnpopK9rj9Plj0J6l2L3j1kJ0J7j0J1
$$ -6 -11 11 -16 13 12 -13 -4 -25 6 -4 8 -5 -3 18 20 27 22 -14 25 26 21 14 8 1 30 21 2 9 6 -4 12 -20 13 2 0 10 27 17 28
7405B8k0j9QlJ5j9J1k1L2kJj9Mk8L1k5K7Nj1K7k8K5k5rRL7l7Jk6M1j4MpMkj1K0
$$ 28 8 -11 -3 -6 9 -10 1 -20 12 10 11 -8 -4 -32 -1 -26 1 6 -5 22 -6 19 -6 -15 -6 31 -6 -5 -31 10 -4 0 -7 -3 -5 -16 4
7442Dk1K3QJ9k1qJ0k5Rj3K2KrRkJ1l2L3l6K1j4MJ5j7K9k8pLK7qj5%lK0j7O%Kj3
$$ 4 -17 6 14 33 12 4 14 -11 -2 -15 7 9 0 9 7 18 -14 19 -17 4 -10 -6 9 -8 21 -7 -14 -11 16 8 -7 -7 -10 10 -7 -1 -1 1 -12
7481a2J0K0o0K5rL1LJ3j0m3M0RRl0KJ9k2J5Rk4mJ6mL2n9lM8l6J2Ln5K8L3J1j2
$$ -12 -2 18 -42 -17 -26 5 8 21 11 -32 8 17 26 -4 -2 17 -5 10 19 -5 -9 7 3 35 -24 -27 21 -15 -3 0 -55 -27 6 17 5
7516Ej4lL6l1J2M%Pj0Nj7j3J8J3Lj7j6J7Nj6NqrL3J7nj4nmL0l4jJ3kM%JJ1j9P
$$ 5 -9 -12 24 -7 5 9 9 16 6 11 -6 -19 -1 12 15 -2 -18 -1 4 -12 -7 -15 -24 9 26 21 7 2 -2 28 -6 -7 6 4 8 8 9 20 1 8
7556Hj8J7J8k0LpJ1J3k7j1KpK3Noj3K7k0%J9j5J3j7Nj2J2Ok7J5Oj8mM5Pk6j0q
$$ 8 -10 7 25 5 8 1 12 25 -2 -13 -11 -18 5 10 4 -9 18 -2 -2 17 2 15 -2 3 -9 3 9 -18 -3 3 -15 -19 26 33 7 -3 -11
7593a1rJ8j6K8k9MK0l0L6j0rQk1L1m3K1mkM0j5k8JJ3K5Ql6QJ5ok9J2N2n1qJ8j2
$$ -11 -20 -2 -18 10 -19 -15 5 -25 11 1 -8 0 -21 10 -33 -12 -16 -18 22 7 -21 -20 -7 18 26 -10 -2 13 7 -22 -10 42 -9 -17 1 -11
7629a1qJ8J4k6J5J7ml3K8nk1J3Kj6J6Nj4K8j8j0JL0k5L0l3K1J7n3J2k3L1jNJ4
$$ -11 -19 -1 13 -13 2 19 15 -18 10 5 -16 -3 -1 -17 -1 4 -10 18 0 -10 -9 21 -4 26 -7 14 31 -22 -10 -33 -2 -3 2 16
7663A6j2j3L3k7mM4j7j6k1M6l0Nj0LK7j4k1oJ3J6Mj1mQj7RK2j8j9K5K0l1J7mK
$$ 16 4 -9 24 -3 -7 37 20 4 -17 29 -1 4 -6 -3 24 10 -11 -17 -4 12 16 5 1 9 -8 1 23 5 -14 11 31 0 17 13 15
7698A5qk3N2k3%n4K3Mk1K1jJ5l6M3rRK1k0JK2l1LK8k0%lJljKK0j3jJ8m4K2k2P
$$ 15 7 -16 36 13 13 -41 -18 -14 -35 -14 -15 0 -36 7 -2 7 28 8 9 31 0 3 31 11 11 8 9 6 5 7 27 14 13 31 -13 9 -13 -6
7736fL0k2j3K2j0l3N1J5m5K3nNj6PJ4j7k9L2kJ8k3k0K9J8j6joLjj0K7j2k4QQO
$$ -6 24 2 -11 11 1 -32 19 34 -11 12 7 12 -4 3 17 0 -29 3 1 19 -4 -24 5 23 7 6 0 3 2 -8 19 7 -17 -9 -1 5
7772El7L6j1oM1l1oOKJ7l2RN3m9J7oK0l1K3%k2J2J0j5J9k3J3lj2rPOj8j2K2pR
$$ 5 -32 4 -7 -13 28 -3 -9 -3 -1 16 -16 -7 46 -3 14 8 28 -3 20 20 -2 10 20 5 24 1 14 11 -1 -10 -3 3 -15 -27 -5 -12 -3
7809cj7J7j3j9M5k5J2Ll9M0Pm4L8pNJ6n3L0j0J5Oj2k3N1k4mL2l9N1n4K4KLlMj4
$$ -3 -20 -3 -16 -35 10 -15 -3 0 -39 1 8 -36 2 -5 0 16 -37 -7 -17 -2 4 -8 -31 20 -4 -8 24 -15 36 -18 6 8 11 8 12 -2
7845boK2J1oj0%Jk3L6j1knJ4k5lPK1k7L3n0MM0j1K4k7k4LORk0J1M0l2j8QJK6j5
$$ -2 -8 14 25 19 9 9 10 -13 23 12 10 5 19 -6 -9 -2 19 -8 25 -25 -21 19 8 32 5 -19 -16 -10 -1 -21 -10 30 -2 -20 -12 -11 15 0
7883@Kkplj9QK0jJ2Jqmj3J1Qk1L7ok4%J2orRK6Pl0j6K5j2J5k2pJ3K0m3N3l5lK
$$ 0 2 0 -7 -10 -29 -21 -1 -2 10 11 3 -1 -14 -3 5 -16 21 15 -9 -9 3 -3 -12 -3 23 30 0 -16 9 -3 12 -10 -17 -4 16 -27 26 -9 -12 -10
7923a0J8LK0j9K6l9Qj1Qnl2M3l5J6%Kj6J6lK4k0Lj7L5K4l1j3k6OJ8J8PonRqK3
$$ -10 8 11 31 12 38 -1 7 -4 4 -1 -33 10 -25 -9 -9 -7 -23 -7 -10 14 -6 -3 -20 15 39 8 -5 -31 -25 -7 11 18 12 7 16 8 31
7960C1k2J7k4NK7l8k2J9RpJ1JnJ7j4Mj1j2MJ0Kj1K4k6MK3Lnm0N0m2QK0j3%j7R
$$ 31 9 26 2 7 34 -4 -26 -7 2 -5 6 7 2 19 5 9 -2 -14 -10 0 2 -9 15 -11 -7 16 19 14 -26 24 -18 -10 10 -3 -3 -20 -11
7997a1J1N3k8k6J0j3looJ0NLK7ok0Jkj7K1j0k2K8oj1K4JJk0M3j9m0L7l1j0J7L3
$$ -11 0 53 25 -1 9 -4 -7 -13 -19 -9 -4 -1 26 20 0 1 -1 -18 3 -7 -29 -1 -7 -18 6 7 8 -12 31 12 -28 9 -22 -32 -15 18
8033A8m7rM3J8l9J1jPNj3J5qNLj8Nj9J9Ol4M4l2J3k4L6k3L0j5j5J0o%K6qJ0rQ
$$ 18 -29 -38 5 23 -16 -5 -6 1 6 -7 8 0 5 8 -10 -5 -24 -5 1 -33 11 -21 -8 -32 4 -19 11 -4 -19 -9 -15 -15 11 3 13 4 12
8070A2k6j7K4Qlk1M9j7j5Rk4M4j8lj9J0K1J8m3j6L5pNj4rJ9ORj5l5N8k7m%mK3
$$ 12 -14 -31 -7 1 -2 -23 26 9 -6 3 -21 23 5 2 -17 -7 14 32 -11 -27 8 1 6 -8 -17 2 8 17 2 -33 25 -2 -6 -6 -10 13
8106A3rj3J6pJ2l0K9nJ4j7j0k4J5J2PM5n7J9k0j0K0Lk1L5m4K6jm3M6pm%K7J3l6
$$ 13 4 -9 7 0 12 -18 11 6 20 3 -7 -31 -16 -4 3 48 -9 10 -10 -20 0 3 -18 17 -27 -1 -2 -45 1 -6 -10 -10 17 30 -6
8141fjlkN2m8K3l6M4qLj3J6l4%J4j0L0j8J1lj4K2j5Lk8L0pmk7J6L2k9nMK4j4J1
$$ -6 -7 -10 -12 40 -8 15 -21 23 15 18 5 21 -13 -13 1 -9 21 3 14 11 -3 19 4 7 -21 9 2 -2 -29 -13 19 -10 -15 -11 13 -1 10
8178A0J4m5K9PmqJ4k0K7k9k8M5k5
$$ 10 24 -21 8 15 11 3 17 -3 24 -5 -33 12 -13
8191a3
##END NTUPLES=NMR FID
##END=
