##TITLE=1H_LR-685B-C1M-TFA
 CDCl3, 8 sc, 
 30.7.2019
##JCAMPDX= 6.0         $$ Bruker NMR JCAMP-DX V2.0
##DATA TYPE= NMR FID
##DATA CLASS= NTUPLES
##ORIGIN= UXNMR, Bruker Analytische Messtechnik GmbH
##OWNER= root
$$ XWIN-NMR		Version 3.5
$$ Tue Jul 30 15:22:59 2019 Russian Standard Time (UT+4h)  she@DPX200
##.OBSERVE FREQUENCY= 200.13155
##.OBSERVE NUCLEUS= ^1H
##.DELAY= (6, 6)
##.ACQUISITION MODE= SIMULTANEOUS
##.ACQUISITION SCHEME= undefined
##.AVERAGES= 8
##.DIGITISER RES= 18
##SPECTROMETER/DATA SYSTEM= spect
##.PULSE SEQUENCE= zg30
##.SOLVENT NAME= CDCl3
##.SHIFT REFERENCE= (INTERNAL, CDCl3, 0, 15.7039)
##AUDIT TRAIL= $$ (NUMBER, WHEN, WHO, WHERE, WHAT)
$$ ##TITLE= Audit trail, XWIN-NMR		Version 3.5
$$ ##JCAMPDX= 5.01
$$ ##ORIGIN= Bruker BioSpin GmbH
$$ ##OWNER= she
$$ F:/spectra/data/she/nmr/H-F/1/audita.txt
$$ ##AUDIT TRAIL=  $$ (NUMBER, WHEN, WHO, WHERE, WHAT)
(   1,<2019-07-30 15:21:58.42 +0400>,<she>,<DPX200>,
      <created by zg, POWCHK disabled, PULCHK disabled
       configuration hash MD5:
       00 E9 B6 7A A2 85 ED C7 34 08 36 98 17 FE 4E 26
       data hash MD5: 16K
       BE BF 9C 53 A0 D1 1A C1 E6 AE B4 CE A2 1D 41 8F>)
$$ ##END=
$$ 
$$ hash MD5
$$ 2A 1C F7 5C EC E8 BF 44 7A AD 20 18 8C CC 86 B6
##$RELAX= 
##$RELAX= 
##$RELAX= 
##$RELAX= 
##$RELAX= 
##$RELAX= 
$$ Bruker specific parameters
$$ --------------------------
##$DU= <F:/spectra>
##$EXPNO= 1
##$NAME= <H-F>
##$PROCNO= 1
##$TYPE= <nmr>
##$USER= <she>
##$AMP= (0..31)
100 100 100 100 100 100 100 100 100 100 100 100 100 100 100 100 100 100 
100 100 100 100 100 100 100 100 100 100 100 100 100 100 
##$AQSEQ= 0
##$AQ_mod= 1
##$AUNM= <au_zg>
##$AUTOPOS= <>
##$BF1= 200.13
##$BF2= 200.13
##$BF3= 200.13
##$BF4= 200.13
##$BF5= 200.13
##$BF6= 200.13
##$BF7= 200.13
##$BF8= 200.13
##$BYTORDA= 1
##$CFDGTYP= 0
##$CFRGTYP= 5
##$CHEMSTR= <none>
##$CNST= (0..31)
1 1 145 1 1 1 1 1 1 1 1 1 1 1 1 1 1 1 1 1 1 1 1 1 1 1 1 1 1 1 1 1 
##$CPDPRG= <>
##$CPDPRG1= <>
##$CPDPRG2= <>
##$CPDPRG3= <>
##$CPDPRG4= <mlev>
##$CPDPRG5= <mlev>
##$CPDPRG6= <mlev>
##$CPDPRG7= <mlev>
##$CPDPRG8= <mlev>
##$CPDPRGB= <>
##$CPDPRGT= <>
##$D= (0..31)
0 1.2 0 0 0 0 0 0 0 0 0 0.03 0 0 0 0 0 0 0 0 0 0 0 0 0 0 0 0 0 0 0 0 
##$DATE= 1564485717
##$DBL= (0..7)
120 120 120 120 120 120 120 120 
##$DBP= (0..7)
150 150 150 150 150 150 150 150 
##$DBP07= 0
##$DBPNAM0= <>
##$DBPNAM1= <>
##$DBPNAM2= <>
##$DBPNAM3= <>
##$DBPNAM4= <>
##$DBPNAM5= <>
##$DBPNAM6= <>
##$DBPNAM7= <>
##$DBPOAL= (0..7)
0.5 0.5 0.5 0.5 0.5 0.5 0.5 0.5 
##$DBPOFFS= (0..7)
0 0 0 0 0 0 0 0 
##$DE= 6
##$DECBNUC= <off>
##$DECIM= 24
##$DECNUC= <off>
##$DECSTAT= 4
##$DIGMOD= 1
##$DIGTYP= 9
##$DL= (0..7)
0 120 120 120 120 120 120 120 
##$DP= (0..7)
150 150 150 150 150 150 150 150 
##$DP07= 0
##$DPNAME0= <>
##$DPNAME1= <>
##$DPNAME2= <>
##$DPNAME3= <>
##$DPNAME4= <>
##$DPNAME5= <>
##$DPNAME6= <>
##$DPNAME7= <>
##$DPOAL= (0..7)
0.5 0.5 0.5 0.5 0.5 0.5 0.5 0.5 
##$DPOFFS= (0..7)
0 0 0 0 0 0 0 0 
##$DQDMODE= 0
##$DR= 18
##$DS= 0
##$DSLIST= <SSSSSSSSSSSSSSS>
$$ [...]
##$SUBNAM2= <"">
##$SUBNAM3= <"">
##$SUBNAM4= <"">
##$SUBNAM5= <"">
##$SUBNAM6= <"">
##$SUBNAM7= <"">
##$SUBNAM8= <"">
##$SUBNAM9= <"">
##$SW= 24.9336996594482
##$SWIBOX= (0..15)
0 0 2 0 0 0 0 0 0 0 0 0 0 0 0 0 
##$SW_h= 4990.01996007984
##$TD= 16384
##$TD0= 1
##$TE= 0
##$TE2= 300
##$TE3= 300
##$TEG= 300
##$TL= (0..7)
0 120 120 120 120 120 120 120 
##$TP= (0..7)
150 150 150 150 150 150 150 150 
##$TP07= 0
##$TPNAME0= <>
##$TPNAME1= <>
##$TPNAME2= <>
##$TPNAME3= <>
##$TPNAME4= <>
##$TPNAME5= <>
##$TPNAME6= <>
##$TPNAME7= <>
##$TPOAL= (0..7)
0.5 0.5 0.5 0.5 0.5 0.5 0.5 0.5 
##$TPOFFS= (0..7)
0 0 0 0 0 0 0 0 
##$TUNHIN= 0
##$TUNHOUT= 0
##$TUNXOUT= 0
##$USERA1= <user>
##$USERA2= <user>
##$USERA3= <user>
##$USERA4= <user>
##$USERA5= <user>
##$V9= 5
##$VALIST= <valist>
##$VCLIST= <CCCCCCCCCCCCCCC>
##$VD= 0
##$VDLIST= <DDDDDDDDDDDDDDD>
##$VPLIST= <PPPPPPPPPPPPPPP>
##$VTLIST= <TTTTTTTTTTTTTTT>
##$WBST= 1024
##$WBSW= 4
##$XGAIN= (0..3)
0 0 0 0 
##$XL= 0
##$YL= 0
##$YMAX_a= 233408
##$YMIN_a= -251594
##$ZGOPTNS= <>
##$ZL1= 120
##$ZL2= 120
##$ZL3= 120
##$ZL4= 120
##$ABSF1= 10
##$ABSF2= 0
##$ABSG= 5
##$ABSL= 3
##$ALPHA= 0
##$AQORDER= 0
##$ASSFAC= 0
##$ASSFACI= 0
##$ASSFACX= 0
##$ASSWID= 0
##$AUNMP= <proc_1d>
##$AZFE= 0.1
##$AZFW= 0.1
##$BCFW= 1
##$BC_mod= 2
##$BYTORDP= 1
##$COROFFS= 0
##$CY= 11.3945322036743
##$DATMOD= 1
##$DC= 2
##$DFILT= <>
##$DTYPP= 0
##$F1P= 20.1537800932815
##$F2P= 0.134698688090026
##$FCOR= 0.5
##$FTSIZE= 0
##$FT_mod= 4
##$GAMMA= 1
##$GB= 0.15
##$INTBC= 1
##$INTSCL= 1
##$ISEN= 128
##$LB= 0.24
##$LEV0= 0
##$LPBIN= 0
##$MAXI= 10000
##$MC2= 0
##$MEAN= 0
##$ME_mod= 0
##$MI= 1.114404
##$NCOEF= 0
##$NC_proc= 0
##$NLEV= 6
##$NOISF1= 3.799351
##$NOISF2= 2.8
##$NSP= 1
##$NTH_PI= 0
##$NZP= 0
##$OFFSET= 15.70392
##$PC= 1
##$PHC0= -9220.214
##$PHC1= 15.00097
##$PH_mod= 1
##$PKNL= yes
##$PPARMOD= 0
##$PSCAL= 0
##$PSIGN= 0
##$REVERSE= no
##$SF= 200.130013532006
##$SI= 16384
##$SIGF1= 3
##$SIGF2= 2
##$SINO= 400
##$SIOLD= 16384
##$SREGLST= <1H.CDCl3>
##$SSB= 0
##$STSI= 0
##$STSR= 0
##$SW_p= 3612.71676300578
##$SYMM= 0
##$S_DEV= 0
##$TDeff= 0
##$TDoff= 0
##$TI= <>
##$TILT= no
##$TM1= 0
##$TM2= 0
##$TOPLEV= 0
##$USERP1= <user>
##$USERP2= <user>
##$USERP3= <user>
##$USERP4= <user>
##$USERP5= <user>
##$WDW= 1
##$XDIM= 8192
##$YMAX_p= 0
##$YMIN_p= 0
$$ End of Bruker specific parameters
$$ ---------------------------------
##NTUPLES= NMR FID
##VAR_NAME=  TIME,          FID/REAL,        FID/IMAG
##SYMBOL=    X,             R,               I
##VAR_TYPE=  INDEPENDENT,   DEPENDENT,       DEPENDENT
##VAR_FORM=  AFFN,          ASDF,            ASDF
##VAR_DIM=   8192,          8192,            8192
##UNITS=     SECONDS,       ARBITRARY UNITS, ARBITRARY UNITS
##FACTOR=    0.0002004,     1,               1
##FIRST=     0,             0,               0
##LAST=      1.6414764,     0,               0
##MIN=       0,             -251594,         0
##MAX=       1.6414764,     233408,          0
$$ Real data points
##PAGE= N=1
##DATA TABLE= (X++(R..R)), XYDATA
0 0 0 0 0 0 0 0 8 -8 8 -16 16 -16 24 -32 40 -48 55 -64 73 -88 104 -120 139 -161 185 -212 242 -274 313
29 313 -352 397 -445 499 -558 624 -695 775 -860 952 -1058 1171 -1295 1432 -1587 1759 -1951
46 -1951 2167 -2416 2700 -3027 3419 -3883 4457 -5180 6124 -7418 9307 -12343 18041 -32503
60 -32503 149379 233408 -34524 -73507 -62494 -34745 -31159 87493 199988 185784 5738
71 5738 -139457 -150848 -53163 22968 62462 67481 39209 -56612 -155319 -167761 -60908 58588
83 58588 84859 641 -108982 -181196 -186369 -120053 6732 109311 92029 -53258 -203760
94 -203760 -236678 -142021 -11917 69813 79098 32612 -49424 -130373 -158217 -99889 18137 115048
106 115048 114305 18530 -86176 -111047 -45160 50930 114782 120433 69045 -15143 -79719 -67902
118 -67902 26204 141986 196117 147596 29149 -75277 -90691 -14333 94232 169241 174857
129 174857 107062 -2023 -82460 -71962 17851 111467 142365 103269 24693 -55019 -89215 -45090
141 -45090 53604 124853 101815 144 -96562 -119799 -68598 11396 70851 83314 37210 -53876
153 -53876 -140690 -156693 -81487 29976 90530 61513 -24980 -108372 -146038 -120923 -44711 39977
165 39977 72573 24784 -66400 -131836 -125331 -53673 33163 77619 49162 -32752 -107895 -121245
177 -121245 -62721 28807 95651 95058 29194 -57004 -105405 -84177 -6070 81482 125286 97523
189 97523 16824 -61525 -82703 -33682 52317 119487 121433 59855 -20865 -62829 -40400 29747
201 29747 101569 127548 86267 1958 -65843 -66117 -280 82459 125192 102502 28376 -52091
213 -52091 -88182 -55480 23255 92509 106309 56081 -25472 -87109 -90318 -35113 39749 81120
225 81120 60618 -8699 -80118 -105913 -69394 2344 58663 59520 3739 -72503 -118027 -101327
237 -101327 -32437 40536 67610 31309 -42266 -105170 -117022 -70105 6928 62593 60050 3902
249 3902 -65417 -101068 -80401 -17196 47634 72208 41452 -22706 -73957 -75385 -24206 45752
261 45752 87738 73472 14297 -47249 -69738 -37587 31499 93341 105878 60087 -11981 -59702
273 -59702 -51693 4552 71140 106372 87805 27733 -34112 -55427 -22908 39382 88111 88846 41824
286 41824 -20968 -56927 -43953 7299 62545 82780 52537 -11569 -66552 -75906 -34109 28460
298 28460 69883 61383 8045 -57502 -91591 -73339 -16548 39067 56288 24970 -34467 -82284
310 -82284 -87347 -46013 11837 45985 33515 -16223 -67832 -86993 -59521 -2195 45606 52074
322 52074 12369 -46660 -83320 -71859 -19734 39481 68530 49329 -4411 -56984 -72102 -38125
334 -38125 21600 66892 68916 29578 -22369 -51799 -39219 7170 56631 74193 48629 -680
346 -680 -39975 -42409 -5716 46933 78219 67248 20035 -31410 -53240 -31323 19259 66403 77954
359 77954 45340 -9878 -51394 -52348 -14142 36089 64545 51922 7480 -38753 -55806 -33923
371 -33923 10698 46576 48516 14059 -32969 -60379 -49800 -9226 34538 51863 29523 -18334
383 -18334 -61108 -68920 -37626 12176 47824 46226 8751 -40219 -67889 -56701 -14741 29198
395 29198 46267 26391 -16326 -52343 -56509 -26317 16588 42608 34790 -977 -40243 -56144
407 -56144 -35770 8449 45411 50693 20901 -23713 -53388 -48687 -11428 34041 59063 46683
419 46683 6427 -34691 -48669 -26983 15242 49471 54104 27287 -11955 -36782 -30253 3535
431 3535 40437 54799 37756 819 -30823 -35742 -9803 30453 57028 51052 16077 -23654 -43526
444 -43526 -30320 6937 43942 56264 34586 -6564 -39695 -44303 -18532 19490 44052 37395
456 37395 4612 -31727 -47144 -33046 364 29871 34255 9997 -27238 -52477 -46978 -15300
468 -15300 20010 35092 20235 -15189 -48726 -57350 -35584 1920 31497 32769 5770 -30652
480 -30652 -52135 -44524 -13018 21076 36126 22962 -8796 -37324 -41854 -18198 16550 39344
492 39344 35604 8508 -22432 -35973 -22186 11192 42198 49761 29331 -5458 -30424 -27830 -362
505 -362 33780 51732 43337 14933 -15096 -28466 -15446 15721 42786 46863 25852 -6322 -27288
518 -27288 -24477 -448 27899 40932 29180 -451 -28958 -36540 -19195 11482 33596 31563 6589
531 6589 -25156 -44130 -37575 -10044 19677 31187 15463 -15923 -41523 -44862 -24766 4376 24195
544 24195 20746 -3411 -31310 -44033 -32512 -4638 21014 26411 8906 -19018 -37805 -34404 -11872
557 -11872 16162 31466 24881 60 -25476 -34312 -20385 7906 32074 36581 18384 -9778 -28292
570 -28292 -23854 193 26621 38708 28508 4133 -19062 -24497 -8210 18432 36763 34462 13204
583 13204 -12176 -25282 -17435 5854 28978 36092 22857 -2691 -23996 -26936 -9841 15636 31421
596 31421 28062 7122 -17638 -30772 -22965 1130 24362 29439 12988 -13116 -30580 -28437 -9175
609 -9175 14262 26091 18625 -4516 -26801 -33928 -20061 4103 22712 22803 4942 -18022 -32030
622 -32030 -27908 -8740 13621 24697 16256 -5994 -26800 -31893 -17406 5523 22506 21432 4022
635 4022 -18346 -29637 -22211 -1636 19272 26201 14031 -8412 -25707 -25201 -7513 14532 26860
648 26860 22293 4694 -15225 -24617 -16050 5994 25896 29723 15534 -5506 -19255 -17118 -1884
661 -1884 17743 30063 25150 5433 -14700 -20445 -7570 12661 27028 26397 12153 -6608 -19501
674 -19501 -17060 44 20625 30115 19193 -3325 -20778 -22143 -9066 8749 21027 20020 5782
687 5782 -14727 -27549 -22117 -2547 16166 19186 6607 -12054 -25129 -25811 -12713 5551 16952
700 16952 12666 -5531 -23428 -28870 -18525 -1212 12868 15575 5500 -12675 -26685 -24780 -7618
713 -7618 12097 20029 12713 -2859 -16865 -20784 -12026 5334 20430 22369 9511 -8288 -18481
726 -18481 -13331 3335 20116 26134 17026 503 -12299 -13781 -2237 14227 25461 23621 10274
739 10274 -6906 -15806 -10889 5568 21493 26013 14621 -3108 -15042 -15422 -4063 10777 20522
752 20522 17964 3157 -14476 -21593 -13647 2945 15336 16021 5151 -10949 -22556 -21025 -6719
765 -6719 9962 16139 8086 -7686 -20037 -21877 -14020 411 12370 14449 2871 -14518 -24275
778 -24275 -18367 -2598 11035 14169 7436 -4223 -15440 -19051 -10130 6350 18466 16142 2336
791 2336 -12223 -16988 -10286 2974 15096 18541 10588 -3808 -14587 -13566 -1204 12584 18766
804 18766 14952 3465 -8536 -14220 -9211 4669 17565 19423 8903 -5437 -14038 -11977 -1036
817 -1036 11088 17959 13500 926 -11834 -15536 -7509 7048 16916 15491 2994 -9615 -15268 -10344
831 -10344 834 11757 15534 8737 -3764 -13720 -14713 -6559 5801 13863 12229 2496 -9734 -16192
845 -16192 -12180 -701 10347 13472 6438 -5777 -15434 -15284 -5710 6064 12716 9138 -2285 -13556
859 -13556 -17143 -10120 2302 10671 10645 2253 -8964 -15458 -13394 -4118 6819 11798 8358 -1573 -11638
874 -11638 -14808 -8538 3012 11914 12377 4469 -6361 -12409 -9461 810 11454 14415 9373 -553
888 -553 -8816 -10142 -2418 9807 16641 13965 4328 -5040 -9021 -5372 4092 13560 16514 10545 -546
903 -546 -8881 -9096 -1422 8705 13955 11513 2149 -7604 -11370 -6840 3098 10407 10254 2495 -7625
918 -7625 -13123 -10980 -3123 4845 8918 4730 -4655 -13421 -15412 -9457 -468 6292 6886 185 -9260
933 -9260 -15157 -13541 -4985 4275 8362 3980 -4701 -12290 -12675 -5705 3482 9370 8124 919 -7266
948 -7266 -10486 -6525 2722 10382 12105 6963 -1466 -7389 -6684 -313 8329 13794 12255 5264 -2919
963 -2919 -7125 -3358 5282 12273 13058 7377 -903 -6201 -5324 960 9183 12566 8493 -235 -7488 -8966
979 -8966 -3030 4747 9595 8555 1731 -6270 -10934 -8944 -1924 5217 7758 3878 -3674 -9862 -11015
994 -11015 -6494 399 5557 5093 -866 -8283 -12137 -8955 -1191 5040 5990 1813 -5576 -10365 -9641 -3566
1010 -3566 4184 8339 5638 -841 -7636 -9025 -5359 1313 7492 8876 4547 -2295 -7119 -6436 -784
1025 -784 6125 9333 6806 1236 -4778 -6555 -2352 4423 9185 8836 3381 -3921 -7081 -4628 1777
1040 1777 8098 9887 6483 -442 -6372 -6987 -2060 4625 8665 7378 2009 -4056 -6782 -4607 698
1055 698 6076 7194 3598 -2251 -6699 -6092 -1110 4487 7097 4544 -682 -6089 -7952 -4796 1678
1070 1678 6679 6409 2117 -4145 -8096 -7169 -2643 3181 6189 4104 -1507 -6411 -7750 -4566 733
1085 733 4348 4426 94 -5094 -7807 -6133 -987 4180 5141 2492 -2892 -7091 -7283 -2761 2575 6161
1101 6161 5472 1106 -4572 -6760 -4425 532 5533 6931 4017 -741 -4484 -4252 -324 4621 7337
1116 7337 5885 1473 -2812 -3864 -972 3752 7458 7251 3506 -1364 -4439 -3296 1546 5958 7740
1131 7740 5560 552 -3909 -5178 -2403 2190 5357 4959 1421 -3083 -5631 -4737 -738 2676 3686
1146 3686 1051 -3148 -6060 -6544 -3221 790 3308 1920 -2156 -5956 -7666 -5743 -1426 2594 3697
1161 3697 1217 -3686 -6781 -6457 -3302 1194 3899 3106 -138 -3773 -5147 -2899 1017 4322 4544 1571
1177 1571 -1741 -3444 -2494 1259 4905 6743 4484 649 -2875 -3074 -296 4053 6913 6329 3277 -832
1193 -832 -3066 -2320 1081 4549 6086 3779 288 -2530 -2869 -824 2325 4429 3166 323 -2963 -4289
1209 -4289 -2724 488 3048 3273 488 -3084 -5563 -4949 -2103 1470 3594 2106 -1541 -4422 -5713
1224 -5713 -3935 -884 2042 2695 348 -2275 -4406 -3979 -1278 1621 2854 1869 -926 -3710 -3699 -1388
1240 -1388 2058 3729 3169 679 -2750 -4043 -2270 616 3655 4796 3112 -246 -3007 -3294 -1168
1255 -1168 2246 4441 3567 1255 -1655 -2712 -1595 910 3053 3492 1980 -1009 -2689 -2090 125 3006
1271 3006 3882 2456 -94 -2945 -3528 -1887 1333 3799 4005 1592 -1133 -3169 -2850 -828 1985 3280
1287 3280 2434 -292 -2335 -2849 -893 1089 2601 2284 349 -1704 -3044 -2029 436 2742 3202 1425
1303 1425 -1724 -3742 -3666 -1540 1151 3014 2221 177 -2697 -3860 -3004 -456 1611 2432 700 -1277
1319 -1277 -3026 -2889 -1318 1054 2187 915 -1210 -2831 -2823 -1214 964 2692 2738 675 -1772 -3048
1335 -3048 -2176 179 2766 3590 2708 343 -2081 -2193 -514 1777 3219 3328 1514 -167 -1226 -404
1351 -404 1497 2977 3222 1563 -127 -1408 -908 488 2311 3371 2588 346 -1882 -2496 -1647 422
1367 422 2326 2432 978 -1137 -3057 -2960 -1590 582 1514 660 -799 -2610 -3126 -2100 -440 909 824
1384 824 -555 -2527 -3582 -2418 -817 1028 1755 482 -1383 -2993 -3243 -1390 637 2345 2332 640
1400 640 -1114 -2232 -1539 339 1753 2700 1802 411 -951 -912 666 2052 2751 2134 844 -532 -1011
1417 -1011 -208 1516 3069 3146 1602 -104 -1316 -1407 230 1626 2981 2388 717 -1261 -2013 -1309 300
1434 300 1247 1418 541 -789 -1876 -1812 -650 493 1148 413 -1264 -2402 -2665 -1572 137 1329 1148
1451 1148 -103 -1902 -3095 -2089 -563 1183 1641 1011 -1177 -1851 -2302 -1232 659 1118 1256 287 -1257
1468 -1257 -1734 -731 422 1465 1622 836 -388 -1028 -1194 156 1447 2063 1670 240 -986 -1684 -937
1485 -937 953 2121 2099 1140 -263 -1570 -1037 -114 1266 1550 1103 146 -895 -903 -427 942 1616 1177 331
1504 331 -983 -1366 -1134 227 1541 2118 874 -266 -1681 -1613 -845 950 1533 1671 414 -979 -1847
1521 -1847 -1191 46 911 1326 757 -464 -1424 -1281 -401 563 1329 589 -605 -1381 -1725 -1395 94 1099
1539 1099 886 68 -958 -1664 -1815 -577 475 1074 777 -568 -1104 -1424 -1277 74 959 803 482 -760
1557 -760 -1258 -433 398 1129 1151 699 30 -744 -554 71 1432 2144 1793 819 -266 -885 -360 618 1578 2175
1577 2175 1650 712 -742 -793 -152 747 1197 1345 359 -679 -609 -375 453 720 730 -57 -995 -1572 -1336 -390
1597 -390 607 759 363 -928 -1535 -1933 -1681 -366 738 794 -63 -1131 -1924 -1686 -948 192 693 260 -603
1616 -603 -1215 -1290 -284 192 797 580 234 -641 -720 -429 271 1270 1809 1208 0 -715 -717 35 1210 1733
1636 1733 1923 1207 61 -687 -16 475 1262 1529 1282 209 -85 -537 -60 514 1257 1044 -505 -791 -1118
1655 -1118 -329 273 928 796 54 -1014 -1522 -1433 -739 144 830 276 -416 -1128 -1558 -1272 -509 272 582 -87
1675 -87 -665 -889 -926 -277 399 620 -18 -435 -944 -837 -133 680 875 652 247 -456 -1171 -944 180 851
1695 851 1139 767 131 -467 -489 33 438 825 872 692 14 -711 -448 117 550 783 498 -551 -793 -747 -55
1716 -55 643 931 582 56 -711 -979 -692 199 737 945 599 -64 -1028 -1000 -235 495 883 621 26 -709 -375
1737 -375 -282 81 568 823 200 -340 -658 -719 145 807 897 248 -109 -551 -910 -444 91 730 650 20 -409
1758 -409 -992 -676 -17 229 507 127 -462 -820 -791 -243 168 405 234 -214 -568 -1137 -590 -152 701 685 331
1779 331 -555 -712 -826 -335 237 726 744 227 -459 -713 -352 554 777 966 524 -68 -244 -160 184 640 941
1800 941 617 -7 -150 -275 -77 600 1297 844 529 -405 -790 -691 -34 729 547 441 -175 -749 -939 -861 -293
1821 -293 293 9 -315 -852 -981 -834 -238 82 222 -167 -711 -637 -659 -504 239 364 230 -206 -755 -672 -682
1842 -682 -85 482 704 536 -271 -475 -421 -243 548 689 698 499 -72 -268 12 321 908 1167 502 -88 -46
1863 -46 -36 218 869 1004 691 78 -542 -598 -167 254 614 932 179 -424 -821 -519 -371 244 264 45 -204
1884 -204 -689 -797 -547 -324 440 257 -5 -868 -938 -759 -151 396 -100 297 -403 -751 -677 -161 249 730 532
1905 532 98 -459 -308 -316 -235 502 665 650 -186 -431 -633 131 750 272 622 99 -461 -284 -200 217 937 880
1927 880 159 -119 -525 -385 -215 266 670 161 -42 -512 -572 -401 74 337 337 145 -170 -136 -384 -78 366
1948 366 331 192 31 -631 -94 125 610 616 264 153 -368 -639 -501 713 903 738 220 -76 -38 -151 92
1969 92 296 530 479 -212 -221 -595 -182 66 276 365 327 -358 -674 -514 -143 385 540 209 -231 -648 -814 -729
1991 -729 -102 317 220 92 -326 -557 -452 -451 -217 384 24 19 -166 -393 -115 -5 453 384 -192 -558 -204 5
2013 5 416 756 782 529 -119 -254 -409 449 508 569 849 449 18 -241 -51 499 640 474 404 88 -366 -127
2035 -127 71 136 186 196 -45 -252 -374 -199 130 182 118 -190 -323 -425 -399 -73 -2 132 -50 -158 -603 -874
2057 -874 -514 -107 202 60 16 -388 -198 -352 -299 90 407 204 -362 -415 -451 -88 216 344 645 -13 -101 -477
2079 -477 -80 389 959 573 496 288 -118 -16 676 502 685 414 205 -135 -271 186 202 451 213 426 -186
2100 -186 -361 -61 -124 442 315 6 78 -703 -374 -189 -78 65 237 -105 -386 -569 -682 -63 344 108 32
2121 32 37 -455 -497 -34 -16 254 203 110 -57 -280 -139 43 601 486 114 -170 -319 -177 199 344 353 480 162
2144 162 90 -434 -217 -190 179 76 119 -162 -513 -393 -312 96 279 457 -303 -145 -239 -213 110 283 -18 -42
2166 -42 -95 -305 -783 86 13 42 71 -76 -112 -325 -101 -107 358 318 120 -96 63 82 -24 181 258 426 160 -258
2190 -258 -214 6 335 444 388 23 -403 -223 174 626 277 278 225 -364 -534 -535 -35 358 23 275 -214 -532
2212 -532 -350 -323 26 16 -66 -98 -470 -439 -449 -215 12 -97 52 -472 -471 -638 -169 -22 209 183 160 -112 -256
2235 -256 -337 154 94 268 291 152 -16 175 326 504 776 473 343 118 -252 384 272 327 733 291 203 -317
2257 -317 -236 310 229 465 269 -37 -332 -128 -40 155 409 -94 223 -73 -210 -334 -57 -84 -98 106 -61 -623
2279 -623 -449 -340 110 -4 -318 -305 -521 -721 -174 -183 8 271 28 -161 -476 32 -359 256 536 446 126
2300 126 -5 23 -66 -36 193 514 33 11 64 62 407 196 433 214 -138 163 -30 75 296 514 354 110
2322 110 -335 -448 -85 21 30 216 112 -99 36 66 -89 -14 304 -18 -137 13 -653 -151 -257 7 -43 139
2344 139 -40 -466 -456 -168 113 582 349 67 -353 -288 13 87 251 397 229 -404 -147 -30 140 40 305
2365 305 249 -122 -121 -410 81 330 174 -56 -130 -181 -179 -528 -140 271 63 -160 -379 -352 -376 -263 -189 202 154 -251
2389 -251 -379 -341 -252 32 301 129 191 -30 14 -92 5 179 150 95 -150 -18 95 200 351 221 299 189 -23
2412 -23 -143 -186 357 179 397 212 108 -10 30 -13 194 40 572 56 -168 -200 162 414 158 234 117 -56
2434 -56 -309 -337 -359 -26 136 -153 -335 -382 -203 -473 -259 80 -76 -27 -416 -210 -9 -149 -295 -142 101 -349
2456 -349 -301 -359 -29 26 -180 134 33 193 -121 -233 221 490 447 179 314 -14 -118 56 165 195 408 124
2478 124 281 264 149 291 297 169 -145 163 -93 15 17 244 302 139 -150 -401 -181 -433 83 78 227 -241 -226
2501 -226 -328 -393 -204 -93 -18 257 -83 -225 -176 -371 -79 -173 -364 -95 -121 -336 -230 -195 218 399 -68 -112
2523 -112 -13 -140 204 69 225 310 -114 -345 104 -44 191 403 178 125 130 181 132 304 294 104 56 63 -105 -99
2547 -99 275 147 41 -132 -79 -172 -236 -321 -260 138 24 144 25 -166 -47 1 -167 -70 159 -83 -232 -140 -419
2570 -419 73 16 234 1 -58 -61 -113 135 115 -172 238 175 -54 -39 -127 363 69 320 390 -114 30 -208 -40
2593 -40 311 36 345 19 217 -56 -69 237 -85 -31 27 -42 -135 -162 -131 -222 -371 -261 46 -366 -166 98 -186
2616 -186 96 28 -131 -224 -376 -438 43 215 73 239 -29 46 94 -91 123 209 180 28 -180 129 350 333 270
2639 270 -27 304 -51 -53 68 249 -144 495 535 16 6 -116 2 -8 421 82 173 46 374 -55 273 54
2661 54 21 126 -193 -379 -106 -127 172 109 -270 -100 -315 -312 -287 133 34 -176 -57 -21 -247 -438 -373 -8 45 371
2685 371 -377 -24 -48 21 -144 200 217 165 58 -136 144 66 441 121 61 181 90 -73 154 388 71 249
2707 249 296 197 -52 62 33 29 346 -36 -49 -177 -193 92 79 64 -273 -11 -11 -26 -247 31 381 140 -335 -137
2731 -137 -619 -385 -236 54 83 138 126 -34 -101 -74 -36 -12 124 -176 -37 -149 7 -238 29 -28 -108 209 -156
2754 -156 150 -26 30 345 155 220 -33 38 134 205 110 260 -30 58 -229 -290 72 -106 17 262 -92 -194 -379
2777 -379 -123 -261 41 235 -24 -286 108 -259 -186 -60 -158 -153 -387 -24 -229 -92 -123 -25 578 -269 8 30
2799 30 -411 -135 78 111 270 137 -45 -43 371 315 -82 -18 -59 180 2 -192 206 13 -25 423 18 -47 205
2822 205 -204 125 162 26 -338 -112 -62 -17 -101 233 232 -190 87 -248 100 63 -28 169 52 -160 -403 -434 76
2845 76 88 219 -144 -133 -21 -342 -155 342 122 -27 116 140 -111 104 0 -95 -142 48 116 116 32 -226 34
2868 34 102 182 71 -63 -89 53 22 219 341 105 75 211 3 -51 169 254 289 70 -180 -233 -261 66 -112 101
2892 101 -57 -143 -268 53 -30 104 179 -6 -461 -435 -186 202 -85 -74 206 27 -119 -86 56 -175 192 21
2914 21 426 30 -65 123 -170 -95 125 -90 125 -179 -20 -8 -15 158 178 68 152 149 217 -76 -70 58 383 -16
2938 -16 -94 -59 -54 -118 83 225 218 142 -127 -27 -27 58 4 -60 -86 -135 -177 -82 138 -43 27 -164 -440 97 -128 -107 -12
2965 -12 266 143 -117 -175 -164 -129 -78 54 -124 150 89 -215 52 121 240 6 84 -132 90 149 173 155 276 269
2989 269 -64 -11 274 15 139 82 46 -99 -289 14 -307 -320 -275 318 91 274 -81 -228 -396 -33 -96 -319
3011 -319 -53 27 -121 -149 76 -64 -115 250 -89 -406 -103 9 441 -5 249 115 -56 -27 52 -157 -94 163
3033 163 409 301 -232 -123 137 0 65 100 37 230 164 204 -195 209 -67 -53 -265 -63 108 67 346 -38
3055 -38 216 -185 69 -237 -182 -52 -118 147 85 299 -76 -29 -56 -290 -58 -36 -341 -241 64 -105 7 -83 -159
3078 -159 -161 -156 -27 93 155 -95 146 -188 -79 -67 151 26 73 -350 73 -64 -119 -7 -110 -142 70 367 108
3101 108 171 -82 245 118 109 136 248 261 72 -36 -331 167 -4 281 3 -85 84 -137 25 -55 -146 -1 333
3124 333 -386 33 -145 78 17 169 -313 -128 71 -59 40 155 -231 -196 -216 -78 75 -84 68 -111 -62 -294
3146 -294 -97 -196 -65 -58 208 318 143 -160 57 176 8 169 391 -108 48 181 29 90 145 439 174 -171
3168 -171 -46 -222 -106 236 25 -3 27 248 -198 -96 -126 386 46 -17 -170 -103 -193 -141 -28 -63 -61 -83 120 -102
3192 -102 -4 221 -151 -5 -62 49 159 65 126 152 97 -19 11 -214 -86 -90 77 -63 66 160 -20 80 46 218
3216 218 -55 22 -44 44 356 -24 78 91 -15 72 63 167 -262 -94 169 263 75 -57 240 -55 -96 -145 -22
3239 -22 -83 41 110 294 -94 -205 -86 -46 -73 164 217 -123 -192 -38 63 -81 199 242 225 126 161 -18 27 203
3263 203 -70 315 151 21 144 41 43 169 214 155 5 -75 -3 -52 8 -54 -40 215 75 209 55 -94 -99 64
3287 64 -188 -68 94 -109 -32 207 167 165 -182 -256 -134 148 -64 -186 213 -202 51 -142 -22 96 266 264 64
3310 64 -22 139 77 -43 291 156 206 210 171 33 186 76 103 -191 -80 44 -93 116 212 196 301 -28 -206
3333 -206 -48 -267 47 -317 -20 -165 -62 -249 65 133 32 -118 -147 -182 263 -275 -266 -142 -176 132 171 -226
3355 -226 -377 14 -63 125 -83 274 -45 -151 -90 -47 -104 215 -265 -102 87 79 191 -143 389 29 119 283
3377 283 -145 327 558 135 325 52 289 -65 102 -13 -18 270 130 200 -53 252 254 105 98 122 44 65 12 -27
3401 -27 37 -99 -81 150 -72 -80 -110 -116 -16 60 -21 75 -28 -74 8 -76 -7 29 20 155 234 -170 -149 133 -3 -187 -181
3428 -181 -90 118 -65 293 49 -92 112 77 96 -140 135 -184 295 179 181 -83 56 49 107 -41 -124 28 -87
3451 -87 -161 166 -168 125 -44 156 -87 -188 -166 -119 37 -191 23 -8 161 -248 -155 1 44 -73 12 14 -250
3474 -250 -71 226 246 -225 -235 -195 -93 149 1 213 23 31 -27 201 60 297 218 133 73 68 292 293 203 -125 225
3499 225 -184 -308 193 -160 244 295 -111 103 60 2 53 332 150 27 -62 -95 -4 125 -153 -256 36 42 104
3522 104 16 -270 -360 -237 -25 127 97 217 -21 -214 -11 143 23 48 47 51 -2 293 192 137 -95 46 -33 197
3546 197 60 -80 2 -23 140 74 111 11 298 71 -100 21 -9 -257 -53 67 59 48 39 -29 -64 35 -89 -154 -182
3571 -182 -51 6 136 -14 -64 -53 72 -11 271 -215 -251 -83 109 -99 -105 -165 -141 213 178 -72 -154 129 5 -48
3595 -48 -196 31 -224 278 -109 -135 112 64 29 -142 -143 -48 -102 -53 21 65 -53 191 -111 315 -190 -81 72 -80
3619 -80 -125 -37 105 -234 106 217 41 -192 -369 -304 0 -394 -45 12 15 165 -41 94 217 -264 26 -100
3641 -100 -317 -100 107 -195 128 -8 25 154 -333 -272 173 -210 24 225 -80 7 -119 -102 152 -21 188
3662 188 15 8 334 -18 107 -178 186 -156 141 193 17 51 57 86 39 51 42 -32 83 -250 -146 -74 -141 26 123
3687 123 -130 154 -165 100 -147 -127 81 -49 -510 -85 -183 46 97 -162 -53 -29 -154 82 -123 418 317
3708 317 13 113 -126 67 287 53 -11 228 63 0 -199 -51 -97 -157 36 207 -343 -58 133 42 -189 -10
3730 -10 41 136 102 26 208 78 -176 36 -97 -33 204 136 -138 20 23 -52 -88 0 -20 272 -50 180 198 13 -70
3755 -70 123 -219 -68 -317 -84 -26 118 -96 -28 -306 179 5 31 -140 28 -52 72 -32 -25 103 296 54
3777 54 58 -9 -19 -124 41 27 46 212 8 122 155 33 -26 126 -20 221 -93 183 194 3 65 316 -100 203
3801 203 -70 25 -317 -103 284 111 -124 101 -121 -133 -22 -26 84 11 160 -131 -35 -97 193 -5 -115 25
3823 25 172 130 334 -43 101 127 -210 170 107 127 78 139 212 -121 72 223 21 136 -91 253 -16 118 -31
3846 -31 -225 96 -142 -29 -18 122 -88 102 173 138 87 90 418 -176 -61 -193 -214 84 -56 43 -201 -91 -194
3869 -194 -39 -24 -101 -177 -142 89 -170 -90 15 138 50 28 -105 -165 385 -195 23 40 137 57 196 153 -168 155
3893 155 -31 49 161 -212 63 -116 -54 119 65 -263 -254 112 51 -311 -207 -44 -309 182 -292 -72 -231 4
3915 4 74 90 99 -115 -100 -273 -258 48 -205 -9 -179 -150 228 121 -37 -278 52 138 118 -30 29 74 116 130 208
3940 208 106 200 -217 -81 97 67 245 -123 284 114 16 -52 -76 115 381 -189 -93 -243 -83 -70 -73 103 -133
3963 -133 50 -249 -90 106 14 -70 -22 73 -374 -88 -41 -6 -136 -297 -208 -110 -106 -31 -79 121 -29 -55 155 130 197
3988 197 122 156 -89 178 104 -143 141 -112 121 28 -14 176 91 -224 -426 -10 58 179 -79 327 67 56 225
4011 225 -192 -6 -386 138 145 43 110 43 -196 83 20 -116 -113 -84 36 -220 119 170 192 20 152 -208 -55
4034 -55 74 -329 -141 122 -198 248 -36 -17 -341 -68 -37 -280 210 -120 -12 272 155 111 54 135 130 191 -228
4057 -228 -2 55 -8 -281 51 84 163 -58 -121 -191 155 -35 -18 -324 -254 249 -232 157 151 -76 -48 -25 -59 -112 162
4082 162 -250 -70 -203 -67 -66 -184 85 -46 27 -157 -329 -109 -88 241 -29 -128 -230 -53 187 -13 188 -10
4104 -10 -86 24 193 -49 -169 -133 -18 80 1 42 117 -191 -157 -260 82 -78 -28 -36 -199 -59 132 -49 -249 -103
4128 -103 197 -214 131 -35 -222 -125 82 -124 -146 -248 1 -282 -104 6 -113 56 -44 -159 -36 118 186
4149 186 168 -400 146 60 -87 41 -221 -5 -281 -330 210 -32 -4 110 222 113 -43 144 -220 29 148
4170 148 244 85 -20 26 -72 -223 215 -146 268 -50 -202 -238 -3 0 35 95 -9 -69 118 -156 -56 -17 -46 26
4194 26 -91 -146 -353 10 -66 -99 -8 -91 -13 -160 -139 6 -97 -82 4 -148 -207 -44 -4 239 -138 67 179 308
4218 308 -32 113 -105 221 -258 38 146 66 147 92 -97 -44 124 194 -71 183 -82 -173 -196 -240 -5 145 115
4241 115 -70 -110 -101 -120 -82 -91 -29 3 34 -158 -255 224 -140 -74 17 1 118 -62 -131 -24 124 58 -271 -23 -124
4266 -124 316 -24 22 -271 223 -72 -98 -216 -77 76 175 76 79 29 -45 66 -77 -298 -10 -146 101 73 139
4289 139 84 98 43 -297 61 -14 -56 158 -22 -50 13 -239 -157 -236 201 31 -27 -293 -249 -41 -186 -106 67 -187
4313 -187 -202 -136 -219 -60 30 74 -320 -264 10 322 159 65 505 -155 158 130 43 170 212 -14 37 150 239 9
4337 9 223 -8 -162 -163 -62 34 -155 117 -73 141 -50 -83 18 -15 9 -293 -36 6 86 19 33 3 -9 -7 -123
4362 -123 -63 118 44 -32 32 -124 8 -34 10 267 -307 -106 33 -123 -3 -263 -57 -72 -208 -240 70 198 42
4385 42 -36 -146 -13 47 -116 74 -154 145 -17 -91 -173 -44 -87 -2 169 84 77 149 -194 78 260 -156 -215 210
4409 210 -246 52 -250 -130 -31 -143 32 -94 13 -91 150 23 -225 -124 -87 -111 -185 -124 -21 -186 70 -188
4431 -188 -154 163 -336 148 90 -84 240 13 204 20 47 257 112 192 147 321 -167 55 -43 32 -213 -44
4453 -44 172 -88 -216 122 162 -23 -55 -18 -213 -123 163 61 207 -215 221 -82 -214 -71 25 -102 -402 -30
4475 -30 160 -51 -105 -113 -108 -148 -233 -131 38 -28 -180 -289 67 72 -37 6 -110 -69 16 198 46 117 -20 -302 -202
4500 -202 97 11 52 359 135 182 -90 309 184 -83 -116 -26 130 5 291 -247 -259 -28 -48 121 231 181 -77
4523 -77 -297 50 -140 112 74 79 -71 -13 203 -326 37 173 58 -192 41 -113 -177 -214 -114 -70 163 7 253
4546 253 -11 167 59 -2 -9 123 154 81 9 21 -27 135 176 128 103 -205 53 67 189 -141 115 -82 -60 8 -59
4571 -59 13 221 79 184 -104 -226 59 -128 -25 -47 -122 -185 77 -3 -25 -195 79 -220 -19 -118 -138 -259 18
4594 18 64 39 185 66 -115 -96 -174 -22 274 -324 33 138 -60 -25 265 -20 -67 375 74 409 -20 93
4616 93 175 83 71 53 329 -154 161 -148 -132 -29 -155 20 -292 79 -97 -37 -176 -147 -357 30 28 74 5 -142
4640 -142 180 -18 36 157 3 140 -53 -191 62 -83 -38 182 51 27 242 84 -102 152 -132 154 12
4661 12 -9 26 170 269 -119 243 96 110 92 97 379 165 384 122 -288 251 245 453 -86 -240 -26 120 2
4684 2 197 11 -66 12 -134 324 -113 -66 -226 260 -335 205 108 335 -47 116 150 -144 -248 -322 -32 109 -174
4707 -174 45 -269 151 165 -56 -115 5 220 -257 -171 -64 -82 107 148 322 -83 212 52 -94 203 202 8
4729 8 -35 -119 -173 -271 208 -140 -192 76 214 -15 230 215 14 72 -270 233 265 64 -35 5 -332 89 -74 59
4753 59 67 57 22 -191 -47 -136 -26 -143 63 139 -89 -242 218 -24 258 -179 -299 -134 -149 129 183 -62 -80
4776 -80 -24 -36 81 -143 81 -132 97 -18 99 260 -21 -77 -10 -61 134 71 136 73 -24 124 153 31 -213 -152
4800 -152 -38 -153 245 -6 25 208 -104 -12 -141 -75 -58 -131 -43 -77 -168 -217 -85 25 -291 13 63 -143 112
4823 112 -8 55 -110 -49 -66 -305 313 141 -82 102 128 257 214 -96 425 -13 84 1 33 14 125 191 -78
4846 -78 69 -310 244 252 -172 -144 146 125 20 169 12 -159 -65 -2 -117 -168 -256 -225 -200 -114 -395 -66 -83 -92 -43
4871 -43 110 -148 -244 190 75 -47 -144 -225 230 30 139 54 18 -137 -62 60 -54 93 -59 217 94 136 -68
4894 -68 46 90 462 -126 88 126 50 -232 260 90 -91 42 -27 137 133 276 3 -203 48 227 47 -58
4916 -58 -294 2 -144 54 228 -124 290 -18 -137 126 -68 -107 -12 -69 -86 -12 144 -236 -158 90 155 69 35
4939 35 -33 97 43 58 -209 -209 -10 264 90 -105 133 147 69 86 18 198 -127 21 85 -201 -74 43 -65 -155
4963 -155 212 39 -13 -151 202 -20 244 158 8 -326 61 54 -83 179 -41 41 -33 -84 -184 -334 -162 -162 181
4986 181 -422 75 187 22 134 -102 -110 -2 -167 327 -122 -406 -137 19 46 -96 120 73 226 -174 244
5007 244 -39 305 105 11 194 124 143 -115 -264 32 6 -80 -130 -9 -81 -149 -179 302 24 -88 -53 18 -78 9
5031 9 66 0 -123 31 -46 -41 107 20 -129 -64 180 173 -338 113 299 -77 -219 -87 -78 75 172 8 8 -24 -35 52
5057 52 3 -81 377 94 -99 -66 97 18 130 92 -223 19 240 145 179 -266 -104 300 107 118 78 -175 -74
5080 -74 56 -324 -83 31 -328 185 -98 -116 96 78 15 -72 159 -132 -153 -90 172 233 -214 13 -249 -135 4
5103 4 -266 -110 161 -174 -157 85 -198 -173 -45 138 121 -59 -105 -112 227 89 -108 -44 207 56 129 -165 441
5126 441 -27 66 83 -345 100 -97 134 -132 21 168 48 127 88 12 -70 258 248 -270 -251 -63 205 189 -153
5149 -153 214 152 244 -231 83 -187 -199 38 -178 -138 51 -106 97 106 -198 266 140 293 -10 64 1 -107 186
5172 186 -198 6 -26 118 121 159 93 -377 38 154 -32 -203 41 288 -289 -183 -63 268 40 -161 -65 106
5194 106 144 -163 86 -172 -184 73 52 71 -3 -148 -70 207 -26 43 147 -165 -202 203 94 -246 90 58 -94
5217 -94 -75 116 -135 114 53 123 196 -263 -189 209 40 -79 85 -8 -74 99 -45 126 -46 289 -22 179 309
5240 309 -412 202 -74 -227 187 -33 122 -109 -193 25 340 -149 -94 9 146 -1 -181 13 -100 -81 -44
5261 -44 60 -31 200 -135 -224 -134 -81 -55 -17 -391 4 23 -398 198 217 185 -195 -26 -143 -5 -89 272 52 258
5285 258 155 143 73 261 7 -81 -93 -40 37 -248 -144 -225 88 -33 215 160 -35 -227 99 -62 -258 134 186
5308 186 48 219 228 55 -262 -113 137 -101 223 122 88 -28 82 -19 -71 132 -25 99 -337 106 155 -39
5330 -39 143 -3 229 -164 128 16 193 -179 114 -75 150 -190 -140 275 128 -137 219 175 157 -318 177
5351 177 154 31 -242 17 142 156 -178 -151 153 -52 43 -81 7 -85 -43 -40 -180 371 -15 163 224 86 -80
5374 -80 -129 -115 88 -96 92 -58 243 152 -9 80 55 154 149 -54 150 -48 36 -269 -380 58 98 -184 -252 -45
5398 -45 -35 111 -57 22 151 35 168 151 -17 -63 -95 -39 -44 -37 -22 -152 -40 -243 140 45 -91 -54 44 80 -167
5423 -167 -302 178 -70 181 49 81 25 -85 -63 -22 -119 -229 -66 55 -12 -50 -175 107 -127 -40 32 -47 241
5446 241 -566 -75 61 159 26 -28 -8 3 88 150 -106 92 -46 -153 64 268 34 179 20 159 314 -280
5468 -280 18 115 -16 88 57 141 -15 51 -118 -35 110 -173 -33 -146 -248 -197 -205 -234 120 -416 142 -158 219
5491 219 -16 -37 -132 -139 31 -48 192 42 6 2 121 -154 133 -228 430 28 189 174 -123 60 -249 -8 177
5514 177 -258 139 -20 161 185 -83 -137 -214 369 40 -64 -387 -27 -81 -7 -11 22 68 31 20 -141 -160 -157 15 -107
5539 -107 -204 -230 8 -73 95 -112 -66 -168 -4 -117 54 -46 252 -53 8 237 -124 109 -185 -236 69 516
5561 516 57 118 -257 84 16 47 75 -190 2 -193 184 43 26 -15 -55 -122 213 -45 24 224 -21 243 114
5584 114 101 -120 -89 -87 113 13 93 -87 144 -79 86 260 237 101 -22 -110 27 43 -180 120 144 -158 231
5607 231 25 241 170 333 -161 85 -185 -411 200 106 -88 119 -242 1 216 167 -109 12 23 -348 197
5628 197 196 162 -66 112 -130 -330 169 -89 -43 323 155 -58 99 -311 73 -17 -39 34 -76 34 160 -51
5650 -51 -39 -227 167 -25 -79 20 -87 34 -57 -40 -65 -134 100 -77 -299 -144 87 24 -58 93 112 273 -13 -169
5674 -169 -85 -36 69 48 68 -221 316 -201 172 85 121 -351 -99 127 -153 236 140 64 46 33 58 28 104 197 -145
5699 -145 -201 167 285 194 -25 170 -14 252 7 371 -52 163 231 -49 -164 -34 -43 148 322 -125 -198 163
5721 163 -340 95 171 4 48 -4 -141 -204 140 30 -48 1 -203 -176 -7 256 50 332 -101 -43 0 171 81
5744 81 -110 49 12 5 29 254 173 126 -114 -186 -89 -34 179 76 -126 98 109 -81 94 260 -1 -122 33 202
5768 202 -223 0 -386 67 39 98 -154 -54 41 -2 -53 -256 133 -58 23 356 319 -70 126 265 12 102 15
5791 15 -207 -192 101 10 -285 3 128 29 -71 -116 38 -205 149 -210 139 -21 152 -113 31 -112 -282 11
5813 11 -83 103 -32 -383 144 -39 -74 -66 77 191 -201 -271 19 -101 64 80 -53 31 -172 7 31 -185 -196
5836 -196 -29 335 -154 -150 -84 52 53 52 209 121 -34 -93 -247 63 84 154 341 -32 -89 -122 47 -312 98 -98
5860 -98 -63 161 -72 197 -22 193 135 -72 171 -99 -30 -232 39 103 -195 136 -128 -266 207 -162 -85 -44
5882 -44 -19 362 -11 -32 222 -181 55 -298 93 304 37 -337 -140 -79 27 24 -179 21 -184 93 -76 92
5904 92 147 51 27 71 141 -67 -148 -47 209 159 27 -201 176 165 -326 101 -93 38 -71 -208 -112 270 -91
5927 -91 6 174 -44 -141 7 -96 94 -144 59 -231 -8 337 41 18 -141 -219 164 128 -218 -204 175 206 -106
5950 -106 -67 -86 -217 191 174 -48 115 -142 212 -79 174 20 -68 -209 -69 105 -208 -96 177 -165 183
5971 183 34 219 -141 152 -127 -65 -188 94 92 -7 -126 94 100 -105 38 68 -38 -143 44 -78 195 35
5993 35 176 165 -1 264 47 4 -92 -62 -55 -104 -225 50 -58 -80 -100 -225 314 -339 169 -44 206 1 -50 -33
6017 -33 -137 38 15 91 195 -32 171 170 74 161 61 173 182 255 -65 -16 -16 75 116 16 -305 -252 -212 254 -31 -4
6043 -4 -13 -291 19 -92 -144 -146 -104 -10 7 -6 41 1 125 -1 -247 -108 147 77 103 -247 -265 -336 -122 216 -134 -227
6069 -227 -13 -84 228 18 152 -195 -173 153 -217 -31 -188 -84 253 -107 107 210 253 201 -158 163 0
6090 0 21 -71 -40 169 14 197 47 -37 -234 -166 -214 87 -57 -220 -347 -45 -83 8 9 185 14 27 -189 11
6114 11 36 51 2 -136 353 -4 157 203 -133 138 185 -54 -66 181 94 -226 124 -35 61 -34 223 183 -204 -138
6138 -138 41 -31 258 281 -109 19 204 31 -14 410 135 -136 103 -67 247 -90 -71 180 390 77 58 -11
6160 -11 187 107 -275 51 -53 24 -74 53 -113 134 -133 40 -6 1 112 -141 -73 -63 99 3 198 -172 -330
6183 -330 454 -144 45 -119 124 137 33 -145 -265 37 100 148 -338 157 53 142 -31 221 86 -120 -223
6204 -223 -95 -49 -39 53 -99 283 -34 143 237 226 -174 101 -181 -103 -41 125 -18 -31 -70 98 -108 -41 -365
6227 -365 96 100 41 -157 -3 -90 -401 136 290 13 -81 118 183 -60 24 121 -234 -60 -216 102 81 -87 -9
6250 -9 -20 128 -114 -278 -94 -61 357 50 -41 245 -32 22 8 -177 178 -121 347 -41 225 39 32 43 10 31
6274 31 48 -100 -89 -258 -221 186 274 13 136 277 16 -156 -94 -325 -180 69 167 263 -241 63 225 -264 -14
6297 -14 99 -187 -33 43 99 -128 -88 -8 124 21 -249 99 -113 -198 -376 155 -8 44 294 370 -338 -117 73
6320 73 52 197 192 -24 -247 332 161 101 -233 145 113 41 22 69 -146 76 -105 -73 237 -32 -248 108 272
6343 272 -107 -113 -20 120 -30 148 -99 252 -102 -3 -41 185 -31 202 193 196 -179 83 -73 199 -138 -62 -38 -5
6367 -5 121 91 175 -81 201 -13 -67 130 211 -94 -155 73 30 -113 117 -32 -40 50 -150 -65 -32 61 23 55 182
6392 182 15 -126 -20 -141 -21 -105 -35 132 266 398 -32 44 124 146 24 -442 -287 -151 -14 -25 -14 257
6414 257 146 191 -67 -52 9 210 -25 -158 -120 143 -34 35 64 -162 279 -54 64 91 18 9 -17 -98 -157 -122 -62
6439 -62 34 172 -277 118 -17 29 271 -143 68 3 57 174 134 -83 44 -32 -86 -226 38 -21 294 279 47
6462 47 -89 114 465 -13 -35 316 -104 126 138 51 169 -103 -1 -144 18 140 -140 -295 -71 257 78
6483 78 36 -8 23 237 -119 41 159 -252 -162 -24 73 -330 -74 -194 78 -239 -276 -44 -98 77 49 -131 -44
6506 -44 194 5 151 104 103 67 -25 -110 2 199 -103 -136 -17 -332 -101 -27 -92 -141 -116 62 50 -260 125 -36
6530 -36 -118 -88 294 -369 -20 211 301 -1 -49 -43 47 133 115 -182 108 -381 19 249 83 254 -213 -290 -362 4
6554 4 -46 -139 -140 59 60 128 17 -77 72 32 190 -137 -57 12 4 217 172 225 -255 -18 -368 2 134 42 98 -121
6580 -121 1 67 -82 4 -59 36 -151 123 -11 -132 27 -87 -3 97 -36 235 320 34 -55 -111 83 -154 208
6603 208 228 -47 -69 -93 323 -145 -15 -77 161 83 -4 44 -287 56 -26 227 58 -94 216 -4 170 -27 -249
6626 -249 154 69 197 -134 33 -186 -89 -80 -5 -259 158 -9 -49 -49 -15 -34 -45 222 -138 -95 -116 109 -302 180
6650 180 -96 -139 -276 116 -99 61 72 -39 -212 -167 181 -32 -411 -55 -52 123 120 233 -213 -14 77 -78 112
6673 112 93 -8 117 -15 190 107 -86 210 -104 152 102 7 85 190 6 -14 -51 -190 159 -107 -58 57 -328
6696 -328 -196 -75 143 14 158 -284 52 -190 3 -148 58 -156 162 259 181 87 -150 -124 -156 -46 10 94
6718 94 212 -184 -133 340 111 55 58 6 -156 231 188 -38 -7 155 173 -145 -88 93 -80 54 242 219 3 -18
6742 -18 -118 -91 216 -170 -121 -79 -87 -26 -106 16 -155 218 -266 -23 -148 245 -80 -112 -23 103 11 -197 -92 109
6766 109 121 -279 -53 287 -50 93 217 104 107 38 -94 62 152 -263 -21 113 -3 -129 40 -7 13 260
6788 260 -236 103 51 -48 -30 102 96 158 34 -6 78 -59 107 209 47 -7 194 -211 -52 54 -286 -243 219
6811 219 -64 -49 78 -16 -109 -207 -55 312 -167 -492 168 50 -308 -16 143 11 -216 238 83 -24 -10 20
6833 20 -24 214 131 -231 14 -67 -53 75 14 -209 20 2 113 5 -59 -319 -190 130 73 -86 83 -108 177
6856 177 18 80 292 -72 86 -204 -148 96 186 194 133 112 43 59 -107 -69 124 -96 -76 -27 29 -148 166 -85
6880 -85 114 -230 46 -68 39 -120 304 -60 -146 -349 -233 -7 2 105 -172 118 123 -70 29 57 207 -140 205
6903 205 238 54 -48 -11 147 -130 -218 -2 170 2 -8 -325 -79 91 120 -135 -45 -3 136 -132 160 235 -8
6926 -8 -193 -34 -28 -272 118 -7 -284 -281 82 59 -102 5 -32 87 -6 -1 198 -42 76 130 -309 196 70 -48
6950 -48 -42 -15 36 34 278 15 -112 103 363 47 -86 -134 296 285 -44 358 -107 -66 47 -16 -232 -96 -198 73
6974 73 115 -77 197 -111 -138 301 -300 -92 -21 3 -161 83 80 61 105 -73 68 9 -202 194 -101 -210 -17
6997 -17 -388 5 -113 -123 -53 -246 -115 -52 4 371 214 218 18 175 75 113 -66 -23 -55 32 -123 111 168 180
7021 180 331 244 73 121 -206 49 107 -7 -64 174 -95 77 221 88 149 67 -116 -150 90 -188 -167 143 289
7044 289 33 109 43 109 4 111 -8 64 -21 2 -162 111 -21 65 -58 -253 107 362 -428 -20 37 -163 -184
7067 -184 -131 -189 -91 222 -149 40 11 -31 -34 -74 -119 69 -172 33 -35 28 -195 23 -159 -11 -162 -20 238 169
7091 169 242 8 -24 -165 59 283 -150 -158 48 70 259 14 321 -58 45 -40 -38 209 38 -32 -47 203 -11
7114 -11 -100 90 -70 -93 18 69 189 159 -158 13 139 -34 -48 -164 126 161 -114 86 94 23 34 150 -232 -25
7138 -25 180 -110 -9 -30 29 -147 -121 -265 161 107 132 105 -42 9 9 -141 189 195 -248 -199 109 -64 23 47 -53
7163 -53 148 -180 -80 44 214 22 98 -49 -316 -3 149 302 -151 155 272 147 -199 134 162 39 -108
7184 -108 171 -54 18 194 -10 69 -165 150 -159 105 45 -80 -5 -174 14 -54 40 87 123 -59 -207 -160 49
7207 49 229 -91 -60 156 -75 -183 -227 -170 -6 37 243 -44 -241 -7 -18 -137 226 -36 -160 -21 89 -168
7229 -168 60 -115 -154 -106 61 80 -42 -61 -97 -47 129 281 -51 243 -90 275 -105 -61 70 -215 248 47
7251 47 161 -20 109 -152 87 -135 58 -117 -240 202 125 68 151 79 40 52 59 118 -6 3 -87 -14 71 -55 117
7276 117 90 -136 114 -15 -88 228 -279 -56 -90 -170 -113 190 34 228 73 -101 267 -293 -119 189 -99 123
7298 123 -84 19 -83 95 232 142 -193 123 5 -253 258 -14 -64 -107 -343 -94 176 -80 194 269 216 87
7320 87 -154 -73 67 -41 -16 48 -16 -387 -79 -65 -90 197 -145 -99 11 -8 -155 -9 67 16 50 11 66 146 -43
7345 -43 -200 -336 -202 113 157 239 11 -167 79 179 -86 -19 45 436 -264 42 126 -108 37 -72 202 124
7367 124 -294 -159 136 -111 229 287 285 29 191 15 278 -91 -203 48 92 -90 -398 -34 -202 35 -46 -13
7389 -13 55 -106 -1 133 107 153 4 352 -78 -32 281 -67 153 116 -141 257 42 -315 -108 -42 203 -96
7411 -96 113 -255 -109 91 135 2 -17 -252 28 172 -4 -276 -156 -257 187 10 24 324 205 93 6 -97
7433 -97 -102 -149 -29 -30 -266 15 27 -7 84 77 -32 -62 87 -26 60 191 7 -255 -42 -140 -176 26 95 -13 -32 119
7459 119 108 -8 2 75 -197 -158 -31 255 -184 -10 -120 -111 -63 -18 130 -64 14 -101 47 275 198 52 61 -91
7483 -91 -54 15 4 76 -140 -28 187 -137 -186 -111 147 176 -42 212 -174 194 284 -101 179 35 -13 73 29 -61
7507 -61 -222 -433 59 -25 100 47 -95 -327 -92 104 77 -16 69 -179 -142 44 -5 31 -25 -93 -18 35 -39 -16 -222
7532 -222 -44 30 178 -221 -24 24 -134 63 154 -127 72 -235 -27 201 34 -214 -72 102 -54 84 315
7553 315 -148 -225 93 -225 190 273 79 80 106 -139 -163 -102 204 -94 -178 -225 53 24 72 -112 -72 152 23 -46
7577 -46 203 -98 -80 41 55 97 21 170 -425 -150 -86 94 128 52 62 42 136 -99 -201 24 -5 -31 -308 -38
7601 -38 73 -47 -56 237 24 -17 -72 -244 47 100 -9 85 272 -190 177 124 284 11 -75 25 178 68 95
7624 95 -134 -86 5 209 -96 131 24 60 327 77 21 62 -5 -43 99 -180 206 61 249 -51 76 116 -66
7647 -66 -112 150 -78 -291 -238 -271 -160 42 224 -222 -256 -133 100 63 20 108 -184 225 194 56 265 -295 68
7670 68 -218 20 21 87 74 353 20 -108 107 292 60 -104 -150 -71 -172 -50 -252 122 -3 -12 85 -21 252
7693 252 -182 10 -164 -116 -3 -114 -137 -221 107 -341 -46 290 73 -68 86 -17 125 -248 28 93 -109
7714 -109 190 -121 66 51 89 72 37 -239 -6 126 -46 -23 7 123 -1 -210 96 -100 45 186 -29 -2
7736 -2 -217 210 74 -145 53 37 45 5 59 119 9 -176 -72 -176 -60 164 -220 128 5 92 66 -356 0
7759 0 -175 127 37 -33 -10 55 -156 48 83 -79 153 -42 -3 127 -51 -175 164 -71 89 43 -164 -21 -58
7782 -58 -233 -145 54 86 -33 -73 -41 -132 122 248 -93 -3 202 -72 57 72 -37 -28 -61 -93 98 247 -132 -12
7806 -12 -226 -191 76 70 41 9 27 -133 -165 249 250 386 57 0 70 -29 137 -14 25 6 18 -83 -25 109 -97 52
7832 52 -69 -114 -6 108 90 91 -167 -59 -225 -376 139 138 -63 -91 -140 -84 204 26 -51 229 -356 241 -37 45
7856 45 -158 -215 -95 -79 15 -110 170 13 -65 94 135 -252 -256 187 -261 -17 197 309 223 21 -100 -41 -144
7879 -144 -101 -47 70 -16 62 33 117 206 4 83 -44 -236 -26 63 -58 -55 -238 -223 45 -16 -66 -1 88 243 24
7904 24 -75 -132 26 12 -73 22 -36 149 215 106 135 106 189 68 118 -59 -152 189 307 43 223 167 -199 224 59
7929 59 -79 17 -204 -107 218 55 47 -168 99 -83 160 -3 96 84 -80 252 -63 -177 14 3 208 27 -146
7952 -146 125 -76 314 155 -120 203 -88 209 339 124 207 291 -151 -437 317 55 97 47 -143 120 -80
7973 -80 -300 -68 157 67 -76 240 -151 117 -31 22 117 189 18 -97 -30 -12 -62 68 -6 72 19 -72 94 234
7997 234 58 -359 -110 152 -211 92 -35 83 -11 -68 55 -135 184 -332 67 -177 -236 -60 64 204 -314
8018 -314 59 -185 -102 -238 36 -15 -216 -110 144 59 99 128 -120 -17 134 -15 261 161 257 -18 53 -150
8040 -150 -11 -45 -173 -233 -143 138 136 -48 -90 104 252 -26 110 40 -56 -317 -189 268 -73 -94 -75 8 131 -8
8064 -8 296 -172 7 -111 -54 50 -90 -246 -46 89 44 -200 148 -73 -386 -112 416 -56 -123 -114 -114 -147 -141 57
8088 57 -58 214 -158 -75 -10 -81 -150 310 -247 122 377 -80 137 -290 86 23 -70 -1 -149 29 -95 -35 10
8111 10 -95 39 196 -272 232 -144 149 -131 -19 169 109 16 145 -45 146 95 -111 -99 -174 -83 322 316 71
8134 71 12 -28 -201 150 26 -24 160 -120 30 11 -41 -95 48 -154 -242 275 57 -92 115 -65 278 -37 -38
8157 -38 147 -113 8 -31 65 51 -134 32 224 169 86 19 52 -104 216 122 6 119 -68 130 -25 -88 -75 120
8181 120 25 -88 -68 13 24 -4 -73 354 49 -157
8191a57
$$ Imaginary data points
##PAGE= N=2
##DATA TABLE= (X++(I..I)), XYDATA
0 0 0 0 0 0 0 0 0 8 -8 8 -8 8 -16 16 -24 24 -32 37 -46 48 -60 70 -80 94 -106 120 -141 158 -180 202 -226
31 -226 255 -287 319 -357 397 -440 490 -544 602 -669 738 -819 907 -1002 1113 -1238 1379
48 1379 -1543 1729 -1955 2225 -2557 2978 -3531 4292 -5415 7237 -10713 19736 -92101 -181366
62 -181366 51129 168434 66411 -165431 -238347 -147483 -22098 21833 34597 13747 -68134
73 -68134 -202891 -251594 -143282 43703 136550 79454 -56131 -157691 -191183 -154408 -56505
84 -56505 70519 137944 85525 -43677 -130215 -117529 -41200 37691 96191 118615 77159 -22853
96 -22853 -100834 -71193 58469 180011 191135 89410 -37185 -93260 -47844 57321 154456
107 154456 196102 163634 63762 -54932 -111045 -52028 82623 187301 187382 94242 -20770 -87460
119 -87460 -75516 -1722 82905 124377 94679 6980 -87693 -120078 -60018 44693 105590 77336
131 77336 -13330 -107981 -155626 -125835 -25781 79383 104336 26110 -92321 -166451 -160726 -94081
143 -94081 -2907 69908 78526 3155 -111528 -178841 -141134 -28425 68247 80311 15587 -68434
155 -68434 -118445 -110578 -45130 46520 104302 78305 -17743 -106930 -118281 -46968 53415 122309
167 122309 121773 54035 -39743 -96747 -76847 7187 100680 145878 116324 31367 -51486 -76059
179 -76059 -26234 64266 131599 131261 62719 -25230 -70759 -41454 39759 113481 128836 75250
191 75250 -12771 -77834 -76332 -11154 73469 120509 98360 17459 -71493 -109881 -72260 10638
203 10638 79821 90682 41359 -38897 -102305 -108032 -50226 29514 72893 48578 -24134 -95741
215 -95741 -118532 -78696 -1401 58848 58457 -2334 -82139 -126170 -104803 -31565 44297 74427
227 74427 39249 -36889 -103123 -115033 -64519 16052 74004 72503 16390 -54583 -91983 -71760
239 -71760 -5128 64598 90636 55729 -14120 -67048 -66285 -11614 60996 104897 90139 25953
251 25953 -43444 -69021 -32084 42036 104917 115139 66523 -7523 -57690 -53440 2181 71628
263 71628 109113 88641 23601 -40521 -61208 -27759 33777 80870 82743 36173 -30443 -71944
275 -71944 -59890 -2525 57708 77394 43254 -23040 -79528 -89869 -48220 17682 62952 56525
287 56525 1284 -66687 -103073 -82848 -22968 35008 52718 20292 -39686 -87093 -90245 -46387
299 -46387 13802 49002 35763 -15136 -67598 -87049 -56826 3469 54565 61022 20752 -39144
311 -39144 -76651 -66698 -14043 47757 79379 60424 5103 -47680 -62099 -29148 28501 73550
323 73550 77185 39308 -14461 -46260 -34256 13770 63821 81109 54082 2475 -38979 -43368
335 -43368 -7010 47301 82278 72388 22796 -33637 -59327 -38542 13451 63062 76060 43552
347 43552 -13819 -57478 -59859 -22249 28783 58767 47017 942 -47412 -65154 -41677 5503
359 5503 42724 44604 9374 -39892 -70268 -60615 -16724 31556 51549 29825 -20369 -65678 -75693
372 -75693 -43616 8626 47893 48635 10777 -39394 -68813 -57138 -13122 32484 49787 28862
384 28862 -14562 -50321 -53399 -21315 23980 51167 41682 3205 -38463 -53979 -31932 14211
396 14211 53669 60417 29850 -17526 -50418 -47553 -9298 38943 65149 53129 11961 -29989
408 -29989 -45786 -26292 15910 51949 57678 29263 -12409 -38272 -31003 3802 41595 56028
420 56028 37646 -2418 -36968 -42770 -14577 28516 57098 51099 14051 -29336 -51714 -38944
432 -38944 529 40269 53488 30973 -11783 -46061 -50035 -23339 15166 40052 33450 -192
444 -192 -37777 -52882 -35726 -232 29975 33045 7136 -31084 -55937 -49580 -16515 21141 38213
457 38213 23660 -13284 -48835 -58219 -34965 5012 35181 36885 11105 -25455 -47957 -41613 -9393
470 -9393 26234 41816 27891 -5203 -33079 -36461 -12741 22280 45367 41227 12982 -19926 -34658
483 -34658 -19656 15352 46593 53964 32632 -2358 -28390 -28679 -2482 33012 53811 46029 15077
496 15077 -17109 -31221 -17486 13129 39605 43856 23171 -9210 -32166 -31179 -5824 25512 40205
509 40205 26034 -7124 -35954 -42631 -23770 7800 30712 29497 3479 -30626 -50018 -41904 -12514
522 -12514 17621 28554 13466 -16951 -42566 -46242 -26404 4408 24432 21214 -3540 -31029
534 -31029 -42333 -30092 -2478 22315 29452 13498 -15063 -36003 -33544 -9522 21097 37678
546 37678 30102 4164 -22337 -31827 -17340 11603 36726 41577 22944 -6414 -26271 -22020 2565
559 2565 30701 42588 31506 4635 -19184 -24337 -7206 19794 37694 35166 13614 -12855 -27822
572 -27822 -20913 3267 28494 36627 22211 -5272 -27657 -31188 -13813 12886 30574 26790 3712
585 3712 -22739 -35570 -25562 -1206 21570 26360 10250 -16162 -34426 -32622 -12085 13380 25776
598 25776 16623 -7386 -29094 -34046 -21051 2235 21307 23910 7714 -17249 -33378 -29321 -8380
611 -8380 15677 26662 17905 -3995 -24935 -30356 -16077 7663 25845 25980 7300 -16763 -28858
624 -28858 -20404 2425 23231 29141 16625 -5694 -22898 -23648 -6872 16114 30919 26522 7034
637 7034 -14908 -24093 -14354 7098 26195 30636 17586 -3174 -20239 -20287 -2801 19871 31813
650 31813 23602 2573 -16494 -21501 -10244 9724 26122 27737 11468 -11789 -25365 -19525 57
663 57 19097 25663 15793 -3998 -22086 -26876 -14657 6770 22368 19593 993 -19979 -28396 -20783
677 -20783 -4114 11461 17340 8729 -10804 -27850 -29448 -12839 8308 18512 11680 -5346 -21063
690 -21063 -27394 -19833 -1875 15746 20375 8202 -12323 -25108 -21773 -5691 12751 22428 18179
703 18179 2222 -15893 -22014 -10651 10181 25008 23740 10335 -6331 -15560 -11962 3109 21113
716 21113 29032 20557 1298 -14170 -15025 -1886 15604 26073 23419 9149 -7977 -16848 -11902
729 -11902 3719 19321 24635 14153 -4366 -18452 -18884 -5813 10834 19735 14043 -1582 -16872
742 -16872 -22018 -14424 206 12666 14751 4279 -13558 -25450 -22458 -7139 8258 13938 7369
755 7369 -6712 -19954 -23918 -15150 1340 13742 13425 1532 -12398 -20066 -17188 -4856 10513
768 10513 18169 12536 -3443 -17591 -17804 -5265 10097 17836 15688 5342 -7424 -15358 -11647 3144
782 3144 19141 22972 12056 -3917 -13246 -11657 -831 11359 19935 17798 5775 -9146 -15186
795 -15186 -8333 5711 17251 18632 9435 -4688 -14773 -14184 -2570 12072 19298 12382 -2204
808 -2204 -14130 -15379 -7478 4663 14074 14188 4056 -9734 -18031 -13827 -1282 11334 14792 7457
822 7457 -5021 -14602 -16171 -8482 3489 12844 13212 2667 -11174 -17949 -13917 -1163 10576 14190
836 14190 6707 -6560 -16331 -15800 -5445 7292 14068 9875 -1642 -12997 -16674 -9686 2525 12373
850 12373 13082 4772 -7595 -14942 -13527 -3173 8557 13906 10345 44 -10698 -14093 -7827 4274
864 4274 14173 14655 5912 -6185 -12635 -9292 1986 13158 16924 10156 -982 -9982 -10058 -1823 9570
879 9570 16561 14469 4785 -5597 -10860 -7079 3820 13546 15822 8640 -2030 -10032 -10426 -2910 6602
894 6602 13376 11143 723 -10049 -13226 -7731 2038 9158 9375 2462 -8388 -15035 -13345 -4481 5173
909 5173 8878 4533 -4788 -13683 -16289 -10404 -754 7427 8211 1214 -9448 -15649 -13209 -3398 6146
924 6146 9277 5412 -3377 -11194 -11833 -4798 5495 11967 9795 1684 -6804 -9692 -5053 3913 12205
939 12205 13889 8698 -191 -6967 -7067 -97 9506 15038 12838 5247 -3582 -7185 -3699 5039 12550
954 12550 13720 7252 -2096 -8035 -6471 1055 9053 11618 6947 -1758 -8575 -10136 -5250 3064 8537
969 8537 8003 722 -7857 -12467 -10158 -3712 3653 6665 3421 -3897 -11007 -12697 -7715 148 5992
984 5992 4551 -1367 -8848 -11661 -8796 -1428 5831 7403 2610 -5398 -11091 -9641 -2747 5454 9351
999 9351 7036 677 -6169 -8809 -5424 2264 9124 10509 5608 -1725 -6425 -5245 406 6906 10773
1014 10773 8060 1416 -4985 -6434 -1349 5882 10511 9277 3284 -3628 -7482 -4824 1351 8097 10009
1029 10009 5891 -949 -6676 -7347 -2922 3495 7697 6753 1668 -4807 -7824 -5437 114 5635 6557
1044 6557 2686 -3386 -7699 -7169 -2645 3624 7023 4792 -983 -7151 -9116 -5872 920 6175 6607
1059 6607 2099 -4366 -8627 -7935 -2531 3661 6225 4063 -1546 -6751 -7612 -4112 973 5156 5294 697
1075 697 -4992 -7516 -5512 -97 4996 6265 3747 -2160 -6908 -6962 -2521 3902 7358 6677 1839 -3898
1091 -3898 -6332 -4013 1622 6276 7749 4606 -557 -4299 -3836 239 4861 7636 6094 1479 -3042
1106 -3042 -4102 -1467 3748 7281 7214 3392 -1583 -5070 -4281 149 4891 7269 5131 -89 -4668 -6092
1122 -6092 -3437 1415 5098 4355 1044 -3812 -6605 -5119 -1721 2689 3745 569 -3635 -7175 -6945
1137 -6945 -3815 938 3775 2412 -1786 -6272 -8012 -5702 -1054 3113 4460 1650 -3049 -5996 -5915
1152 -5915 -2430 2042 4470 4072 79 -3519 -4485 -1806 2309 5524 5290 2744 -978 -3210 -1992 2244
1168 2244 5959 7241 5176 1083 -2483 -3085 -76 3984 6730 6951 3306 -1026 -3465 -2411 942
1183 942 4291 5523 3388 -49 -2929 -3714 -1256 1967 3932 3141 -536 -3820 -5675 -3505 25 3154
1199 3154 2889 299 -3465 -6322 -5924 -2817 1045 3052 2249 -1299 -4821 -5998 -4118 -645 2315 2608
1215 2608 365 -2764 -4542 -3682 -855 2043 3518 2322 -781 -3681 -3427 -1094 2592 4740 4056 1129
1231 1129 -2035 -3399 -2382 959 4388 5482 3525 157 -2424 -2615 -959 2201 4504 3810 1222
1246 1222 -1605 -2865 -1100 1361 3489 3403 1400 -1045 -2873 -2611 -267 2443 4048 2761 -402 -3574
1262 -3574 -4021 -2195 1331 3271 3353 1523 -1491 -3888 -3803 -673 1742 3054 1878 -188 -2980 -3175
1278 -3175 -1089 942 2565 2385 -315 -2509 -3747 -2381 630 2618 2872 1322 -1990 -3914 -4251 -1659
1294 -1659 1444 2903 2554 -1 -2660 -3480 -2456 -296 1997 2100 835 -1256 -2556 -2491 -468 1716
1310 1716 2420 1518 -659 -2379 -2786 -1300 1275 3067 3174 1071 -1276 -2920 -2251 101 2637 3859
1326 3859 3114 639 -1463 -2033 -701 1341 2915 3309 1453 -362 -1461 -537 1062 2864 3009 1544
1342 1544 -298 -2050 -1860 -383 1840 3184 2351 163 -2046 -3065 -2261 -308 1853 2448 910 -1490
1358 -1490 -3053 -3078 -1643 297 1235 448 -1244 -2715 -3518 -1970 54 1061 744 -998 -2544 -3600
1374 -3600 -2614 -332 1312 2118 1094 -718 -2835 -2747 -1591 1002 2588 2252 1060 -396 -1578 -1145
1390 -1145 383 2042 2903 2216 439 -674 -676 816 2282 2951 2344 1101 -905 -1174 -274 1642 3030
1407 3030 3232 1650 -266 -1642 -1715 -125 1440 2584 2103 331 -1498 -2022 -1511 -36 1096 1225 44
1424 44 -1849 -2629 -1913 -680 654 1104 374 -1408 -3106 -3207 -1749 427 1533 1418 -386 -2305 -2552
1441 -2552 -2263 -657 823 1742 1112 -488 -1982 -2061 -580 966 1434 1172 217 -1033 -1288 -314 698
1458 698 1922 1925 1014 -57 -1415 -1028 539 1856 2674 1966 426 -875 -1549 -855 948 2121 2145 1234
1476 1234 -359 -1080 -1275 -423 1121 1779 1170 -217 -1278 -1107 -477 429 1213 1067 29 -1306 -1755 -1223
1494 -1223 -60 1465 1618 892 -477 -1752 -2003 -1133 817 1640 1458 27 -1201 -1881 -1198 -197 995
1511 995 1097 238 -1090 -1467 -959 -161 512 1057 637 -379 -1435 -1906 -897 201 1552 1053 475 -874
1529 -874 -1990 -1854 -620 779 1437 1089 -225 -1372 -1302 -572 490 1110 1061 680 -473 -609 -492 339
1547 339 1414 1363 923 -323 -1049 -974 182 1306 2119 1781 1125 -113 -1236 -667 354 1482 2154 1452
1565 1452 403 -672 -704 -451 777 1117 929 194 -932 -1470 -646 443 621 818 -201 -1145 -1876 -1717
1583 -1717 -571 54 955 419 -822 -1678 -2146 -1690 -669 734 632 58 -919 -1618 -1461 -753 385 602
1601 602 468 -102 -828 -863 -703 482 1056 979 269 -471 -751 -317 764 1705 1594 1384 394 -656 -854 147
1621 147 1086 1890 1698 1099 75 -530 33 389 1145 1472 922 -2 -588 -578 66 878 1036 433 -312 -1182
1641 -1182 -1235 -1000 78 970 624 -80 -1066 -1657 -1262 -730 245 388 230 -600 -1319 -1289 -1115 -444 420 274
1661 274 -36 -748 -1035 -969 -365 362 963 170 -380 -905 -871 -166 770 1319 1292 308 -33 -964 -589 229 973
1682 973 1230 938 687 -134 -472 22 481 915 1086 316 -49 -678 -86 263 1016 707 242 -608 -640 -966
1702 -966 -165 606 925 480 43 -905 -1032 -1018 -94 722 790 377 -375 -974 -542 -229 325 758 446 -31 -605
1723 -605 -594 -376 412 698 638 149 -840 -852 -807 221 475 1097 570 -482 -1223 -987 -644 254 654 754 251
1744 251 -416 -544 -687 -27 108 482 109 -228 -520 -779 -145 513 558 565 -252 -808 -909 -628 269 671 793
1765 793 533 -293 -664 -831 -350 313 811 712 398 -217 -154 -344 141 799 1084 569 56 -363 -424 140 760
1786 760 1155 438 -22 -105 -803 122 503 903 795 205 -443 -1022 -544 -146 272 459 474 -287 -962 -883 -711
1807 -711 -122 338 52 -357 -609 -1176 -1003 -497 -124 131 -177 -687 -1025 -1122 -590 77 502 498 -38 -453 -1007
1828 -1007 -472 29 496 591 765 -25 -403 -386 75 715 753 849 372 62 -265 -88 647 1023 845 711 -210
1849 -210 -170 -140 532 862 1131 530 218 -375 -509 -292 287 721 616 93 -446 -648 -560 -442 -35 660 -53
1870 -53 -356 -682 -826 -297 122 741 301 -196 -599 -915 -541 -204 575 442 69 -401 -660 -661 -63 145 801
1891 801 172 -27 -240 -383 -508 155 672 932 331 91 -595 -96 -114 511 673 125 79 -179 -296 -137 615
1912 615 803 629 128 -358 -719 -468 -288 287 352 476 74 -594 -260 -363 -48 69 560 -118 -458 -550 -511
1933 -511 37 205 521 62 -440 -574 -627 176 152 503 658 88 -283 -701 -268 87 377 258 505 103 -144
1954 -144 -357 -87 357 441 343 20 326 -406 -90 275 429 475 205 -519 -459 -638 -36 487 365 372 -133 -639
1976 -639 -879 -761 64 448 221 -49 -360 -494 -741 -391 -80 344 295 -147 -508 -527 -200 515 485 605 5
1997 5 -332 -210 -71 152 501 664 405 121 -526 -196 293 592 881 889 517 218 -360 -37 374 482 589
2018 589 221 -199 -348 -419 -77 193 414 474 -126 -539 -500 -388 95 297 385 70 -658 -779 -597 -273 173
2039 173 -88 105 -276 -598 -650 -477 -381 6 76 57 -647 -518 -168 -109 371 330 0 -39 -352 -391 6 326 814
2062 814 381 600 -243 -180 -50 443 347 558 588 421 -163 -192 81 637 454 564 85 118 -6 -245 349 258
2084 258 284 -62 -228 -427 -382 -56 98 173 182 -512 -748 -806 -161 -51 72 184 62 -445 -655 -810 -277 -36
2106 -36 146 95 -225 -298 -390 -11 273 522 264 177 -134 -543 -298 429 591 258 120 -217 -253 -186 117 240
2128 240 502 503 -214 -262 -399 -190 465 102 223 11 -128 -816 -52 259 214 289 82 180 -542 -244 -60 11
2150 11 195 169 78 -409 -272 -300 -102 544 471 -37 142 -400 -620 -96 -1 120 214 193 -301 41 184 229 574
2173 574 440 184 -65 32 -182 36 388 427 -8 27 -411 -208 -182 50 206 344 154 -239 -454 -339 -119
2194 -119 -43 37 261 -220 -39 -598 -305 -37 22 -73 -114 -297 -559 -108 -131 -53 220 -254 -388 -91 -336 -224
2216 -224 292 77 351 -195 -322 -421 -71 129 223 786 378 239 -15 -81 413 432 361 165 -73 -71 40 245
2238 245 394 617 504 284 39 -109 46 30 308 408 117 31 -318 -306 -179 -157 179 209 -66 -322 -660 -389
2260 -389 -325 154 52 -23 -566 -413 -375 -398 -97 -66 -95 -100 -774 -252 112 -166 167 235 75 -242 -329 -425 -155 154
2284 154 339 260 -148 131 -70 -57 375 466 400 363 56 -104 -54 397 171 349 355 296 -344 88 210 208 485 365
2308 365 47 -284 -2 -42 -209 119 360 22 -174 -260 -100 -67 191 -77 85 -285 -250 -344 -342 250 159 -58 87
2331 87 27 -410 -454 -88 224 309 165 -101 -9 -217 -127 126 325 -45 152 164 33 217 87 -121 285 352 -169
2354 -169 -130 -95 74 335 205 231 -139 -327 -280 -134 -8 56 346 199 -200 -379 -206 -309 143 266 -8 -137
2376 -137 -63 -240 84 -187 342 334 -136 17 -154 6 -32 344 548 120 -68 81 -230 95 309 345 399 416
2398 416 201 -197 168 -375 478 -36 85 220 -45 250 38 365 105 356 21 -193 -499 -246 28 123
2418 123 12 81 -373 -49 -210 -62 -39 -69 0 -521 -457 -240 -435 -570 -218 117 -142 -335 -181 -192 -237 -65
2440 -65 -5 269 -17 -248 -184 -101 77 350 356 254 -7 -102 -75 -86 425 582 289 158 -27 292 383 229 275 300
2464 300 551 187 -85 432 247 452 224 0 33 -29 -125 51 424 -2 145 -28 -173 -502 -88 236 -92
2485 -92 246 -166 -172 -420 -348 -425 -145 31 -254 -214 28 -394 -374 -303 -135 -228 -72 -463 -179 41 237 144 178 -192
2509 -192 214 -89 -411 368 181 129 -132 171 -268 104 -288 150 428 91 252 -196 -25 -160 191 118 363
2530 363 317 -66 217 110 -207 200 433 206 -100 -324 -114 -245 185 175 260 -150 -56 -248 -526 131 -170
2551 -170 47 -241 32 44 -229 186 133 207 -90 14 -79 -381 -469 211 286 -215 265 190 25 -35 107 247 209
2574 209 -141 -84 -25 29 39 -133 37 -68 396 -49 -368 178 194 406 -47 -165 9 -219 -41 -22 -104 79
2596 79 -114 -70 -130 -248 -241 -114 258 -10 -222 182 -12 -27 151 121 199 -54 -133 -238 268 -87 -130 143 16
2619 16 162 66 103 262 237 261 144 94 183 3 -337 -122 175 16 -12 216 381 -65 -108 125 306 308 -178 -108
2643 -108 102 -180 16 -32 30 45 3 -241 -191 -36 -81 22 -238 -77 -327 -477 -374 -105 -96 -108 11 36 -45 -138
2667 -138 -226 -261 11 66 243 -30 204 1 -105 30 223 301 118 -232 201 18 144 414 225 241 160 100
2689 100 103 197 154 3 371 -17 -249 -79 165 75 352 55 -169 94 -55 -111 -29 42 -97 -144 -285 -239 -188 -275
2713 -275 10 9 1 24 -595 -253 -391 -222 176 142 -42 -160 -239 86 -17 -19 -121 -59 -281 -75 -97 70 111 158
2737 158 97 86 386 66 -276 -123 247 -8 172 51 176 -26 28 -323 103 398 -71 -37 102 -73 -97 -37
2759 -37 -40 120 -16 -274 75 199 -32 63 -69 151 -103 -219 -204 357 101 118 64 -131 -38 -144 -116 -40 102
2782 102 26 80 230 -83 75 0 103 -32 101 9 -354 -93 61 101 180 400 -76 -207 94 67 324 -163
2804 -163 -87 -235 20 162 46 48 46 146 -91 -171 -228 278 -22 -234 174 -207 155 -178 215 -234 -325 204 -26
2827 -26 40 -275 -1 -87 -63 -47 -136 104 -86 -193 -63 23 170 287 15 146 243 -3 107 -237 91 244 204
2850 204 -8 -16 110 228 -2 90 343 218 -190 50 -51 91 164 36 107 276 -61 -291 -17 -292 232 166
2872 166 101 160 -123 -224 -62 -268 6 -194 -347 -238 -61 -125 -145 64 -240 -199 -39 -344 21 127 -149 -28
2894 -28 -76 83 -187 -86 -50 51 147 -16 190 -116 -39 20 181 -26 250 66 162 -67 -107 320 302 154 42
2917 42 22 -122 47 82 -16 108 66 -167 33 -192 301 -222 -78 146 -62 -57 -199 2 -275 -52 -122 -95 -2
2940 -2 -128 39 -228 -59 -105 -416 117 -355 -435 -231 382 149 -161 226 -165 -182 48 293 -340 -198 137 74
2962 74 -164 159 37 45 -139 229 -292 -186 183 195 -93 7 312 167 30 -17 -109 -96 -18 139 295 195 -291
2985 -291 131 -260 -259 71 -80 1 -143 67 13 -127 91 88 6 -213 -153 -293 34 42 -117 -126 -84 126 -82 -67 76
3010 76 37 240 -63 234 -212 44 140 100 80 -20 152 33 -327 198 12 142 50 -183 26 217 12 -84
3032 -84 250 106 -93 387 102 -410 -4 -48 217 -28 -204 -42 104 91 -169 -132 -43 8 220 -106 -2 -168
3054 -168 -7 143 -216 -44 -56 -474 6 -218 27 -117 -60 0 -107 9 -210 249 274 311 -95 -146 -104 91
3076 91 -96 10 50 -334 132 110 35 54 500 197 78 -2 114 14 42 -18 489 -223 110 -197 277 -114 -2
3099 -2 -34 -297 -13 -42 -257 -27 -37 -16 -143 -111 108 -158 52 -418 57 -17 -143 -141 -51 -222 45 -166 246 -104
3123 -104 -158 21 -64 155 -99 88 121 8 346 153 39 -37 82 133 64 -93 93 -22 107 244 -22 -1
3145 -1 -33 -1 252 -7 -28 -27 4 -180 38 18 -44 -45 -177 -56 52 160 116 -127 27 -70 -100 9 188 -1 216
3170 216 -40 -221 -69 116 -57 58 -232 214 -226 -75 -247 -78 68 -138 19 -94 121 -240 13 150
3190 150 146 -74 78 -243 -284 -158 207 86 166 33 260 -251 20 210 -269 69 109 191 100 83 -21 209 124
3213 124 -200 91 -100 -49 -65 -80 195 157 -142 -300 -106 -107 74 105 -285 -151 64 61 168 -276 54 192 228
3236 228 -96 15 -228 -258 196 -33 -9 82 -219 -88 67 68 82 21 72 -127 110 -15 101 63 211 -124 358
3259 358 93 333 -34 164 -110 -53 -81 59 -523 -63 94 50 278 -92 75 -88 111 -78 -261 -168 -244 -251
3281 -251 -59 -125 -103 67 152 253 -24 -66 -73 -169 -39 69 -8 -318 262 -109 57 -143 28 -53 65 -136 59
3304 59 211 -50 -119 229 180 -37 -1 138 47 -115 180 151 -57 56 -232 29 109 120 34 -181 -36 -343 -125
3327 -125 133 -179 219 195 7 -188 -49 96 -287 51 -57 -44 -256 -317 -248 -164 -206 -171 -306 118 -116 -112 114
3350 114 39 -13 22 -139 -160 -34 -241 165 117 104 188 -181 245 56 -51 280 14 -209 92 -32 -107 97 100
3373 100 -188 82 396 155 -27 64 -43 -99 29 -53 -14 -107 -90 280 -38 -3 -312 -249 -46 99 -115 59 -47
3396 -47 -354 53 -212 -76 9 271 57 -208 146 186 276 97 -118 -29 -51 -221 -137 -297 102 35 -7 117 204
3419 204 -267 -134 131 142 -57 167 90 6 89 6 -21 118 64 -127 63 50 10 150 -78 -189 -134 -107 -156 -81
3443 -81 -39 -176 -233 53 -269 61 86 -90 57 58 19 20 -30 -134 198 -9 -65 159 -20 127 233 22 -53 -77
3467 -77 86 -114 -224 -155 -3 -263 -109 122 -28 147 193 83 237 -103 51 17 -75 -33 14 242 -206 -15
3489 -15 116 -53 34 -183 185 59 14 -277 -121 -280 -222 -224 234 -128 -111 -220 -183 -120 -62 -32 104 -214 48 -257
3513 -257 -211 -53 -187 54 -33 -183 -144 -243 171 -108 167 10 187 349 368 122 0 -255 -89 68 30 56
3535 56 230 100 129 -10 153 117 -127 72 123 -4 -107 271 -67 8 146 112 -2 -412 -174 -69 -47 104
3557 104 -172 -337 235 169 -221 -110 54 47 -178 116 -299 -204 -224 -103 -239 -15 -93 -6 -27 -29 201 -20 132
3580 132 -125 229 82 118 -124 205 322 128 183 -58 193 141 -53 119 257 123 137 139 256 75 48 -234
3602 -234 222 -175 247 204 -436 124 -145 -147 34 95 39 -160 85 65 -66 -154 -57 -261 -1 238 -332 155 56
3625 56 -202 227 218 -51 151 -107 -73 247 76 104 80 48 -50 -101 210 -34 167 320 109 130 249 269 -317 74
3649 74 -55 270 -37 22 17 208 115 -292 81 -299 -141 144 -23 111 -80 12 146 -194 250 -211 44 -57
3671 -57 -224 -75 154 98 -47 104 228 195 276 137 -141 266 -204 -67 -53 -109 -131 92 83 -34 215 14 92
3694 92 18 78 18 361 162 26 -22 215 160 8 -143 -52 -15 -38 -391 -240 -185 185 -6 253 -207 139 10
3717 10 -80 1 -28 117 -81 25 -27 -420 95 6 8 -24 -102 23 24 55 159 148 -100 -36 -22 -161 -213 76 -17 -24 -132
3744 -132 -238 -33 129 246 -284 56 58 103 -180 -104 169 161 -4 34 92 -97 45 272 387 363 -285 3 228
3767 228 251 -83 194 165 146 224 -35 11 382 -41 -44 72 -185 -83 -205 0 38 84 -94 -109 -223 8 9 -69
3791 -69 -148 22 -158 112 33 -130 89 -225 -57 -27 116 14 -239 -11 46 343 -157 -1 -82 -91 108 -25 -191
3814 -191 -186 57 92 6 -2 -185 -195 -75 -12 140 -69 74 152 49 23 -222 265 -259 93 -6 -201 57 53 121 -47
3839 -47 -117 133 130 -26 -38 -153 -190 -70 98 -116 50 -284 -103 102 -2 -60 -169 -89 -171 95 163 114 36 10
3863 10 -52 283 76 209 -75 126 -330 76 -77 133 73 -13 -27 -238 -19 40 105 -132 39 -117 -130 -126 92
3886 92 330 61 124 -236 243 9 141 -244 -383 314 135 -122 -214 290 -40 -120 -96 -181 -432 -328 -82 -283
3908 -283 244 -85 26 -217 -64 -35 -6 48 -101 192 10 223 -88 -19 -47 -204 -48 -27 12 -20 75 20 -49 187
3932 187 133 385 88 72 383 49 2 182 156 -50 3 -37 -46 137 70 -41 13 -93 -59 -89 -355 20 299 -14
3956 -14 -212 6 -187 -128 -55 5 -90 -377 139 11 -193 -16 136 -56 -237 47 225 -141 -168 202 54 68
3978 68 -39 -24 40 59 42 -253 289 -226 289 -202 118 122 23 -66 39 33 -187 123 -160 167 268 4 -50 -71
4002 -71 -12 -325 261 -98 -135 -89 213 4 -177 -17 -48 -197 -114 101 96 460 -384 -62 -78 -62 170 -122 -16
4025 -16 -107 -217 76 -3 33 6 6 144 -130 -92 130 -46 -70 318 -17 273 120 -163 -102 -66 0 -160 83 215
4049 215 81 149 -291 91 -98 -48 5 -30 150 130 112 198 -50 -34 0 -321 -357 -74 56 235 -95 -65 -23 -398
4073 -398 -85 33 116 -64 -206 -37 204 -155 -139 114 8 62 35 49 -122 -252 -56 39 -11 326 -181 -18
4095 -18 -170 93 -107 -43 -84 -132 -195 73 52 31 -62 40 87 -302 -246 199 -140 -57 283 -101 70 -107 140 -184
4119 -184 260 -61 139 150 -173 -232 -250 -52 -42 -10 -93 13 136 -236 86 226 138 -119 -137 65 -41 31 -104
4142 -104 60 119 -41 196 71 63 118 45 41 328 -105 -8 111 138 259 -96 45 76 -100 -106 -228 117 -66 -34
4166 -34 155 -103 360 -184 59 -73 131 -97 -312 37 -19 65 -11 55 -61 -80 -50 -137 -110 110 -86 7 -463
4189 -463 145 -12 80 153 108 -10 23 127 49 73 -44 -21 -25 -196 114 41 72 125 18 -40 52 -226 54 118 179
4214 179 118 31 101 -36 -8 74 66 -7 199 -106 2 33 -212 28 -194 -84 92 -293 -208 109 -35 -378 -256
4237 -256 -8 -313 -144 -135 -238 111 -62 -119 -183 30 10 24 -324 -43 39 -121 118 44 78 -179 -11 112 80
4260 80 -161 -141 97 10 7 63 -56 64 -260 159 -139 -221 -177 98 -97 317 33 114 -139 -72 -54 -138 116 77
4284 77 -151 -94 -74 -260 -67 -181 76 217 0 20 -243 -63 -236 -71 -256 85 -66 216 -201 -201 31 133
4306 133 157 296 108 107 -159 -45 161 -12 -16 247 -149 -106 126 124 236 -186 10 8 -193 283 59 -254 437
4329 437 202 -32 -121 -61 179 297 -193 175 -7 51 161 -65 -75 -293 103 -135 -88 -299 145 190 98 -106
4351 -106 -94 130 -97 -79 213 207 -49 -34 86 -237 -262 49 -136 -171 125 115 2 -119 145 -75 -107 93 -275
4374 -275 203 -41 70 -62 93 -119 314 300 -2 224 282 29 283 251 59 24 -117 10 -65 103 51 106
4396 106 -212 -94 -147 -11 -155 -197 -180 37 29 -298 10 136 -211 -401 130 -256 -100 -36 -27 -143 -211 -29 -142
4419 -142 -175 157 13 -218 -305 229 -183 185 49 49 161 -187 71 56 168 -300 53 -51 177 223 130 285
4441 285 58 167 44 64 -28 21 96 104 236 407 -23 -289 -119 73 -44 -230 74 -147 14 -16 65 -34 -9
4464 -9 -335 -42 -130 137 55 -164 38 -477 -6 211 -154 -36 216 -53 -128 -174 161 155 -123 -22 -131 152 -48
4487 -48 157 103 31 52 -164 79 -49 63 43 -281 -317 117 51 119 158 -228 -44 138 127 -117 -132 47 158 -40
4511 -40 -152 26 -71 30 -53 -196 -209 -286 101 -158 5 -120 202 139 -260 28 5 130 -363 -171 -100 40 -214
4534 -214 -169 42 213 82 -247 121 397 46 115 162 19 -132 175 -73 -172 86 -29 146 -100 66 -149
4555 -149 145 177 -41 -87 14 -106 -310 110 116 -70 50 10 -149 -8 -116 86 67 -119 -108 -3 -111 259
4577 259 190 167 -68 -191 86 -385 -71 -30 125 110 -166 -332 238 -14 22 109 -7 43 122 -313 -62 196 -57
4600 -57 105 335 69 51 48 67 234 -200 207 172 49 17 193 -197 93 95 -208 -61 -201 -21 6 123 132 108
4624 108 49 -3 72 7 53 43 -257 -22 -98 -68 -245 -130 -7 -33 -302 -18 -167 217 120 28 -92 383 192 299
4648 299 79 377 -176 -144 152 -181 78 -112 263 -16 -32 109 138 184 -121 -151 -118 375 120 213 373 20
4670 20 20 8 -110 -91 28 -116 -69 134 62 100 -23 -42 108 -72 -63 -170 58 -62 -230 58 -166 -55 -31 189
4694 189 99 -143 -13 -150 -232 -16 -11 -6 3 -35 -53 -178 -60 -295 -33 223 -187 118 266 -40 306 -76 153
4717 153 208 388 190 -188 -101 -126 167 117 -79 133 -503 -55 -84 243 105 -51 -2 249 -27 -27 -80 -417 -197
4740 -197 5 115 -5 -42 -124 197 6 166 -309 -184 -92 -208 -82 -103 109 91 32 133 -15 24 152 129 567
4763 567 60 -71 98 -20 279 236 112 -45 333 178 -21 -57 78 -139 -1 -106 117 179 167 67 69 -26
4785 -26 34 48 245 167 -247 144 12 32 46 -25 -188 299 -297 -253 -180 -77 -11 77 -294 -134 30 -39 -80 87
4809 87 -70 176 -68 39 98 -112 -124 64 -250 2 231 169 76 124 -205 286 34 -155 -65 196 -112 71
4831 71 85 102 -40 94 -108 264 11 -165 11 14 75 68 154 274 -12 49 -107 -191 -323 -235 -160 -31 -292 -147
4855 -147 156 177 117 99 -98 -39 -29 -188 61 -137 44 -38 37 -79 -25 -17 -168 -54 132 -147 182 -233 -291 182
4879 182 14 -290 -215 222 228 71 93 136 15 10 132 -270 175 57 -110 181 -40 71 88 167 -251 -75 59
4902 59 -26 13 170 149 -16 49 -216 52 43 57 161 -129 -151 -33 -142 -78 -151 -184 142 28 -203 27 154 -73
4926 -73 -18 306 31 -11 -63 -67 64 290 -181 444 193 99 26 109 14 -270 -188 108 46 76 280 -160 -233 -127 16
4951 16 376 -161 -33 3 185 152 36 -38 4 46 -105 -105 79 225 136 -197 -319 -32 -43 -365 -33 -93 -172 -5
4975 -5 17 6 -30 177 51 -81 -124 -136 -151 140 107 -22 179 -20 -170 -164 11 -90 271 105 13 56 -23 -219 70
5000 70 154 78 81 -70 -7 55 50 -113 23 74 260 144 -213 -146 193 169 10 -243 177 24 -69 -400 -142 399
5024 399 -28 178 -103 -139 -180 -219 -108 -75 -46 -151 -54 -109 -69 -7 141 -78 -136 -148 358 -145 203 59 -81 -16
5048 -16 326 47 -90 80 -89 424 11 -60 181 -94 -19 -142 -224 75 243 355 373 -108 -216 57 -41 -80
5070 -80 52 -163 -215 -17 -148 -119 -145 -60 -206 -139 -102 -149 -78 -200 24 -114 -75 -412 70 0 252 -96 106 72
5094 72 102 -25 -12 -233 -132 270 -100 335 171 110 17 -218 -333 253 322 102 37 -17 79 -58 47 79 9 285
5118 285 257 38 -219 126 -78 162 -22 -98 -289 -129 8 92 -141 91 -31 -68 -2 -208 33 142 31 -234
5140 -234 225 -161 -19 219 -200 174 -91 233 -82 -7 127 141 239 98 17 -71 -191 -210 -164 203 28 0 68
5163 68 217 76 122 144 -43 -82 18 47 83 -109 114 -112 -195 149 81 -115 -44 -110 128 -71 -83 -133 -100 53
5187 53 -136 -36 -33 -200 -157 -58 72 272 -177 247 11 13 -165 222 -222 -104 -96 120 -8 -115 -16 -100 334 -2
5211 -2 96 9 -58 273 230 -8 -38 102 -61 219 21 28 -188 4 -25 180 -281 -359 20 -69 -150 -36 -45 -9 -286
5236 -286 50 -29 -83 99 -496 -137 23 228 -93 16 -87 88 -60 -63 80 -33 212 18 -290 37 -221
5257 -221 -55 10 97 278 -10 9 -156 53 -232 -249 156 96 -45 -296 -69 387 80 -207 150 247 59 -237
5279 -237 34 80 -17 110 -29 -33 -136 -100 96 -103 -17 -98 53 272 99 -248 -97 -157 -214 -44 94 98 165 -186
5303 -186 -48 -76 -214 18 283 -180 278 -216 -87 -143 -87 246 -257 -321 -323 81 -191 -133 148 -47 -67 -161 -107
5326 -107 11 -240 100 114 155 221 -21 -119 251 -59 67 47 -82 -71 -172 -156 236 -196 11 -352 78 -157
5348 -157 7 247 -281 -218 -94 38 146 131 127 -52 32 1 1 -109 -144 -35 75 -206 -22 155 -105 331 -243
5371 -243 -99 107 22 -76 -48 26 23 10 -95 -191 -22 -91 -138 -54 -156 -256 27 38 -64 145 13 -127 -109 -191 197
5396 197 -5 -52 78 -287 43 -212 66 -57 -54 120 171 133 199 23 237 92 -111 -111 198 2 -43 48 -199
5419 -199 7 163 -291 55 -120 130 37 -139 47 -11 120 103 -97 202 -1 -59 -26 -163 127 -200 111 267
5441 267 67 -317 16 89 -120 118 60 0 -117 55 -54 -81 77 -156 118 107 -4 -175 -94 -2 -8 -35 18 -121
5465 -121 234 -371 118 312 -15 -10 -173 24 -328 243 22 252 191 -485 182 198 -56 -44 -18 513 188 -192
5487 -192 384 -234 -101 84 -140 -137 -115 339 78 -41 33 91 -52 85 -237 -93 -123 108 -189 -238 62 35 -226
5510 -226 17 -70 54 -162 145 -132 52 196 72 5 -40 26 -191 -171 -180 52 -221 78 168 211 -74 209 -14
5533 -14 -57 -105 -39 -93 -122 0 -32 237 384 -170 -102 -83 -330 -87 344 -79 -28 4 26 -310 -112 44 -214 60
5557 60 -41 61 -9 -115 326 -15 -24 -201 180 132 171 177 162 143 303 129 58 111 -9 25 171 -302 87 17 -272
5582 -272 233 -73 -121 169 55 -146 172 298 109 -267 -209 74 -221 -127 -246 78 -101 -142 80 127 -306 -191
5604 -191 11 20 -98 287 -66 75 -292 -32 295 -277 -60 -217 -56 294 42 5 96 106 49 38 -74 -34 177
5627 177 108 -128 68 48 406 108 12 216 -69 -84 -131 -22 74 -89 -32 232 -36 222 -145 -62 -430 -71 219
5650 219 -79 204 14 -175 333 182 -66 64 9 -95 -25 244 -16 -146 47 167 -146 -45 -89 43 96
5671 96 56 -187 344 37 14 271 181 78 -140 -245 232 179 -30 19 30 377 -119 2 303 255 -152 -145 234
5694 234 -159 -73 159 315 -19 65 0 -120 -138 -229 -100 119 98 -125 43 -75 32 492 -37 63 -304 -433
5716 -433 -8 -78 160 170 29 88 162 -111 27 39 -150 138 -228 247 22 159 -147 49 -123 -237 202 16
5738 16 -67 -162 -85 220 72 -88 145 108 245 431 -48 -175 67 -229 47 337 123 176 38 -151 36 16
5760 16 -125 145 -121 184 178 107 -16 65 198 168 -37 21 93 18 286 -413 -237 156 237 181 -125 -162 -86 138
5784 138 -67 68 -178 -78 4 -122 -230 355 184 151 267 26 8 -3 9 -19 352 89 -116 299 -52 -230
5806 -230 108 276 -44 -225 -39 -7 149 -259 75 -76 271 -98 -189 61 -115 236 -20 297 9 66 -158
5827 -158 135 243 101 -93 15 112 58 -274 154 -16 85 4 4 -147 406 310 13 237 137 278 -186 -80
5849 -80 -68 101 119 173 -11 -61 -39 -205 -162 -25 -72 -44 -243 -111 -91 -226 -157 30 -63 -84 -205 -144 -17 -2 198
5874 198 3 -11 187 297 225 120 160 225 18 31 58 -3 189 -340 -83 85 76 -541 -253 -54 211 142 127 9
5898 9 -50 69 46 19 -133 -131 -43 36 -7 93 44 -45 -46 -53 -159 141 158 125 8 -55 -202 -23 67 33 -218 90 28
5925 28 -108 -212 -190 91 -37 16 149 -136 -72 -41 35 -153 -221 238 146 -154 7 206 -177 99 -141 -103 -4
5948 -4 -132 -98 -51 -32 231 101 87 144 -177 17 -15 162 -146 -94 160 -1 -73 -98 -36 -141 154 -3 -35 -131 80
5973 80 331 -120 8 -103 -124 -4 44 222 -26 71 104 -14 -199 -170 169 -169 89 -292 235 215 262 -166 -123
5996 -123 -208 -248 203 104 259 176 -70 73 214 68 43 29 -252 -173 -232 -38 46 -43 113 -40 -116 -131 -65 -381
6020 -381 -146 17 72 -104 225 -105 -121 79 115 -41 0 138 -11 50 -179 14 -121 -11 14 143 -12 -32
6042 -32 -73 48 126 57 251 -208 143 180 -91 92 -18 -93 -8 101 -73 -63 102 361 51 -108 128 152 98
6065 98 -210 53 121 27 -126 -23 284 -55 172 188 73 117 -89 -163 33 116 -470 212 27 -1 81 -37 -168
6088 -168 309 414 51 -101 -40 -194 31 251 -171 4 106 -114 265 -144 122 -20 178 176 -146 109 -54
6109 -54 -55 107 -16 -81 208 -292 131 264 -504 137 42 54 306 229 -65 -55 3 199 89 -241 -167 87 149 38
6133 38 -250 -22 118 271 64 -311 -135 -129 194 -29 -37 19 -98 65 195 118 113 -184 52 68 94 98 108 49 58 -38
6159 -38 115 152 -25 191 -142 21 -313 12 190 -59 126 11 226 -186 105 -254 171 -26 -44 -249 -66
6180 -66 -87 -18 117 113 -72 -88 -114 -143 130 56 60 -53 -44 266 235 -176 -115 -198 3 -16 -164 194 164 127 97 126 -41
6207 -41 38 149 -81 134 -85 -175 178 -208 179 -172 111 -266 73 -198 -51 -39 7 75 -229 161 106 163 6
6230 6 61 92 171 -13 -57 64 -101 66 -4 198 -5 -103 162 -40 -79 -180 -184 62 -139 -52 -84 -69 -55 -290 -148
6255 -148 -42 -57 18 -104 -210 127 107 193 274 168 -259 42 -125 -184 -25 -133 -115 108 -29 -187 9 -109
6277 -109 59 70 -58 205 36 -335 118 108 93 -120 -74 -53 112 -61 49 176 75 -202 -149 38 146 86
6299 86 225 -157 -284 -168 -9 30 -169 -98 -190 -88 99 -58 120 125 -88 66 39 39 -53 -60 237 82 283 -311
6323 -311 -78 39 18 -122 -246 88 -42 -52 230 94 218 -244 -87 -50 65 173 -19 -138 92 211 -62
6344 -62 -114 76 16 163 -324 -173 97 28 -135 91 184 134 298 325 -139 286 69 141 -146 -8 33 -135 182
6367 182 28 -122 -40 -236 -65 50 -197 153 123 -21 -105 -349 -372 23 55 17 -179 61 18 144 121 -162 -145
6390 -145 34 246 -235 -9 -29 45 -37 178 -118 -93 196 -103 214 -258 -114 49 121 101 -105 -227 148 -111
6412 -111 148 -96 57 -30 -123 164 -117 -122 -89 -33 -140 -193 129 191 -47 -117 -191 -28 -106 142 -113 -74 91 -101
6436 -101 -54 112 209 136 -199 42 46 -41 -16 65 -92 -132 -170 -56 -80 -31 -172 47 383 -401 -35 285 -92 277
6460 277 168 -173 -27 -184 42 125 306 -288 -413 41 214 -80 63 38 -20 277 -203 -69 50 -9 -39 -9
6482 -9 -5 -201 51 164 -34 111 -64 -58 190 105 -69 -172 171 -3 122 226 161 108 115 116 -52 96 -142 -45 -203
6507 -203 -207 -124 192 66 257 55 -219 -145 56 -160 -129 -121 -92 212 88 -73 -48 -194 36 175 -18 141 201
6530 201 110 237 17 59 -205 -184 133 -11 208 93 -100 113 65 -304 -2 110 249 -69 -238 -41 27 59
6552 59 -43 42 -183 50 9 150 -89 2 -62 -143 -152 -209 -64 40 -168 -105 -125 210 -127 -364 -162 -63 17 140
6576 140 91 25 -251 79 139 40 -218 137 322 115 -122 149 -134 -45 85 -304 -90 21 -84 69 -163 68
6598 68 172 40 -143 152 289 74 16 182 27 172 397 154 -73 -25 -63 159 -67 42 -100 231 30
6619 30 -108 -188 -91 -172 -14 89 -156 56 -22 -176 -52 -69 -184 -9 63 -102 5 -113 -35 47 -215 -327 -65
6642 -65 -17 24 144 -207 -25 2 132 26 -73 -194 -194 -112 306 -176 38 -110 21 -123 10 70 71 -209 -109 -47
6666 -47 -68 -72 -116 167 -33 31 29 -313 150 130 -181 -97 -165 -70 -141 -313 -57 367 -172 268 -13 32 20 -62 -79 -34
6692 -34 -23 -7 151 -240 -434 -200 9 9 158 35 -111 176 -8 5 -15 206 14 167 298 -262 100 -71
6714 -71 -204 60 153 227 -24 -25 95 -47 82 -45 -83 -148 30 135 -150 -48 -70 -60 -25 -103 34 29 -312 59
6738 59 95 -143 -6 182 -194 -38 63 -80 105 91 -107 -141 33 74 50 -74 -38 -114 68 -246 159 171 -94
6761 -94 73 322 -121 68 -7 -348 53 -22 138 -135 -238 -73 -183 -111 -57 -40 269 148 98 45 91 9 169
6784 169 -41 -28 155 -180 140 52 57 -315 -80 204 297 84 -150 -9 232 -71 150 -29 49 353 158 13
6806 13 322 -45 -227 -36 -63 15 20 -5 136 36 -302 -64 -76 -134 32 215 -105 80 76 107 73 -350 -97 124
6830 124 56 118 -114 -121 163 59 -10 -191 -41 -51 56 -144 -110 79 -42 322 -109 269 -29 61 162 41 -88
6853 -88 -21 -67 -159 -125 170 112 -61 -121 152 -90 -10 -128 -125 -61 -83 78 -160 -132 -116 168 -42 93 71 54 -222
6878 -222 -157 199 84 220 103 -89 152 4 -205 -215 -352 -3 271 242 -66 -37 -50 446 -70 111 37 94
6900 94 185 96 -259 66 -66 -230 157 -161 -99 55 -105 -16 60 -53 -17 241 46 170 -3 98 208 -319
6922 -319 -255 220 -68 -10 -51 9 121 -83 -376 92 -195 -96 0 52 26 175 -130 112 -147 99 20 -90 -20
6945 -20 94 -67 -137 119 275 -51 30 144 86 -145 52 -9 -161 -73 -169 -21 -230 14 7 -273 -258 92 -87
6968 -87 -89 -111 90 390 161 -34 -92 -351 -106 143 -51 -40 166 33 -337 31 -140 85 -74 -220 -9 93
6990 93 -263 -10 16 -41 -128 145 -27 23 90 -158 -179 266 21 132 -146 42 315 -285 106 -14 -20 -109 161
7013 161 38 288 -187 -215 -131 -250 324 33 158 22 8 -112 23 -135 141 263 -174 40 -35 223 261 -222
7035 -222 -260 -195 -2 73 34 41 203 -8 -209 216 -71 -68 -113 163 158 -20 212 126 -144 208 5 1 21 157 22
7060 22 -68 147 146 -73 252 -96 120 300 -145 48 -39 -98 -151 -138 -87 65 223 189 182 -79 97 -132 -59 -167
7084 -167 -24 58 -146 -78 150 -33 -114 -131 194 172 14 25 -160 38 -189 -55 -51 -126 107 -192 -89 187 -76
7107 -76 -50 -13 -104 49 60 260 212 21 -85 -114 222 362 228 -243 158 -116 65 -39 78 254 54 46 -134
7130 -134 293 -97 86 -107 -243 91 -163 197 -147 116 91 -123 70 -127 56 78 -370 -270 432 241 -137
7151 -137 128 72 -229 -37 -3 79 0 303 -153 19 199 -61 -108 130 27 -18 -82 -132 -131 70 151 -225 -44 211
7175 211 109 136 27 -81 -153 71 -58 234 -141 -67 82 113 -19 17 -138 -88 -8 18 -22 8 9 81 70 4 -10
7200 -10 -177 169 -171 -176 -184 -353 -111 255 -88 51 -7 211 -12 139 82 45 -3 67 -227 58 258 -312 104
7223 104 181 -106 -70 42 83 -234 -19 -21 40 -278 7 -243 18 -7 -45 -94 -154 48 34 236 234 84 -83 -116 -135
7248 -135 -129 -150 -6 109 143 24 -37 -131 -364 -28 -195 113 -69 -78 -192 29 -116 -215 -238 122 85 -8 -8 169 87
7273 87 -118 -14 108 -193 113 -77 209 11 -3 -21 -164 -8 -111 23 17 147 -115 165 -129 99 60 -119
7295 -119 -132 -117 231 -5 212 27 -140 209 147 162 21 110 -174 -187 44 -9 -114 24 -280 -26 80 109 193
7318 193 185 -169 99 -76 -11 102 75 23 195 -233 -26 412 61 -210 226 205 20 -136 169 55 148 169 88
7341 88 -53 -103 -180 -142 -76 251 92 25 124 -95 -8 -242 -42 -27 -152 39 -61 22 15 96 237 93 154 -179 -212
7366 -212 127 -126 45 47 -134 -74 -71 -151 49 -125 21 -357 99 -83 -215 -62 -198 -24 -55 9 -131 -157 10
7389 10 104 -184 140 -21 -126 111 37 259 3 73 15 38 163 -135 82 -136 -13 -48 151 46 18 -152 162
7412 162 288 270 31 137 114 -129 -208 12 -63 -345 -131 81 51 -29 -234 -61 -164 288 -198 -26 162 46
7434 46 170 140 117 193 -157 -114 -58 -68 -14 -33 -184 339 52 -319 -251 107 209 78 24 -7 90 95 -114 97 174
7459 174 -43 105 144 205 -259 -154 -23 -133 80 -141 56 62 116 -184 3 129 65 -25 45 140 -76 -76 -116 291
7483 291 -162 -214 -3 -39 -275 123 -94 -42 154 174 -3 60 86 24 22 71 -140 62 259 306 -99 -226 235 217
7507 217 329 -141 54 74 197 -352 -46 -202 -33 221 -140 383 -355 172 21 6 -3 -34 112 15 289 288 -156
7530 -156 -69 105 276 6 128 107 -28 -114 159 -57 -144 69 -120 -229 -91 23 -97 120 155 -48 -363 47
7552 47 -301 -196 -66 107 342 -124 -98 20 71 5 -34 28 -48 -329 139 28 -154 -163 -110 168 119 150 -296 -65
7576 -65 344 -219 -1 -65 148 -6 -110 183 2 137 178 31 31 150 122 343 -127 338 -6 -117 87 260
7598 260 -116 58 -164 -297 59 -339 -37 -28 -170 -273 -3 270 259 -115 -23 -14 -203 116 53 92 19 -21 -180
7621 -180 -117 -9 142 -212 39 113 -67 215 -113 -5 102 -113 5 60 14 -127 -117 -59 438 -78 342 -214
7643 -214 78 -61 -168 179 52 32 94 -157 82 -45 -175 19 134 -57 253 -37 199 -127 -1 12 -272
7664 -272 -9 138 -182 129 -286 -304 94 170 116 106 -189 204 -3 -110 -48 133 -125 266 91 -149 -110 -78
7686 -78 -5 151 -95 37 -69 32 -124 171 190 -242 12 -236 -69 -159 -184 -175 62 -77 -135 41 -223 -72 36
7709 36 60 -135 109 -374 -185 134 339 -12 -136 119 13 70 100 67 -359 118 -238 13 124 162 38 11
7731 11 286 -189 -103 147 -261 107 179 -33 71 93 -225 13 -269 -45 228 95 -91 -65 -152 79 -182 122
7753 122 100 -36 286 0 -141 -49 138 -19 16 -343 -36 158 116 -186 114 -31 42 -257 -1 343 119 33
7775 33 53 -147 190 -103 35 -10 48 -136 89 -159 -162 -22 -88 -24 24 83 -171 -107 -47 -252 242 -284 226 94
7799 94 303 -217 20 -57 -40 106 58 293 -123 -182 219 -39 43 -137 36 195 -146 -70 286 248 62 289 26
7822 26 174 -184 31 80 43 -28 157 175 85 94 -129 52 106 -110 -13 -46 -58 308 80 -3 6 -40 -85 -9 209 121
7848 121 -61 -174 313 99 249 213 4 -66 -65 56 14 -74 -6 250 -71 -1 -54 -230 -16 -95 -42 -83 42 -36
7872 -36 -127 77 34 147 -178 -71 340 132 1 -68 -383 209 -152 3 85 -32 32 -244 -107 -38 -239 49
7894 49 10 10 80 288 -1 -143 -100 75 -36 -109 -31 203 19 162 115 202 204 -129 -12 -94 -26 -206 151 39 -174
7919 -174 101 -40 61 208 -327 -133 193 51 8 -118 146 -72 198 -236 33 -30 -118 63 377 176 107
7940 107 -442 -110 -20 42 -89 -279 -150 79 -6 -131 6 -206 263 72 136 94 79 139 234 -37 236 198 -141
7963 -141 -180 106 306 -80 -243 -65 -21 77 153 -91 5 -87 -68 57 49 -78 -249 73 125 122 -94 83 -73 -255
7987 -255 38 113 173 18 -6 -35 166 8 129 25 55 -22 27 231 105 250 -427 39 -97 254 68 -18 -262
8010 -262 -24 -7 44 135 48 -38 5 369 60 -36 -20 1 -189 -33 -16 222 3 38 59 129 151 -4 353 -97 43
8035 43 112 -309 138 223 130 207 308 69 50 -114 53 -84 -104 -178 -119 -111 -105 -96 -149 -61 -18 278 39 -34 -31 -234 118
8062 118 146 105 25 -184 -74 71 50 10 41 -79 -37 235 -86 -10 -281 227 -354 148 -76 9 -20 -96 64 -146
8086 -146 67 81 -161 3 261 1 433 -97 95 1 75 -97 -26 -109 28 -55 -190 -181 185 -47 -406 20 10
8109 10 -84 124 146 -57 -47 -82 -87 -273 14 -388 -193 124 214 -229 -172 29 116 -195 16 36 -23 -59 141 -128
8133 -128 42 -20 -97 107 288 -32 87 133 -45 -100 29 -210 108 205 -242 55 -76 103 45 -162 -121 -28 -14
8156 -14 -215 -126 48 283 -111 131 -51 90 -76 75 -385 -72 270 233 -226 241 109 -99 361 -62 -172
8177 -172 -133 36 -80 -56 96 -28 319 -43 9 38 -114 81 -371 -126
8191a26
##END NTUPLES=NMR FID
##END=
