##TITLE=1H_LR-685A-OC1
 CDCl3, 8 sc, 
 30.7.2019
##JCAMPDX= 6.0         $$ Bruker NMR JCAMP-DX V2.0
##DATA TYPE= NMR FID
##DATA CLASS= NTUPLES
##ORIGIN= UXNMR, Bruker Analytische Messtechnik GmbH
##OWNER= root
$$ XWIN-NMR		Version 3.5
$$ Tue Jul 30 15:02:11 2019 Russian Standard Time (UT+4h)  she@DPX200
##.OBSERVE FREQUENCY= 200.13155
##.OBSERVE NUCLEUS= ^1H
##.DELAY= (6, 6)
##.ACQUISITION MODE= SIMULTANEOUS
##.ACQUISITION SCHEME= undefined
##.AVERAGES= 8
##.DIGITISER RES= 18
##SPECTROMETER/DATA SYSTEM= spect
##.PULSE SEQUENCE= zg30
##.SOLVENT NAME= CDCl3
##.SHIFT REFERENCE= (INTERNAL, CDCl3, 0, 15.7039)
##AUDIT TRAIL= $$ (NUMBER, WHEN, WHO, WHERE, WHAT)
$$ ##TITLE= Audit trail, XWIN-NMR		Version 3.5
$$ ##JCAMPDX= 5.01
$$ ##ORIGIN= Bruker BioSpin GmbH
$$ ##OWNER= she
$$ F:/spectra/data/she/nmr/H-F/1/audita.txt
$$ ##AUDIT TRAIL=  $$ (NUMBER, WHEN, WHO, WHERE, WHAT)
(   1,<2019-07-30 15:01:12.46 +0400>,<she>,<DPX200>,
      <created by zg, POWCHK disabled, PULCHK disabled
       configuration hash MD5:
       00 E9 B6 7A A2 85 ED C7 34 08 36 98 17 FE 4E 26
       data hash MD5: 16K
       2B B6 2C FD EC D6 26 94 B7 9C CE D0 C5 FA 7A 65>)
$$ ##END=
$$ 
$$ hash MD5
$$ 42 DF 1A 63 02 67 1A B8 40 8B 17 13 41 CB BB 06
##$RELAX= 
##$RELAX= 
##$RELAX= 
##$RELAX= 
##$RELAX= 
##$RELAX= 
$$ Bruker specific parameters
$$ --------------------------
##$DU= <F:/spectra>
##$EXPNO= 1
##$NAME= <H-F>
##$PROCNO= 1
##$TYPE= <nmr>
##$USER= <she>
##$AMP= (0..31)
100 100 100 100 100 100 100 100 100 100 100 100 100 100 100 100 100 100 
100 100 100 100 100 100 100 100 100 100 100 100 100 100 
##$AQSEQ= 0
##$AQ_mod= 1
##$AUNM= <au_zg>
##$AUTOPOS= <>
##$BF1= 200.13
##$BF2= 200.13
##$BF3= 200.13
##$BF4= 200.13
##$BF5= 200.13
##$BF6= 200.13
##$BF7= 200.13
##$BF8= 200.13
##$BYTORDA= 1
##$CFDGTYP= 0
##$CFRGTYP= 5
##$CHEMSTR= <none>
##$CNST= (0..31)
1 1 145 1 1 1 1 1 1 1 1 1 1 1 1 1 1 1 1 1 1 1 1 1 1 1 1 1 1 1 1 1 
##$CPDPRG= <>
##$CPDPRG1= <>
##$CPDPRG2= <>
##$CPDPRG3= <>
##$CPDPRG4= <mlev>
##$CPDPRG5= <mlev>
##$CPDPRG6= <mlev>
##$CPDPRG7= <mlev>
##$CPDPRG8= <mlev>
##$CPDPRGB= <>
##$CPDPRGT= <>
##$D= (0..31)
0 1.2 0 0 0 0 0 0 0 0 0 0.03 0 0 0 0 0 0 0 0 0 0 0 0 0 0 0 0 0 0 0 0 
##$DATE= 1564484471
##$DBL= (0..7)
120 120 120 120 120 120 120 120 
##$DBP= (0..7)
150 150 150 150 150 150 150 150 
##$DBP07= 0
##$DBPNAM0= <>
##$DBPNAM1= <>
##$DBPNAM2= <>
##$DBPNAM3= <>
##$DBPNAM4= <>
##$DBPNAM5= <>
##$DBPNAM6= <>
##$DBPNAM7= <>
##$DBPOAL= (0..7)
0.5 0.5 0.5 0.5 0.5 0.5 0.5 0.5 
##$DBPOFFS= (0..7)
0 0 0 0 0 0 0 0 
##$DE= 6
##$DECBNUC= <off>
##$DECIM= 24
##$DECNUC= <off>
##$DECSTAT= 4
##$DIGMOD= 1
##$DIGTYP= 9
##$DL= (0..7)
0 120 120 120 120 120 120 120 
##$DP= (0..7)
150 150 150 150 150 150 150 150 
##$DP07= 0
##$DPNAME0= <>
##$DPNAME1= <>
##$DPNAME2= <>
##$DPNAME3= <>
##$DPNAME4= <>
##$DPNAME5= <>
##$DPNAME6= <>
##$DPNAME7= <>
##$DPOAL= (0..7)
0.5 0.5 0.5 0.5 0.5 0.5 0.5 0.5 
##$DPOFFS= (0..7)
0 0 0 0 0 0 0 0 
##$DQDMODE= 0
##$DR= 18
##$DS= 0
##$DSLIST= <SSSSSSSSSSSSSSS>
##$DSPFIRM= 0
$$ [...]
##$SUBNAM2= <"">
##$SUBNAM3= <"">
##$SUBNAM4= <"">
##$SUBNAM5= <"">
##$SUBNAM6= <"">
##$SUBNAM7= <"">
##$SUBNAM8= <"">
##$SUBNAM9= <"">
##$SW= 24.9336996594482
##$SWIBOX= (0..15)
0 0 2 0 0 0 0 0 0 0 0 0 0 0 0 0 
##$SW_h= 4990.01996007984
##$TD= 16384
##$TD0= 1
##$TE= 0
##$TE2= 300
##$TE3= 300
##$TEG= 300
##$TL= (0..7)
0 120 120 120 120 120 120 120 
##$TP= (0..7)
150 150 150 150 150 150 150 150 
##$TP07= 0
##$TPNAME0= <>
##$TPNAME1= <>
##$TPNAME2= <>
##$TPNAME3= <>
##$TPNAME4= <>
##$TPNAME5= <>
##$TPNAME6= <>
##$TPNAME7= <>
##$TPOAL= (0..7)
0.5 0.5 0.5 0.5 0.5 0.5 0.5 0.5 
##$TPOFFS= (0..7)
0 0 0 0 0 0 0 0 
##$TUNHIN= 0
##$TUNHOUT= 0
##$TUNXOUT= 0
##$USERA1= <user>
##$USERA2= <user>
##$USERA3= <user>
##$USERA4= <user>
##$USERA5= <user>
##$V9= 5
##$VALIST= <valist>
##$VCLIST= <CCCCCCCCCCCCCCC>
##$VD= 0
##$VDLIST= <DDDDDDDDDDDDDDD>
##$VPLIST= <PPPPPPPPPPPPPPP>
##$VTLIST= <TTTTTTTTTTTTTTT>
##$WBST= 1024
##$WBSW= 4
##$XGAIN= (0..3)
0 0 0 0 
##$XL= 0
##$YL= 0
##$YMAX_a= 242307
##$YMIN_a= -622716
##$ZGOPTNS= <>
##$ZL1= 120
##$ZL2= 120
##$ZL3= 120
##$ZL4= 120
##$ABSF1= 10
##$ABSF2= 0
##$ABSG= 5
##$ABSL= 3
##$ALPHA= 0
##$AQORDER= 0
##$ASSFAC= 0
##$ASSFACI= 0
##$ASSFACX= 0
##$ASSWID= 0
##$AUNMP= <proc_1d>
##$AZFE= 0.1
##$AZFW= 0.1
##$BCFW= 1
##$BC_mod= 2
##$BYTORDP= 1
##$COROFFS= 0
##$CY= 11.3945322036743
##$DATMOD= 1
##$DC= 2
##$DFILT= <>
##$DTYPP= 0
##$F1P= 20.1537800932815
##$F2P= 0.134698688090026
##$FCOR= 0.5
##$FTSIZE= 0
##$FT_mod= 4
##$GAMMA= 1
##$GB= 0.15
##$INTBC= 1
##$INTSCL= 1
##$ISEN= 128
##$LB= 0.24
##$LEV0= 0
##$LPBIN= 0
##$MAXI= 10000
##$MC2= 0
##$MEAN= 0
##$ME_mod= 0
##$MI= 1.114404
##$NCOEF= 0
##$NC_proc= 0
##$NLEV= 6
##$NOISF1= 3.799351
##$NOISF2= 2.8
##$NSP= 1
##$NTH_PI= 0
##$NZP= 0
##$OFFSET= 15.70392
##$PC= 1
##$PHC0= -9218.58
##$PHC1= 12.00097
##$PH_mod= 1
##$PKNL= yes
##$PPARMOD= 0
##$PSCAL= 0
##$PSIGN= 0
##$REVERSE= no
##$SF= 200.130013532006
##$SI= 16384
##$SIGF1= 3
##$SIGF2= 2
##$SINO= 400
##$SIOLD= 16384
##$SREGLST= <1H.CDCl3>
##$SSB= 0
##$STSI= 0
##$STSR= 0
##$SW_p= 3612.71676300578
##$SYMM= 0
##$S_DEV= 0
##$TDeff= 0
##$TDoff= 0
##$TI= <>
##$TILT= no
##$TM1= 0
##$TM2= 0
##$TOPLEV= 0
##$USERP1= <user>
##$USERP2= <user>
##$USERP3= <user>
##$USERP4= <user>
##$USERP5= <user>
##$WDW= 1
##$XDIM= 8192
##$YMAX_p= 0
##$YMIN_p= 0
$$ End of Bruker specific parameters
$$ ---------------------------------
##NTUPLES= NMR FID
##VAR_NAME=  TIME,          FID/REAL,        FID/IMAG
##SYMBOL=    X,             R,               I
##VAR_TYPE=  INDEPENDENT,   DEPENDENT,       DEPENDENT
##VAR_FORM=  AFFN,          ASDF,            ASDF
##VAR_DIM=   8192,          8192,            8192
##UNITS=     SECONDS,       ARBITRARY UNITS, ARBITRARY UNITS
##FACTOR=    0.0002004,     1,               1
##FIRST=     0,             0,               0
##LAST=      1.6414764,     0,               0
##MIN=       0,             -622716,         0
##MAX=       1.6414764,     242307,          0
$$ Real data points
##PAGE= N=1
##DATA TABLE= (X++(R..R)), XYDATA
$$ [...]
$$ plain form
1995 -300 -454 252 299 -407 -80 333 -253 -151 121 658 123 -127 177 447 91 -426 358 378 29 115 477
2016 477 293 37 -129 408 369 -164 -92 613 438 -316 203 575 -119 -349 -93 628 -20 -679 7 284 -303
2037 -303 -336 286 205 -438 -463 51 -140 -297 -421 410 -22 -699 -475 113 404 -439 -63 461 231 -467 187
2058 187 423 1 -423 351 740 -90 -517 278 595 -297 -204 324 614 126 -260 494 49 -478 71 716
2078 716 4 -473 303 235 -32 -613 -124 540 -319 -614 77 87 -472 -429 370 73 -500 -465 77 159 -584 -527
2100 -527 295 -45 -496 69 554 -60 -633 -198 262 76 -605 -166 652 -392 -318 626 817 -304 -316 150
2120 150 472 -285 -113 537 421 -266 -286 814 422 -395 -141 610 311 -392 -142 479 -70 -412 -67 457
2140 457 -204 -455 29 252 -391 -731 35 410 -353 -538 296 133 -824 -466 64 -8 -736 -342 565 37
$$ packed form
1995c00j54P06M7p06L27M13n86J02K72N37n35k50L04K70l56n17P84K0l49Q6L62
2016D77j84k56j66N37l9n33P2P05j75p54N19L72o94k30K56P21o48o59O86K77n87
2037c03l3O22q1o43k5N14j91j57j24Q31m32o77K24N88K91q43L76N24k30o98O54
2058A87K36m22m24P74L89q30m27P95L17q92R3N28K90m88l86P54m45n27N49O45
2078G16p12m77P76o8k67n81M89O64q59k95O91J0n59M3P99k97n73L5N42Q2p43N7
2100e27Q22l40m51N65M85o14n73M35M60j86o81M39Q18j044P4R44J91j121j2M66
2120A50L22p57J72O50j16o87k0J100l92q17K54P51k99p03K50O21n49l42L45N24
2140D57o61k51M84K23o43l40P66L75p63j85Q34j63r57L58N30p2p28L94R07n28
$$ plain form
2160 37 -644 -132 474 205 -593 70 868 -351 -130 424 756 -125 -180 373 723 -243 -392 759 473 11
2180 11 -98 888 472 -247 -27 869 57 -418 -72 784 -21 -205 232 545 -78 -783 25 350 -291 -639
2200 -639 -87 491 -696 -816 35 -4 -784 -542 260 -109 -203 -285 578 -99 -533 -476 611 -78 -542 -68 496
2221 496 154 -341 66 660 -115 -459 466 428 -89 -254 526 394 11 113 907 297 -353 -116 596 284
2241 284 -296 309 468 212 -645 147 595 -34 -359 126 273 -495 -367 175 397 -501 -296 203 66 -417
2261 -417 -596 168 -180 -614 -442 242 -151 -700 -244 81 -196 -487 -128 223 -1 -477 312 520 -503 -158
2281 -158 380 482 22 -3 43 495 -15 173 396 521 28 37 591 228 -287 584 417 15 -390 -9 531
2302 531 -45 83 196 150 67 46 110 124 -371 -239 104 47 -334 -298 123 0 -663 -345 20 -102 -398 -186
$$ packed form
2160C7o81N12O06k69p98O63P98j219K21N54L32q81n5N53L50r66j49J151k86m62
2180A1j09R86m16p19K20Q96q12m75L46Q56q05j84M37L13o23p05Q08L25o41l48
2200f39N52N78j187j20Q51l9p80K42Q02l69r4q2Q63o77m34N7J087o89m64M74N64
2221D96l42m95M07N94p75l44R25l8n17j65P80j32l83J02P94o10o50K37P12l12
2241B84n80O05J59k56q57P92M48o29l25M85J47p68J28N42K22q98K05M99j37m83
2261d17j79P64l48m34J72O84l93n49M56L25k77k91L59L51k24m76P89K08j023L45
2281a58N38J02m60k5M6M52n10J88K23J25m93RN54l63n15Q71j67m02m05L81N40
2302E31n76J28J13m6q3k1O4J4m95J32L43n7l81L6M21j23o63L18L65j22k96K12
$$ plain form
2324 -186 235 -140 -294 -180 381 -455 -330 130 63 -262 -447 406 306 -255 -167 383 338 -89 31 370 253
2345 253 24 -113 688 407 -356 162 544 224 -13 153 520 -110 -293 249 399 -84 8 104 10 -201 -116
2366 -116 123 -13 -210 -237 103 -78 -380 -343 39 -115 -372 -330 -131 -60 -264 -40 46 -142 -60 33 -6 -71 -386
2389 -386 349 15 277 99 36 287 -26 191 130 157 211 -99 450 433 -92 314 381 246 -154 240 -136 206
2411 206 -17 409 194 -22 -111 134 257 -143 -292 -94 -175 -305 -243 -172 -126 -331 -96 51 19 -282 -102 -101 -339
2434 -339 -250 -170 233 -81 -290 -215 -137 -459 -181 34 128 -133 273 108 16 26 90 79 387 9 281 639 222
2457 222 70 17 17 386 -121 228 609 -26 230 197 540 223 -188 200 -42 -76 159 4 -50 -183 -7 145
2479 145 131 -110 -74 -167 -172 -537 -154 -240 -461 -433 -93 30 0 82 -122 -2 -17 -241 58 -18 -61 65 -294 -41
$$ packed form
2324a86M21l75j54J14N61q36J25M60o7l25j85Q53j00n61Q8N50m5m27J20L39j17
2345B53k29j37Q01k81p63N18L82l20k37J66L67o30j83N42J50m83R2R6r4k11Q5
2366a16K39j36j97k7L40j81l02L7L82j54k57M2J99P1k04K24Q6j88Q2R3l9o5l15
2389c86P35l34K62j78o3K51l13K17o1K7N4l10N49j7n25M06O7j35m00L94l76L42
2411B06k23M26k15k16q9K45J23m00j49J98q1j30O2P1M6k05K35J47l2l01J80Jk38
2434c39Q9Q0M03l14k09P5P8l22K78K15R4k61M06j65r2J0O4j1L08l78K72L58m17
2457B22j52n3%L69n07L49L81o35K56l3L43l17m11L88k42l4K35j55n4j33J76J52
2479A45j4k41L6r3nl65L83q6k21K8L40J23l0Q2k04J20j5k24K99p6m3J26l59K53
$$ plain form
2503 -41 -71 -108 310 16 186 243 310 307 56 92 243 431 -84 199 71 501 61 228 197 335 101 30 343
2526 343 326 167 -73 94 -218 56 446 -210 -160 -154 -15 -311 -148 -184 -40 -45 289 -260 -191 -428 -438 -223 -301
2549 -301 127 -129 -89 -13 -65 107 33 9 -127 159 -259 87 259 216 260 68 12 183 142 19 -55 -196 187
2572 187 32 256 326 487 49 -286 93 124 76 126 165 -186 -19 -212 -12 -120 -193 -105 147 -90 -587 -295
2594 -295 121 -78 -163 179 -27 -280 -52 -79 -85 20 -98 -73 12 5 -213 93 -340 -42 8 380 123 -90 102
2617 102 205 252 -72 566 80 1 9 136 434 34 443 105 210 -65 16 358 275 -208 -57 322 103 -66
2639 -66 -63 134 -51 -167 -162 171 -356 -575 143 121 -114 -381 -192 195 -249 -118 -40 -285 -373 -402 121 -137 -237
2662 -237 -147 83 290 -396 -144 127 -35 -217 255 659 -106 -131 -85 329 90 -102 435 195 25 -24 347
$$ packed form
2503d1l0l7M18k94J70N7O7lk51L6J51J88n15K83j28M30m40J67l1J38k34p1L13
2526C43j7j59k40J67l12K74L90o56N0OJ39k96J63l6J44nL34n49O9k37j0K15p8
2549c01M28k56M0P6n2J72p4k4j36K86m18L46J72m3M4j92n6J71m1j23p4j41L83
2572A87j55K24P0J61m38l35L79L1m8N0L9l51J67j93K00j08p3Q8K52k37m97K92
2594b95M16j99q5L42k06k53K28k7oJ05j18K5Q5pk18L06m33K98N0L72k57k13J92
2617A02J03M7l24O38m86p9QJ27K98m00M09l38J05k75Q1L42q3m83J51L79k19j69
2639f6LJ97j85j16NL33n27k19P18k2k35k67J89L87m44J31P8k45q8k9N23k58j00
2662b37R0K30K07o86K52K71j62j82M72M04p65k5M6M14k39j92N37k40j70m9L71
$$ plain form
2683 347 356 -54 -11 335 204 -222 214 284 318 88 294 369 -44 -388 128 219 -234 -82 145 178 -458 -373 -147
2706 -147 -3 -209 -168 -4 94 -371 -337 148 -100 -427 -517 289 130 -102 -246 336 -73 -412 -15 201 199 -473
2728 -473 157 328 21 44 195 576 202 -67 344 152 -150 252 268 254 -83 176 416 267 -91 241 510
2749 510 151 -149 104 213 42 -432 211 372 -187 -460 249 404 -307 -155 147 216 -650 -596 -85 -240 -304
2770 -304 -249 156 -259 -512 177 649 -45 -419 126 123 49 -75 280 268 -64 -516 -68 669 -436 -338 280 527
2792 527 -257 38 511 343 -245 42 795 275 14 193 405 272 -338 157 148 -81 -546 260 95 -467 -295
2813 -295 286 -82 -462 -23 189 136 -570 -362 196 -38 -719 -443 267 -248 -643 -222 134 -157 -526 104
2833 104 266 110 -268 225 263 -84 -335 65 166 -350 -147 287 403 5 254 496 -6 -471 -64 80
$$ packed form
2683C47Rm10M3L46j31m26M36P0L4k30K06P5m13l44N16R1m53J52K27L3o36Q5K26
2706a47J44k06M1J64R8m65L4M85k48l27r0Q06j59k32j44N82m09l39L97K16ko72
2728d73O30J71l07K3J51L81l74k69M11j92l02M02J6j4l37K59K40j49l58L32K69
2749E10l59l00K53J09j71m74O43J61n59k73P09J55p11J52L02O9q66N4N11j55o4
2770c04N5M05m15k53O89M72o94l74N45lp4j24L55j2l32m52M48P37j105R8O18K47
2792E27p84K95M73j68n88K87P53n20k61J79K12j33o10M95rk29m65Q06j65n62J72
2813b95N81l68l80M39K12n3p06K08N58k34o81K76P10n15l95M21L56k91l69O30
2833A04J62j56l78M93L8l47k51M00J01n16K03M34J16l98K49K42n02m65M07J44
$$ plain form
2853 80 3 -129 252 533 236 42 -48 548 -14 -215 410 209 -167 -217 346 137 -274 -363 113 -48 -456 -513
2875 -513 242 -145 -266 -198 399 51 -519 53 382 -203 -507 238 194 -145 -479 -43 179 -186 -384 356 308
2896 308 -56 -48 270 68 -8 19 263 86 -28 109 575 299 -385 169 206 407 -158 320 206 43 -256 271
2918 271 314 -300 -125 419 483 -244 -125 101 37 -446 -408 323 202 -301 -442 124 -213 -230 -18 263 -34 -416
2940 -416 -3 323 -64 -27 -117 380 -138 31 306 92 -136 -169 220 250 -299 72 134 55 -125 46 295 95
2962 95 -222 -135 610 -4 -96 130 419 -102 -300 135 13 -156 -133 193 -59 -225 -146 340 197 -335 -497 311
2984 311 65 -200 -126 17 -184 -450 68 267 -245 -169 56 50 -373 -431 -2 181 -127 -94 122 412 -133 -188
3006 -188 291 -141 -441 -16 106 151 39 -231 175 114 -32 168 -39 -88 -86 86 516 84 -232 95 113 45
$$ packed form
2853H0p7j32L81K81k97j94r0N96n62k01O25k01l76n0N63k09m11q9M76j61m08n7
2875e13P55l87j21O8N97l48n70N72L29n85l04P45m4l39l34M36K22l65j98P40m8
2896C08l64QL18k02p6K7K44j77j14J37M66k76o84N54L7K01n65M78j14j63k99N27
2918B71M3o14J75N44O4p27J19K26o4m83L8P31j21n03j41N66l37j7K12K81k97l82
2940d16M13L26l87L7r0M97n18J69K75k14k28l3L89L0n49L71O2p9j80J71K49k00
2962I5l17Q7P45o14r2K26K89n21j98M35j22j69K3L26k52j66P9M86j43n32j62Q08
2984C11k46k65P4J43k01k66N18J99n12P6K25om23n8M29J83l08L3K16K90n45n5
3006a88M79m32l00M25J22M5j12k70M06o1j46K00k07m9KJ72M30m32l16L27J8o8
$$ plain form
3028 45 171 162 340 37 -37 -15 -70 -353 -306 192 -210 -208 -158 266 -104 -172 -103 -289 -195 -134 -105 -157 -214 -198 8 -20
3054 -20 217 -532 162 178 -37 -39 -18 -44 -11 111 14 102 164 85 298 155 -28 311 321 225 -71 196 185 -92 41
3079 41 187 -17 -122 -233 -181 228 -103 -236 196 70 -82 -193 25 -184 -226 -74 -46 -8 -192 -150 86 -396
3101 -396 -456 -455 -8 23 -18 13 -77 -331 -155 35 -24 -1 -165 -24 125 -74 47 175 211 181 8 222 -162 121
3125 121 96 103 57 -41 265 -65 214 272 131 -66 30 203 -107 48 80 -282 -34 10 20 -148 -186 -256 -101 166
3149 166 72 -38 -61 -28 -252 -184 -350 7 -64 -200 131 -177 -136 -63 -54 -12 -227 -46 157 -126 69 -352 -54
3172 -54 74 -48 178 17 -151 209 340 19 238 248 94 -57 120 242 -54 190 200 70 140 49 112 178
3194 178 192 99 -74 -212 154 153 242 -99 -194 -267 -133 117 37 -31 -61 -136 -123 -338 102 71 67 32 -82 -51 -80 -36
$$ packed form
3028D5J26rJ78l03p4K2n5k83M7M98m02KN0M24l70o8O9j86R4O1K9n2n7J6K06k8
3054b0K37p49O94J6k15kK1k6L3J22r7Q8O2p9K13j43j83L39J0r6k96K67j1k77J33
3079D1J46k04j05j11N2M09l31j33M32j26j52j11K18k09m2J52K8L8j84M2K36m82
3101c96o0JM47L1m1L1r0k54J76J90n9K3j64J41J49j99J21J28L6l0j73K14l84K83
3125A21k5Pm6r8L06l30K79N8j41j97R6J73l10J55L2l62K48M4J0j68l8p0J55K67
3149A66r4j10k3L3k24O8j66L57p1j36L31l08M1P3RM2k15J81K03k83J95m21K98
3172e4J28j22K26j61j68L60J31l21K19J0j54j51J77J22k96K44J0j30P0r1O3O6
3194A78J4r3j73j38L66jQ9l41r5p3J34K50q0o8l0p5J3k15M40l1ml5j14L1k9M4
$$ plain form
3220 -36 115 -49 51 -34 69 -29 -105 -45 61 104 20 -123 -28 294 -277 568 45 163 85 59 26 -3 -22 146
3244 146 -91 248 58 -8 32 205 284 124 16 -28 104 -73 284 -157 -364 -200 273 71 -38 101 -102
3265 -102 61 -15 135 -213 -272 -163 -20 -88 -393 363 -26 120 88 -49 -7 70 -179 -184 70 130 181 23 436
3288 436 88 139 5 255 93 378 170 296 -107 124 58 17 300 29 -236 -86 -57 -56 -96 -171 104 -29 111
3311 111 109 90 106 24 -4 -267 -192 49 49 -81 -210 208 108 -15 -121 41 -10 -60 -66 14 126 -227 -171 41 -192
3336 -192 11 -77 -28 125 71 64 102 21 -30 -16 -20 -31 295 644 91 -99 106 19 254 -110 -221 -11 -279 66
3360 66 31 -13 -187 -299 35 175 -104 -199 -81 204 -32 -25 52 -102 -241 52 -141 -282 -182 214 -89 -267
3382 -267 195 -38 -7 96 -136 60 -115 -129 -144 -122 61 -227 116 -8 247 29 189 172 286 1 -134 67
$$ packed form
3220c6J51j64J00q5J03r8p6O0J06M3q4j43R5L22n71Q45n23J18p8k6l3k9j9J68
3244A46k37L39j90o6M0J73P9j60j08m4J32j77L57m41k07J64M73k02j09J39k03
3265a02J63p6J50l48n9J09J43o8l05P56l89J46l2j37M2P7k49nK54O0N1j58M13
3288D36l48N1j34K50j62K85k08J26m03K31o6m1K83k71k65J50K9Jm0p5K75j33J40
3311A11kj9J6q2k8k63P5K41%j30j29M18j00j23j06J62n1n0oQ0J12l53N6K12k33
3336a92K03q8M9J53n4pL8q1n1J4mj1L26L49n53j90K05q7K35l64j11K10k68L45
3360F6l5m4j74j12L34J40k79r5J18K85k36PP7j54j39K93j93j41J00L96l03j78
3382b67M62k33L1J03k32J96j75j4j5K2J83k88L43j24K55k18J60j7J14k85j35K01
$$ plain form
3404 67 -43 10 296 279 -92 11 93 315 63 266 126 -292 44 -79 -10 -114 190 -343 22 -80 -188 323
3426 323 -43 -420 39 -144 27 29 -388 -278 -80 -183 -15 25 -36 -44 122 -160 0 -91 25 147 -80 21
3448 21 31 227 236 -174 146 264 489 9 -61 180 146 19 146 64 -118 138 7 130 198 -64 100 380 -65
3471 -65 32 193 289 -105 41 158 109 -34 -157 145 -96 -247 -114 -19 80 -206 -82 66 -70 -26 94 222
3493 222 15 -104 147 -1 -375 -79 -62 119 26 107 310 -191 93 -98 -55 6 71 383 416 251 -11 161
3515 161 402 -172 -202 158 264 205 -291 81 -165 76 -43 163 -55 302 -445 97 239 -127 -163 -14 162
3536 162 63 25 202 97 -99 -168 -25 -138 -170 -225 -24 -318 -219 171 92 -4 -54 -6 -239 53 -5 6 78 -215
3560 -215 -54 70 -125 -124 -164 279 35 264 -6 173 103 -230 287 -118 68 180 150 54 -25 -30 130 79 -26
$$ packed form
3404F7j10N3K86j7l71J03Q2K22k52K03j40m18L36j23O9j04L04n33L65j02j08N11
3426C23l66l77M59j83J71Km17J10J98j03J68M0o1qJ66k82J60r1J16J22k27J01
3448B1J0J96Rm10L20J18K25m80p0K41l4j27J27q2j82K56j31J23O8k62J64K80m45
3471f5R7J61R6l94J46J17m9j43j23L02k41j51J33R5R9k86J24J48j36M4J20J28
3493B22k07j19K51j48l74K96J7J81r3Q1K03n01K84j91M3O1O5L12L3j65k62J72
3515A61K41n74l0L60J06n9m96L72k46K41j19K06k18L57p47N42J42l66l6J49J76
3536A62r9l8J77j05j96o9J43j13l2n5K01k94R9L90p9r6n0M8k33K92n8J1P2k93
3560b15J61J24j95Jm0M43k44K29k70J79p0l33N17m05J86J12l0r6p9nJ60n1j05
$$ plain form
3583 -26 -139 26 -38 110 107 35 -79 -174 -94 -36 -126 -114 -68 180 -111 -144 57 174 -13 -190 -166 -122 -30 -258 16
3608 16 33 -210 -41 -177 -36 -244 -209 107 -175 -117 -146 114 42 -66 154 144 26 -135 427 163 4 121
3630 121 348 159 -91 -67 140 -90 -68 -72 -11 112 178 -48 62 70 -220 -177 96 276 3 209 33 -320 -27
3653 -27 40 192 79 125 -186 133 -33 -137 267 -103 46 -52 13 -1 92 216 94 94 -228 27 -13 -28 10 191
3677 191 172 219 31 -40 -178 -103 -24 258 133 -68 -171 -6 276 -8 -175 281 105 310 -31 88 -213 -297
3699 -297 -113 150 -9 -74 -39 -183 -220 -80 -41 64 -148 -288 110 -238 35 -93 22 113 257 -15 238 -82
3721 -82 -335 50 -54 -265 -273 72 276 393 -193 84 89 -73 -124 418 116 50 304 -284 78 -190 -77 296
3743 296 263 -94 126 -417 43 -171 222 92 94 -27 -150 105 57 -110 -203 -128 -198 -134 -41 -109 -28 -157 -272 137
$$ packed form
3583b6j13J65o4J48lp2j14r5Q0N8r0J2M6K48k91l3K01J17j87j77K4M4R2k28K74
3608A6J7k43J69j36J41k08L5L16k82N8k9K60p2j08K20j0j18j61N62k64j59J17
3630A21K27j89k50K4K07k30K2mO1J23O6k26J10Qk90M3K73J80k73K06j76l53K93
3653b7O7J52j13M6l11L19j66j04M04l70J49r8O5j4R3J24j22%l22K55m0j5L8J81
3677A91j9M7j88p1j38P5P9K82j25k01j03J65K82k84j67M56j76K05l41J19l01q4
3699b97J84K63j59o5L5j44l7J40L9J05k12j40L98l48K73j28J15R1J44k72K53l20
3721h2k53L85j04k11qL45K04J17n86K77Nj62n1N42l02o6K54n88L62k68J13L73
3743B96l3l57K20n43M60k14L93j30Kj21j23K55m8j67r3P5p0O4R3o8Q1j29j15M09
$$ plain form
3767 137 -10 -8 -302 -84 15 -52 -208 91 -120 43 4 -128 -14 191 -7 -57 -86 207 -177 -99 128 -197 -87
3790 -87 -139 -70 100 167 -130 21 -47 47 -30 -165 22 268 360 -120 -117 32 -169 -136 -36 -157 -214 -69 -199 195
3814 195 -57 -96 -187 -333 -163 116 -32 -110 84 74 -135 -180 -159 -156 -184 -25 -93 -174 18 -207 -4 188 12 141
3838 141 -112 37 -58 -83 9 123 12 -120 85 92 9 35 -29 93 -13 -124 -36 150 167 122 8 -176 -63 4
3862 4 193 -146 -298 -8 215 133 70 -47 -55 -46 -182 -159 215 6 -369 -118 64 14 -199 -76 -125 31 62 -194
3886 -194 34 44 174 -263 85 0 -266 167 -131 63 66 -56 -14 70 103 -97 102 198 32 -41 -1 39 293 -177
3910 -177 74 240 -197 119 -237 193 -5 65 -84 164 29 27 -11 -150 -2 -179 40 -81 159 14 -181
3931 -181 53 -198 -149 -369 -28 196 -120 129 -5 69 -3 -58 -58 199 139 93 -107 91 -157 27 -340 -196 -15
$$ packed form
3767A37j47Kk94K18R9o7j56K99k11J63l9j32J14K05j98n0k9K93l84P8K27l25J10
3790h7n2O9J70O7k97J51o8R4p7j35J87K46R2m80LJ49k01L3J00j21n7J45j30L94
3814A95k52l9r1j46J70K79j48p8J94j0k09m5K1Lk8J59o8q1J92k25K03J92j76J29
3838A41k53J49r5k5R2J14j11j32K05Pq3K6o4J22j06j11Q8J86J7m5j14j84J13O7
3862DJ89l39j52K90K23q2o3j17qRj36K3L74k09l75K51J82n0k13J23m9J56L1k56
3886a94K28J0J30m37L48q5k66M33k98J94Lj22M2Q4L3k00J99R6j66p3M0M0K54m70
3910a77K51J66m37L16l56M30j98P0j49K48j35kl8j39J48j77K19j21K40j45j95
3931a81K34k51M9k20L41K24l16K49j34P4p2n5%K57o0m6k00J98k48J84l67J44J81
$$ plain form
3954 -15 42 113 -11 -91 -16 173 226 -97 -149 20 -56 62 -126 100 -35 -48 200 -176 -129 191 -137 301 -11
3977 -11 -102 -216 348 176 -359 80 7 -132 19 -126 -96 -170 127 38 -125 159 -131 88 126 -33 -82 132 -90
4000 -90 266 314 -137 -101 176 -16 -23 -25 -61 17 -195 246 9 52 -24 274 -64 -15 63 -187 -5 251 408 8
4024 8 54 87 73 228 80 90 -154 -22 187 14 -55 -47 -68 -43 148 -232 -257 -138 -107 -331 -65 271 -220 -196 -73
4049 -73 -45 -20 -149 62 -189 11 163 -122 -287 116 181 152 150 80 87 105 27 239 74 135 -37 -86 244 495 341
4074 341 -273 59 -144 -120 54 397 76 3 86 424 46 16 23 19 304 -266 -81 -111 91 27 60 -121 79 92
4098 92 -37 33 47 204 276 -360 135 -313 163 -30 -266 183 -65 86 -22 122 -109 -81 259 183 26 -101
4120 -101 167 129 -43 -77 -220 -127 -134 -77 101 193 208 198 206 -69 241 -164 358 211 139 180 114 117 31 3 -18 -9 -333
$$ packed form
3954a5N7P1j24q0P5J89N3l23n2J69p6J18j88K26j35j3K48l76M7L20l28M38l12
3977a1r1j14N64j72n35M39p3j39J51j45L0p4K97q9j63K84k90K19L8j59m9K14k22
4000i0L56M8m51L6K77j92pkl6P8k12M41k37M3p6K98l38M9P8k50J82K56J57m00
4024HM6L3j4J55j48J0k44J32K09j73o9Qk1K5J91l80k5J19L1k24K66L36m91K4J23
4049g3K8K5j29K11k51K00J52k85j65M03O5k9kp0PJ8p8K12j65O1j72m9L30K51j54
4074C41o14L32k03K4J74L43l21p3Q3L38l78l0PmK85n70J85l0K02o4L3j81K00J3
4098I2j29P0J4J57P2o36M95m48M76j93k36M49k48J51j08J44k31K8L40p6j57j27
4120a01K68l8j72l4j43R3pN7J78R2J5j0Qk75L10m05N22j47p2M1o6Lq6k8k1Rl24
$$ plain form
4147 -333 -237 18 92 68 14 -168 -84 -34 -460 -155 72 196 -3 -63 -237 108 -282 15 155 -159 30 -102
4169 -102 -90 32 28 -175 -82 87 -27 156 307 374 151 -127 157 88 -184 -148 -76 40 -171 188 248 -74 7
4192 7 -21 -28 36 158 48 -32 -125 -215 -83 -265 151 -171 -55 -29 -123 198 -102 -114 225 -105 -356 137 -164 82
4216 82 -15 53 137 -176 290 -24 79 -344 41 94 147 7 -340 393 89 153 100 -71 -160 -64 150 -166 -115 -155
4240 -155 226 245 116 -132 137 102 -230 23 131 -134 -12 -229 204 58 -136 57 117 139 106 234 -200 -316
4262 -316 -176 302 49 -22 -11 -209 -49 -73 156 127 143 122 -118 219 82 37 -79 -90 113 -48 -103 50 233
4285 233 -133 20 -160 114 26 -204 273 93 12 126 231 222 72 194 -63 56 -162 211 6 -36 76 38
4307 38 -349 -133 35 -121 72 180 -136 -135 59 -115 81 172 -258 -56 127 -323 -153 -155 -176 -250 215 -476 132
$$ packed form
4147c33R6K55P4k4n4j82Q4N0m26L05K27J24j99o0j74L45l90K97J40l14J89j32
4169a02J2J22mk03R3J69j14J83J51O7k23k78K84o9k72L6P2J16k11L59O0l22Q1
4192Gk8pO4J22j10q0r3r0J32j82M16l22J16K6r4L21l00j2L39l30k51M93l01K46
4216H2r7O8Q4l13M66l14J03m23L85N3N3j40l47P33l04O4n3j71q9R6K14l16N1m0
4240a55L81J9j29k48K69l5l32K53J08k65J22k17M33j46j94J93O0K2l3J28m34j16
4262c16J40M78k53p1J1j98J60k4K29k9J6k1k40L37j37m5j16j1K03j61n5J53J83
4285B33l66J53j80K74q8k30M77j80q1J14J05rj50J22k57J19k18L73k05m2J12l8
4307C8l87K16J68j56J93J08l16JJ94j74J96R1m30K02J83m50J70kk1p4M65o91O08
$$ plain form
4330 132 -322 -8 103 -136 56 -50 -2 86 222 -7 75 98 -36 18 -96 126 21 -246 261 254 -174 118
4352 118 -55 24 -108 111 -234 380 262 15 236 -542 323 41 175 -96 50 -30 -134 -8 -283 275 -91
4373 -91 -94 62 82 157 -111 71 140 -19 -67 -120 -53 158 22 -103 -104 -44 104 -209 -29 -129 -200 134 226 60 141
4398 141 -189 316 -117 102 113 77 25 138 46 -195 -5 -237 -70 43 268 321 181 14 -75 -179 30 -177
4420 -177 64 -18 142 19 -184 54 -94 191 101 125 -46 -94 81 20 4 140 -152 -29 236 106 138 -103
4442 -103 80 -27 -39 41 121 -139 92 -64 -187 236 -482 -175 -22 60 -20 -30 -216 -45 236 -68 -26 53 339
4465 339 36 -100 -166 -76 -179 66 85 420 -114 -303 -67 71 137 26 210 -117 -209 46 -165 24 -110 -175
4487 -175 74 -9 -38 110 -35 285 -135 -53 94 -26 -76 -81 306 185 8 -42 -158 -49 132 -38 10 130 392
$$ packed form
4330A32m54L14J11k39J92j06M8Q8J36k29Q2K3j34N4j14K22j05k67N07pm28K92
4352A18j73P9j32K19l45O14j18k47K21p78Q65k82J34k71J46q0j04J26k75N58l66
4373i1lJ56K0P5k68J82O9j59m8n3O7K11j36j25jO0J48l13J80j00p1L34R2j66Q1
4398A41l30N05m33K19J1l6n2J13r2k41J90k32J67J13K25N3j40j67q9j04K09k07
4420a77K41q2J60j23k03K38j48K85r0K4j71m8J75o1j6J36k92J23K65j30L2k41
4442a03J83j07j2Q0Q0k60K31j56j23M23p18L07J53Q2q0j0j86J71K81l04M2P9K86
4465C39l03j36o6R0j03K45J9L35n34j89K36J38O6j11J84l27r2K55k11J89j34o5
4487a75K49q3k9J48j45L20m20Q2J47j20n0nL87j21j77n0j16J09J81j70M8J20K62
$$ plain form
4510 392 48 66 23 -51 -121 31 23 -22 265 -89 -115 244 -27 90 106 -62 148 -9 -62 3 -152 122 133 164
4534 164 -108 265 -110 9 -44 -44 -122 182 -29 54 73 72 12 -11 73 -202 -126 -312 -208 137 -30 -88 153 14
4558 14 -11 -332 350 -55 -77 43 -27 54 -123 217 117 69 -223 -62 -169 4 299 85 169 -92 -55 -164 282
4581 282 -87 -438 -53 -225 10 -47 85 180 76 222 -11 214 -168 -208 -124 -51 -31 148 -123 -206 -114 -83 113
4604 113 -172 -99 -335 205 -44 -81 -73 -55 -205 75 -62 -202 -113 105 -199 38 81 -22 -164 380 -19 -43 119
4627 119 -172 103 -76 130 -340 -260 -89 -75 50 351 104 387 -29 405 57 3 50 -150 228 -142 23
4648 23 217 107 -2 -147 -56 -3 -176 -37 -9 -25 -2 -45 -93 31 -113 63 65 -439 64 -146 215 163 136 97
4672 97 113 95 51 -61 333 -250 237 10 342 -286 11 201 -275 -22 219 116 18 -122 -140 39 -108 -122
$$ packed form
4510C92l44J8m3p4p0J52qm5K87l54k6L59k71J17J6j68K10j57n3O5j55K74J1L1
4534A64k72L73l75J19n3%p8L04k11Q3J9jo0k3Q4k75P6j86J04L45j67n8K41j39
4558A4k5l21O82m05k2J20p0Q1j77L40j00m8k92J61j07J73K95k14Q4k61L7j09M46
4581B82l69l51L85j72K35n7J32R5j04J46k33K25l82m0Q4P3K0J79k71q3R2L1J96
4604A13k85P3k36N40k49l7QJ8j50K80j37j40Q9K18l04K37M3j03j42N44l99k4J62
4627A19k91K75j79K06m70Q0J71J4J25L01k47K83m16M34l48n4M7k00L78l70J65
4648B3J94j10j09j45R1N3j73J39K8j6K3m3m8J24j44J76Kn04N03k10L61n2k7l9
4672I7J6j8m4j12L94n83M87k27L32o28K97J90m76K53K41j03r8j40j8J79j47j4
$$ plain form
4694 -122 -132 -22 -69 43 300 57 -127 -9 -10 -88 -67 -147 -286 172 -405 171 32 -22 57 -40 53 181 -254 34
4718 34 68 -57 -158 -110 -93 124 133 -248 156 -177 176 173 147 16 -36 66 340 197 -18 -193 -131 229 -30 59
4742 59 -33 56 -45 128 -201 -24 -14 95 -45 132 -80 -106 -44 -25 113 -92 133 -344 145 113 -65 -89 57
4765 57 -30 -193 -323 -25 -351 6 54 156 -154 -50 100 4 -125 -155 -6 -467 -82 125 -149 -146 -73 -67 66
4788 66 -127 -138 52 26 19 124 22 60 242 28 42 194 -14 148 -61 43 -328 235 -49 25 216 67 -138
4811 -138 58 98 13 279 -221 134 -42 -105 55 -130 129 -28 63 18 -4 -125 -192 82 -30 -36 71 -177 -32
4834 -32 93 226 -71 26 149 -79 195 296 48 -67 -65 279 -141 -98 162 -30 315 -255 94 -76 -123 32
4856 32 171 -66 36 -12 -121 -1 366 58 -128 39 -26 -34 -19 324 -54 -143 188 -193 -135 -185 189 -68 -290
$$ packed form
4694a22j0J10m7J12K57k43j84J18jp8K1q0j39M58n77N76j39n4P9r7R3J28m35K88
4718C4L4j25j01M8J7K17Rl81M04l33L53lk6j31n2J02K74j43k15j75O2L60k59Q9
4742E9r2Q9j01J73l29J77J0J09j40J77k12k6O2J9J38k05K25m77M89l2j78k4J46
4765E7q7j63j30K98l26L57M8J02l10J04J50r6j29l0J49m61L85K07k74LP3OJ33
4788F6j93j1J90k6pJ05j02L8J82k14J4J52k08J62k09J04l71N63k84P4J91j49k05
4811a38J96M0q5K66n00L55j76o3J60j85K59j57R1m5k2j21o7K74j12oJ07k48J45
4834c2J25J33k97R7J23k28K74J01k48j15KL44m20M3K60j92L45n70L49j70m7J55
4856C2J39k37J02m8j09J20L67l08j86J67o5qJ5L43l78q9L31l81N8n0L74k57k22
$$ plain form
4879 -290 93 125 27 -249 95 31 33 -38 110 9 -109 -327 168 42 4 -146 -13 -86 43 -149 -48 -152 235
4902 235 100 -185 16 -38 52 -209 267 73 300 -85 140 -5 -156 -187 -113 208 -240 51 217 -122 90
4923 90 82 -248 71 96 103 1 -44 10 -265 303 -111 -54 18 28 -71 -179 16 14 -292 -22 -233 -28 -241 20 243
4948 243 -141 116 -81 -157 99 -27 -59 -50 184 48 19 -121 -54 -41 173 32 215 -6 16 308 147 -11 86
4971 86 16 -19 77 16 -152 -92 190 -126 216 49 -108 -48 50 -102 3 -197 -22 373 9 -125 29 145 -111
4994 -111 -526 -364 194 -78 -220 95 45 164 -11 45 154 -264 -71 -88 -234 -259 -249 98 -35 -29 42 40 141
5017 141 38 -86 152 -117 -11 -58 174 75 -40 445 24 -115 -13 -26 109 -79 -220 63 29 159 187 168
5039 168 -90 -26 -6 -41 -36 -62 -79 -19 128 -127 -153 -274 191 -107 -175 -11 34 -154 -42 -466 319 -22 -24 -86 183
$$ packed form
4879b90L83L2r8k76L44o4Kp1J48j01j18k18M95j26l8j50J33p3J29j92J01j04L87
4902B35j35k85K01n4R0k61M76j94K27l85K25j45j51l1P4L21m48K91J66l39K12
4923I0ql30L19K5Pj02m5N4k75N68m14N7P2J0r9j08J95kl06K70k11K05k13K61K23
4948B43l84K57j97p6K56j26l2RK34j36k9j40O7J3K14j41J83k21K2K92j61j58R7
4971H6p0l5R6o1j68O0K82l16L42j67j57O0R8j52J05k00J75L95l64j34J54J16k56
4994a11m15J62N58k72j42L15n0J19j75N6J09m18J93j7j46k5J0L47j33OP1kJ01
5017A41j03j24K38k69J06m7K32r9j15M85m21j39J02j3J35j88j41K83l4J30K8j9
5039A68k58O4K0l5Nk6j7O0J47k55k6j21M65k98o8J64M5j88J12m24P85l41ko2K69
$$ plain form
5064 183 209 122 -56 130 400 84 -64 -30 90 -129 296 2 285 -151 93 93 325 -96 117 201 54 28
5086 28 33 181 -22 87 50 -115 222 -43 63 -384 -124 -175 80 187 -68 183 -43 -117 -155 -199 -404 377 -120
5109 -120 -368 35 34 -85 22 -199 144 -135 -144 67 117 135 -48 16 -46 39 46 20 73 318 304 50 99 -194 -75
5134 -75 100 90 75 -12 186 255 -168 -39 148 -17 236 -11 -39 121 -178 -72 59 55 0 129 260 94 -31
5157 -31 132 20 40 45 -83 -91 -439 -133 -168 -61 -416 -138 -175 -56 229 -213 202 10 -250 -106 127 132 -244
5180 -244 61 -370 99 45 92 98 -38 100 52 12 -127 -21 -81 198 96 -130 200 -3 -156 30 158 210 53
5203 53 114 232 -101 355 -208 307 14 74 -90 -34 -1 151 -10 -148 68 -91 -10 -137 -225 143 -202 -20
5225 -20 -66 -42 -320 -30 118 -292 29 -96 -16 25 141 257 118 -296 112 -184 129 -40 156 301 -196 -108
$$ packed form
5064A83K6q7j78J86K70l16j48L4J20k19M25k94K83m36K44%K32m21K13Q4j47k6
5086B8NJ48k03J09l7j65L37k65J06m47K60n1K55J07k55K51k26p4l8m4k05P81m97
5109a20k48M03jj19J07k21L43k79rK11N0J8j83O4o2Q5Pk6N3K45j4k54M9k93J19
5134g5J75j0j5q7J98O9m23J29J87j65K53k47k8J60k99J06J31mn5J29J31j66j25
5157c1J63j12K0Nj28ql48L06l5J07l55K78l7J19K85m42M15j92k60J44K33Nl76
5180b44L05m31M69n4M7Oj36J38m8m0j39J06o0K79j02k26L30k03j53J86J28N2j57
5203E3O1J18l33M56n63N15k93O0j64N6L3J52j61j38K16j59Q1j27q8L68l45J82
5225b0m6K4k78K90J48m10L21j25Q0M1J16J16j39m14M08k96L13j69J96J45m97Q8
$$ plain form
5247 -108 52 318 177 7 145 -92 -146 -75 77 -133 -180 103 173 -162 -131 22 -132 -138 -12 14 6 131 -117
5270 -117 -28 -106 84 204 -19 -85 -42 26 2 116 -13 53 48 -79 -210 77 85 -165 -1 52 89 62 42 82 55 57
5296 57 185 52 37 34 3 -14 -124 115 -26 -157 -34 106 32 -35 -98 -80 108 -116 233 158 229 96 -90 -66
5320 -66 -41 -51 -102 25 -277 -330 -277 -106 109 317 23 -189 198 -39 18 -218 15 -215 -188 -196 86 87 -210 -90
5344 -90 -103 173 -107 -257 -92 -176 63 201 -4 -118 -44 83 260 54 269 -13 11 45 79 454 -12 -30 -165
5367 -165 281 87 -105 124 78 303 -353 134 -66 -66 -312 204 -145 184 -349 186 -78 -172 -334 -168 76
5388 76 85 -62 -107 0 -64 -146 -28 -147 77 -13 20 15 5 269 110 -36 125 -7 -118 -27 152 -156 -179 -44
5412 -44 42 87 -49 126 26 190 24 17 115 37 190 -8 73 34 261 40 -134 29 -57 -318 -163 136 235 -119
$$ packed form
5247a08J60K66j41j70J38k37n4P1J52k10m7K83P0l35L1J53j54oJ26K6qJ25k48
5270a17Q9p8J90J20k23o6M3O8k4J14j29O6nj27j31K87Qk50J64N3L7k7k0M0k7K
5296E7J28j33j5ll1j7j10K39j41j31J23J40p4o7o3J8J88k24L49p5P1j33j86K4
5320f6K5j0n1J27l02n3N3J71K15K08k94k12L87k37N7k36K33k30K7qK82Jk97J20
5344i0j3K76k80j50J65q4K39J38k05j14P4J27J77k06K15k82K4L4L4L75m66j8j35
5367a65M46j94j92K29m6K25o56M87k00%k46N16l49L29n33N35k64r4j62J66K44
5388G6Rj47m5J07o4q2J18j19K24r0L3nj0K64j59j46J61j32j11R1J79l08k3J35
5412d4Q6M5j36J75j00J64j66pR8p8J53j98Q1l9K27k21j74J63q6k61J55K99R9l54
$$ plain form
5436 -119 -144 -114 -19 -220 -166 -495 -55 -37 10 -86 137 -88 8 -215 -282 33 -74 -69 -62 87 181 95 20 136 36
5461 36 -34 -109 -54 140 -73 215 113 275 204 70 -49 102 336 -135 -11 122 -139 172 301 -323 -194 200
5483 200 122 -34 142 89 18 66 -4 -227 -77 -142 209 106 -74 255 -68 111 -179 -1 -193 77 64 -228
5505 -228 -101 35 -182 98 256 -131 -191 -267 47 143 112 -69 165 182 -46 -190 61 193 -68 71 247 -89
5527 -89 -72 -139 195 -43 -108 177 23 90 -99 118 0 -26 -185 211 115 -68 -100 -27 76 -29 283 174 -95
5550 -95 218 -9 -73 -234 -148 63 -200 -374 -129 176 263 -329 -46 -24 97 -61 9 136 97 230 108 286
5572 286 -154 287 28 -159 -9 83 67 27 -83 210 -57 157 -69 -32 48 -101 -118 -94 92 229 -48 122
5594 122 59 -43 -188 120 40 -48 -104 -81 36 166 247 313 -150 -46 -190 -96 0 -272 -19 86 -139 -107 -179 -14
$$ packed form
5436a19k5L0R5k01N4l29M40J8M7r6K23k25R6k23o7L15j07NPJ49R4q6p5J16j00
5461C6p0p5N5J94k13K88j02J62p1j34j19J51K34m71J24J33k61L11J29o24J29L94
5483B00p8j56J76n3p1M8p0k23J50o5L51j03j80L29l23J79k90J78j92K70j3k92
5505b28J27J36k17K80J58l87o0p6L14R6l1j81K34J7k28j44K51J32k61J39J76l36
5527h9J7o7L34k38o5K85j54O7j89K17j18k6j59L96r6j83l2P3J03j05L12j09k69
5550i5L13k27o4j61Q6K11k63j74K45L05Q7n92K83K2J21j58P0J27l9J33j22J78
5572B86m40M41k59j87J50R2j6m0j10K93k67K14k26L7Q0j49j7K4J86J37k77J70
5594A22o3j02j45L08q0q8n6K3J17J30Q1O6m63J04j44R4R6k72K53J05k25L2p2J65
$$ plain form
5618 -14 0 -238 115 146 -130 -145 25 182 83 11 79 55 125 -123 190 -4 -77 86 -133 98 167 -64 253 -190
5642 -190 221 -110 271 -1 7 145 -79 1 -263 110 -166 -4 -109 259 -2 -177 28 -60 120 -58 -265
5663 -265 -175 -13 -181 138 330 32 -105 239 -148 -121 2 345 49 168 42 -9 93 276 -116 -46 123
5684 123 -274 95 -19 -43 -20 237 -132 -16 103 173 120 410 -13 84 156 -427 57 -132 -42 159 97 164 51
5707 51 272 16 -8 -219 -11 -178 -70 -133 64 -354 18 -165 96 65 -466 30 -52 -345 -97 43 151 -150
5729 -150 319 31 -176 -137 -39 223 -68 -47 -111 183 -66 -102 -149 -108 366 296 -143 -125 84 34 127 94 -72 154
5753 154 -31 15 452 -335 62 267 -83 180 -88 196 -139 -72 203 44 1 -30 -68 156 -390 279 7 -416
5775 -416 78 -64 -59 -283 389 -16 -237 95 180 -405 36 -90 -64 32 -338 77 108 173 151 92 -390 -87 -101
$$ packed form
5618a4J4k38L53L1k76j5J70J57r9p2O8k4P0k48L13j94p3J63k19K31O9k31L17m43
5642a90M11l31L81k72QJ38k24Q0k64L73k76J62j05L68k61j75K05q8J80j78k07
5663b65R0J62j68L19J92k98j37L44l87K7J23L43k96J19j26n1J02J83l92P0J69
5684A23l97L69j14k4K3K57l69J16J19P0n3K90m23R7P2n83M84j89R0K01o2O7j13
5707E1K21k56k4k11K08j67J08o3J97m18L72j83K61l1n31M96q2k93K48J40J08l01
5729a50M69k88k07L9R8K62k91K1o4K94k49l6m7M1M74p0m39J8K09n0R3l3j66K26
5753A54j85M6M37p87L97K05l50K63k68K84l35O7K75j59m3l1l8K24n46O69k72m23
5775d16M94j42Nk24O72m05k21L32Q5n85M41j26K6R6l70M15L1O5k2n9m82L03j4
$$ plain form
5798 -101 -140 197 -172 233 -253 64 88 -101 -229 68 117 -39 -253 91 -188 64 106 45 -146 63 -53 151
5820 151 93 35 -207 -145 125 95 -105 57 234 -13 169 39 -349 254 -188 14 -75 112 -216 73 116 -67
5842 -67 -314 -413 86 -245 -143 -66 53 -226 -151 129 182 -290 134 -60 23 97 -197 30 -106 10 188 -179
5864 -179 109 93 -216 -333 -68 40 71 140 7 -250 -194 -94 96 134 -320 -183 -205 3 -225 59 116 146 -304
5887 -304 52 -156 33 228 -42 -86 -261 -352 -31 131 -176 -162 -164 -256 134 67 -47 -104 -148 6 148 -43 -1
5910 -1 -108 97 -165 254 -2 -250 -242 -11 -132 -183 330 -33 208 222 -10 -223 -81 42 39 295 5 33 -100
5933 -100 -46 95 -172 115 125 -3 61 -86 11 27 -22 20 -77 13 62 -169 273 263 -266 -235 -59 -26 -100 105 134
5958 134 64 1 92 -125 -4 126 -72 -97 -169 205 -8 58 76 -22 311 13 -197 98 -98 12 248 40 -28
$$ packed form
5798a01l9L37l69M05m86L17K4j89j28K97M9j56k14L44k79K52M2o1j91K09j16K04
5820A51n8n8k42O2K70l0k00J62J77k47J82j30l88O03m42K02q9J87l28K89M3j83
5842f7k47r9M99l31J02P7J19k79P5K80N3m72M24j94Q3P4k94K27j36J16J78l67
5864a79K88j6l09j17K65J08L1O9j33k57N6J00J90L8m54J37k2K08k28K84N7L0m50
5887c04L56k08J89J95k70m4j75r1L21J62l07J4kr2L90o7j14n7m4J54J42j91M2
5910aj07K05k62M19k56k48QK31j21n1N13l63K41J4k32k13J42J23lK56k90K8j33
5933a00N4J41k67K87J0j28O4j47R7J6m9M2r7R0M9k31M42j0n29L1J76L3p4K05K9
5958A34p0o3R1k17J21J30j98k5p2L74k13O6J8r8L33k98k10K95j96J10K36k08o8
$$ plain form
5981 -28 186 107 -177 108 252 264 -163 26 25 -31 -144 184 35 77 -15 41 205 -67 -104 1 -142 -90 -58 58
6005 58 14 -119 -62 105 -9 -56 52 135 -103 -74 62 20 -97 82 -121 -18 216 189 100 22 -114 -121 266 -18
6029 -18 80 239 -22 -49 -278 71 -69 -48 -101 -5 -154 254 -7 45 -23 -78 -133 28 -12 -141 -139 283 105 -177
6053 -177 -7 -109 58 -10 165 242 185 -51 129 -109 166 -43 -41 -44 -109 94 -125 202 -57 126 -10 109 212
6076 212 -113 139 312 65 -57 -123 93 47 -14 24 -41 -25 -208 253 -222 28 202 162 -69 -202 -96 217
6098 217 38 -83 21 202 -59 213 129 28 299 -177 121 -126 -67 -223 95 159 -88 -139 -40 -79 -42 -168
6120 -168 -309 -96 -132 19 19 33 307 -122 -246 -196 141 68 -112 -54 135 41 191 -38 194 86 -87 8 98
6143 98 -75 37 151 -206 53 -13 -23 200 163 15 109 288 124 -52 -7 -123 29 -137 24 -9 249 60
$$ packed form
5981b8K14p9k84K85J44J2m27J89jn6j13L28j49M2r2N6J64k72l7J05j43N2L2J16
6005E8m4j33N7J67j14m7J08Q3k38K9J36m2j17J79k03J03K34k7q9p8j36pL87k84
6029a8R8J59k61k7k29L49j40K1n3R6j49M08k61N2o8n5n5J61m0j29KM22j78k82
6053a77J70j02J67o8J75P7n7k36J80k38K75k09Klo5K03k19L27k59J83j36J19J03
6076B12l25K52J73k47j22o6K16m6o1L8o5J6j83M61m75K50J74m0k31j33J06L13
6098B17j79j21J04J81k61K72q4j01K71m76K98k47N9j56L18O4k47n1R9l9L7j26
6120a68j41K13l6J51%J4K74m29j24N0L37p3j80N8J89r4J50k29K32j08j73R5R0
6143I8j73J12J14l57K59o6j0K23l7j48R4J79j64j76M5j16J52j66J61l3K58j89
$$ plain form
6165 60 122 96 28 -361 262 -103 54 119 3 -45 -75 -25 -325 86 -152 -38 -151 166 227 -9 -90 69 78 86 78
6190 78 -46 125 -184 -26 96 14 -133 -13 174 -25 56 200 -253 -97 -6 -24 -63 14 85 -340 235 -187 39
6213 39 323 -250 193 0 -184 -312 10 -65 -131 -130 -161 276 -10 101 30 -68 130 81 -200 58 -82 -167 158
6236 158 197 90 -21 -240 -102 150 -125 2 11 35 -136 -263 -37 143 -87 15 147 43 99 95 -107 -75 -120
6259 -120 29 -83 22 333 -129 145 -136 -207 -149 -16 5 -282 8 112 149 51 27 205 -342 36 -133 -11
6281 -11 -205 -105 -84 51 -7 31 134 -200 -324 -356 -2 70 -187 141 66 -12 -25 -137 -38 -107 -190 -222 65 8 -139
6306 -139 73 21 152 -177 151 -62 383 195 64 -254 -73 98 -90 132 137 -52 209 -61 -123 -113 132 79
6328 79 -290 -90 -168 -129 114 53 -5 185 168 124 56 164 97 211 -1 -65 56 -108 -281 -76 -64 99 88 17
$$ packed form
6165F0O2k6o8l89O23l65J57O5j16m8l0N0l00M11k38J14j13L17O1k36q1J59RQq
6190G8j24J71l09J58J22q2j47J20J87j99Q1J44m53J56R1j8l9P7P1m25N75m22K26
6213C9K84n73M43j93j84j28L22p5o6Jl1M37k86J11p1r8J98m9k81K58j40q5L25
6236A58L9j07j11k19J38K52k75J27RK4j71j27K26J80k30J02J32j04N6mk02L2m5
6259a20J49j12J05L11m62K74k81p1N8J33K1k87K90J04L7r8k4J78n47L78j69J22
6281a1j94J00K1J35n8L8J03l34j24l2L54P2k57L28p5p8j3j12R9o9q3l2K87n7j47
6306a39K12n2J31l29L28k13M45j88j31l18J81J71j88K22Nj89K61k70o2J0K45n3
6328G9l69K00p8L9K43o1n8J90j7m4o8J08o7J14k12o4J21j64j73K05J2J63j1p1
$$ plain form
6352 17 67 13 96 128 -11 41 89 36 163 202 -37 127 -158 -118 -194 34 -158 12 -30 57 184 -52 54 120 235
6377 235 168 147 -173 70 -52 -39 65 79 -337 -68 281 -76 82 21 -191 -171 -71 -31 28 -267 77 -68 -270
6400 -270 -175 34 274 -132 270 257 -107 36 72 72 -46 313 -83 -120 167 45 -117 -4 -145 131 143 -91
6422 -91 -133 -185 142 85 177 160 -160 -65 -43 -21 1 232 27 -132 -132 -202 158 95 104 -215 85 12 -107 35 -120 -159
6448 -159 -113 77 -90 5 97 66 116 207 -140 -155 54 -150 -148 13 -310 -42 -116 -20 123 -112 -89 -214 63 161
6472 161 -122 24 -227 29 95 61 110 -34 138 120 91 -106 139 -291 18 160 61 25 20 29 22 289 -54 -156
6496 -156 226 64 28 -28 -77 11 14 -197 182 151 -182 164 -382 176 -16 -117 366 202 -63 -101 73 -228 -201
6519 -201 -58 25 -17 -68 74 -6 31 20 -92 41 212 49 -56 47 -37 -151 82 -20 87 -130 53 30 1
$$ packed form
6352A7N0n4Q3L2j39N2M8n3J27L9k39J64k85M0p6K28j92J70m2Q7J27k36J06O6J15
6377B35o7k1l20K43j22J3J04J4m16K69L49l57J58o1k12K0J00M0N9k95L44j45k02
6400b70R5K09K40m06M02j3l64J43L6%j18L59l96l7K87j22j62J13j41K76J2k34
6422i1m2n2L27n7R2j7l20R5K2K2K2K31k05j59%p0L60o3Rl19L00p3j19J42j55l9
6448a59M6J90j67R5R2l1N0R1l47j5K09k04KJ61l23K68p4R6J43k35K3j25K77R8
6472A61k83J46k51K56O6l4M9j44J72j8k9j97K45m30L09J42r9l6nRpK67l43j02
6496a56L82j62l6n6m9Q8Lk11L79l1l33L46n46N58j92j01M83j64k65l8J74l01K7
6519b01J43Q3m2n1J42q0L7j1j12J33J71j63j05J03q4j14K33j02J07k17J83k3k9
$$ plain form
6542 1 214 209 150 -127 147 3 144 163 11 36 262 94 -19 -16 41 110 -291 -312 226 111 -5 -207 174 -83
6566 -83 -216 14 -38 384 20 -1 -191 70 -130 -210 18 -44 71 214 113 292 -240 191 -166 158 162 -148
6588 -148 47 226 416 -98 241 -189 -42 -198 145 -235 394 90 -301 104 39 308 -87 -197 239 156 56
6609 56 52 -70 -107 52 78 77 -69 -40 -163 19 187 -27 114 230 109 -17 28 -25 119 354 88 -154 173
6632 173 48 38 48 31 75 74 -34 -58 122 279 -102 50 206 87 74 -131 29 114 -67 181 -167 -373 -26
6655 -26 -226 77 7 167 -123 130 45 -223 -60 235 -152 -134 43 -104 -280 -177 191 112 -64 -109 -109 -198 -372
6678 -372 -79 -106 -9 203 -193 90 -164 77 -55 -131 241 90 304 99 10 192 88 93 -92 78 -169 172
6700 172 139 26 98 -204 163 169 10 -27 -19 185 -37 -134 -206 196 -121 3 181 284 -118 37 -281 36 117
$$ packed form
6542AK13nn9k77K74j44J41J9j52K5K26j68j13LN7O9m01k1N38j15j16k02L81k57
6566h3j33K30n2M22l64k1j90K61k00q0K28o2J15J43j01J79n32M31l57L24Ml10
6588a48J95J79J90n14L39m30J47j56L43l80O29l04l91M05o5K69l95j10M36q3j00
6609E6mj22l7J59K6jj46K9j23J82J68k14J41J16j21j26M5n3J44K35k66k42L27
6632A73j25j0J0j7M4jj08k4J80J57l81J52J56j19j3k05J60Q5j81K48l48k06L47
6655b6k00L03p0J60k90K53q5k68J63K95l87J8J77j47j76J03L68p9j76m5%q9j74
6678c72K93k7R7K12l96K83k54K41j32p6L72j51K14k05q9J82j04Nj85J70k47L41
6700A72l3j13P2l02L67Oj59l7QK04k22r7p2M02l17J24J78J03m02J55l18L17Q1
$$ plain form
6723 117 -31 48 -85 148 -180 260 -66 89 179 -204 -13 -362 18 -56 -52 -164 134 56 -63 138 -189 -215
6745 -215 -133 242 -312 225 94 -72 230 117 -56 316 -321 -162 -73 -27 -249 -99 -165 169 100 -330 -145 183
6767 183 21 -140 -89 -111 -90 -114 158 63 2 134 -119 -253 -226 -55 -8 10 -14 -226 120 105 134 16 -16 35 35
6792 35 -247 -89 83 -292 124 -70 -275 -112 -57 -43 130 207 -158 -174 -174 -59 120 -195 -88 -154 87 -225 -161
6815 -161 362 160 205 240 -268 28 -12 57 216 30 8 -163 308 -185 59 -155 151 -21 -176 21 -205 -37
6837 -37 -342 35 -78 244 -44 29 -108 -17 -277 62 -115 27 207 -42 -60 -177 -106 -76 -44 -216 52 189
6859 189 -110 290 -110 -2 296 -9 -48 -138 129 17 99 -79 -52 91 -36 -10 -17 -136 13 210 -72 163
6881 163 113 116 -104 139 7 336 145 230 87 -106 -43 -37 -145 -55 168 285 48 38 -47 197 -56 220 112
$$ packed form
6723A17j48P9j33K33l28M40l26J55R0l83J91l49L80p4Mj12K98p8j19K01l27k6
6745b15Q2L75n54N37j31j66L02j13j73L72o37J59Q9M6k22J50o6L34o9m30J85L28
6767A83j62j61N1k2K1k4K72r5o1J32k53j34K7J71M7J8k4k12L46j5K9j18l2N1%
6792C5k82J58J72l75M16j94k05J63N5J4J73P7l65j6%J15J79l15J07o6K41l12O4
6815a61N23k02M5L5n08K96m0O9J59j86k2j71M71m93K44k14L06j72j55J97k26J68
6837c7l05L77j13L22k88P3j37R1k60L39j77J42J80k49j8j17P1L0L2j72K68J37
6859A89k99M00m00J08K98l05l9r0K67j12Q2j78K7J43j27K6pj19J49J97k82K35
6881A63n0Lk20K43j32L29j91Q5j43j93O3Oj08R0K23J17k37j0q5K44k53K76j08
$$ plain form
6904 112 -52 72 -118 255 145 114 -192 -75 -191 85 170 149 64 -58 400 -216 190 103 -134 -125 -50 -97 212
6927 212 135 -90 -24 69 -45 -85 -261 221 -215 -177 -239 275 144 -214 1 -167 99 -79 -131 276 -33 -42 -345
6950 -345 269 -174 -71 58 -79 -18 190 101 -213 -164 130 -16 149 -241 99 63 -43 -213 180 87 192 -162
6972 -162 52 111 -58 -174 -61 181 29 215 168 66 -67 -193 -67 -192 -79 -155 20 -191 -58 -87 -188
6993 -188 -116 45 -92 2 150 -66 -4 -242 229 97 394 -69 -132 -110 -111 -50 18 -149 -19 464 163 301 27
7016 27 -186 -190 -34 94 -164 -231 -37 -67 -17 94 18 -90 -158 -252 -163 -61 -168 122 -139 -182 -62 -5 30 118 -54
7041 -54 94 26 84 -12 -199 13 347 -193 -197 -29 83 -99 -141 19 92 256 -97 39 -9 -4 71 -42 -232 103
7065 103 306 -54 104 303 -364 266 292 49 -129 400 273 -86 -8 86 -36 143 -247 -288 -298 -101 -31 -16
$$ packed form
6904A12j64J24j90L73j10l1l06J17j16K76Q5k1q5j22M58o16M06q7k37RP5m7L09
6927B12p7k25O6R3j14m0j76M82m36L8o2N14j31l58K15j68K66j78n2M07l09rl03
6950c45O14m43J03J29j37O1K08q9l14M9K94j46J65l90L40l6j06j70L93r3J05l54
6972a62K14N9j69j16J13K42j52J86m7j02j33j26J26j25J13p6J75k11J33k9j01
6993a88P2J61j37R4J48k16O2k38M71j32K97m63o3K2jO1O8j67J30M83l01J38k74
7016B7k13mJ56J28k58o7J94l0N0J11p6j08o8r4Q9J02j07K90k61m3J20N7L5Q8j72
7041e4J48o8N8r6j87K12L34n40mJ68J12j82m2J60P3J64l53J36m8NP5j13j90L35
7065A03K03l60J58J99o67O30K6k43j78N29j27l59P8R4j22J79l90m1j0J97P0J5
$$ plain form
7087 -16 7 99 -127 220 0 41 -41 30 37 -53 -315 -228 -16 333 54 -100 -17 249 -238 -157 -73 80 72 -158 143
7112 143 -1 -16 -86 14 -175 145 21 98 -239 46 20 32 45 -4 183 -81 284 -229 -64 23 -560 -123 194
7135 194 2 274 -379 -199 -102 130 38 163 21 315 311 -71 51 -276 -168 72 22 113 69 174 -39 103
7157 103 -248 -57 331 16 272 105 -34 337 60 -45 102 -59 38 181 209 41 -24 -88 115 32 278 -198
7179 -198 -126 62 -5 137 -81 229 -61 45 -319 59 -4 135 91 94 -29 -293 12 -133 13 21 -85 62 62
7202 62 101 -307 -107 -13 148 245 -125 -271 153 13 -143 178 -206 -55 -47 116 5 -159 89 124 -62 147
7224 147 132 -70 34 -9 -57 58 -258 58 -305 -194 123 -72 -87 -78 353 248 -87 -120 39 -43 171 -8 -97
7247 -97 407 -82 142 -181 -166 -73 193 -11 -38 46 -254 -260 258 -3 349 -186 231 -41 125 -102 -84 9 -81
$$ packed form
7087a6K3R2k26L47k20M1q2P1Pr0k62Q7K12L49k79j54Q3K66m87Q1Q4J53qk30L01
7112A43j44j5p0J00j89L20j24P7l37K85k6J2J3m9J87k64L65n13J65Q7n83M37L17
7135A94j92K72o53J80R7K32r2J25j42K94ml82J22l27J08K40n0R1m4J05k13J42
7157A03l51J91L88l15K56j67j39L71k77j05J47j61R7J43K8j68o5o4K03q3K46m76
7179a98P2J88o7J42k18L10k90J06l64L78o3J39m4Lj23k64L05j45J46Qj06J47%
7202F2L9m08K00R4J61R7l70j46M24j40j56L21l84J51QJ63j11j64K48L5j86K09
7224A47j5k02J04m3m8J15l16L16l63J11L17j95j5RM31j05l35l3J59q2K14j79q9
7247i7N04m89K24l23J5R3K66k04k7Q4l00oN18k61L52n35M17k72J66k27J8R3r0
$$ plain form
7270 -81 82 -118 52 -76 6 129 175 34 369 303 -69 -197 -67 -21 25 49 -49 129 89 386 -42 -31 124
7293 124 -265 46 -109 181 123 -120 137 -157 -39 26 -79 -127 27 -29 255 -51 -59 -134 -22 218 -111 94
7315 94 183 95 69 -84 8 -95 -237 -65 -175 221 -9 -38 -51 -295 -180 52 -156 187 -69 -44 120 -154 -188
7338 -188 250 175 167 -117 -17 -171 25 11 48 -3 -40 -42 328 -156 -33 -121 -176 -235 117 158 -61 -156 -52 159 246
7363 246 49 -189 127 71 161 -81 30 83 -125 -42 134 105 130 49 87 80 -152 -188 52 -210 -134 -118 1 -252
7387 -252 -236 62 -182 -34 -92 144 3 93 -78 109 71 -79 -170 294 98 96 38 -216 -15 -19 -123 -143 -39 -153
7411 -153 54 -78 -300 -85 -42 44 -172 14 303 -379 -167 -200 171 -210 -90 111 -43 -205 -68 -116 -27 24
7433 24 -40 -165 40 -67 421 186 -85 -39 102 -239 -74 91 321 10 204 114 3 17 -103 -38 37 -112
$$ packed form
7270h1J63k00J70j28Q2J23M6j41L35o6l72j28J30M6M6K4r8J78m0K97m28J1J55
7293A24l89L11j55K90n8k43K57k94J18O5j05m8J54n6K84l06qp5J12K40l29K05
7315I4Q9q8k6j53R2j03j42J72j10L96k30k9j3k44J15K32k08L43k56K5J64k74l4
7338a88M38p5qk84J00j54J96j4L7n1l7kL70m84J23q8n5n9L52M1k19r5J04K11Q7
7363B46j97k38L16n6R0k42J11N3k08Q3J76k9K5q1L8pk32l6K40k62P6J6J19k53
7387b52J6K98k44J48n8K36j41R0j71J87l8j50r1M64j96kn8k54K01mj04k0J04j14
7411a53K07j32k22K15M3Q6k16J86K89o82K12l3L71l81J20K01j54j62J37m8Q9N1
7433B4o4j25K05j07M88k35k71M6J41l41J65J65K30l11J94r0j11J4j20O5P5j49
$$ plain form
7455 -112 162 124 -40 8 -119 100 -388 10 -37 88 -86 -259 -131 182 -19 -115 -184 -219 -269 288 275 235 96
7478 96 184 145 -47 30 -64 157 -3 76 29 80 -146 -59 20 70 92 16 -8 -122 -35 -12 227 84 132 26 61 59 -32
7505 -32 80 34 98 -174 -70 109 -263 -127 -136 117 84 297 243 -227 216 -52 -160 -195 128 -76 17 -67 165
7528 165 37 -333 84 121 -346 138 -85 119 -117 45 -89 45 -64 -57 -20 -74 140 -40 129 262 85 -105
7550 -105 -253 -29 206 151 -70 -76 232 34 -161 64 -13 -106 52 24 -143 95 184 96 -47 199 -85 87 2
7573 2 -166 120 -150 117 364 -158 42 -115 162 99 37 -150 297 -195 -501 -43 93 -30 -91 96 -196 95
7595 95 17 -31 -175 -15 10 145 126 256 202 -234 119 88 12 274 55 -78 -162 125 -195 -49 90 111 61 -79
7619 -79 -135 68 -23 142 97 68 -245 175 370 53 139 301 -259 105 113 -267 2 -30 -80 -34 76 19 169 -317
$$ packed form
7455a12K74l8j64M8j27K19m88L98m7J25j74j73J28L13k01r6o9l5n0N57j3m0j39
7478I6Q8l9j92P7r4K21j60P9m7N1k26Q7P9N0K2p6k4j14Q7K3K39j43M8j06L5kr1
7505c2J12m6O4k72J04J79l72J36rK53l3K13n4m70M43k68j08l5L23k04R3q4K32
7528A65j28l70M17L7m67M84k23K04k36J62j34J34j09PL7n4K14j80J69J33j77j90
7550a05j48K24K35n5k21oL08j98j95K25p7r3J58k8j67K38Q9q8j43K46k84J72q5
7573Bj68K86k70K67K47n22K00j57K77o3o2j87M47m92l06M58J36j23o1J87k92K91
7595I5p8m8j44J60K5J35j9J30n4m36L53l1p6K62k19j33q4K87l20J46J39K1n0j40
7619g9n6K03r1J65m5k9l13M20J95l17Q6J62n60L64Ql80K69l2n0M6J10n7J50m86
$$ plain form
7643 -317 -67 -107 0 361 -154 -147 124 80 -139 6 99 -34 121 137 87 6 -7 105 133 144 211 -99 -309 40
7667 40 -9 -136 218 35 -58 229 98 229 381 32 -60 -322 69 80 383 -101 21 -285 159 -11 -12 -297
7689 -297 46 51 172 77 25 134 196 -35 -31 30 -150 184 175 423 -120 -44 -54 214 -74 -20 -95 125 -79 -290 -50
7714 -50 -36 -54 -40 -114 108 -33 -80 260 -114 115 -54 -207 162 118 83 -48 -36 -192 -153 -58 1 366 -13 151
7738 151 246 -43 60 -132 -240 350 86 -30 -169 75 -98 54 -143 -139 180 115 38 -255 -119 -77 76 -225
7760 -225 56 -192 -211 38 134 -9 88 -15 127 -115 -114 -155 81 -162 -365 -4 -224 16 -235 85 426 175
7782 175 5 63 47 -240 76 -95 257 306 -53 94 80 93 -55 38 75 -292 -150 -455 -96 34 59 -85 -152
7805 -152 160 74 -143 -111 58 261 -151 186 -138 -291 -173 85 -25 -22 298 -43 158 281 -89 -175 -351 -80
$$ packed form
7643c17K50m0J07L61n15PK71m4k19J45R3j33J55J6n0q1j3J12K8J1O7l10k10L49
7667D0m9j27L54j83r3K87j31J31J52l49r2k62L91J1L03m84J22l06M44j70jk85
7689b97L43NJ21r5n2J09O2k31MO1j80L34rK48n43P6j0K68k88N4p5K20k04k11K40
7714e0J4j8J4p4K22j41m7L40l74K29j69j53L69m4l5j31J2j56L9R5N9L65l79J64
7738A51R5k89J03j92j08N90k64j16j39K44j73J52j97ML19o5p7k93J36M2J53l01
7760b25K81k48j9K49R6j43R7j03J42k42Jm1K36k43k03L61k20K40k51L20L41k51
7782A75j70N8j6k87L16j71L52M9l59J47j4J3j48R3L7l67J42l05L59J30K5j44o7
7805a52L12q6k17L2J69K03m12L37l24j53J18K58j10LL20l41K01J23l70q6j76K71
$$ plain form
7827 -80 191 -197 45 -92 -93 49 221 -348 -220 -226 77 150 -100 142 212 -158 -30 -219 -146 199 50 264 -183
7850 -183 273 20 -48 72 75 4 -56 133 -179 249 297 220 26 -67 77 72 -41 -62 -178 127 -214 -122 157 75
7874 75 -73 -174 -207 40 -25 -162 -132 -58 -100 -213 -16 -122 -175 137 -44 107 236 413 93 -181 48 -198
7896 -198 -92 -12 -96 -5 -240 23 -124 98 -172 111 -145 60 178 186 93 -187 130 164 240 49 227 43 39
7919 39 169 -227 -14 19 -5 113 22 -216 -112 -122 -52 -28 78 82 67 -21 215 -67 351 -79 -65 44 -199 -16
7943 -16 -66 -25 98 35 162 195 63 -98 75 119 18 -124 42 146 -2 -100 -156 98 129 93 -187 -9 -88 -181
7967 -181 125 75 5 -313 -187 -79 124 226 28 -98 -57 70 -224 129 -8 -107 -4 130 -55 38 55 -19
7989 -19 -169 33 252 -113 -120 62 -246 -243 -284 -217 126 -307 -37 -262 195 213 -55 -277 -153 -198 -297 -99 -53 120
$$ packed form
7827h0K71l88K42j37jJ42J72n69J28oL03P3k50K42P0l70J28j89P3L45j49K14m47
7850a83M56k53o8J20Lp1o0J89l12M28M8p7j94r3J44nj13k1j16L05l41R2K79q2
7874G5j48j01l3K47o5j37L0P4m2j13J97j06n3L12j81J51J29J77l20k74K29k46
7896a98J06Q0q4R1k35K63j47K22k70K83k56K05J18Qr3k80L17L4P6j91J78j84m
7919C9J30l96K13L3k4J18r1k38J04j0P0K4J06Mj5q8K36k82M18m30J4J09k43J83
7943a6n0M1J23o3J27L3j32j61J73M4j01j42J66J04j48r8n6K54L1l6k80J78p9r3
7967a81L06n0p0l18J26J08K03J02j98j26M1J27k94L53j37r9J03J34j85R3J7p4
7989a9j50K02K19l65pJ82l08Lm1O7L43m33K70k25M57J8k68k22J24m5r9J98M6J73
$$ plain form
8013 120 -354 -20 271 172 -60 -175 103 -40 -109 133 -82 -8 137 -67 75 -74 -104 23 355 32 -447
8034 -447 -195 238 -114 -144 -318 -51 -96 -17 -64 -77 -13 16 -54 19 -166 66 -272 171 -128 -189 -270 5 -8 -159
8058 -159 -294 -294 -10 40 47 155 -342 -203 98 70 -42 31 207 -135 24 -60 117 -5 -295 -292 94 477 -53
8081 -53 120 -113 -130 -57 -72 154 192 -123 50 14 -115 5 33 -238 -119 50 137 141 10 -91 24 -85 -146 170
8105 170 117 6 -285 -36 -16 -15 -257 162 -427 -75 23 47 68 63 -173 -56 69 1 34 -34 138 53 25 -119 91
8130 91 -12 28 225 -47 256 175 -57 -42 -23 -212 -144 189 -32 268 -64 123 -63 -160 -15 -37 -223 -60 166
8153 166 -11 94 50 -46 -9 -27 -40 -2 100 -432 -132 119 2 -245 -218 4 -403 188 -267 168 94 -203 -209
8176 -209 116 -62 137 -111 -103 80 -138 48 44 -171 -145 -239 -145 -75 -33
$$ packed form
8013A20m74L34K91r9k32j15K78j43o9K42k15P4J45k04J42j49l0J27L32l23m79
8034d47K52M33l52l0j74K67m5P9m7j3O4K9p0P3j85K32l38M43k99o1q1K75j3j51
8058a59j35%K84N0PJ08m97J39L01k8j12P3J76l42J59q4J77j22k90LL86L83n30
8081e3J73k33j7P3j5K26L8l15J73l6j29J20K8k71J19J69Q7Mj31j01J15j09o1L16
8105A70n3j11k91K49K0Jk42M19n89L52R8K4K1nk36J17J25o8L3o8J72q5k8j44K10
8130I1j03M0J97k72L03q1k32J5J9j89O8L33k21L00l32J87j86r7J45k2j86J63K26
8153A66j77J05m4r6L7j8j3L8J02n32L00K51j17k47K7K22m07N91m55M35p4k97o
8176b09L25j78J99k48QJ83k18J86mk15K6r4R4P0M2
8191c3
$$ Imaginary data points
##PAGE= N=2
##DATA TABLE= (X++(I..I)), XYDATA
$$ plain form
0 0 0 0 0 1 -8 0 -8 8 -8 16 -16 24 -24 32 -40 48 -56 64 -80 89 -108 126 -143 166 -190 216 -247 279 -319
29 -319 359 -404 453 -508 569 -634 704 -784 869 -963 1069 -1183 1311 -1450 1605 -1780 1976
46 1976 -2198 2452 -2744 3086 -3491 3982 -4591 5369 -6401 7842 -10003 13597 -20664 39877
60 39877 -199882 -622716 -184537 188873 78509 -192434 -126177 -19742 -138668 -296929
70 -296929 -210104 -75860 -91888 -201309 -231542 -178370 -51775 54000 7354 -169427 -221266
81 -221266 -105586 -60155 -151425 -123295 62476 126305 1219 -36969 51872 21689 -105276
92 -105276 -28624 203729 228940 32312 -28756 110640 174041 100704 92938 152315 118085 49110
104 49110 107652 208476 196777 144395 138654 74852 -52775 -30336 160950 236811 107440
$$ packed form
0@%%%JrQqJ6j6K4l2M0m8N6p2Q8j04J20j44J69j97K34k69L09l56M06m63N26n98
29c19O78p63Q57r61J077j203J338j488J653j832K032k252K494k761L055l385L756
46A976m174M650n196N830o577P473q573R960j1770J4243j7845K3600l4261O0541
60C9877k39759m22834M38179L73410j10364k70943O6257J06435j18926j58261
70b96929Q6825J34244j6028j09421l0233N3172J26595J05775m6646j76781n1839
81b21266J15680M5431r1270K8130J85771O3829j25086l8188Q8841l0183j26965
92a05276P6652K32353K5211j96628o1068J39396O3401p3337p766N9377l4230o8975
104D9110N8542J00824j1699n2382n741o3802j27627K2439J91286P5861j29371
$$ plain form
115 107440 28671 93301 80178 -57287 -86296 31663 62595 -35270 -64056 -3407 -11032 -62642
127 -62642 -28842 2476 -102712 -208907 -152149 -57172 -73458 -87763 -13944 -18471 -167749 -238814
139 -238814 -126616 -41841 -94642 -109922 -25893 -22152 -127325 -137846 -26697 1082 -83694
150 -83694 -95087 -11827 11484 -24818 6420 69925 44345 -20374 -16277 9331 -291 35712
162 35712 138943 163845 69563 17916 64779 73362 19230 46456 145123 140324 41479 37136
174 37136 127974 134246 51654 33511 72242 41526 -13555 33849 118094 99055 24429 12045
186 12045 17355 -32722 -58651 2591 45993 1787 -34491 -9334 -17032 -80519 -87742 -26720 -21788
199 -21788 -83300 -89615 -34591 -28550 -68099 -61352 -34657 -74928 -129835 -101046 -37865 -31724 -41276
$$ packed form
115A07440p8769O4630j3123j37465k9009J17959L0932r7865k8786O0649p625n1610
127f2642L3800L1318j05188j06195N6758R4977j6286j4305P3819m527j49278p1065
139b38814J12198Q4775n2801j5280Q4029L741j05173j0521J11149K7779q4776
150h3694j1393Q3260K3311l6302L1238O3505k5580o4719M097K5608r622L6003
162C5712J03231K4902r4282n1647M6863Q583n4132K7226R8667m799r8845m343
174C7136R0838O272q2592j8143L8731l0716n5081M7404Q4245j9039p4626j2384
186A2045N310n0077k5929O1242M3402m4206l6278K5157p698o3487p223O1022M932
199b1788o1512o315N5024O041l9549O747K6695m0271n4907K8789O3181O141r552
$$ plain form
212 -41276 -9287 -5096 -71217 -105439 -48314 -3756 -31791 -41644 8811 28244 -13539 -20777 27079
225 27079 35028 -12560 -21623 22146 38273 26708 51129 85642 60952 11506 14667 42161 37343
238 37343 34747 73296 95877 59322 27698 45085 54594 25903 18662 50022 54638 23082 23682
251 23682 57971 52588 6056 -8642 9789 -95 -25496 -7067 32752 25340 -12279 -20757 -16021
264 -16021 -38897 -59423 -38633 -12084 -21200 -34698 -23539 -20648 -44831 -57436 -43424 -41827 -60453
277 -60453 -55425 -25183 -15443 -30213 -30522 -20972 -37319 -60895 -48217 -15990 -8836 -14898 -2327
290 -2327 10067 -5377 -23266 -12680 3899 580 -896 19367 34414 27101 22363 31147 28674
303 28674 12172 10540 28965 38260 35920 45440 58499 49255 25564 19484 26679 25082 20925 33224
$$ packed form
212d1276L1989M191o6121l4222N7125M4558k8035r853N0455J9433m1783p238M7856
225B7079P949m7588r063M3769J6127j1565K4421L4513k4690m9446L161K7494m818
238C7343k596L8549K2581l6555l1624J7387R509k8691p241L1360M616l1556O00
251B3682L4289n383m6532j4698J8431r884k5401J8429L9819p412l7619q478M736
264a6021k2876k0526K0790K6549r116j3498J1159K891k4183j2605J4012J597j8626
277f0453N028L0242R740j4770l09R550j6347k3576J2678L2227P154o062J2571
290b327J2394j5444j7889J0586J6579l319j476K0263J5047p313m738Q784k473
303B8674j6502j632J8425R295k340R520J3059r244k3691o080P195j597m157J2299
$$ plain form
317 33224 47558 41588 27513 24372 22225 8700 -1759 2853 9210 6814 7044 13804 10321 -6595
331 -6595 -19521 -20768 -23365 -28435 -23892 -12952 -11146 -19390 -24290 -27643 -36847 -45756 -42668 -33595 -29148
346 -29148 -26417 -21299 -19280 -26191 -33161 -33513 -31746 -31553 -26900 -15788 -5270 -1585 -1661 -4203 -10038
361 -10038 -14537 -10968 -2095 6144 13036 20680 24853 20914 15914 15071 15639 14447 16186 25164 34509
376 34509 37756 35917 32088 26050 19703 17309 20145 23718 25453 28325 30437 27456 20030 12018 6460
391 6460 2579 673 3143 8420 11758 9085 1439 -6486 -13046 -17781 -20083 -19923 -16414 -12558 -10288
406 -10288 -10857 -16310 -23095 -29051 -32113 -31439 -27166 -20820 -15359 -13878 -15790 -19435 -21466 -22961 -23828 -22691
422 -22691 -18215 -10468 -2088 1175 -35 -4103 -7042 -7873 -6381 -970 6363 11696 13869 15453 16687
$$ packed form
317C3224J4334n970j4075l141k147j3525j0459M612O357k396K30O760l483j6916
331f595j2926j247k597n070M543J0940J806q244m900l353r204q909L088R073M447
346b9148K731N118K019o911o970l52J767J93M653J1112J0518L685p6k542n835
361a0038m499L569Q873Q239O892P644M173l939n000q43N68j192J739Q978R345
376C4509L247j839l829o038o347k394K836L573J735K872K112k981p426q012n558
391F460l881j906K470N277L338k673p646p925o560m735k302J60L509L856K270
406a0288n69n453o785n956l062O74M273O346N461J481j912l645k031j495q67J137
422b2691M476P747Q380L263j210m068k939q31J492N411P333N333K173J584J234
$$ plain form
437 16687 14909 10954 8760 9043 11435 16199 25098 30836 27829 18895 13255 12494 12225 11490 14160 18490
453 18490 20233 18328 16570 14113 8085 1061 -1981 -1021 2274 6395 9658 6885 -367 -6092 -8452
468 -8452 -11249 -14610 -12886 -8682 -7178 -7001 -5546 -6336 -14060 -22533 -22909 -18096 -16192 -13687 -7766 -4732
484 -4732 -9805 -15327 -14334 -13054 -15875 -16602 -10850 -5388 -1969 1548 3475 -2513 -10668 -10638 -3864 -955
500 -955 1127 8856 14684 8847 976 3924 9926 5363 -507 5317 13597 14534 13848 18183 17766 7726
516 7726 1000 4845 9177 9050 12302 18140 15964 7596 6600 9266 2932 -4657 798 10419 8761 3302
532 3302 6865 8696 -2206 -11852 -6678 338 -4695 -8833 -1097 4311 -2608 -7797 -6117 -10047 -20004
547 -20004 -18757 -5122 -601 -7006 -7226 -3155 -9808 -19395 -14746 -4981 -8389 -15113 -7658 1415 -2771
$$ packed form
437A6687j778l955k194K83K392M764Q899N738l007q934n640p61k69p35K670M330
453A8490J743j905j758k457o028p024l042R60L295M121L263k773p252n725k360
468h452k797l361J724M204J504J77J455p90p724q473l76M813J904K505N921L034
484d732n073n522R93J280k821p27N752N462L419L517J927n988q155L0O774K909
500i55K082P729N828n837p871K948O002m563n870N824Q280R37o86M335m17j0040
516G726o726L845M332j27L252N838k176q368r96K666o334p589N455R621j658n459
532C302L563J831j0902r646N174P016n033m138P736N408o919n189J680l930r957
547b0004J247J3635M521o405k20M071o653r587M649R765l408o724P455R073m186
$$ plain form
562 -2771 -8485 -3151 -1185 -12618 -16656 -3049 6949 1673 -163 8982 8416 -5042 -8626 2563
576 2563 6994 2269 6415 16401 13306 2843 5311 13364 7962 -621 6595 15720 9404 4972 16560
591 16560 22701 8468 -3094 2961 8255 1932 3667 17009 17458 1289 -4591 4625 3807 -6835
605 -6835 -5107 5708 2320 -8130 -2988 6396 -1200 -13880 -10279 -4627 -13335 -18086 -4272 4903
619 4903 -6357 -14977 -7537 -7543 -20933 -21573 -4778 1193 -10033 -12075 -1114 -3237 -15857 -12430 1128
634 1128 -1534 -13327 -7628 6321 4585 -2965 3753 9362 -2592 -11728 768 12733 8536 6607
648 6607 16557 15876 -529 -3626 12058 16454 5541 5763 17697 15132 3183 7791 20563 13059
662 13059 -3726 -607 12013 7911 763 10506 18799 4563 -10452 -4671 3113 -3857 -5558 5710
$$ packed form
562b771n714N334J966j1433m038J3607R998n276j836R145n66j3458l584J1189
576B563M431m725M146R986l095j0463K468Q053n402q583P216R125o316m432J1588
591A6560O141j4233j1562O055N294o323J735J3342M49j6169n880R216q18j0642
605f835J728J0815l388j0450N142R384p596j2680L601N652q708m751J3814R175
619D903j1260q620P440oj3390o40J6795N971j1226k042J0961k123j2620L427J3558
634A128k662j1793N699J3949j736p550O718N609j1954r136J2496J1965m197j929
648F607R950o81j6405l097J5684M396j0913K22J1934k565j1949M608J2772p504
662A3059j6785L119J2620m102p148R743Q293j4236j5015N781P784o970j701J1268
$$ plain form
676 5710 6194 -8341 -12153 -1395 -2144 -15939 -14433 -1329 -5239 -19094 -13471 3123 -1292 -16897
690 -16897 -15116 -6365 -13162 -21045 -7842 5982 -1180 -11022 -5265 -1989 -12804 -13867 2760 8390
704 8390 -3857 -6574 6073 8200 -3064 -1192 11385 7658 -6022 -1585 15130 15383 5868 9910
718 9910 16089 5163 -5957 3999 17199 12576 6269 13749 14998 1362 -3107 9873 13317 2
732 2 -3437 8126 9050 -2662 -874 11252 6248 -11156 -12745 -293 238 -6974 -914 7507 -2756
747 -2756 -16412 -11464 -3092 -8515 -12170 -2273 2042 -9609 -14606 -3507 205 -10346 -13309 -3161
761 -3161 -3102 -12690 -8527 6750 5934 -7357 -8597 -525 -3728 -10157 -770 12109 6574 -3631 134
776 134 6697 387 -4066 5569 10789 1790 -1829 8856 13063 3825 946 9058 8035 -3600 -2508
$$ packed form
676E710M84j4535l812J0758p49j3795J506J3104l910j3855N623J6594m415j5605
690a6897J781Q751o797p883J3203J3824p162r842N757L276j0815j063J6627N630
704H390j2247k717J2647K127j1264J872J2577l727j3680M437J6715K53r515M042
718I910O179j0926j1120R956J3200m623o307P480J249j3636m469J2980L444j3315
732Bl439J1563R24j1712J788J2126n004j7404j589J2452N31p212O060Q421j0263
747b756j3656M948Q372n423l655R897M315j1651m997J1099L712j0551k963J0148
761c161N9r588M163J5277q16j3291j240Q072l203o429R387J2879n535j0205L765
776A34O563o310m453R635N220q999l619J0685M207r238k879Q112j023j1635J092
$$ plain form
791 -2508 10446 13054 4926 4384 9460 3296 -6282 -2030 7803 5647 -353 4023 7236 -1355 -6358
806 -6358 1616 5680 -3403 -8562 -1330 3068 -3133 -3353 4080 1797 -10179 -12545 -3239 -985 -5373
821 -5373 -2740 3759 -777 -10157 -8231 -864 -3603 -8536 -3543 1858 -2893 -6579 -500 3193 -3607
836 -3607 -7476 -2009 -49 -5103 -3327 6015 7121 -1542 -3723 1276 394 -4671 -564 7897 6268
851 6268 -181 1313 6219 2449 -1628 2193 5989 1840 -942 4977 8952 4239 1099 4353 4132
866 4132 -2242 -2325 5299 7491 3154 2547 5762 2432 -3923 -2673 3265 2678 -936 945 4019 134
882 134 -3397 -283 2229 -2991 -6898 -2944 537 -1700 -2606 1317 498 -6293 -8969 -4439 -1784 -4125
898 -4125 -3194 40 -958 -5502 -5138 -1515 -3005 -5886 -4003 -534 -1794 -3043 69 2011 -1346 -4170
$$ packed form
791b508J2954K608q128n42N076o164r578M252R833k156o000M376L213q591n003
806f358P974M064r083n159P232M398o201k20P433k283j1976k366R306K254m388
821e373K633O499m536r380J926P367k739m933M993N401m751l686O079L693o800
836c607l869N467J960n054J776R342J106q663k181M999q82n065M107Q461j629
851F268o449J494M906l770m077L821L796m149k782N919L975m713l140L254k21
866D132o374q3P624K192m337o07L215l330o355J250N938n87l614J881L074l885
882A34l531L114K512n220l907L954L481k237r06L923q19o791k676M530K655k341
898d125R31L234r98m544L64L623j490k881J883L469j260j249L112J942l357k824
$$ plain form
914 -4170 -2060 47 -1530 -526 3936 5087 1260 56 2744 2412 -850 865 5134 5991 3015 3931
930 3931 6381 4905 1633 2178 4487 3271 2008 4231 6236 4430 2691 3686 3204 -418 -1733 1606
946 1606 3569 2054 1089 2153 791 -3040 -3166 -1174 -1163 -3440 -2975 -1357 -2016 -3409 -2793 -2372 -5273
963 -5273 -7782 -5927 -2579 -2317 -3025 -2487 -2800 -5007 -6027 -4265 -2776 -3540 -2868 -999 -244 -1079 -963
980 -963 457 -616 -2669 -1505 1688 2798 2509 2366 3406 2531 1548 2285 3125 2631 2961 4576 5568 4825
998 4825 4396 4648 3555 1847 1811 3637 4465 3884 3131 3104 2456 1449 866 527 -170 -1143 256 909 1003
1017 1003 -369 -929 -1923 -3908 -4277 -3280 -1699 -1986 -2417 -2886 -2864 -3356 -4055 -4215 -4311 -4602 -3703 -2175 -1698
1036 -1698 -1974 -2270 -2451 -2839 -3457 -2487 -1157 -452 -227 511 795 737 422 358 181 310 1274 2581 3504 3369
$$ packed form
914d170K110K107j577J004M462J151l827j204K688l32l262J715M269Q57k976R16
930C931K450j476l272N45K309j216j263K223K005j806j739R95m82l622j315L339
946A606J963j515r65J064j362l831j26J992J1k277M65J618o59j393O16M21k901
963e273k509J855L348K62p08N38l13k207j020J762J489p64O72J869P55q35J16
980i63J420j073k053J164L193J110k89j43J040q75r83P37Q40m94L30J615R92p43
998D825m29K52j093j708l6J826Q28n81p53k7o48j007n83l39o97r73J399O53R4
1017A003j372n60r94j985l69R97J581k87m31m69K2m92o99j60r6k91Q99J528M77
1036a698k76k96j81l88o18R70J330P05K25P38K84n8l15o4j77J29R64J307R23j35
$$ plain form
1056 3369 2764 2902 2440 1444 1351 2576 3045 3400 3379 3115 2921 2395 1778 906 1001 1535 1869 2076 1393 1507
1076 1507 902 -7 -988 -1253 -831 -802 -576 -637 -556 -438 -1524 -1951 -2408 -3077 -2372 -1689 -1576 -1214 -1253 -1404 -1991
1097 -1991 -2399 -2730 -2476 -1864 -1111 -741 -802 -369 -383 -915 -1238 -1201 -1161 -152 111 815 922 977 1201 -37 -426
1118 -426 -134 894 1536 1220 1429 1725 1776 1298 534 669 705 855 838 1213 1678 1916 1459 712 -226 -262 266
1139 266 706 534 813 1285 579 131 -133 -338 -527 -615 -413 483 517 316 35 -207 -819 -861 -778 -311 -503
1160 -503 -24 -87 -11 -161 -811 -1036 -1425 -1291 -753 -355 -314 129 -74 -229 -1074 -1374 -1401 -640 -691 -584 -274 174
1182 174 239 -681 -969 -508 -630 -497 -260 436 727 808 225 311 -181 -138 -144 200 814 1218 1264 1029 807 679
1204 679 768 279 457 1001 1298 1357 1229 1607 1098 829 -23 315 519 989 396 815 956 539 -67 -450 -134
$$ packed form
1056C369o05J38m62r96r3J225M69L55k1k64j94n26o17q72R5N34L34K07o83J14
1076A507o05r09r81k65M22K9K26o1Q1J18j086m27m57o69P05O83J13L62l9j51n87
1097a991m08l31K54O12P53L70o1M33j4n32l23L7M0J009K63P04J07N5K24j238l89
1118d26K92J028O42l16K09K96N1m78p64J35L6J50j7L75M65K38m57p47r38l6N28
1139B66M40j72K79M72p06m48k64k05j89q8K02Q96L4k01k81k42o12m2Q3M67j92
1160e03M79o3P6j50o50k25l89J34N38L98M1M43k03j55q45l00k7P61n1J07L10M48
1182A74O5r20k88M61j22J33K37O96K91Q1n83Q6m92M3oL44O14M04M6k35k22j28
1204F79Q9m89J78N44K97N9j28L78n09k69q52L38K04M70n93M19J41m17o06l83L16
$$ plain form
1225 -134 -382 30 -502 -264 -345 -582 -198 -1287 -1597 -1259 -940 -1370 -1072 -849 -591 -1010 -1673 -1942 -1602 -1493
1245 -1493 -1632 -1265 -1157 -980 -1009 -260 -783 -1173 -1204 -750 -343 -5 78 626 473 176 605 719 415 329 657
1266 657 1297 1509 1426 1501 1623 944 644 1124 1553 1153 1367 1578 1714 1320 885 853 824 619 342 579 746
1287 746 839 607 -116 -292 -881 -725 -462 -881 -1080 -813 -481 -966 -1035 -1223 -1364 -1907 -1933 -1706 -806 -988 -1277
1308 -1277 -926 -1481 -1779 -1800 -1038 -642 -535 -444 -626 -275 -454 -193 105 -112 -385 190 615 1325 1085 1328
1328 1328 892 479 720 1035 1417 1122 1266 1548 1600 1309 1390 1429 882 869 737 1309 1283 1012 693 783 222 -291
1350 -291 -28 -82 30 -338 -314 -143 7 -558 -895 -698 -1175 -1559 -992 -937 -893 -1246 -1133 -1401 -1485 -1378 -718 -977
1372 -977 -1278 -1175 -540 37 -891 -420 -93 -375 -580 -385 353 373 446 248 702 345 22 359 820 999 758
$$ packed form
1225a34k48M12n32K38q1k37L84j089l10L38L19m30K98K23K58m19o63k69L40J09
1245a493j39L67J08J77k9P49n23l90l1M54M07L38Q3N48j53k97M29J14l04q6L28
1266F57O40K12q3P5J22o79l00M80M29m00K14K11J36l94m35l2k9k05k77K37J67
1287G46R3k32p23j76n89J56K63m19j99K67L32m85o9j88j41n43k6K27R00j82k89
1308a277L51n55k98k1P62L96J07R1j82L51j79K61K98k17k73N75M25P10k40K43
1328A328m36m13K41L15L82k95J44K82N2k91Q1L9n47j3j32N72k6k71l19R0n61n13
1350b91K63n4J12l68K4J71J50n65l37J97m77l84N67N5M4l53J13k68q4J07O60k59
1372i77l01J03O35N77r28M71L27k82k05J95P38K0P3j98M54l57l23L37M61J79k41
$$ plain form
1393 758 1342 1071 993 541 1126 850 586 408 1152 1249 575 475 760 659 311 230 603 288 -243 505 833
1414 833 269 -434 -256 -148 -278 -753 107 49 -435 -664 -632 -68 -607 -648 -248 -631 -549 -781 -132 193 -342
1435 -342 -374 -187 -577 -897 -371 270 55 3 -171 25 -251 -435 198 689 216 -340 584 470 190 -72 102
1456 102 499 -185 -33 131 771 205 115 -41 230 -175 -95 583 153 -66 -44 777 794 -258 -87 350 238
1477 238 -269 -64 472 -32 -135 74 649 344 -385 167 2 -53 198 244 460 -413 -350 194 332 -192 -174
1498 -174 423 165 -331 162 819 -135 -606 -359 129 -480 -589 -132 496 195 -772 -300 -259 -664 -695 23 206
1519 206 -566 -767 -87 -340 -593 -311 84 -187 -314 -182 150 -205 -485 -80 109 18 -214 89 566 228
1539 228 245 538 750 -83 206 314 571 300 313 1186 660 299 209 597 669 117 331 400 374 18 381 543
$$ packed form
1393G58N84k71p8m52N85k76k64j78P44R7o74j00K85j01l48q1L73l15n31P48L28
1414H33n64p03J78J08j30m75Q60n8m84k29L2N64n39m1M00l83Q2k32O49L25n35
1435c42l2J87l90l20N26O41k15n2j74J96k76j84O33M91m73n56R24j14k80k62J74
1456A02L97o84J52J64O40n66r0j56K71m05Q0O78m30k19K2Q21J7j052J71M37j12
1477B38n07K05N36n04j03K09N75l05p29N52j65n5K51M6K16q73O3N44J38n24J8
1498a74N97k58m96M93O57r54m71K47M88o09j09M57O28l01r67M72M1m05l1P18J83
1519B06p72k01O80k53k53K82L95k71j27J32L32l55k80M05J89r1k32L03M77l38
1539B28J7K93K12q33K89J08K57k71J3Q73n26l61r0L88P2n52K14O9k6l56L63J62
$$ plain form
1561 543 31 -361 51 188 -24 -230 419 95 -441 -571 -464 -374 -507 -829 -5 -523 -590 -567 -349 -488 -576
1582 -576 -679 -286 -503 -374 -511 -57 -355 -614 -121 19 -532 -543 188 290 -99 -102 360 329 -102 -195 671 464
1604 464 475 490 1007 875 356 595 532 429 440 410 837 609 555 484 241 463 111 349 369 92 -75 511 78
1627 78 -237 -456 281 -212 -694 -438 -109 19 -380 -177 -134 -279 -856 -494 -179 -598 -819 -547 -253 -643 -653
1648 -653 -150 -347 -627 -377 -69 342 -107 -200 38 -156 -128 -65 548 334 -28 408 425 488 338 458 273 90
1670 90 337 573 795 533 201 532 551 414 -17 -8 180 133 -9 263 471 -32 -403 -132 -176 -299 -329 -210
1692 -210 -172 -169 -193 -103 -437 -499 -264 -299 -360 -314 67 -293 -452 -403 -3 -60 -324 -502 -139 -109 3 -48 66 -26 -110
1717 -110 -218 117 54 -226 249 461 311 105 172 263 17 219 331 511 598 24 117 459 287 282 -10 -6 75
$$ packed form
1561E43n12l92M12J37k12k06O49l24n36j30J07R0j33l22Q24n18o7K3K18j39q8
1582e76j03L93k17J29j37M54k98k59M93J40n51j1P31J02l89lM62l1m31r3Q66k07
1604D64J1J5N17j32n19K39o3j03J1l0M27k28n4p1k43K22l52K38K0k77j67N86m33
1627G8l15k19P37m93m82K56L29J28l99K03M3j45n77L62L15m19k21K72K94l90j0
1648f53N03j97k80K50L08M11m49r3K38j94K8O3O13k14l62M36J7O3j50J20j85j83
1670I0K47K36K22k62l32L31J9j37m31RJ88m7j42K72K08n03l71K71m4j23l0J19
1692b10L8Lk4R0l34o2K35l5o1M6L81l60j59M9M00n7k64j78L63L0J12n1J14r2q4
1717a10j08L35o3k80M75K12j50k06O7R1k46K02J12J80Q7n74R3L42j72nk92MQ1
$$ plain form
1740 75 195 99 7 18 93 74 26 -88 -75 36 -74 -21 79 -67 -286 -144 -180 -341 -185 -381 509 -37 41 -141
1764 -141 -207 -226 -426 -234 -252 -84 -194 -183 -104 182 -174 -112 -142 245 73 350 89 353 -140 -57 62 2 133
1787 133 -275 -55 -221 268 94 188 -23 -377 -120 -38 -216 -146 18 -132 -44 -170 4 -367 -126 0 212
1808 212 72 240 369 332 87 -147 -211 169 57 150 153 207 -59 88 -12 329 374 99 4 331 73 76 -229
1831 -229 -123 -242 -386 239 164 69 43 78 31 -91 -85 -39 10 78 -347 -156 -232 169 -151 -356 -317 -194 1 -226
1855 -226 -239 191 -86 -295 120 -249 -182 -14 -75 -38 -313 -266 -198 51 -80 -330 -229 139 -67 250 130 370
1877 370 302 361 369 373 325 300 202 367 227 390 358 169 65 -27 263 321 182 52 206 194 -4 201 -80 202
1901 202 -122 -205 -173 -178 -369 170 -147 -545 -439 -421 -184 -561 -270 -321 -122 -305 -607 -164 -173 -150 -257 21 -167
$$ packed form
1740G5J20r6r2J1P5j9m8j14J3J11j10N3J00j46k19J42l6j61J56j96Q90n46P8j82
1764a41o6j9k00J92j8J68j10J1P9K86l56O2l0L87j72K77k61K64m93Q3J19o0J31
1787A33m08K20j66M89j74R4k11l54K57Q2j78P0J64j50Q8j26J74l71K41J26K12
1808B12j40J68J29l7k45k34o4L80j12R3LN4k66J47j00L41M5k75r5L27k58Ll05
1831b29J06j19j44O25p5r5k6L5m7j22OM6M9O8m25J91p6M01l20k05L9J23J95k27
1855b26j3M30k77k09M15l69O7J68o1L7k75M7O8K49j31k50J01L68k06L17j20K40
1877C70o8N9QMm8k5r8J65j40J63l2j89j04r2K90N8j39j30J54j2j98K05k81K82
1901B02l24q3L2nj91N39l17l98J06J8K37l77K91n1J99j83l02M43rK3j07K78j88
$$ plain form
1924 -167 -350 24 198 -294 -147 -182 349 -28 186 197 284 -115 -9 504 390 46 -238 394 361 219 456
1945 456 403 517 74 -3 466 -10 52 416 535 -2 -70 545 437 -42 -146 226 128 -349 -329 -108 98 -290
1967 -290 -410 -24 -100 -728 -468 -31 -31 -257 -252 -176 -398 -644 -251 335 134 -229 133 238 -234 -332 135 235
1989 235 -170 -302 399 421 -30 53 318 111 -111 104 590 492 -133 221 634 288 -200 17 212 32 -349
2010 -349 229 559 -42 -365 266 230 -432 -395 -13 -17 -193 -129 272 -163 -508 -479 -124 -202 -869 -164 181 -85
2032 -85 -338 -15 293 -190 -628 40 211 -372 -347 49 170 -305 -451 317 229 -221 -155 670 369 -242 432
2053 432 616 15 -719 70 689 101 -188 525 650 82 -279 279 593 -358 -212 315 289 -566 -87 345
2073 345 215 -453 -496 -144 -141 -676 27 641 18 -737 -137 553 -199 -648 -34 352 -157 -611 135 386 -350
$$ packed form
1924a67j83L74J74m92J47l5N31l77K14J1Q7l99J06N13j14l44k84O32l3j42K37
1945D56n3J14m43p7M69m76O2L64J19n37o8O15j08m79j04L72r8m77K0K21K06l88
1967b90j20L86p6o28K60M37%k26NP6k22k46L93N86k01l63L62J05m72r8M67J00
1989B35m05j32P01K2m51Q3K65k07k22K15M86r8o25L54M13l46m88K17J95j80l81
2010c49N78L30o01l23O31l6o62L7L82mj76O4M01m35l45K9L55p8o67P05L45k66
2032h5k53L23L08m83m38O68J71n83K5L96J21m75j46P68q8m50O6Q25l01o11O74
2053D32J84o01p34P89O19n88k89P13J25n68l61N58L14r51J46N27k6q55M79M32
2073C45j30o68m3L52Ln35P03O14o23p55O00O90p52m49O14L86n09m54P46K51p36
$$ plain form
2094 -350 -687 149 282 -229 -54 683 443 -343 26 731 -14 -444 288 1021 341 -221 28 532 -45 -278
2114 -278 499 771 -55 -711 527 837 -358 -621 561 469 -829 -492 709 166 -489 -586 464 -7 -901
2133 -901 -274 308 59 -1027 370 436 -254 -961 -96 505 -670 -872 208 304 -415 -636 583 454 -292
2152 -292 -434 337 237 -209 32 460 293 -457 103 640 193 -310 357 686 -232 -500 434 715 206 -303
2172 -303 435 682 -497 -340 589 385 -808 -555 347 177 -779 -610 310 51 -787 -373 530 65 -662
2191 -662 -630 273 -283 -439 -107 416 -229 -996 -16 373 -201 -579 195 450 -384 -181 431 243 -187 -89 587
2212 587 165 -401 321 904 147 -555 161 918 243 -283 361 457 159 52 473 464 -81 -310 398 908 -481
2233 -481 5 714 172 -493 -441 779 -86 -553 -412 346 -160 -306 -95 238 -397 -950 -32 303 -194 -647
$$ packed form
2094c50l37Q36J33n11J75P37k40p86L69P05p45m30P32P33o80n62K49N04n77k33
2114b78P77K72q26o56J238L10j195k63J182r2j298L37J201n43o55r7J050m71q94
2133i01O27N82k49j086J397O6o90p07Q65O01j175k02J080R6p19k21J219j29p46
2152b92j42P71j00m46K41M28j67p50N60N37m47n03O67L29r18k68R34K81n09n09
2172c03P38K47j179J57R29k04j193K53R02j70r56J69R20k59q38M14R03m65p27
2191f62L2R03n56j56L32N23o45p67R80L89n74l78P74K55q34K03O12j88m30R8O76
2212E87m22n66P22N83p57p02P16P57o75n26O44R6k98j07M21rn45k29P08N10j389
2233d81M86P09n42o65N2J220q65m67J41P58n06j46K11L33o35n53R18L35m97m53
$$ plain form
2253 -647 153 146 -477 -532 277 213 -573 -334 24 173 -656 -232 692 174 -627 -139 791 174 -24 17 628 171
2275 171 -149 305 690 -101 -68 66 509 32 142 293 187 -267 -120 615 278 -367 -175 202 71 -682
2295 -682 -67 317 -131 -547 -137 155 -191 -303 140 -107 -299 -346 -122 -118 -640 -252 11 102 -553 -343 231
2316 231 233 -108 -87 73 30 -141 83 511 155 -125 172 523 127 -227 332 390 121 -147 620 528 26 57
2338 57 290 72 24 -229 429 153 -53 -251 208 87 -433 53 378 -208 -488 -72 97 -479 -419 107 54
2359 54 -391 -151 -93 -77 -374 -580 -29 17 -304 -198 182 -88 -326 -110 375 -18 -283 -198 332 -30 -52 183
2381 183 -25 69 106 282 260 95 93 439 -2 227 84 88 57 -123 132 229 138 -61 11 284 6 -209 -132 91
2405 91 -235 -410 -58 145 -140 -228 -104 -48 -278 -324 -98 84 -418 -240 -56 -152 -103 -300 46 18 4 -247 -311
$$ packed form
2253f47Q00po23n5Q09o4p86K39L58J49q29M24R24n18q01M88R30o17j98M1O11m57
2275A71l20M54L85p91L3J34M43m77J10J51j06m54J47P35l37o45J92L77j31p53
2295f82O15L84m48m16M10K92l46j12M43k47j92m7K24Mn22L88K63R1o55K10N74
2316B31Kl41K1J60m3j71K24M28l56k80K97L51l96l54N59N8k69k68P67r2n02L1
2338E7K33k18m8k53O58k76k06j98M59j21n20M86L25n86k80M16J69n76O0N26n3
2359E4m45K40N8J6k97k06N51M6l21J06L80k70k38K16M85l93k65Q5N30l62k2K35
2381A83k08R4L7J76k2j65kL46m41K29j43Ml1j80K55R7r1j99P2K73k78k15P7K23
2405I1l26j75L52K03k85q8J24N6k30m6K26J82n02J78J84r6M9j97L46k8j4k51o4
$$ plain form
2428 -311 -96 -72 41 -144 115 146 -10 231 182 17 -80 406 123 418 285 371 99 88 469 381 266 0
2450 0 313 219 68 -1 90 116 -213 27 -218 -118 -304 -170 -8 -58 -215 153 122 -229 -358 -337 -409 -148 -422
2473 -422 -351 -256 -216 -409 -92 -96 -168 -198 -467 -71 -10 13 -193 -26 114 114 27 -67 181 175 375 215 168 417 328 92
2499 92 12 294 338 477 129 387 380 39 172 387 84 -14 21 94 18 21 95 433 -33 -96 17 -56 -262 -340 -54
2524 -54 -128 -274 -312 -93 -338 -175 -46 44 -195 -42 -316 -88 -236 297 -256 -47 -89 39 140 100 57 172
2546 172 63 -20 -25 136 361 229 338 113 425 198 88 191 164 202 2 391 383 -291 242 315 346 -165 22
2569 22 -163 191 -97 -257 169 -361 136 -404 7 210 -217 -28 -214 -67 -282 -267 -62 -50 -505 -284 -106
2590 -106 68 -82 -112 293 56 -86 -66 -208 -250 -120 -29 -10 13 -44 173 208 -257 -29 63 123 -102 -65 302 -69
$$ packed form
2428c11K15K4J13j85K59L1j56K41m9j65r7M86k83K95j33Q6k72j1L81q8j15k66
2450@L13r4j51o9R1K6l29K40k45J00j86J34J62n0j57L68l1l51j29K1p2K61k74
2473d22P1R5M0j93L17mp2l0k69L96O1K3k06J67J40%q7r4K48oK00j60m7K49q9k36
2499I2q0K82M4J39l48K58pl41J33K15l03r8L5P3p6LP4L38m66o3J13p3k06p8K86
2524e4p4j46l8K19k45J63J29R0k39J53k74K28j48N33n53K09m2J28J01m0m3J15
2546A72j09q3nJ61K25j32J09k25L12k27j10J03k7L8k00L89qo74N33P3L1n11J87
2569B2j85L54k88j60M26n30M97n40M11K03m27J89j86J47k15J5K05J2m55K21J78
2590a06J74j50l0M05k37j42K0j42m2J30R1J9K3n7K17L5m65K28R2O0k25L7L67l71
$$ plain form
2614 -69 210 181 82 183 -84 -75 299 -22 -38 304 377 130 -122 179 52 -169 -135 141 -83 -302 -308 -29 -99 -334
2638 -334 -54 134 -17 -159 -184 -69 -393 -195 -122 -160 102 -7 85 211 -32 -381 20 239 -39 -55 149 41
2660 41 -148 96 752 235 -276 37 450 219 114 164 419 23 -374 105 269 160 -12 -60 418 -106 -147
2681 -147 474 105 -368 -167 -153 -204 -210 -84 235 -59 -307 -238 101 -262 -482 -299 151 -310 -9 -239 11 -94
2703 -94 -256 251 38 -139 -129 134 241 -419 4 229 34 -340 32 482 360 -9 282 698 299 -167 -87
2724 -87 549 28 -274 150 525 326 -203 166 563 -103 -358 276 49 -69 -239 225 -129 -279 -126 437
2744 437 264 -487 -269 149 -212 -577 -106 267 -34 -339 -250 198 -475 -279 74 239 -80 -241 -51 137
2764 137 -328 -396 67 17 -245 98 510 118 -349 18 389 275 -424 248 734 -207 8 235 442 -140 24
$$ packed form
2614f9K79k9r9J01k67RL74l21j6L42P3k47k52L01j27k21L4K76k24k19oK79p0k35
2638c34K80J88j51j42k5J15l24J98P3l8K62j09R2J26k43l49M01K19k78j6K04j08
2660D1j89K44O56n17n11L13M13k31j05N0K55l96l97M79J64j09j72m8M78n24m1
2681a47O21l69m73K01J4n1oJ26L19k94k48O9L39l63k20J83M50m61L01k30K50j05
2703i4j62N07k13j77J0K63J07o60M23K25j95l74L72M50j22l69K91M16l99m66Q0
2724h7O36n21l02M24L75j99n29L69L97o66k55O34k27j18j70M64l54j50J53N63
2744D37j73p51K18M18l61l65M71L73l01l05Q9M48o73J96L53J65l19j61J90J88
2764A37m65o8M63n0k62L43M12l92m67L67L71j14o99O72M86r41K15K27K07n82J64
$$ plain form
2785 24 249 411 -137 -210 610 512 -443 -201 326 129 -74 115 320 -122 -197 -107 610 -179 -498 -64 -30 -427
2807 -427 -782 12 118 -674 -585 -241 -42 -233 -420 43 -43 -656 0 429 328 -215 -230 363 51 -349 70
2828 70 597 -64 -205 183 471 -57 -189 192 162 233 -254 348 685 -347 -248 555 525 -285 -172 124 189 -361
2850 -361 178 671 84 -164 -267 606 -81 -438 232 344 -182 -380 2 165 -221 -365 -392 107 -363 -529
2870 -529 312 108 -358 -297 100 59 -322 111 170 5 -835 186 570 116 -136 -175 555 -48 -16 386 403 -271
2892 -271 -289 351 199 -221 -222 177 224 -67 -21 301 204 -113 -323 37 178 -159 -159 266 -206 -378 31 443 -136
2915 -136 -481 -41 30 -228 -217 134 -101 -16 71 238 197 -520 -413 202 -84 -330 -241 417 46 -434 142 -21
2937 -21 230 46 301 289 -84 -174 346 65 34 -80 189 263 -199 102 383 299 -376 147 549 -14 44 174
$$ packed form
2785B4K25J62n48p3Q20r8r55K42N27j97k03J89K05m42p5R0P17p89l19M34L4l97
2807d27l55P94J06p92Q9L44J99j91j87M63q6o13O56M29j01n43j5N93l12m00M19
2828G0N27o61j41L88K88n28j32L81l0P1m87O02L37j032R9Q03l0q10J13K96O5n50
2850c61N39M93n87k48j03Q73o87l57O70J12n26j98L82J63l86j44k7M99m70j66
2870e29Q41k04m66O1L97m1l81M33N9j65q40J021L84m54k52l9P30o03L2M02J7o74
2892b71j8O40j52m20jL99M7k91M6L22r7l17k10L60J41l37%M25m72j72M09M12n79
2915a36l45M40P1k58J1L51k35Q5Q7J67m1p17J07O15k86k46Q9O58l71m80N76j63
2937b1K51j84K55j2l73r0N20k81l1j14K69P4m62L01K81q4o75N23M02n63N8J30
$$ plain form
2959 174 207 122 -180 -152 -184 192 -280 147 173 -163 -162 107 203 -267 -527 97 -15 -231 -337 244 -178 -311 17
2982 17 96 54 -50 -45 423 60 -87 106 168 -180 -165 350 505 -30 46 116 224 -127 -42 345 155 15 127
3005 127 440 258 -165 -101 132 225 -129 28 14 -14 -319 -16 86 -231 -160 -204 35 -69 -310 70 133 -90
3027 -90 -190 -23 -108 -381 176 -29 207 -375 79 -135 -152 -165 369 42 15 143 70 48 -178 -138 56 24 -182
3050 -182 -8 196 3 7 -162 324 234 166 244 345 171 -107 346 30 -367 -199 7 21 -142 54 166 -125
3072 -125 21 -67 56 -86 281 136 -138 -15 -109 -321 -10 119 95 -166 80 42 -259 34 48 -100 -203 11
3094 11 149 -156 7 109 394 61 -293 192 -4 -128 -82 -15 -73 -1 39 365 -92 73 182 220 252 82 160
3117 160 -111 -48 -91 198 153 -29 -111 241 145 145 -122 233 -77 -82 -46 24 168 62 19 -27 180 3 88 -36 -14
$$ packed form
2959A74L3q5l02K8l2L76m72M27K6l36JK69R6m70k60O24j12k16j06N81m22j33L28
2982A7P9m2j04NM68l63j47J93O2l48J5N15J55n35P6P0J08l51Q5L87j90j40J12
3005A27L13j82m23O4K33R3l54J57j4k8l05L03J02l17P1m4K39j04k41L80O3k23
3027i0j00J67q5k73N57k05K36n82M54k14j7j3N34l27k7J28p3k2k26M0J94l2k06
3050a82J74K04j93Mj69M86r0o8P8J01j74k78M53l16l97J68K06J4j63J96J12k91
3072a25J46q8J23j42L67j45k74J23r4k12L11J29k4k61K46l8l01K93J4j48j03K14
3094A1J38l05J63J02K85l33l54M85j96j24M6O7n8P2M0L26m57J65J09L8L2j70P8
3117A60k71O3m3K89m5j82q2L52r6%k67L55l10nL6P0J44j06m3m6K07j77Q5j24K2
$$ plain form
3142 -14 -157 -124 -246 231 -272 -120 -103 27 -39 -154 -154 215 162 -82 22 -7 -105 -153 64 33 199 205 -49 154
3166 154 72 144 5 -60 145 165 90 -303 357 98 103 361 -122 133 -48 89 329 316 193 241 -74 -100 4
3189 4 -297 -113 -87 -38 76 -291 -95 52 3 234 -7 -44 -112 48 -41 -160 -268 -43 14 -72 -182 -184 -122 0
3213 0 -147 -202 88 -207 -50 23 57 -155 -110 137 174 -26 -26 19 -63 88 -30 -13 -204 127 -224 207 -92 -51
3237 -51 -58 247 -9 295 -71 -85 -292 -71 -76 62 -140 -91 -209 83 330 -318 96 -31 -71 159 19 -178 -88
3260 -88 -137 11 59 -3 189 34 17 -253 24 -114 244 6 -117 -50 -23 -217 170 -84 178 85 -110 136 -92
3283 -92 -22 43 67 -125 -40 -39 266 36 112 52 -150 -18 48 155 8 -167 -185 68 -264 -70 -187 24 -259 -134
3307 -134 66 -101 44 238 81 -50 257 142 -10 -133 178 73 12 240 35 112 96 -148 13 -358 -82
$$ packed form
3142a4j43L3j22M77n03J52J7J30o6j15%L69n3k44J04k9r8m8K17l1J66Ok54K03
3166A54q2P2j39o5K05K0p5l93O60k59NK58m83K55j81J37K40j3j23M8l15k6J04
3189Dl01J84K6M9J14l67J96J47m9K31k41l7o8J60q9j19j08K25N7q6j10kO2J22
3213@j47n5K90k95J57P3L4k12M5K47L7k00%M5q2J51j18J7j91L31l51M31k99M1
3237e1pL05k56L04l66j4k07K21nJ38k02M9j18K92K47o48M14j27m0K30j40j97R0
3260h8m9J48M8o2J92j55j7k70K77j38L58k38j23O7K7j94L87k54K62r3j95K46k28
3283i2P0O5K4j92Q5JL05k30P6o0k02J32O6J07j47j75j8K53l32J94j17K11k83J25
3307a34K00j67J45J94j57j31L07j15j52j23L11j05o1K28k05P7j6k44J61l71K76
$$ plain form
3328 -82 303 604 -37 42 57 189 -41 158 132 270 63 4 179 139 217 -104 -208 -94 -149 245 248 -36 101
3351 101 -340 65 124 -42 -114 3 -253 71 -230 200 -276 -90 61 -143 -32 -137 36 -137 -98 -284 -136
3372 -136 -260 -177 21 -48 120 205 37 1 -186 127 78 138 190 -164 257 166 -233 187 132 62 33 -17 -152 92
3396 92 89 100 99 89 2 -233 -23 -145 -121 -15 212 -334 -246 -79 355 -18 94 -144 237 118 -337 -313 16 -78
3420 -78 -31 -124 208 74 -160 -93 -222 -91 -278 153 185 -120 -109 -57 -132 -270 -50 -52 -111 -302 -183 153 203 -134
3444 -134 -10 13 -57 315 355 -71 82 340 -18 179 -145 -364 15 58 14 67 250 212 21 58 -55 -20 -270
3467 -270 131 249 -156 -236 -29 1 9 205 -13 -206 -217 -165 111 201 -74 -82 -42 -361 -212 -193 287 11 -258 153
3491 153 41 -79 -218 406 36 47 -36 75 -73 291 210 110 -41 -202 239 -9 156 59 139 336 207 -29
$$ packed form
3328h2L85L01o41P9J5J32k30J99k6J38k07n9J75m0P8l21j04J14n5L94Lk84J37
3351A01m41M05N9j66p2J17k56L24l01M30m76J86J51k04J11j05J73j73L9j86J48
3372a36j24Q3J98o9J68Q5j68l6j87L13m9O0N2l54M21r1l99M20n5p0k9n0j35K44
3396I2lJ1jj0q7k35K10j22K4J06K27n46Q8J67M34l73J12k38L81j19m55K4L29r4
3420g8M7r3L32j34k34O7j29J31j87M31L2l05J1N2p5j38K20kn9j91J19L36N0l37
3444a34J24K3p0L72M0m26J53K58l58J97l24k19L79M3m4N3J83l8j91L7j13L5k50
3467b70M01J18m05q0K07L0QJ96k18j93j1N2K76R0k75qM0l19J49J9M80k76k69M11
3491A53j12j20j39O24l70J1q3J11j48L64q1j00j51j61M41k48J65r7Q0J97j29k36
$$ plain form
3513 -29 -66 2 -136 -144 -203 101 17 -163 133 113 112 21 -148 -59 -103 -64 -212 164 -49 -109 172 -179 34 -158 73
3538 73 -68 60 -86 13 -121 172 349 73 25 -24 -64 319 46 -168 131 -65 -114 81 182 115 174 -84 286
3561 286 73 103 183 205 -42 -95 -154 84 -17 -128 -92 167 -36 -159 52 -72 -38 235 -12 36 -389 126 283
3584 283 78 -194 -96 43 -61 78 -136 167 228 -194 -46 39 -72 -208 -21 -201 24 -111 1 -100 -13
3605 -13 -101 114 87 -70 136 204 23 -168 -148 -171 87 59 200 286 -42 22 17 9 124 -17 220 200 -60 192 3
3630 3 -16 -73 63 223 -46 9 -181 -146 -189 -112 -96 2 35 -130 -179 74 48 185 -33 269 176 -188 -183 343 -98
3655 -98 48 113 -454 -46 16 -61 -124 -88 -45 187 124 -118 -8 -128 26 61 -169 203 342 52 28 -49 211 179
3679 179 -239 3 -289 -252 -17 -6 123 -58 -134 12 -31 264 -39 2 -28 -190 -137 -129 -172 90 -82 -217 -171 226
$$ packed form
3513b9l7O8j38qn9L04q4j80K96k0jr1j69Q9m4L9j48L76k13o0K81l51K13j92K31
3538G3j41J28j46R9j34K93J77k76m8m9m0L83k73k14K99j96m9J95J01o7N9k58L70
3561B86k13L0Q0K2k47n3n9K38j01j11L6K59k03j23K11j24L4K73k47M8m25N15J57
3584B83k05k72R8J39j04J39k14L03O1m22J48Q5j11j36J87j80K25j35J12j01Q7
3605a3q8K15k7j57K06O8j81j91K0k3K58k8J41Q6l28O4nqJ15j41K37k0k60K52j89
3630Cj9n7J36J60k69N5j90L5m3P7J6R8L3j65m9K53k6J37k18L02r3l64NN26m41
3655i8J46O5n67M08O2p7o3L6M3K32o3k42J10j20J54L5k30L72J39k90k4p7K60l2
3679A79m18K42k92L7K35J1J29j81p6J46m3K95l03M1l0j62N3Qm3K62j72j35M6L97
$$ plain form
3703 226 156 -251 -33 -277 275 -87 103 217 145 -181 81 202 367 -47 44 203 -12 -40 45 -3 -53 -162
3725 -162 51 34 82 -26 96 110 111 -14 -36 129 -158 -111 -103 -42 -253 -146 -26 245 153 -139 -95 -111 -179 -183 -103 -74
3751 -74 -135 -114 109 -105 -98 38 190 -231 -169 -221 -106 94 71 29 -112 23 181 142 140 -76 -39 103 115 -38 -239
3776 -239 278 -113 113 254 12 107 169 -127 86 -249 -95 -9 115 -45 251 110 204 -105 -108 1 -192 188
3798 188 116 -237 108 230 -71 -117 -21 119 -204 -121 98 -136 -41 -35 -222 128 -6 -65 -30 37 -202 313 -49
3821 -49 -149 76 54 -202 76 -25 -120 -82 -99 169 -80 -199 11 141 113 -183 70 -13 19 142 -66 163 -65
3844 -65 -28 -44 70 284 135 320 -56 102 -32 146 86 -99 120 -48 53 -331 -249 -341 -29 -144 18 -130
3866 -130 -25 -157 65 284 -46 -264 -224 -117 -76 47 411 282 -106 -121 30 -176 -26 156 218 -2 -53 -185
$$ packed form
3703B26p0m07K18k44N52l62J90J14p2l26K62J21J65m14R1J59k15k8Q5m8n0j09
3725a62K13j7M8j08J22J4Jj25k2J65k87M7QO1k11J07J20K71r2k92M4j6o8mQ0K9
3751g4o1K1K23k14PJ36J52m21O2n2J15K00k3m2j41J35J58l9kk16L7J42J2j53k01
3776b39N17l91K26J41k42R5O2k96K13l35J54Q6J24j60K96j41R4l09lJ09j93L80
3798A88p2l53L45J22l01m6R6J40l23Q3K19k34R5Oj87L50j34n9L5O7k39N15l62
3821d9j00K25k2k56K78j01r5L8j7K68k49j19K10J30k8k96K53q3L2J23k08K29k28
3844f5L7j6J14K14j49J85l76J58j34J78o0j85K19j68J01l84Q2r2L12j15J62j48
3866a30J05j32K22K19l30k18M0J07M1J23L64j29l88j5J51k06J50J82O2k20n1j32
$$ plain form
3888 -185 -46 194 336 131 -248 1 -161 32 26 40 101 188 -74 -102 201 41 -104 125 -76 -213 -38 -128
3910 -128 -1 158 -83 80 246 -211 9 -208 -25 187 -85 -271 184 -97 0 162 -202 12 -147 -72 -294
3931 -294 -251 -31 67 111 -163 -223 169 -136 283 -67 73 52 126 51 -208 63 440 -3 256 89 -123 45
3953 45 -307 -56 91 -26 -66 -70 -146 -91 71 -37 80 178 -161 -76 110 134 -16 -111 -10 41 122 -127 -12 -80
3977 -80 -127 173 -31 27 -98 178 -167 31 -215 -71 38 105 168 -46 -50 129 358 224 -68 30 56 186 136
4000 136 76 103 85 -13 -90 339 83 187 204 27 -3 -180 -250 102 -254 -29 81 27 -435 62 21 -39 65 -302
4024 -302 -293 -272 -214 -216 26 86 -93 -31 65 154 -146 -8 -271 -141 -127 2 157 -45 -331 23 137 134 -158 -199 68
4049 68 -32 273 -80 214 -49 260 51 8 226 149 62 4 -32 186 -298 331 223 -166 61 -187 187 33
$$ packed form
3888a85J39K40J42k05l79K49j62J93oJ4O1Q7k62k8L03j60j45K29k01j37J75r0
3910a28J27J59k41J63J66m57K20k17J83K12k72j86M55k81R7J62l64K14j59P5k22
3931b94M3K20R8M4k74o0L92l05M19l50J40k1P4p5k59K71L77m43K59j67k12J68
3953D5l52K51J47j17m0mp6N5J62j08J17R8l39Q5J86K4j50r5J01N1Q1k49J15o8
3977h0m7L00k04N8j25K76l45J98k46J44J09O7O3k14mJ79K29j34k92R8K6J30n0
4000A36o0K7j8r8p7M29k56J04J7j77l0j77p0L52l56K25J10n4m62M97m1o0J04l67
4024c02RK1N8kK42O0j79O2R6Q9l00J38k63J30J4J29J55k02k86L54J14lk92m1K67
4049F8j00L05l53K94k63L09k09m3K18p7q7n8l6K18m84O29j08l89K27k48L74j54
$$ plain form
4071 33 -166 305 -147 -21 7 -33 194 -210 54 -168 -106 -126 31 256 -19 -185 -173 257 28 -55 -253 75
4093 75 121 -139 -232 -304 -219 39 62 -94 -96 -87 17 -37 183 -84 25 36 -252 17 132 127 -101 133 -11 104 121
4118 121 195 313 -16 182 -136 38 193 38 75 167 -2 -1 40 12 -233 -173 -9 -184 -3 -84 -146 46 23 -237
4142 -237 -147 73 -226 -383 -62 -203 -70 -125 -145 -133 -120 388 -284 43 -49 164 110 157 96 -28 -145 82 -41
4165 -41 -55 157 -143 275 170 13 -244 55 271 -67 -269 -113 57 270 -32 -57 103 214 86 -45 226
4186 226 138 55 -22 -28 86 209 -88 -90 94 -144 -116 -126 87 105 -63 -145 -363 -193 -205 -29 146 -33 -161 -144
4210 -144 -501 215 143 232 -216 29 217 17 70 -94 -149 216 190 -31 -89 94 -286 -73 -169 303 100 121 -4
4233 -4 -174 98 63 98 -189 174 25 -25 84 73 -99 45 285 226 -174 89 -93 161 -65 47 128 -138 205
$$ packed form
4071C3j99M71m52J26K8m0K27m04K64k22O2k0J57K25k75j66J2M30k29q3j98L28
4093G5M6k60r3p2Q5K58K3j56kRJ04n4K20k67J09J1k88K69J15nk28K34j44J15J7
4118A21P4J18l29J98l18J74J55j55L7R2j69JM1k8k45O0J64j75J81q1o2J92k3k60
4142b37R0K20k99j57L21j41J33n5k0J2J3N08o72L27r2K13n4M7o1j24j17K27j23
4165d1j4K12l00M18j05j57k57K99K16l38k02J56J70K13l02k5J60J11j28j31K71
4186B26q8q3p7oJ14J23k97kJ84k38K8j0K13J8j68q2k18J70j2J76J75j79j28J7
4210a44l57P16p2Q9m48K45J88k00N3j64n5L65k6k21n8J83l80K13r6M72k03K1j25
4233dj70K72l5L5k87L63j49n0J09j1j72J44K40n9m00K63j82K54k26J12Q1k66L43
$$ plain form
4256 205 -95 -365 59 -172 91 95 -52 228 -83 234 -180 -57 -197 67 210 327 98 -237 -51 25 276
4277 276 -50 136 158 186 -43 64 241 -43 -26 316 194 -79 295 103 99 101 -89 -52 -142 76 243 126 -79
4300 -79 -17 148 38 -147 -299 141 119 42 160 -82 -142 -171 -78 -85 -200 97 -83 212 192 -158 113 -233 -223 304
4324 304 194 -228 186 -75 -326 10 88 222 48 -11 176 11 175 226 155 208 -59 5 -434 634 24 -149
4346 -149 -199 -308 126 -49 92 158 -85 133 104 84 88 25 211 -8 -106 -433 141 40 -2 -228 146 17 128
4369 128 -309 110 116 189 -313 -52 -222 -438 -310 39 129 -17 305 6 -151 -30 1 201 53 149 101 -87
4391 -87 9 77 -34 -43 54 83 -77 312 9 -55 364 48 -233 21 -19 129 85 -41 19 35 -39 401 163 -27
4415 -27 165 154 8 -190 29 -92 -207 89 -255 -45 50 -102 108 -35 201 65 -100 26 -372 -132 53
$$ packed form
4256B05l00k70M24k31K63Mj47K80l11L17m14J23j40K64J43J17k29l35J86P6K51
4277B76l26J86K2K8k29J07J77k84J7L42j22k73L74j92mKj90L7r0K18J67j17k05
4300g9O2J65j10j85j52M40k2p7J18k42o0k9R3pj15K97j80K95k0l50K71l46J0N27
4324C04j10m22M14k61k51L36P8J34j74n9J87j65J64N1p1N3k67O4m39J068o10j73
4346a49n0j09M34j75J41O6k43K18k9k0Mo3J86k19r8l27N74j01m2k26L74j29J11
4369A28m37M19OP3n02K61j70k16J28L49R0j46L22k99j57J21L1K00j48R6m8j88
4391h7R6O8j11rR7K9j60L89l03o4M19l16k81K54m0J48m4j26O0J6p4M40k38j90
4415b7J92j1j46j98K19j21j15K96l44K10R5j52K10j43K36j36j65J26l98K40J85
$$ plain form
4436 53 54 -18 148 56 191 -1 31 -1 165 48 -342 -80 -137 159 -35 -159 -10 193 51 -24 57 -181 95
4459 95 235 -176 -106 31 36 -210 -305 -125 177 17 179 -134 -216 60 -193 -270 -86 -56 148 55 -92 245 -260
4482 -260 20 344 -192 -87 146 181 -31 -196 72 209 30 -150 222 246 68 105 129 160 -132 4 -67 215
4504 215 -67 80 235 249 153 -142 52 85 -57 51 86 33 -176 -294 -48 157 211 2 173 -59 48 -150
4526 -150 -277 -7 63 -42 -62 -52 205 -121 76 -250 -78 -50 162 183 85 -260 -46 300 268 -67 -277 7
4548 7 -128 -120 -87 60 319 189 68 252 201 437 -166 31 150 26 277 -18 -71 -198 134 157 54 -53 54
4571 54 -140 134 76 -67 -183 -109 -218 -72 20 -9 68 -116 55 203 -17 -122 -5 -17 274 -74 265 -110
4593 -110 -96 -115 167 186 -50 348 35 -143 72 -91 -196 -185 -110 -28 157 83 -14 -178 154 51 -13 226 135
$$ packed form
4436E3Jp2J66r2J35j92L2l2J66j17l90K62n7K96j94j24J49K03j42p5Q1k38K76
4459I5J40m11P0J37Nk46r5J80L02j60J62l13q2K76k53p7J84L0K04r3j47L37n05
4482b60K80L24n36J05K33L5k12j65K68J37j79j80L72K4j78L7K4L1k92J36p1K82
4504B15k82J47J55J4r6k95J94L3j42J08L5n3k09j18K46K05N4k09J71k32J07j98
4526a50j27K70P0j05k0J0K57l26J97l26J72K8K12K1r8l45K14L46l2l35k10K84
4548Gj35QL3J47K59j30j21J84n1K36o03J97J19j24K51k95n3j27L32K3j03j07J07
4571E4j94K74n8j43j16P4j09J46R2k9P7j84J71J48k20j05J17j2K91l48L39l75
4593a10J4j9K82J9k36L98l13j78K15j63j05J1P5Q2J85p4r7j64L32j03o4K39r1
$$ plain form
4616 135 -184 -136 33 80 -147 -27 182 -96 228 -16 47 34 70 -272 -115 -25 -454 124 95 -53 -83 196 -66
4639 -66 -74 -46 -134 -157 -304 78 58 -50 162 -229 -162 -85 -109 -196 30 101 85 -46 53 101 -57 64 -71 -2 -36 230
4665 230 41 -85 109 -198 63 46 111 -190 80 -10 48 14 -114 -6 55 -241 -22 -126 -98 11 7 -195 134
4688 134 -27 241 203 -115 104 83 45 -149 -115 -47 -71 -282 -102 -60 -232 -208 -152 -229 83 -74 273 201 35 25
4712 25 88 -15 373 -7 -168 -168 26 -29 65 102 114 -19 -71 -18 -8 114 -162 256 86 161 -157 58 197 26
4736 26 270 111 116 -169 142 11 138 -234 -26 -197 35 248 -143 -147 -34 41 -140 56 124 56 134 54 -180
4759 -180 16 -13 -125 -152 -138 -120 -71 -94 27 -41 -180 -121 -26 119 -52 39 -186 -93 -102 39 161 155 321 17 -90
4784 -90 116 70 333 132 -2 -113 -40 -14 34 177 162 91 163 -245 -107 77 151 -188 123 150 34 65 267 161
$$ packed form
4616A35l19M8J69M7k27J20K09k78L24k44O3j3L6l42J57R0m29N78k9j48l0K79k62
4639f6qK8q8k3j47L82k0j08K12l91O7P7k4q7K26P1j6j31R9M8j58J21j35O9l4K66
4665B30j89j26J94l07K61j7O5l01K70r0N8l4j28J08O1k96K19j04K8J09mk02L29
4688A34j61K68l8l18K19k1l8j94L4O8k4k11J80M2j72K4N6p7L12j57L47p2j66j0
4712B5O3j03L88l80j61%J94n5R4L7J2j33n2N3J0J22k76M18j70P5l18K15J39j71
4736B6K44j59Nk85L11j31J27l72K08j71K32K13l91mJ13P5j81J96O8o8P8q0k34
4759a80J96k9j12k7J4J8M9k3J21o8j39N9R5J45j71R1k25R3rJ41J22oJ66l04j07
4784i0K06m6K63k01j34j11P3K6M8J43j5p1P2m08J38J84P4l39L11K7j16L1K02j06
$$ plain form
4808 161 -2 135 23 -116 -224 -217 77 -32 -100 -138 6 -245 -51 14 -167 73 24 232 -50 90 58 192
4830 192 207 10 123 15 -50 -72 -104 -195 1 109 126 32 263 -6 -182 -68 6 -275 244 122 118 -263 -52
4853 -52 -1 -118 93 188 8 15 2 95 26 -85 166 64 -137 -290 -25 10 -106 195 -151 -75 0 105 80 -67
4877 -67 -93 -176 -6 186 31 -248 7 -134 -142 -281 178 9 -31 -48 12 6 171 113 313 -107 -29 -38 -127 18 110
4902 110 254 169 -19 203 1 212 -16 51 71 5 227 -200 -261 -120 81 -11 272 -204 87 -77 -4 112
4924 112 -67 120 51 -144 20 58 59 -62 331 126 -183 -188 -55 233 -364 -217 146 209 -26 19 -49 246 -8
4947 -8 274 -12 -47 36 -223 -5 36 -248 -60 0 -219 208 -382 58 35 23 88 -215 -117 56 18 23 -87 107
4971 107 8 137 94 -13 161 -87 27 -76 -198 -27 110 -42 88 -159 -70 -32 -234 189 -75 49 -170
$$ packed form
4808A61j63J37j12j39j08PK94j09o8l8J44k51J94O5j81K40m9K08k82J40l2J34
4830A92J5j97J13j08o5k2l2r1J96J08J7r4K31k69j76J14P4k81N19j22ml81K11
4853e2N1j17K11R5j80Pj3R3o9j11K51j02k01j53K65L5j16L01l46P6P5J05k5j47
4877f7k6q3J70J92j55k79K55j41qj39M59j69m0j7O0oJ65n8K00m20P8rq9J45R2
4902A10J44q5j88K22k02K11k28O7K0o6K22m27o1J41K01r2K83m76K91j64P3J16
4924A12j79J87o9j95J64L8Jj21L93k05l09nJ33K88n97J47L63O3k35M5o8K95k54
4947hK82k86l5Q3k59K18M1k84J88O0k19M27n90M40k3j2O5l03R8J73l8Nj10J94
4971A07r9J29m3j07J74k48J14j03j22J71J37j52J30k47Q9L8k02M23k64J24k19
$$ plain form
4992 -170 -52 58 146 126 -10 20 -221 -76 -160 375 -231 83 95 126 236 -60 -108 13 210 238 128 37 48
5015 48 56 36 199 28 -122 -82 -199 -5 -298 -131 -417 123 -161 -54 -97 -140 -236 -433 92 84 113 -137 201 173
5039 173 173 -63 -60 -153 -116 -44 25 -43 -281 -28 59 17 71 -85 -211 -26 -76 86 263 102 112 7 -75 87 47
5064 47 310 32 -169 211 199 59 2 -151 -119 208 193 64 -261 -45 -155 8 170 172 86 21 -114 -115 -270 131
5088 131 -15 -540 -328 181 -382 -120 -132 -148 154 -200 -42 175 -298 -300 -110 -304 -87 -166 130 1 -115 24
5110 24 101 120 -176 237 219 13 25 -62 90 147 48 210 103 38 -78 185 97 133 11 -8 -287 -76 93 -59
5134 -59 262 108 -82 -167 247 -131 18 -104 -295 399 59 81 261 -99 -222 -353 2 -55 -122 -143 30 -135
5156 -135 68 209 -47 -235 68 -10 -172 9 86 -9 -70 -219 -87 70 206 -333 -174 -80 125 -206 177 242
$$ packed form
4992a70J18J10Q8k0j36L0k41J45q4N35o06L14J2L1J10k96m8J21J97K8j10r1J1
5015D8Qk0J63j71j50M0j17J94k93J67k86N40k84J07m3m3r6j97N25qK9k50L38k8
5039A73%k36Lr3L7P2O9o8k38K53Q7m2N4j56j26J85n0J62J77j61J0j05q2J62m0
5064D7K63k78k01L80j2j40n7j53L2L27j5j29l25K16j10J63J62Kq6o5j35jj55M01
5088A31j46n25K12N09n63K62j2j6L02l54J58K17m73kJ90j94K17p9K96j29j16J39
5110B4P7J9k96M13j8k06J2q7J52N7r9J62j07o5j16K63q8L6j22j9k79K11J69j52
5134e9L21j54j90q5M14l78J49j22j91O94l40K2J80l60j23j31L55n7o7k1J73j65
5156a35K03J41k56j88L03p8j62J81P7r5o1j49J32J57J36n39J59R4K05l31L83O5
$$ plain form
5178 242 8 -40 28 167 -13 205 135 -77 210 56 -299 46 169 194 1 29 156 -147 -90 -36 343 -83
5200 -83 64 132 -107 -47 -141 -251 295 -198 167 -8 -50 44 99 -23 49 -6 -121 5 -263 -55 -22 122 -19
5223 -19 5 53 238 -193 199 152 3 5 -12 306 202 107 207 -49 -27 -7 185 7 -20 83 155 -53 -99 41
5247 41 -154 141 160 128 134 -37 -176 -170 -42 -183 2 104 43 -212 -155 379 59 -135 15 -86 124 95 67 32
5271 32 20 -67 138 -174 -18 -24 85 -55 -88 -61 -274 -69 47 94 -64 52 143 -6 106 -224 -172 101 63 -83
5295 -83 100 -38 -192 -28 -245 -166 159 -227 34 -19 72 -8 227 151 238 161 -273 171 -130 -312 -274 -173 -127
5318 -127 56 -11 -203 80 85 -203 177 221 -120 166 -68 -10 -3 0 129 63 3 139 185 72 -71 240 -60 51
5342 51 192 159 -137 280 108 -148 -8 28 -30 -291 45 67 -81 -159 -126 185 198 12 -203 -352 -319 -222 -76
$$ packed form
5178B42k34m8O8J39j80K18p0k12K87j54l55L45J23K5j93K8J27l03N7N4L79m26
5200h3J47O8k39O0r4j10N46m93L65j75m2R4N5j22P2n5j15J26k68K08L3J44j41
5223a9K4M8J85m31L92m7j49Kj7L18j04r5J00k56K2K0J92j78k7J03P2k08m6J40
5247D1j95K95J9l2Oj71j39OJ28j41J85J02o1k55N7N34l20j94J50j01K10k9k8l5
5271C2j2q7K05l12J56oJ09j40l3K7k13K05J16M7j58J16R1j49J12l30N2K73l8j46
5295h3J83j38j54J64k17P9L25l86K61n3R1q0K35p6Q7p7m34M44l01j82L8J01M6
5318a27J83o7j92K83Nk88L80M4l41K86k34N8PLJ29o6o0J36M6j13j43L11l00J11
5342E1J41l3k96M17j72k56J40L6n8k61L36K2j48p8L3L11J3j86k15j49L3R7J46
$$ plain form
5365 -76 263 70 -43 10 46 142 72 -65 -51 -343 -138 51 60 -161 -303 37 -75 -405 43 -85 1 87 87 197
5389 197 69 118 -127 -252 -161 107 72 -106 -107 112 -2 -108 -5 74 97 39 35 52 101 152 -242 65 10 114 406
5414 406 114 -98 9 -135 71 191 91 126 99 -172 61 -247 -128 -160 157 -104 191 -4 -25 311 95
5435 95 -21 -173 -189 91 115 -35 -82 129 223 -55 -149 1 -72 312 205 268 189 -53 157 275 153 41 -94
5458 -94 -62 132 293 -84 31 373 177 79 51 353 -93 -60 158 -121 -118 -149 -296 -106 -137 5 -107 235 59
5481 59 -108 -80 -18 -89 38 113 36 -1 -71 350 -168 -285 60 32 63 -169 70 -164 -161 80 85 130 19 -230 -94
5506 -94 47 -47 122 -69 -5 101 -67 285 -69 96 366 -19 106 -58 -106 -117 -74 -163 67 -51 3 -172 169
5529 169 105 -256 -71 67 65 132 -185 -32 87 -206 80 -129 324 130 -4 -34 58 -16 -62 260 318 48 128
$$ packed form
5365g6L39j93j13N3L6R6p0j37J4k92K05J89Rk21j42L40j12l30M48j28Q6Q6%J10
5389A97j28M9k45j25R1K68l5j78jK19j14j06J03P9K3n8mJ7M9N1l94L07n5J04K92
5414D06k92k12J07j44K06J20j00L5k7k71K33l08J19l2L17k61K95j95k1L36k16
5435I5j16j52j6K80K4j50m7K11R4k78r4J50p3L84j07O3p9k42K10J18j22j12j35
5458i4L2J94J61l77J15L42j96r8k8L02m46L3K18k79Ll1j47J90l1J42j12L42j76
5481E9j67K8O2p1J27P5p7l7p0M21n18j17L45k8L1k32K39k34LK41NM5j11k49J36
5506i4J41r4J69j91O4J06j68L52l54J65K70l85J25j64m8j1M3q9K30j18N4j75L41
5529A69o4l61J85J38kO7l17J53J19k93K86k09M53j94j34l0R2p4m6L22N8k70Q0
$$ plain form
5552 128 -192 78 -44 -40 70 -196 152 -63 26 -189 -155 -127 183 123 210 -66 -54 -280 72 -84 100 -74 -177
5575 -177 -35 90 112 76 116 10 -179 -272 72 81 85 -434 62 70 -190 122 113 299 -219 109 115 -15 476 -24 -264
5600 -264 -34 2 -64 -46 -125 12 109 169 -255 -275 42 -142 79 -42 -230 -31 -219 160 66 14 17 -97 -99 -52 39
5625 39 -16 -238 -8 124 -161 133 297 -37 13 -132 -99 3 59 -71 -64 -162 115 44 113 -137 -187 -129 -97 -26 -4
5650 -4 74 198 64 -233 180 -248 -34 75 14 268 -100 -49 293 70 89 -253 -227 70 -7 134 54 -259 -160
5673 -160 85 -54 -294 209 -63 223 -53 116 146 -141 -55 41 16 -12 -146 -60 36 64 -72 1 79 -180 -124 71
5697 71 182 -83 67 138 -231 -8 46 -62 133 -63 47 -95 71 -138 -77 -62 169 -11 196 -79 185 61
5719 61 -140 35 75 157 205 18 -184 118 221 93 -63 155 -242 -8 135 -46 96 5 162 93 296 -59
$$ packed form
5552A28l20K70j22MJ10k66L48k15Q9k15L4K8L10o0Q7k76J2k26L52j56J84j74j03
5575a77J42J25K2l6M0j06j89r3L44RMn19M96Qk60L12rJ86n18L28Oj30M91n00k40
5600b64K30L6o6J8p9J37R7O0m24k0L17j84K21j21j88J99j88L79r4n2Lj14kM7R1
5625C9n5k22K30J32k85K94J64l34N0j45L3J02N6j30Pr8K77p1O9k50n0N8L2P1K2
5650dP8J24j34k97M13m28K14J09o1K54l68N1L42k23J9l42K6K97p7J41q0l13R9
5673a60K45j39k40N03k72K86k76J69L0k87Q6R6k5k8j34Q6R6K8j36P3P8k59N6J95
5697G1J11k65J50P1l69K23N4j08J95j96J10j42J66k09O1J5K31j80K07k75K64j24
5719F1k01J75M0Q2M8j87k02L02J03j28j56K18l97K34J43j81J42r1J57o9K03l55
$$ plain form
5741 -59 -206 -8 178 62 -36 154 31 -32 39 -37 -153 -118 332 -104 105 -5 -147 -66 -194 -52 -137 -131 -191 -484
5765 -484 -224 180 82 -150 -203 306 -137 238 -45 -217 281 -138 4 -87 -189 -63 -106 22 -63 203 -127 89
5787 89 70 -94 -98 -40 413 168 235 -10 66 -70 -292 -230 63 -21 89 76 176 44 -49 108 -140 -32 88 -6
5811 -6 -4 72 186 -155 106 48 -41 -51 -242 -217 26 -280 166 -230 -252 16 -103 -25 -15 97 -111 -105 -84 -68 49
5836 49 63 89 -105 -73 -191 164 220 215 -201 -124 20 154 70 -40 -90 302 184 -142 -81 -99 -21 92 -176 -375
5860 -375 337 -4 -210 24 -79 -51 -341 32 -15 -6 -147 35 -63 -139 52 175 -224 -141 45 -12 210 -49 103
$$ packed form
5741e9j47J98J86j16r8J90j23o3P1p6j16L5M50m36K09j10j42Q1j28J42q5Oo0k93
5765d84K60M04r8k32n3N09m43L75k83j72M98m19J42r1j02J26m3J28q5K66l30K16
5787H9j9j64mN8M53k45O7k45P6j36k22O2K93q4J10j3J00j32r3J57k48J08J20r4
5811fKP6J14l41K61n8q9j0j91K5K43l06M46l96k2K68j19P8J0J12k08OK1J6J17
5836D9J4K6j94L2j18L55N6nm16P7J44J34q4j10n0L92j18l26O1j8P8J13k68j99
5860c75P12l41k06K34j03K8k90L73m7Rj41J82r8p6J91J23l99Q3J86n7K22k59J52
$$ [...]
8191a6
##END NTUPLES=NMR FID
##END=
