##TITLE=1H_LR-685A-OC1-H
 D2O, 8 sc, 
 18.9.2019
##JCAMPDX= 6.0         $$ Bruker NMR JCAMP-DX V2.0
##DATA TYPE= NMR FID
##DATA CLASS= NTUPLES
##ORIGIN= UXNMR, Bruker Analytische Messtechnik GmbH
##OWNER= root
$$ XWIN-NMR		Version 3.5
$$ Wed Sep 18 14:17:31 2019 Russian Standard Time (UT+4h)  she@DPX200
##.OBSERVE FREQUENCY= 200.1315
##.OBSERVE NUCLEUS= ^1H
##.DELAY= (6, 6)
##.ACQUISITION MODE= SIMULTANEOUS
##.ACQUISITION SCHEME= undefined
##.AVERAGES= 8
##.DIGITISER RES= 18
##SPECTROMETER/DATA SYSTEM= spect
##.PULSE SEQUENCE= zg30
##.SOLVENT NAME= D2O
##.SHIFT REFERENCE= (INTERNAL, D2O, 0, 15.7039)
##AUDIT TRAIL= $$ (NUMBER, WHEN, WHO, WHERE, WHAT)
$$ ##TITLE= Audit trail, XWIN-NMR		Version 3.5
$$ ##JCAMPDX= 5.01
$$ ##ORIGIN= Bruker BioSpin GmbH
$$ ##OWNER= she
$$ F:/spectra/data/she/nmr/H-F/1/audita.txt
$$ ##AUDIT TRAIL=  $$ (NUMBER, WHEN, WHO, WHERE, WHAT)
(   1,<2019-09-18 14:16:27.23 +0400>,<she>,<DPX200>,
      <created by zg, POWCHK disabled, PULCHK disabled
       configuration hash MD5:
       00 E9 B6 7A A2 85 ED C7 34 08 36 98 17 FE 4E 26
       data hash MD5: 16K
       3D F8 33 89 2F CB 60 50 F9 45 D0 3B EE 4A 46 C2>)
$$ ##END=
$$ 
$$ hash MD5
$$ DE F8 AF 28 E3 34 12 36 AA 39 D9 F2 9A 16 FD 58
##$RELAX= 
##$RELAX= 
##$RELAX= 
##$RELAX= 
##$RELAX= 
##$RELAX= 
$$ Bruker specific parameters
$$ --------------------------
##$DU= <F:/spectra>
##$EXPNO= 1
##$NAME= <H-F>
##$PROCNO= 1
##$TYPE= <nmr>
##$USER= <she>
##$AMP= (0..31)
100 100 100 100 100 100 100 100 100 100 100 100 100 100 100 100 100 100 
100 100 100 100 100 100 100 100 100 100 100 100 100 100 
##$AQSEQ= 0
##$AQ_mod= 1
##$AUNM= <au_zg>
##$AUTOPOS= <>
##$BF1= 200.13
##$BF2= 200.13
##$BF3= 200.13
##$BF4= 200.13
##$BF5= 200.13
##$BF6= 200.13
##$BF7= 200.13
##$BF8= 200.13
##$BYTORDA= 1
##$CFDGTYP= 0
##$CFRGTYP= 5
##$CHEMSTR= <none>
##$CNST= (0..31)
1 1 145 1 1 1 1 1 1 1 1 1 1 1 1 1 1 1 1 1 1 1 1 1 1 1 1 1 1 1 1 1 
##$CPDPRG= <>
##$CPDPRG1= <>
##$CPDPRG2= <>
##$CPDPRG3= <>
##$CPDPRG4= <mlev>
##$CPDPRG5= <mlev>
##$CPDPRG6= <mlev>
##$CPDPRG7= <mlev>
##$CPDPRG8= <mlev>
##$CPDPRGB= <>
##$CPDPRGT= <>
##$D= (0..31)
0 1.2 0 0 0 0 0 0 0 0 0 0.03 0 0 0 0 0 0 0 0 0 0 0 0 0 0 0 0 0 0 0 0 
##$DATE= 1568801786
##$DBL= (0..7)
120 120 120 120 120 120 120 120 
##$DBP= (0..7)
150 150 150 150 150 150 150 150 
##$DBP07= 0
##$DBPNAM0= <>
##$DBPNAM1= <>
##$DBPNAM2= <>
##$DBPNAM3= <>
##$DBPNAM4= <>
##$DBPNAM5= <>
##$DBPNAM6= <>
##$DBPNAM7= <>
##$DBPOAL= (0..7)
0.5 0.5 0.5 0.5 0.5 0.5 0.5 0.5 
##$DBPOFFS= (0..7)
0 0 0 0 0 0 0 0 
##$DE= 6
##$DECBNUC= <off>
##$DECIM= 24
##$DECNUC= <off>
##$DECSTAT= 4
##$DIGMOD= 1
##$DIGTYP= 9
##$DL= (0..7)
0 120 120 120 120 120 120 120 
##$DP= (0..7)
150 150 150 150 150 150 150 150 
##$DP07= 0
##$DPNAME0= <>
##$DPNAME1= <>
##$DPNAME2= <>
##$DPNAME3= <>
##$DPNAME4= <>
##$DPNAME5= <>
##$DPNAME6= <>
##$DPNAME7= <>
##$DPOAL= (0..7)
0.5 0.5 0.5 0.5 0.5 0.5 0.5 0.5 
##$DPOFFS= (0..7)
0 0 0 0 0 0 0 0 
##$DQDMODE= 0
##$DR= 18
##$DS= 0
##$DSLIST= <SSSSSSSSSSSSSSS>
##$DSPFIRM= 0
$$ [...]
##$SUBNAM2= <"">
##$SUBNAM3= <"">
##$SUBNAM4= <"">
##$SUBNAM5= <"">
##$SUBNAM6= <"">
##$SUBNAM7= <"">
##$SUBNAM8= <"">
##$SUBNAM9= <"">
##$SW= 24.0689530833862
##$SWIBOX= (0..15)
0 0 2 0 0 0 0 0 0 0 0 0 0 0 0 0 
##$SW_h= 4816.95568400771
##$TD= 16384
##$TD0= 1
##$TE= 0
##$TE2= 300
##$TE3= 300
##$TEG= 300
##$TL= (0..7)
0 120 120 120 120 120 120 120 
##$TP= (0..7)
150 150 150 150 150 150 150 150 
##$TP07= 0
##$TPNAME0= <>
##$TPNAME1= <>
##$TPNAME2= <>
##$TPNAME3= <>
##$TPNAME4= <>
##$TPNAME5= <>
##$TPNAME6= <>
##$TPNAME7= <>
##$TPOAL= (0..7)
0.5 0.5 0.5 0.5 0.5 0.5 0.5 0.5 
##$TPOFFS= (0..7)
0 0 0 0 0 0 0 0 
##$TUNHIN= 0
##$TUNHOUT= 0
##$TUNXOUT= 0
##$USERA1= <user>
##$USERA2= <user>
##$USERA3= <user>
##$USERA4= <user>
##$USERA5= <user>
##$V9= 5
##$VALIST= <valist>
##$VCLIST= <CCCCCCCCCCCCCCC>
##$VD= 0
##$VDLIST= <DDDDDDDDDDDDDDD>
##$VPLIST= <PPPPPPPPPPPPPPP>
##$VTLIST= <TTTTTTTTTTTTTTT>
##$WBST= 1024
##$WBSW= 4
##$XGAIN= (0..3)
0 0 0 0 
##$XL= 0
##$YL= 0
##$YMAX_a= 420886
##$YMIN_a= -557530
##$ZGOPTNS= <>
##$ZL1= 120
##$ZL2= 120
##$ZL3= 120
##$ZL4= 120
##$ABSF1= 10
##$ABSF2= 0
##$ABSG= 5
##$ABSL= 3
##$ALPHA= 0
##$AQORDER= 0
##$ASSFAC= 0
##$ASSFACI= 0
##$ASSFACX= 0
##$ASSWID= 0
##$AUNMP= <proc_1d>
##$AZFE= 0.1
##$AZFW= 0.1
##$BCFW= 1
##$BC_mod= 2
##$BYTORDP= 1
##$COROFFS= 0
##$CY= 11.3945322036743
##$DATMOD= 1
##$DC= 2
##$DFILT= <>
##$DTYPP= 0
##$F1P= 20.1720416913024
##$F2P= 0.152960286110954
##$FCOR= 0.5
##$FTSIZE= 0
##$FT_mod= 4
##$GAMMA= 1
##$GB= 0.15
##$INTBC= 1
##$INTSCL= 1
##$ISEN= 128
##$LB= 0.24
##$LEV0= 0
##$LPBIN= 0
##$MAXI= 10000
##$MC2= 0
##$MEAN= 0
##$ME_mod= 0
##$MI= 1.114404
##$NCOEF= 0
##$NC_proc= 0
##$NLEV= 6
##$NOISF1= 3.799351
##$NOISF2= 2.8
##$NSP= 1
##$NTH_PI= 0
##$NZP= 0
##$OFFSET= 15.70392
##$PC= 1
##$PHC0= -9579.841
##$PHC1= 15.00096
##$PH_mod= 1
##$PKNL= yes
##$PPARMOD= 0
##$PSCAL= 0
##$PSIGN= 0
##$REVERSE= no
##$SF= 200.130013532006
##$SI= 16384
##$SIGF1= 3
##$SIGF2= 2
##$SINO= 400
##$SIOLD= 16384
##$SREGLST= <1H.CDCl3>
##$SSB= 0
##$STSI= 0
##$STSR= 0
##$SW_p= 3612.71676300578
##$SYMM= 0
##$S_DEV= 0
##$TDeff= 0
##$TDoff= 0
##$TI= <>
##$TILT= no
##$TM1= 0
##$TM2= 0
##$TOPLEV= 0
##$USERP1= <user>
##$USERP2= <user>
##$USERP3= <user>
##$USERP4= <user>
##$USERP5= <user>
##$WDW= 1
##$XDIM= 8192
##$YMAX_p= 0
##$YMIN_p= 0
$$ End of Bruker specific parameters
$$ ---------------------------------
##NTUPLES= NMR FID
##VAR_NAME=  TIME,          FID/REAL,        FID/IMAG
##SYMBOL=    X,             R,               I
##VAR_TYPE=  INDEPENDENT,   DEPENDENT,       DEPENDENT
##VAR_FORM=  AFFN,          ASDF,            ASDF
##VAR_DIM=   8192,          8192,            8192
##UNITS=     SECONDS,       ARBITRARY UNITS, ARBITRARY UNITS
##FACTOR=    0.0002076,     1,               1
##FIRST=     0,             0,               0
##LAST=      1.7004516,     0,               0
##MIN=       0,             -557530,         0
##MAX=       1.7004516,     420886,          0
$$ Real data points
##PAGE= N=1
##DATA TABLE= (X++(R..R)), XYDATA
$$ [...]
$$ plain form
3700 -8404 -13930 -12642 -5432 4654 12380 14184 8886 -825 -10221 -14617 -11386 -2876 7316 13783
3714 13783 13326 6042 -3463 -11642 -14166 -9616 -489 9465 14425 11944 3765 -6127 -12725 -13626 -7442
3729 -7442 2045 11157 14782 10238 1084 -8457 -13720 -12461 -5074 4993 12555 14262 8393 -1248 -10387
3744 -10387 -14161 -10796 -2354 7436 13654 13002 6052 -3773 -12110 -13815 -8948 645 9558 14108 11486
3759 11486 3462 -6104 -12964 -13162 -7039 2751 11321 14049 9566 909 -8556 -13647 -12035 -5076 5244
3774 5244 12604 13762 7970 -1640 -10084 -13838 -10541 -2043 7388 13194 12733 5328 -4356 -12067 -13504
3789 -13504 -8758 144 9608 13582 11212 3117 -6477 -13089 -12933 -6557 2966 11169 13488 9384 787
3804 787 -8389 -13253 -12157 -4020 5617 12436 13135 6998 -1554 -10210 -13742 -10324 -1502 7843 13186
$$ packed form
3700h404n526J288P210J0086P726J804n298r711r396m396L231Q510J0192O467
3714A3783m57p284r505q179k524M550R127R954M960k481q179r892o598r01O184
3729g442R487R112L625m544r154r541n263J259P387J0067P562J707n869r641r139
3744a0387l774L365Q442R790O218o52o950r825q337j705M867R593Q913M550k622
3759A1486q024r566o860j98O123R790Q570K728m483q657r465n091J612O959J0320
3774E244P360J158n792r610q444l754L297Q498R431N806m61p405r684p711j437
3789a3504M746Q902R464L974k370q095r594o612J56O376R523Q203K319m104q597
3804G87r176m864J096Q137R637O819O99o137q552q656l532L418Q822R345N343
$$ plain form
3819 13186 12188 4718 -4586 -11626 -13437 -8287 549 9734 13589 10650 3003 -6497 -12653 -12388 -5949
3834 -5949 3375 11057 13143 8913 68 -8798 -13238 -11571 -3743 5825 12369 12533 7083 -2020 -10184
3849 -10184 -13578 -9998 -930 7592 12919 11393 4567 -4317 -11511 -13094 -7976 1049 9455 13387 10259
3864 10259 2392 -7001 -12670 -12156 -5779 3607 11293 12847 8622 -58 -8886 -12990 -11206 -3317 6005
3879 6005 12475 12153 6542 -2673 -10394 -13170 -9278 -799 8037 12793 11301 4362 -4892 -11801 -12961
3894 -12961 -7370 1803 9593 13172 9679 2079 -6776 -12462 -11688 -5319 4230 11292 12711 7980 -557
3909 -557 -8908 -12891 -10463 -2795 6095 11844 12199 6028 -2561 -10489 -12816 -8665 -635 7871 12568
3924 12568 11075 3731 -4963 -11755 -12221 -6817 1526 9756 12757 9484 1771 -7029 -12097 -11359 -4537
$$ packed form
3819A3186r98p470r304p040j811N150Q836R185L855k939p647r500o156K65O439
3834e949R324P682K086m230q845q866m440J667P828R568O544J64n450r103q164
3849a0184l394L580R068Q522N327j526o826q884p194j583N118R025Q406L932l128
3864A0259p867r393n669N14O377R386P686J554m225q680q828m104J784P889R322
3879F005O470l22n611r215p721k776L892Q479Q836M756j492o939r254o909j160
3894a2961N591R173P790L579l493p600q855n686P74O369R549P062J419m731q537
3909e57q351l983K428P668Q890N749L55o171q589p928k327M151Q030Q506M697
3924A2568j493p344q694o792m66N404Q343Q230L001l273p713q800n068P38O822
$$ plain form
3939 -4537 4008 10925 12373 7915 -598 -8556 -12352 -10100 -2815 6080 11782 11637 5625 -3077 -10155
3954 -10155 -12587 -8412 -199 8145 12484 10793 3635 -5404 -11284 -11942 -6733 1785 9783 12894 9209
3969 9209 1552 -6875 -12245 -10991 -4398 4241 10953 12124 7333 -1204 -9229 -12277 -9923 -2402 6286
3984 6286 11903 11389 5512 -3138 -10490 -12111 -8115 -273 7977 12206 10376 3143 -5142 -11139 -11828
3999 -11828 -6306 2219 9441 12239 9017 1123 -7270 -12012 -10675 -4010 4493 10916 12162 7035 -1346
4014 -1346 -9007 -12315 -9459 -2021 6469 11567 11073 5064 -3429 -10332 -12063 -8007 228 8188 11986
4029 11986 9875 2647 -5369 -11343 -11678 -6141 2173 9510 12181 8284 770 -7051 -12137 -10276 -4038
4044 -4038 4483 10583 11609 6663 -1236 -8579 -11950 -9214 -1632 6370 11282 10766 4717 -3375 -9909
$$ packed form
3939d537Q545O917J448m458q513p958l796K252P285Q895N702j45o012q702p078
3954a0155k432M175Q213Q344M339j691p158r039n880o58N209Q518P998L111l685
3969I209p657q427n370J254O593Q639O712J171m791q537q025l048K354P521Q688
3984F286N617n14n877q650p352j621L996P842Q250M229j830p233q285n997o89
3999a1828N522Q525P222K798l222p894q393m742J337O665Q503O423J246n127q381
4014a346p661l308K856P438Q490N098m94o009q493o903j731M056Q235P960L798
4029A1986k111p228q016n974l35N537Q314P337K671l897p514p821n086J861O238
4044d038Q521O100J026m946p899p343l371K736P582Q002M912n16o049q092o534
$$ plain form
4059 -9909 -11709 -7834 203 8192 11392 9948 2689 -5443 -10803 -11281 -5757 2490 9670 11895 8379
4074 8379 533 -7351 -11714 -10295 -3673 4897 10423 11029 6625 -1547 -8748 -11722 -8992 -1268 6146
4089 6146 11274 10462 4509 -3503 -9731 -11423 -7197 564 7903 11547 9446 2475 -5435 -10732 -10854
4104 -10854 -5459 2740 9386 11495 7786 388 -7543 -11545 -9837 -3549 4901 10243 11230 6160 -1686
4119 -1686 -8784 -11651 -8516 -1090 6595 11027 10412 4207 -3809 -10119 -11315 -6905 891 8460 11677
4134 11677 8862 2153 -5665 -10503 -10502 -5101 2999 9370 11168 7500 -3 -7256 -10886 -9295 -2975
4149 -2975 4740 10570 10647 5699 -1773 -8740 -11305 -8194 -852 6419 10894 9830 4033 -4130 -10209
4164 -10209 -10959 -6727 998 8237 11145 8649 1633 -5945 -10783 -10170 -4863 2929 9552 11034 7040
$$ packed form
4059i909j800L875Q037P989L200j444p259q132n360m78N524Q247P180K225l516
4074H379p846p884m363J419O622Q570N526O06m404q172p201k974K730P724P414
4089F146N128q12n953q012o228j692M226P761P339L644k101o971p910n297j22
4104a0854N395Q199O646K109l709p398p931m002J708O288Q450N342R87n070p846
4119a686p098k867L135P426P685M432o15o205q016o310j196M410P796P569L217
4134A1677k815o709p818m838JN401Q100O371J798l668p503p253l630J591O320
4149b975P715N830P7m948p472o967k565L111P342P271M475j064n797q163o079
4164a0209p50M232P725P239K908k496p016p578m838O13N307P792O623J482l994
$$ plain form
4179 7040 -104 -7466 -10924 -9051 -2501 5368 10597 10763 5236 -2500 -8719 -11058 -7842 -527 6803
4194 6803 10838 9232 3322 -4195 -9683 -10724 -6218 1497 8122 10988 8278 1375 -5843 -10735 -9927
4209 -9927 -4164 3595 9650 10859 6534 -458 -7360 -10792 -8930 -2230 5291 10519 10267 5003 -2495
4224 -2495 -8780 -10798 -7422 -281 6894 10436 9086 3165 -4277 -9740 -10243 -5886 1749 8380 10571
4239 10571 7970 1314 -5861 -10187 -9631 -3857 3909 9238 10360 6151 -552 -7740 -10778 -8460 -2136
4254 -2136 5442 10214 9468 4891 -2589 -8756 -10926 -6973 -27 6916 10493 8844 2844 -4672 -9729
4269 -9729 -10015 -5301 2001 8064 10468 7644 1086 -6110 -10271 -9165 -3692 3672 9285 10183 6259
4284 6259 -1122 -7838 -10856 -8210 -1772 5568 9676 9277 4310 -2844 -8866 -10376 -6559 39 7153
$$ packed form
4179G040p144p362l458J873O550P869N229J66n527p736o219k339L216P315P330
4194F803M035j606n910p517n488j041M506P715O625K866k710o903p218m892Q08
4209i927N763P759O055J209m325o992o902l432J862O700P521N228k52n264p498
4224b495o285k018L376P141P175L542j350n921p442n463n03M357P635O631K191
4239A0571k601o656p175m326N56N774P766N329J122m209o703p188l038K318O324
4254b136P578M772p46m577p480o167k170L953O946O943L577j649o000p516n057
4269i729k86M714P302O063K404k824o558p196m161J106N473P364N613Q98l924
4284F259p381o716l018K646O438P340M108l99m967p154o022j510L817O598P114
$$ plain form
4299 7153 10361 8357 2294 -4861 -9910 -9705 -4886 2156 8101 10485 7372 673 -6590 -9889 -8883
4314 -8883 -3318 4117 9023 9966 5784 -1395 -7981 -10429 -7484 -1183 5304 10005 9622 4081 -3429
4329 -3429 -8735 -10001 -6284 772 7089 10242 8197 2398 -4739 -9644 -9549 -4624 2475 8188 9942
4344 9942 6985 44 -6230 -10242 -8831 -3165 4102 9372 9516 5654 -1639 -7819 -9940 -7457 -1211
4359 -1211 5697 9751 8855 3843 -3594 -8603 -9824 -5788 600 7223 10169 8015 1802 -5283 -9718
4374 -9718 -9141 -4275 2556 8354 9730 6611 248 -6646 -10088 -8368 -2823 4087 9102 9232 5029
4389 5029 -1834 -8089 -10004 -6987 -1075 5820 9700 8760 3106 -3261 -8676 -9392 -5436 556 7246
4404 7246 9683 7699 1505 -5168 -9403 -8920 -4075 2643 8264 9892 6071 55 -6722 -9511 -7976
$$ packed form
4299G153L208k004o063p155n049K05M819P042N945K384l113o699p263l299J006
4314h883N565P435M906R43m182p179o586k448K945O301O487M701l83n541p510
4329c429n306j266L717P056O317L153k045n799p137m905R5M925P099N713J754
4344I942k957o941o274m012J411N666P267N270J44l862p293o180k121K483O246
4359a211O908M054q96n012p437n009j221M036O388O623K946k154o213p085m435
4374i718N77M866O831N798J376l119o363o894l442J720N545O910N015J30m203
4389E029o863o255j915L017N912O895L880r40n654o367n415p16L956N992O690
4404G246K437j984o194o673m235M83M845O718N621J628l821o016o777k789J535
$$ plain form
4419 -7976 -2679 4189 9030 9256 4755 -2077 -7668 -9686 -6748 -488 5569 9613 8381 2975 -3668
4434 -3668 -8570 -9414 -5395 817 7127 9529 7410 1173 -5442 -8986 -8655 -4097 3021 8070 9444
4449 9444 5896 -835 -6594 -9487 -7504 -1905 4752 9240 8846 4369 -2168 -7508 -9403 -6358 18
4464 18 5856 9284 8159 2644 -3779 -8592 -9000 -5248 1062 7089 9603 6780 859 -5062 -9243 -8323
4480 -8323 -3421 3334 8318 9401 5375 -816 -6519 -9462 -7874 -1990 4758 8970 8531 4047 -2686
4495 -2686 -7750 -9246 -6199 -50 6196 8955 7725 2411 -4084 -8609 -8990 -4828 1925 7513 9299
4510 9299 6308 771 -5575 -9046 -7795 -3363 3771 8284 9005 5165 -999 -6771 -9076 -6730 -1286
4525 -1286 5125 8637 8282 3826 -3089 -7777 -9010 -5614 425 6507 9054 7397 2320 -4306 -8555
$$ packed form
4419g976N297O868M841K26m501o832n591k018K938O260O057M044j232n406o643
4434c668m902q44M019O212O310K402k119o237o615l544L31M558P118N049J374
4449I444l548o731n759k893J983N599O657M488l94m477o537n340j895L045O376
4464A8N838L428j125n515o423m813m08L752O310O027K514k823n921n921m181R20
4480h323M902O755M984J083m026o191n703k943J588N884O748M212m39m484o733
4495b686n064j496L047O149O246K759j230n314o495m525l81M162O753N588J786
4510I299k991n537o346l471J251M432P134M513P21l840o164n772k305K346N444
4525a286O411L512l55m456o915m688j233L396O039O082K547j657n077o626m249
$$ plain form
4540 -8555 -8868 -4119 2198 7514 8856 6054 494 -5585 -8941 -7992 -2759 3825 8313 8482 5214 -1336
4556 -1336 -6861 -9403 -6831 -865 4981 8624 8100 3361 -2987 -7798 -9009 -5547 520 6266 8990
4571 8990 7301 1922 -4372 -8557 -8421 -4011 2169 7095 8730 5933 372 -5900 -9216 -7472 -2257
4586 -2257 4063 8221 8482 4663 -1441 -6781 -8992 -6386 -934 5067 8916 7808 3249 -2968 -7757
4601 -7757 -8876 -5045 533 6320 8952 7013 1903 -4357 -8451 -8277 -3821 2345 7516 8913 5679
4616 5679 -268 -5817 -8622 -7072 -2405 3925 7874 8222 4419 -1892 -6914 -8722 -6377 -702 5167
4631 5167 8512 7434 2846 -3249 -7861 -8460 -5194 1101 6230 8601 6396 1287 -4671 -8196 -7842
4646 -7842 -3830 2639 7424 8262 5376 -147 -5955 -8741 -7084 -1871 3907 8221 7956 4005 -1733
$$ packed form
4540h555l13M749O317N316J342k802n560o079l356R49N233O584M488J69l268o550
4556a336n525k542K572N966N846L643n24m739o348m811j211L462O067N746K724
4571H990j689n379o294m185J36M410O180M926J635k797n561o272l316J744N215
4586b257O320M158K61l819o104n340k211K606N452O001L849j108m559o217m789
4601g757j119L831N578N787K632j939n110o260m094J74M456O166N171J397l234
4616E679n947n549k805J550M667O330L949L48l803o311n022j808K345N675N869
4631E167L345j078m588o095m612n99L266O295N129K371k205n109n958l525L54
4646g842M012O469M785Q38k886n523n808k786J657N213N778M314k65l951n738
$$ plain form
4661 -1733 -7088 -8489 -5952 -183 5494 8466 7372 2569 -3288 -7491 -8193 -4570 1478 6604 8611
4676 8611 6651 1055 -4995 -8287 -7585 -3389 2660 7383 8436 5350 -333 -5827 -8631 -6868 -1799
4691 -1799 4126 7690 7800 3935 -2057 -6948 -8524 -5540 -127 5375 8371 6959 2625 -3349 -7873
4706 -7873 -8549 -4474 1593 6688 8305 6158 900 -4434 -8105 -7368 -3170 2766 7308 8050 4902 -779
4722 -779 -5621 -8293 -6372 -1960 4039 7609 7682 3913 -1934 -6798 -7927 -5658 -78 5327 7931 6917
4738 6917 2268 -3476 -7748 -7753 -4156 1570 6666 8370 6138 657 -4849 -8147 -7584 -2683 2927 7585
4754 7585 7973 4920 -650 -6097 -8254 -6414 -1338 4338 7640 7521 3428 -2361 -6991 -8056 -5260
4769 -5260 -1 5275 8059 6800 1966 -3718 -7583 -7487 -4019 1745 6532 7992 5700 435 -5095
$$ packed form
4661a733n355j401K537N769N677K972j094m803n857m203p02L623O048N126K007
4676H611j960n596o050l292P02M196O049M723J053l086n683n494k804J763N069
4691a799N925L564J10l865n992m891j576K984N413N502K996j412m334n974m524
4706g873o76M075O067N095J617k147n258n334l671P37M198N936M542P42l148n681
4722g79m842k672J921M412N999L570P3l769n847m864j129K269N580N405K604j014
4738F917m649n744m272nL597N726N096J704k232n481n506l298N63M901N610M658
4754G585L88l053n570n447k157J840N076N676L302j19m093n789m630j065K796
4769e260N259N276K784j259m834n684l865R6L468N764M787J460k292n265n530
$$ plain form
4784 -5095 -7897 -7029 -2507 3328 7115 7574 4659 -959 -5961 -8411 -6044 -920 4545 7514 6982 3386
4800 3386 -2551 -6846 -7733 -4975 297 5462 8067 6404 1845 -3919 -7559 -7379 -3865 1773 6360
4815 6360 8135 5441 77 -4705 -7393 -6793 -2542 3214 7395 7713 4446 -860 -6301 -7771 -5721
4830 -5721 -1042 4666 7668 7155 2738 -2684 -6624 -7862 -4853 741 5629 7693 6186 1439 -3926
4845 -3926 -7263 -7157 -3570 1670 6335 7608 5251 152 -5319 -7992 -6453 -1996 3141 6904 7724
4860 7724 4175 -1252 -5946 -7818 -5595 -623 4507 7677 6942 3036 -2573 -6871 -7316 -4642 556
4875 556 5570 7864 5950 1574 -4030 -7392 -7322 -3395 1930 6381 7827 5144 -83 -5073 -7552 -6317
4891 -6317 -1771 3540 6855 7363 3909 -1415 -6342 -7692 -5357 -430 4548 7390 6613 2783 -2689
$$ packed form
4784e095k802Q68M522N835L787M59k915n618n002k450K367N124N465K969n32l596
4800C386n937m295q87K758N272N165K605j663m559n764l640J80L514N638M587
4815F360J775k694n364m782k688O00M251N756M181L18l267n306n441j470K050
4830e721M679N708L002n13m417n422l940j238L009N594M888K064j507m747n365
4845c926l337J06L587N240M665J273k357n099n471k673J539M457N137L763Q20
4860G724l549n427m694j872K223M972N130L170p35l906n609m298m45K674N198
4875E56N014K294j914m376n604l362P0L927N325M451J446k683n227m990k479J235
4891f317M546N311L315N08l454n324m927j350K335M927M978K842p77l830n472
$$ plain form
4906 -2689 -6783 -7372 -4196 1027 5967 7738 5758 1233 -3883 -7165 -6728 -3203 2078 6635 7626 5087
4922 5087 -273 -5214 -7550 -6365 -1579 3701 6899 7064 3423 -2091 -6088 -7462 -4887 -333 4646
4937 4646 7419 6368 2273 -2927 -6970 -7179 -3800 1448 5785 7552 5334 965 -4237 -7216 -6505
4952 -6505 -3080 2657 6476 7275 4361 -423 -5290 -7670 -5813 -1385 3748 7033 6862 3217 -2211
4967 -2211 -6465 -7340 -4758 -260 4932 7329 5838 1781 -3127 -6852 -6641 -3453 1255 5770 7469
4982 7469 5254 598 -4528 -7207 -6198 -2517 2676 6425 6843 4307 -664 -5223 -7324 -5521 -1165
4997 -1165 3898 6854 6600 2933 -2215 -6088 -7233 -4834 329 5061 7152 5920 1747 -3177 -6607
5012 -6607 -6835 -3609 1496 6058 7065 5229 573 -4558 -7070 -6106 -2227 2643 6452 6971 3868 -985
$$ packed form
4906b689m094n89L176N223M940J771j980m525n116l282M37L525N281M557R91k539
4922E087n360m941k336J185M786N280L198J65l641n514l997j374K575M554M979
4937D646K773j051m095n200m043k09L379N248M337J767k218m369n202k979P11
4952f505L425N737L819P99k914m784m867k380J857M428N133L285j71l645n428
4967b211m254q75K582M498N192K397j491m057m908l725K11L188M708M515J699
4982G469k215m656n126k679J009L681N193L749M18k536m971m559k101J803M356
4997a165N063K956k54l667n148l873j145K399N163M732K091j232m173m924l430
5012f607k28L226N105M562J007j836m656n131k512R64L879M870L809N19l103m853
$$ plain form
5028 -985 -5457 -7150 -5568 -846 3910 7018 6658 3068 -2035 -6030 -7216 -4130 695 4901 6852
5043 6852 5727 1493 -3400 -6786 -6467 -3275 1495 5911 6922 5038 505 -4667 -6947 -6256 -2040
5058 -2040 2786 6242 6722 3945 -844 -5445 -7294 -5453 -932 3863 6838 6300 2743 -2300 -6122
5073 -6122 -6746 -3919 450 4929 7020 5625 1371 -3589 -6572 -6511 -3249 1793 5843 6833 4903 -40
5089 -40 -4597 -7006 -5855 -1981 2728 6365 6789 3729 -1311 -5516 -6995 -4973 -447 4073 6680 6294
5105 6294 2669 -2830 -6225 -6588 -4206 732 4637 6835 5386 1149 -3562 -6440 -5794 -2981 1775
5120 1775 5645 7001 4573 174 -4786 -6577 -5598 -1790 2828 6021 6499 3659 -1865 -5565 -6712
5135 -6712 -4703 -575 4168 6582 5847 2581 -2473 -6250 -6279 -3968 677 5117 6758 5359 666 -3566
$$ packed form
5028i85m472j693J582M722M756L108l60l590n103l995j186L086M825M206J951
5043F852j125m234m893l386L19L192M770M416J011j884m533n172k280O91M216
5058b040M826L456M80k777m789m601j849J841M521M795K975n38l557n043l822
5073f122o24K827M369M479K091j395m254m960k983O1L262N042M050R90j930m943
5089d0m557k409J151L874M709L637M24l060n040m205j479K022M526M520K607l86
5105F294l625n499l395l63K382M938L905K198j449m237m711k878O46K813M756
5120A775L870J356k428m399m960j791R79L808M618L193M78k840n524l700j147
5135f712K009M128M743K414p35l266n054l777k9K311M645M440J641j399m693m232
$$ plain form
5151 -3566 -6118 -5945 -2793 2024 5992 6623 4042 -592 -4498 -6615 -5293 -1551 3287 6493 6358 3072
5167 3072 -1731 -5190 -6343 -4697 -681 4320 6701 5899 1677 -2748 -6460 -6488 -3590 1190 5145 6796
5183 6796 4975 357 -3689 -6348 -6024 -2424 2314 5748 6369 4099 -775 -4747 -6537 -5126 -1312
5198 -1312 3269 6460 5806 2707 -1802 -5434 -6619 -4514 57 4508 6611 5426 1785 -2715 -6262
5213 -6262 -6351 -3431 1366 5310 6662 4623 336 -4112 -6085 -6053 -1997 2336 5766 6213 3759 -815
5229 -815 -4736 -6170 -4830 -991 3409 6305 5939 2743 -1806 -5442 -6428 -4151 384 4462 6334 5195
5245 5195 1610 -2716 -5943 -6116 -2910 1501 5294 6416 4525 484 -3917 -6382 -5334 -2259 2587
5260 2587 5729 6100 3416 -604 -4783 -6553 -4706 -1077 3508 6228 5667 2295 -1857 -5516 -6494 -3935
$$ packed form
5151c566k552J73L152M817L968O31k581m634l906k117J322L742M838L206j35l286
5167C072m803l459j153J646M016N001K381q02m222m425l712k8K898M780L955J651
5183F796j821m618m046k659L24L600M738L434O21k270m874l972j790J411L814
5198a312M581L191o54l099m509l632j185K105M571M451K103j185l641m500l547
5213f262q9K920M797L944J352k039m287m448j973L2M056M333L430M47k454m574
5229h15l921j434J340L839M400K896l66l196m549l636r86K277M535M078J872j139
5245E195l585m326l227j73L206M411L793J122j891m041m401k465J048L075M846
5260B587L142L71k684m020m179j770J847L629M585K720n61l372m152l659r78K559
$$ plain form
5276 -3935 636 4080 6313 5040 1224 -2925 -6153 -6055 -2676 1616 5279 6266 4472 225 -4159 -6262
5292 -6262 -5280 -1821 2593 5827 6077 3513 -998 -4701 -6448 -4769 -487 3499 5973 5643 2254 -1998
5308 -1998 -5512 -6128 -3969 380 4490 6348 5009 1311 -3276 -5919 -5913 -2822 1702 5118 6244 4130
5324 4130 -171 -4135 -6082 -5320 -1838 2597 5927 5700 3110 -1238 -4814 -5891 -4447 -775 3720
5339 3720 6227 5449 1923 -2153 -5410 -6169 -3347 775 4459 6186 4908 975 -3282 -6023 -5852 -2480
5355 -2480 1621 5469 6009 3983 -123 -4109 -6235 -5021 -1411 2873 5745 5848 2920 -1292 -4801
5370 -4801 -6125 -4298 -136 4009 5944 5028 2168 -2331 -5306 -5888 -3411 873 4355 5930 4800
5385 4800 708 -3363 -5634 -5219 -2595 1603 5322 5713 3920 -57 -4345 -5971 -4771 -1470 2868
$$ packed form
5276c935M571L444K233j273l816m149l228R8L379M292L663R87j794m247m384k103
5292f262R82L459M414L234K50k564m511l703j747J679M282L986K474l30l389m252
5308a998l514o16K159M349M110J858j339l698m587k643OL091M524L416J126k114
5324D130m301l964j947P62L482M435L330k27k590m348l576j077J444L672M495
5339C720K507p78l526m076l257p59K822M122L684J727j278l933m257k741J71L372
5355b480M101L848N40k026m106l986k126J214L610M284K872J03k928m212l509
5370d801j324J827M162M145J935r16k860m499k975n82K477M284L482J575j130
5385D800m092m071k271M15K624M198L719L91j793l977m288j626J200L301M338
$$ plain form
5400 2868 5632 5796 3021 -1236 -5137 -5969 -4169 -45 3779 5953 5244 2035 -2314 -5456 -5673 -3399
5416 -3399 903 4644 5827 4506 789 -3289 -5733 -5376 -2373 1975 5069 5826 3874 -124 -4168
5431 -4168 -5717 -4600 -1269 2736 5473 5363 2741 -1243 -4708 -6016 -4023 -118 3721 6003 4870
5446 4870 1662 -2592 -5550 -5327 -3055 645 4668 5680 4456 862 -3461 -5713 -5333 -2159 2041
5461 2041 5048 5731 3482 -541 -4268 -5707 -4677 -1045 2831 5554 5548 2717 -1489 -5073 -5549 -3513
5477 -3513 -60 3814 5906 4975 1658 -2551 -5214 -5385 -3020 1032 4374 5747 4137 345 -3217
5492 -3217 -5668 -5007 -1939 2320 5093 5790 3390 -732 -4046 -5799 -4508 -1080 3048 5509 5430 2456
5508 2456 -1464 -4716 -5474 -3263 -46 3665 5613 4604 1231 -2542 -5418 -5370 -2929 1202 4615 5406
$$ packed form
5400B868K764J64k775m257l901q32J800M124L824K174p09l209m349l142k17K274
5416c399M302L741J183j321l717m078k444L57L003M348L094P57j952l998m044
5431d168j549J117L331M005K737j10k622l984l465j308J993L905L839K282j133
5446D870l208m254k958K23K272L700M023J012j224l594m323k252L80L174M200
5461B041L007O83k249m023l727j439J030L632L876K723ok831m206l584m76K036
5477c513L453L874K092r31l317m209k663j71K365M052L342J373j610l792l562
5492c217k451O61L068M259K773O97k400m122l314j753J291L428M128K461p9k974
5508B456l920l252p58K211L217L711J948j009l373l773k876M8K441M131L413P91
$$ plain form
5524 5406 4024 429 -3286 -5680 -5204 -1715 1698 4956 5456 3293 -603 -4012 -5505 -4545 -512 3066
5540 3066 5460 5107 2295 -1633 -4865 -5595 -3526 -21 4129 5755 4572 1096 -2702 -5161 -5327 -2781
5556 -2781 1619 4331 5381 3868 422 -3492 -5515 -4795 -2025 2374 4857 5564 2790 -691 -4203
5571 -4203 -5257 -4112 -739 3049 5188 4940 2356 -1481 -4933 -5408 -3150 276 3734 5827 4576
5586 4576 1206 -2583 -5164 -5025 -2670 1272 4598 5333 3948 151 -3683 -5456 -4679 -1416 2540 5177
5602 5177 5281 2698 -1027 -4268 -5633 -3795 -709 3043 5125 4877 2231 -1962 -4806 -5164 -3246 635
5618 635 3588 5515 4343 1066 -2636 -5130 -4925 -2345 1313 4616 5324 3702 -190 -3423 -5403 -4476
5634 -4476 -1272 2375 4901 5003 2820 -1076 -4193 -5464 -3979 -241 3318 5404 5012 1696 -2040
$$ packed form
5524E406j382l595l715k394M76L489L413L258N00k163l896l409j493R60M033L578
5540C066K394l53k812l928l232p30K069L505M150J626j183l476l798k459j66K546
5556b781M400K712J050j513l446l914k023P20K770M399K483P07k774l481l512
5571d203j054J145L373L788K139k48k584l837l452m75K258L426L458K093j251
5586D576l370l789k581J39K355L942L326P35j385l797l834j773P77L263L956K637
5602E177J04k583l725l241j365J838L086L752K082k48k646m193k844l58J918L881
5618F35K953J927j172l277l702k494K05K580L658L303P08j622l892l233j980R27
5634d476L204L647K526J02k183l896l117j271J485L738L559K086l92l316l736
$$ plain form
5649 -2040 -4986 -5083 -2877 654 3840 5393 4071 962 -2671 -5162 -5172 -2318 1446 4695 5245 3430
5665 3430 -310 -3471 -5409 -4595 -1379 2308 4926 4992 2595 -1099 -3951 -5289 -3887 -465 3300 5067
5681 5067 4943 1549 -1754 -4605 -4966 -3022 562 3993 5391 4196 561 -2767 -5027 -4880 -2229 1514
5697 1514 4658 5273 3455 -61 -3316 -4982 -4174 -1115 2561 4664 4993 2308 -921 -4114 -5137 -3470
5713 -3470 -351 3448 4999 4550 1528 -2405 -5031 -5148 -2943 945 3922 5451 3767 371 -2897
5728 -2897 -4893 -4878 -2033 1668 4593 5021 2769 -452 -3428 -5056 -4059 -921 2547 5103 4987 2078
5744 2078 -1366 -4123 -5248 -3600 -102 3328 4903 4495 1554 -2146 -5053 -4879 -2449 955 4015
5759 4015 4859 3763 474 -3261 -5060 -4396 -1746 1913 4446 4778 2949 -528 -3559 -5029 -3778 -1086
$$ packed form
5649b040k946r7K206L531L186J553j322l109l633k491j0K854L764L249N50j815
5665C430l740l161j938Q14L216L687K618O6k397l694k852j338J402L422L765J767
5681E067j24l394l303k851l61J944L584L431J398j195l635l328k260J47K651L743
5697A514L144O15j818l516l255j666Q08L059L676K103L29k685l229l193j023J667
5713c470L119L799J551m49l022l933k626j17K205L888K977J529j684l396l268
5728b897j996J5K845L701K925M28k252l221k976j628R97L138L468K556j16k909
5744B078l444k757j125J648L498L430J575m08k941l700k907J74K430L404L060
5759D015Q44j096l289l735j799O64K650L659K533L32j829l477l031j470J251K692
$$ plain form
5775 -1086 2766 4929 4391 2315 -1765 -4407 -4760 -3085 187 3711 5102 4115 1001 -2421 -4472 -4530
5791 -4530 -2510 1101 3979 4867 3807 194 -3038 -4815 -4328 -1500 1791 4214 5096 2980 -746 -3953
5807 -3953 -4710 -3912 -538 2501 4960 4640 2254 -1504 -4326 -4985 -3049 105 3433 5130 3605 1121
5823 1121 -2428 -4642 -4634 -2460 1014 3886 5090 3241 -18 -3083 -4712 -4321 -1677 1849 4489 4822
5839 4822 2720 -712 -3845 -4758 -3704 -484 2680 4865 4564 1811 -1734 -4349 -4586 -3076 144 3342
5855 3342 4826 4165 1002 -2505 -4581 -4530 -2356 1090 3997 4935 3262 238 -3056 -4809 -4073 -1696
5871 -1696 1856 4328 4341 2577 -515 -3666 -4627 -3559 -536 2998 4576 4423 1738 -1358 -3975 -4873
5887 -4873 -2980 420 3514 4718 3696 975 -2203 -4683 -4667 -2167 1294 3980 4828 3229 147 -3231
$$ packed form
5775a086L852K163n38k076m080k642l53J675L272L524J391r87l114l422k051n8
5791d530K020L611K878Q88j060l613l232j777M87K828L291K423Q82k116l726l207
5807c953p57P98L374L039K459l20k386l758k822o59J936L154L328J697j525k484
5823A121l549k214QK174L474K872J204j849l259l065j629L91K644L526K640L33
5839D822k102l432l133r13J054L220L164K185l01k753l545k615k37J510L220L198
5855C342J484o61l163l507k076N1K174L446K907R38j673l024l294j753P36K377
5871a696L552K472J3j764l092l151r61J068L023L534J578j53k685l096k617q98
5887d873J893L400L094J204j022k721l178k480J6K500L461K686Q48j599l082l378
$$ plain form
5903 -3231 -4807 -4100 -1176 2217 4775 4423 2585 -825 -3643 -4536 -3413 -397 2760 4822 4158 1521
5919 1521 -1744 -4048 -4881 -2493 476 3172 4468 3793 573 -2666 -4514 -4521 -2215 1320 3836 4407
5935 4407 2883 -297 -3223 -4969 -3823 -1054 2112 4413 4644 2370 -855 -3913 -4684 -3385 -549
5950 -549 2861 4788 4025 1357 -1783 -4187 -4760 -2616 297 3298 4618 3435 557 -2484 -4549 -4231
5966 -4231 -2042 1398 3974 4397 2911 -196 -3467 -4647 -3421 -802 2335 4333 4178 2305 -1260
5981 -1260 -3688 -4463 -3244 -73 3204 4299 4118 1259 -1980 -4080 -4209 -2458 968 3500 4509 3116
5997 3116 380 -2436 -4410 -3967 -1725 1263 4055 4543 2714 -502 -3018 -4461 -3719 -786 2485 4230
6013 4230 4325 1634 -1069 -3652 -4509 -3139 -302 3257 4487 4272 1021 -1980 -3901 -4225 -2346 932
$$ packed form
5903c231j576P07K924L393K558l52j838l410k818q93J123L016L157K062o64k637
5919A521l265k304q33K388K969K696J296o75l220l239j848pK306L535K516N71
5935D407j524l180k926j746J146K769L166K301K31k274l225l058p71J299K836
5950e49L410J927p63k668l140k404n73K144K913L001J320j183k878l041k065L18
5966d231K189L440K576M23j486l107l271j180J226K619L137J998j55j873l565
5981a260k428p75J219L171L277J095j81k859l239k100j29J751L426K532J009j393
5997C116k736k816j974M43K242K988K792M88j829l216k516j443P42K933L271J745
6013D230R5k691k703k583q57J370K837L559J230k15l251l001j921l24J879L278
$$ plain form
6029 932 3719 4488 3180 396 -2771 -4445 -4071 -1514 1853 3970 4405 2657 -456 -3410 -4573 -3561
6045 -3561 -681 2509 4086 4071 1847 -1189 -3799 -4451 -2915 -30 2852 4434 3397 879 -2111 -4154
6061 -4154 -3900 -2248 937 3340 4450 3011 35 -2636 -4332 -3784 -1435 1626 3922 4208 2363 -608
6077 -608 -3033 -4305 -3187 -688 2391 4467 3927 1716 -1149 -3629 -4385 -2868 272 3230 4303 3485
6093 3485 1148 -2154 -3930 -3969 -1860 1102 3724 4464 3059 -9 -2657 -4112 -3629 -1205 1970 4454
6109 4454 4329 1908 -666 -3373 -4367 -3204 -153 2585 4376 3867 1499 -1558 -3725 -4076 -2645 370
6125 370 3145 4203 3435 578 -2298 -4092 -3873 -1559 1187 3988 4262 2723 -100 -2829 -4226 -3742
6141 -3742 -1179 1877 4131 4191 1964 -942 -3246 -4314 -2797 -302 2624 4254 3430 1516 -1611 -3796
$$ packed form
6029I32K787P69j308k784l167j674L74K557L367K117M35j748l113k954j163J012
6045c561K880L190J577j5k224l036k610o52J536K885K882J582j037k518k990k043
6061d154K54J652L185K403J110j439k976k671j696N48K349L061K296K86j845k971
6077f08k425j272J118K499L079K076n40k211k865k480p56J517L140K958J073q18
6093C485k337l302j776l9K109K962K622P40j405l068k648j455M83K424L175K484
6109D454j25k421k574k707r94J163L051K738J791n09k368l057k167l51J431L015
6125C70K775J058p68k857k876j794K19K314K746K801K74j539k823k729j397M84
6141c742K563L056K254O0k227k906k304j068J517K495K926J630q24j914l127k185
$$ plain form
6157 -3796 -4224 -2468 455 2930 4130 3210 605 -2109 -3912 -3787 -1778 1528 3764 4515 2677 -128
6173 -128 -2930 -4260 -3619 -840 2020 3613 3920 1809 -868 -3333 -4197 -2798 6 2981 3934 3445
6189 3445 977 -1958 -3809 -4150 -2249 754 3535 4234 3212 418 -2407 -4078 -3543 -1732 1696 3582
6205 3582 4049 2377 -465 -2856 -4172 -3331 -641 2217 4190 4025 1872 -931 -3468 -4048 -2795 165
6221 165 2662 4105 3313 1114 -1722 -3513 -4037 -2136 680 3572 3889 3136 226 -2430 -4024 -3684
6237 -3684 -1439 1421 3722 3670 2023 -502 -2661 -4184 -3137 -696 2311 3860 3516 1872 -1168 -3316
6253 -3316 -3939 -2731 25 2858 4188 3402 1141 -1623 -3812 -3796 -2124 1030 3303 3754 3054 253
6269 253 -2349 -4208 -3514 -1148 1760 3231 3742 2171 -411 -3059 -4133 -3259 -667 2236 3823 3694
$$ packed form
6157c796m28J756K923K475J200r20k605k714j803J25K009L306K236P51j838k805
6173a28k802j330O41K779K860J593L07k111k677k465q64J399K804K975R53m89
6189C445k468k935j851l41J901L003K781O99j022k794k825j671N35J811L428J886
6205C582M67j672k842k391j316Q41K690K858J973j65k153k803k537n80J253K960
6221A65K497J443p92k199k836j791n24J901K816K892L17p53k910k656j594L40
6237c684K245K860K301n2j647k525k159j523J047K441L007J549l44j644l040k148
6253c316o23J208K756K833J330p86k261k764k189J6J672L154K273M51p00k801
6269B53k602j859O94K366K908J471N11j571k582k648j074Q74K592K903J587j29
$$ plain form
6285 3694 1838 -1314 -3204 -3911 -2321 350 2768 4132 3439 990 -1998 -3829 -3674 -1697 898 3166
6301 3166 3987 2570 154 -2679 -3924 -3229 -1166 1707 3352 3734 2157 -660 -3166 -3961 -2730 -327
6317 -327 2016 3789 3535 1215 -1213 -3340 -3807 -2227 352 2756 3766 3212 774 -1975 -3514 -3573
6333 -3573 -1886 859 3089 3891 2494 54 -2583 -3974 -3094 -1277 1581 3714 3681 1936 -666 -2954
6349 -2954 -3694 -2867 -351 2290 3408 3255 1459 -1472 -3410 -3768 -2390 -73 2727 4049 3192 804
6365 804 -2150 -3611 -3273 -1736 1127 3041 4171 2525 12 -2870 -3816 -3088 -962 1753 3539 3520
6381 3520 1820 -621 -2981 -3842 -2643 -378 2260 3556 3204 1031 -1429 -3353 -3693 -2003 425 2801
6397 2801 3671 2464 555 -2120 -3605 -3395 -1559 1359 3219 3788 2226 -13 -2556 -3537 -3234 -763
$$ packed form
6285C694j856l152j890p07J590K671K418J364o93k449k988j831J55J977K595K268
6301C166Q21j417k416k833j245O95K063K873J645L82j577k817k506p95J231K403
6317c27K343J773k54k320k428k127m67J580K579K404J010n54k438k749j539n9
6333c573J687K745K230Q02j397k440k637j391Q80J817K858K133l3j745k602k288
6349b954p40Q27K516K641J118j53j796k931j938l58J378K317K800J322q57k388
6365H04k954j461L38J537K863J914J130j646k513k882r46P28K126K715J786j9
6381C520j700k441k360q61J199K265K638J296l52k173k460j924l40J690K428K376
6397B801Q70j207j909k675j485K10J836K918J860N69j562k239k543r81L03K471
$$ plain form
6413 -763 1745 3440 3686 1771 -900 -2860 -3684 -2532 -162 2452 3933 3276 1123 -1353 -3222 -3478
6429 -3478 -2095 528 2711 3825 2680 277 -2203 -3844 -3460 -1376 1371 3306 3688 2235 -97
6444 -97 -2720 -3587 -2813 -768 1743 3658 3360 1585 -837 -2835 -3691 -2529 64 2351 3655 3070 892
6461 892 -1421 -3434 -3391 -1867 689 2699 3569 2741 353 -2142 -3488 -3358 -1492 1543 3213 3739 1997
6478 1997 -123 -2360 -3522 -2914 -499 1692 3336 3235 1471 -802 -2877 -3876 -2156 372 2402 3738
6494 3738 2877 1149 -1512 -3213 -3280 -1846 751 2992 3729 2298 346 -2105 -3629 -3082 -1414 1269
6510 1269 3030 3183 2233 -577 -2486 -3614 -2687 -700 1896 3575 3430 1491 -971 -3068 -3245 -2260
6526 -2260 171 2461 3417 2658 770 -1770 -3534 -3349 -1993 748 2774 3386 2154 242 -2157 -3519
$$ packed form
6413g63K508J695K46j915k671j960q24J152K370K614J481o57k153k476j869k56
6429c478J383K623K183J114j145k403k480j641L84K084K747J935L82j453k332
6444i7k623q67P74K045K511J915k98j775k422j998q56J162K593K287J304n85k178
6461H92k313k013M3J524K556K010Q70q28k388k495j346J30J866L035J670N26j742
6478A997k120k237j162O08K415K191J644j01j764k273k075r99J720K528K030J336
6494C738q61j728k661j701o7J434K597K241P37j431j952k451j524N47J668K683
6510A269J761J53r50k810j909j128R27J987K596J679j45j939k462k097j77R85
6526b260K431K290R56p59j888k540j764J85J356K741K026O12j232j912k399j362
$$ plain form
6542 -3519 -3039 -1125 1331 3223 3460 1777 -402 -2727 -3573 -2430 -286 2097 3182 3015 1442 -1129
6558 -1129 -3029 -3562 -2211 191 2502 3469 2945 917 -1850 -3474 -3184 -1577 820 2823 3707 2478
6574 2478 -238 -2172 -3414 -2731 -955 1715 3102 3016 1477 -390 -2484 -3301 -2458 -325 1971 3363
6590 3363 3189 1667 -1133 -3071 -3301 -1940 396 2661 3404 2453 832 -1543 -3330 -3210 -1560 889
6606 889 2910 3380 2463 63 -2171 -3561 -2933 -987 1453 3101 2974 1534 -706 -2746 -3346 -2223
6622 -2223 -393 2125 3262 2957 1293 -1186 -3068 -3337 -2068 238 2563 3303 2554 493 -1730 -3264
6638 -3264 -3252 -1419 762 2876 3099 1932 53 -2051 -3265 -2449 -618 1506 2906 2743 1648 -623
6654 -623 -2642 -3160 -2211 -323 2091 3330 2595 634 -1328 -2825 -3086 -1632 538 2486 3411 2663 160
$$ packed form
6542c519M80J914K456J892K37j683k179k325q46J143K144K383J085j67j573k571
6558a129j900n33J351K402K311R67n24k028k767j624K90J607K397K003Q84j229
6574B478k716j934j242O83J776K670J387q6j539j867k094q17Q43K133K296J392
6590C363j74j522k800j938k30J361K336K265P43r51j621k375j787J20J650K449
6606H89K021M70r17k400k234j390O28J946K440J648j27j440k240k040o00J123
6622b223J830K518J137l05j664k479j882k69J269K306K325P40p49k061k223j534
6638c264J2J833K181K114K23j167j879k104j214Q16J831K124J400j63j095k271
6654f23k019n18R49J888K414J239p35j961j962j497k61J454K170J948R25p48k503
$$ plain form
6671 160 -1798 -3054 -2935 -1226 1161 2675 3122 2197 -11 -2510 -3269 -2273 -574 1537 2967 2927 1501
6688 1501 -685 -2523 -3310 -2198 -30 2200 3315 2693 975 -1378 -2932 -3110 -1925 656 2388 3322
6704 3322 2184 276 -1927 -3113 -2785 -1019 1042 2815 2994 1647 -366 -2190 -3027 -2410 -484 1405
6720 1405 2937 2792 1307 -938 -3063 -2886 -1889 97 2318 2937 2547 644 -1395 -3091 -2815 -1624
6736 -1624 694 2505 3125 2394 145 -1804 -3071 -2859 -1210 1142 2853 2826 1557 -363 -2031 -3218
6752 -3218 -2173 -353 1618 3191 2757 981 -924 -2472 -3107 -1835 67 2014 3036 2584 760 -1631
6768 -1631 -3069 -2919 -1537 835 2703 3273 1948 42 -1950 -3150 -2903 -680 1219 2783 3173 1493
6784 1493 -677 -2584 -3015 -2412 -267 1790 3232 2636 965 -659 -2466 -3072 -1631 119 2351 2932
$$ packed form
6671A60j958j256J19J709K387J514M47r25k208k499p59R96J699K111J430m0j426
6688A501k186j838p87J112K168K230J115o22j718k353j554j78J185K581J732R34
6704C322j138j908k203j186L28J766K061J773J79j347k013j824q37O17J926J889
6720A405J532j45j485k245k125J77R97J986K221O19l90j903k039j696K76J191
6736a624K318J811O20p31k249j949j267K12J649K352J711k7j269j920j668j187
6752c218J045J820J971J573m34j776j905j548o35J272J902J947J022m52j824k391
6768a631j438J50J382K372J868N70j325j906j992j200K47K223J899J564L90j680
6784A493k170j907m31O03K145K057J442n96j671j624j807o06J441J750K232N81
$$ plain form
6800 2932 2344 603 -1608 -2913 -2795 -1224 796 2492 3039 1845 -205 -2074 -2885 -2423 -584 1213
6816 1213 2671 2891 1472 -439 -2272 -2875 -2199 -196 2029 2950 2734 976 -1047 -2578 -2858 -1664
6832 -1664 577 1907 2827 2294 512 -1501 -3171 -2687 -1388 857 2306 2785 1958 -186 -2086 -2983
6848 -2983 -2604 -780 1176 2843 2762 1322 -691 -2458 -2745 -2103 7 1892 2980 2475 1028 -974
6864 -974 -2925 -3039 -1625 452 2080 2865 2188 486 -1913 -3019 -2663 -1293 892 2235 2818 1830 -76
6881 -76 -1885 -3026 -2444 -757 1207 2965 2860 1571 -334 -2462 -2775 -1856 -251 1793 3078 2371 829
6898 829 -708 -2452 -2780 -1438 328 2339 3108 2044 212 -1789 -2801 -2387 -983 1038 2168 3020
6914 3020 1861 31 -2238 -2986 -2148 -694 1544 2884 2718 1112 -750 -2338 -3113 -1880 -45 1980
$$ packed form
6800B932n88j741k211j305J18J571K020J696N47j194k050j869q11M62J839J797
6816A213J458K20j419j911j833o03O76K003K225R21k16j758k023j531k80J194
6832a664K241J330R20n33j782k013j670M84J299K245J449M79q27k144j900q97
6848b983L79J824J956J667q1j440k013j767k87O42K110J885J088n05j447k002
6864i74j951j14J414K077J628P85o77j702k399j106L56J370K185J343N83r88j906
6881g6j809j141N82J687J964J758j05j289j905k128l13R19J605K044J285p07j542
6898H29j537j744l28J342J766K011P69j064j832k001j012M14J404K021J130Q52
6914C020j159j830k269p48Q38J454K238J340j66j606j862j588p75J233J835K025
$$ plain form
6930 1980 2746 2132 766 -1376 -2507 -2566 -1333 492 2255 2924 2075 338 -1926 -3011 -2469 -1164 1025
6947 1025 2505 2627 1476 -38 -1902 -2558 -2263 -274 1494 2736 2727 1035 -813 -2385 -2930 -1620 16
6964 16 1825 2743 2448 980 -1424 -2549 -2471 -1284 561 2195 2956 2118 216 -1508 -2814 -2280 -927
6981 -927 1199 2448 2723 1471 -484 -1973 -2831 -2131 -610 1738 2727 2341 1143 -791 -2258 -2730 -1941
6998 -1941 167 1891 2683 1986 976 -1104 -2551 -2618 -1512 624 2222 2700 1975 3 -1610 -2526 -2473
7015 -2473 -955 1298 2413 2608 1571 -220 -2095 -2630 -2159 -481 1441 2583 2438 1148 -796 -2477
7031 -2477 -2488 -1833 55 1831 2621 2177 601 -1329 -2481 -2620 -1228 623 2186 2520 1727 24 -2113
7048 -2113 -2909 -2029 -534 893 2372 2753 1821 -441 -2054 -2714 -2108 -54 1715 2454 2241 679 -988
$$ packed form
6930A980P66o14j366k142j131n9J233J825J763O69q49j737k264j085N42J305K189
6947A025J480J22j151j514j864o56K95J989J768J242rj692j848j572n45J310J636
6964A6J809R18k95j468k404j125P8J187J845J634P61q38j902j724j306N34J353
6981i27K126J249K75j252j955j489q58P00J521K348R89l86j198j934j467m72P89
6998a941K108J724P92o97j010k080j447o7J106K136J598M78p25j972j613r16N3
7015b473J518K253J115J95j037j791j875n35M71J678J922J142j45j290j944j681
7031b477j1O55J888J776P90m44j576j930j152j39J392J851J563L34p93j703k137
7048b113p96Q80J495J427J479L81r32k262j613o60O06K054J769P39k13j562j667
$$ plain form
7065 -988 -2476 -2709 -1767 79 1993 2416 2126 488 -1278 -2348 -2507 -1176 528 2194 2536 1925 66
7082 66 -1850 -2676 -2119 -428 1081 2468 2425 1426 -703 -2126 -2613 -1522 -147 1600 2586 2188 939
7099 939 -962 -2229 -2689 -1558 303 1884 2737 2064 437 -1291 -2621 -2468 -952 765 2238 2508
7115 2508 1621 -252 -1733 -2862 -2095 -959 1162 2389 2458 1047 -420 -2135 -2676 -1798 -160 1522
7131 1522 2649 2294 730 -880 -2376 -2379 -1608 66 1860 2584 1873 542 -1307 -2570 -2568 -1112 739
7148 739 2425 2234 1711 -396 -1935 -2580 -2065 -542 1443 2479 2316 1116 -330 -1994 -2630 -1781 234
7165 234 1993 2599 2314 784 -1051 -2489 -2208 -1098 430 1647 2331 1739 333 -1241 -2692 -2199 -931
7182 -931 933 2093 2539 1244 -283 -1612 -2541 -1860 -457 1437 2310 2266 1464 -609 -2288 -2317 -1635 -87
$$ packed form
7065i88j488k33R42J846J914M23k90j638j766j070j59J331J704J666L42o11j859
7082F6j916q26N57J691J509J387m3r99k129j423m87J091J375J747R86l98j249
7099I39j901j267m60J131J861J581Q53o73j627j728j330J53J516J717J473K70
7115B508q87j873j481j129P67J136K121J227O9j411j467j715n41Q78J638J682
7131A522J127l55j564j610j496lP71J674J794P24p11j331j849j263KJ456J851
7148G39J686j91n23k107j539o45N15J523J985J036j63j200j446j664o36Q49K015
7165B34J759O06k85j530j835j438K81J110J528J217O84n92j406j574j451M93J268
7182i31J864J160M46j295j527j329r29O81J403J894Q73m4q02k073j679k9O82J548
$$ plain form
7200 -87 1871 2477 2356 1039 -1099 -2288 -2333 -1359 452 2031 2390 1689 67 -1646 -2280 -1991 -822 868
7218 868 2395 2562 1508 -273 -1784 -2462 -1689 -494 1398 2590 2267 1073 -723 -2088 -2313 -1408 74
7235 74 1568 2372 2110 525 -1271 -2369 -2421 -1205 334 2091 2477 1598 96 -1605 -2270 -2041 -772
7252 -772 742 2143 2150 1470 -299 -1861 -2565 -1815 -202 1404 2571 2246 1100 -740 -1980 -2403 -1486
7269 -1486 14 1566 2242 1797 645 -1106 -2371 -2270 -1160 403 1888 2204 1551 -22 -1563 -2146
7285 -2146 -2013 -831 945 2324 2178 1568 -182 -1937 -2310 -2063 -497 1363 2322 2072 957 -775 -2086
7302 -2086 -2447 -1477 27 1650 2398 2098 741 -953 -2167 -2378 -1033 510 2228 2401 1756 132 -1531
7319 -1531 -2633 -1773 -829 1003 1897 2233 1319 -514 -1548 -2496 -1819 -253 1480 1968 1958 992 -839 -1903
$$ packed form
7200h7J958O06j21j317k138j189m5R74J811J579L59p01j622j713o34K89J169J690
7218H68J527J67j054j781j511o78P73J195J892J192l23j194j796j365k25R05J482
7235G4J494Q04k62j585j796j098n2J216J539J757L86q79j502j701o65K29J269
7252g72J514J401Po80j769j562p04P50J613J606J167l25j146j840j240m23R17
7269a486J500J552O76m45j152j751j265J01J110J563J485L16o53j573j541n83
7285b146J33J182J776J379j46o10j750j755l73K47J566J860R59k50j115j732j311
7302b086l61R70J504J623P48l00j357j694j214k11J345J543J718J73o45j624j663
7319a531j102Q60R44J832Q94L36r14j833j034r48O77J566J733M88j0r66j831j064
$$ plain form
7337 -1903 -2058 -1331 -35 1690 2247 1648 428 -1105 -2012 -2111 -1295 465 1568 2288 1603 -150 -1531
7354 -1531 -2651 -1915 -821 725 2243 2222 1102 -604 -1852 -1776 -1758 -114 1430 2186 2028 866 -894
7371 -894 -1840 -2468 -1626 468 1634 2352 1672 414 -1196 -2174 -1931 -1050 461 2069 2382 1207 -9
7388 -9 -1855 -2230 -1876 -831 1023 2143 2133 1073 -215 -1636 -2153 -1310 -30 1506 2070 1807 931 -935
7406 -935 -2104 -1756 -1108 609 1742 2204 1730 366 -1321 -2299 -2024 -1017 521 1919 2315 1547 167
7423 167 -1650 -2252 -1951 -243 979 1962 2096 643 -461 -1952 -2471 -1576 -296 1800 2388 1948 780
7440 780 -1111 -1822 -1928 -1072 439 1683 2343 1661 27 -1109 -2231 -2228 -671 583 1982 2499 1268
7457 1268 -150 -1326 -2124 -1515 -179 1239 1837 1984 944 -799 -1914 -2064 -1469 22 1337 2276 1850
$$ packed form
7337a903j55P27J296J725N57n99j220j533r07r9Q16J760J103P20o85j753j381
7354a531j120P36J094J546J518k1j120j706j248P6J8J644J544P56j58j162j760
7371h94r46o28Q42K094J166P18o80j258j610r78K43Q81J511J608L13j175j216
7388ij846l75L54J045J854J120j0j060j288j421n17Q43J280J536N64k63q76j866
7406i35j169L48O48J717J133M62m74j364j687r78K75J007J538J398L96p68j380
7423A67j817o02L01J708J222R83J34j453j104j491n19Q95J280K096N88m40j168
7440G80j891p11j06Q56J511J244O60o82j634j136j122LJ557J254J399N17j231
7457A268j418j176p98O09J336J418N98J47j040j743j115j50N95J491J315R39m26
$$ plain form
7474 1850 561 -931 -1832 -1975 -931 328 2070 2181 1529 116 -1500 -2012 -1846 -592 1055 1910 2149
7491 2149 1232 -219 -1600 -2327 -1638 -231 1118 2268 2062 859 -748 -1825 -2069 -1416 173 1667
7507 1667 2029 1602 252 -1158 -2123 -2130 -762 735 1624 2060 1389 37 -1340 -2180 -1910 -597 943 1815
7525 1815 2008 960 -381 -1617 -2091 -1638 -245 1119 2063 1767 703 -712 -2037 -1987 -1244 171 1521
7542 1521 1825 1541 425 -1413 -1800 -1797 -726 497 1493 2174 821 47 -1213 -1751 -1820 -631 1019 1971
7560 1971 1932 1206 -181 -1677 -2376 -1445 6 917 2200 1723 891 -878 -1759 -2273 -1104 268 1451
7577 1451 2190 1734 546 -1088 -2143 -2047 -653 442 1955 1761 1575 89 -1535 -1754 -1683 -430 818
7594 818 1904 1952 852 -541 -1742 -1997 -1394 -119 1309 1894 1733 711 -616 -1622 -1928 -1142 -170
$$ packed form
7474A850j289j492r01j43J044J259J742J11o52j413j616n12J66J254J647Q55K39
7491B149r17j451j381p27O89J407J349J150k06j203j607j077k44O53J589J494
7507A667L62m27j350j410r65pJ368J497Q89M36o71j352j377q40K70J313J540Q72
7525A815J93j048j341j236m74M53J393J364R44k96j064j415j325N0P43J415J350
7542A521L04k84j116j838l87LJ071J223R96O81j353p74j260n38o9J189J650R52
7560A971l9p26j387j496o99R31J451R11J283m77q32j769q81n14J169J372J183
7577A451P39m56j188j634j055R6J394J095J513j94j86j486j624k19P1J253J248
7594H18J086M8j100j393j201k55O03J275J428N85j61j022j327j006l06P86R72
$$ plain form
7611 -170 1489 1756 1779 133 -1113 -1754 -1869 -808 534 1807 2118 1236 -156 -1550 -1858 -1231 -356 990
7629 990 1841 1800 850 -773 -1793 -1928 -1287 142 1155 2056 1733 642 -722 -1685 -1720 -932 644 1715
7647 1715 1923 1391 145 -1101 -2029 -1991 -763 792 1648 1880 1417 -33 -1569 -2168 -1455 -315 990
7664 990 2107 1783 996 -168 -1960 -2039 -1371 -108 1328 1769 1754 621 -792 -1783 -1765 -1237 325 1594
7682 1594 2158 1595 260 -1235 -1777 -2078 -393 938 1933 2141 1358 -125 -1355 -1923 -1565 -484 1091
7699 1091 1821 1920 873 -457 -1398 -1864 -1234 -142 1565 1945 1548 72 -759 -1816 -1959 -847 350
7716 350 1646 2037 1093 38 -1165 -1587 -1677 -543 576 1597 1977 942 -58 -1528 -1858 -1423 -416
7733 -416 840 1784 1587 517 -522 -1397 -2013 -1130 18 1224 1854 1724 369 -1168 -1781 -1797 -941 211
$$ packed form
7611a70J659K67K3j646j246o41j15J061J342J273L11q82j392j394l08O27Q75J346
7629I90Q51m1r50j623j020j35O41J429J013R01l23j091j364r63l5P88J576J071
7647A715K08n32j246j246r28L8J228J555Q56K32m63j450j536n99P13J140J305
7664I90J117l24p87j164j792p9O68J263J436M41j5j133j413r91J8N28J562J269
7682A594N64n63j335j495n42l01J685J331R95K08p83j483j230n68L58J081J575
7699A091P30R9j047j330r41m66O30J092J707L80l97j476q31j057j43J112J197
7716C50J296L91r44j055j203m22r0J134J119J021L80j035j000j470l30M35J007
7733d16J256R44j97j070j039q75o16Q83J148J206O30j30j355j537o13j6Q56J152
$$ plain form
7751 211 1521 1818 1458 360 -1272 -2026 -1703 -500 808 1699 1955 741 -288 -1220 -1820 -1480 -36
7768 -36 1110 1875 1574 607 -385 -1968 -1562 -937 116 1496 2062 1485 333 -1033 -1696 -1539 -984 347
7786 347 1722 1919 1271 117 -1052 -1902 -1534 -504 433 1755 1952 1148 -415 -1359 -1894 -1165 -97 994
7804 994 2005 1665 694 -568 -1616 -1701 -1241 294 1317 1730 1527 144 -856 -1659 -1760 -964 450 1591
7822 1591 1888 1172 -185 -1113 -1798 -1473 -438 937 1814 1588 808 -426 -1454 -1595 -1435 -263 1043
7839 1043 1501 1672 464 -589 -1750 -1424 -991 169 1125 1800 1554 244 -896 -1607 -1638 -798 475 1328
7857 1328 1602 1280 59 -1176 -1590 -1509 -413 875 1603 1790 814 -287 -1309 -1465 -1373 -211 938 1799
7875 1799 1792 554 -691 -1748 -1605 -930 179 1628 1603 1101 144 -961 -1730 -1592 -697 531 1543 1710
$$ packed form
7751B11J310K97l60j098j632p54L23J203J308Q91K56j214j029r32o00L40J444
7768c6J146P65l01r67r92j583M06O25J053J380N66n77j152j366o63J57N55J331
7786C47J375J97o48j154j169q50L68J030R37J322J97q04j563r44n35P29J068J091
7804I94J011l40r71j262j048q5M60J535J023M13k03j383j000q03j01P96J414J141
7822A591K97p16j357r28o85L25J035J375Q77k26p80j234j028j41J60J172J306
7839A043M58J71j208j053j161L26M33J160R56O75k46j310j140p11l1Q40J273Q53
7857A328K74l22j221j235m14Q1J096J288P28J87r76j101j022j56R2J162J149Q61
7875A799pj238j245j057J43O75J109J449k5n02r57j105p69J38Q95J228J012J67
$$ plain form
7893 1710 1477 -42 -1441 -1477 -1393 -589 1109 1669 1682 980 -432 -1411 -1723 -1264 69 852 1558 1549 312
7912 312 -501 -1609 -1619 -772 237 1093 1589 1200 221 -866 -1765 -1389 -930 823 1706 1711 1039 -177 -1264
7931 -1264 -1910 -1457 -382 905 1751 1526 966 -680 -1461 -1739 -1030 111 1089 1432 1346 233 -795 -1428
7949 -1428 -1767 -951 332 1274 1624 1295 87 -991 -1775 -1572 -758 717 1459 1536 967 -302 -1417 -1937
7967 -1937 -1573 -283 967 1707 1498 728 -458 -1286 -1793 -977 252 1094 1730 1499 401 -716 -1642 -1592
7985 -1592 -742 482 1289 1617 1046 -120 -1200 -1796 -927 -272 595 1614 1801 891 -356 -1473 -1491 -1291
8003 -1291 -130 919 1853 1609 512 -535 -1409 -1557 -1011 25 1051 1749 1431 107 -968 -1828 -1748
8020 -1748 -839 404 1400 1637 1126 -57 -1109 -1508 -1318 -534 500 1623 1755 969 -243 -1151 -1574 -1179
$$ packed form
7893A710k33j519j399l6Q4Q04J698N60J3p02j412r79l12M59J333P83P06rj237
7912C12q13j108j0Q47J009Q56M96l89r79j087q99L76M59J753Q83No72j216j087
7931a264o46M53J075J287Q46k25n60j646p81k78P09J141R78L43q6j113j028o33
7949a428l39Q16J283R42L50l29j208j078p84K03Q14J475P42P7n69j269j115n20
7967a937L64J290J250P40k09p70j186q28n07Q16J229Q42O36k31j098j117r26N0
7985a592Q50J224Q07L28n71j166j080n96Q69O55Q67J019J87r10j247j117j8K00
8003a291J161J049R34k44j097j047q74j48N46J036J026O98l18j324j075q60Q0
8020a748R09J243R96K37n11j183j052l99J90P84J034J123J32p86j212r08m23L95
$$ plain form
8038 -1179 -54 863 1868 1519 683 -707 -1184 -1751 -879 -55 1395 1431 955 414 -730 -1495 -1197 -586
8056 -586 490 1754 1660 1126 272 -1081 -1540 -1649 -131 703 1682 1505 767 -420 -1365 -1868 -1051 -245 955
8075 955 1806 1479 437 -933 -1468 -1702 -598 65 1128 1742 1294 26 -1165 -1484 -1682 -725 680 1327
8093 1327 1365 1043 -190 -1209 -1432 -1353 -315 801 1599 1375 801 -504 -1260 -1698 -1056 -212 1052 1635
8111 1635 1215 539 -873 -1492 -1550 -875 221 1239 1615 1259 123 -1007 -1252 -1498 -626 542 1524 1477
8129 1477 1127 -318 -1167 -1399 -1233 -91 881 1472 1229 415 -416 -1161 -1459 -735 166 1076 1277 1337 370
8148 370 -724 -1382 -1261 -512 238 1167 1401 1089 359 -1136 -1477 -1423 -793 548 1500 1800 908 -162 -959
8167 -959 -1319 -1060 -267 660 1513 1378 496 -483 -911 -1711 -802 -119 974 1826 1337 264 -608 -1616 -1325
$$ packed form
8038a179J125R17J005l49q36j390m77n67Q72Q24J450L6m76n41j144p65K98O11
8056e86J076J264r4n34q54j353m59j09J518Q34R79j77p38j187r45n03Q17Q06J200
8075I55Q51l27j042j370n35k34J104O63J063O14m48j268j191l19j98R57J405O47
8093A327L8l22j233j019k23P9J038J116P98k24n74j305p56m38O42Q44J264N83
8111A635m20o76j412o19n8O75J096J018L76l56j136j130k45k46Q72J168R82m7
8129A477l50j445q49k32J66J142R72N91k43q14q31p45k98P24R01R10K01O0r67
8148C70j094o58J21P49P50R29K34l12p30j495l41N4O30J341R52L00q92j070p97
8167i59l60K59P93R27Q53j35q82r79m28q00R09O83J093Q52m89j073q72j008K91
$$ plain form
8186 -1325 -457 476 1141 1466 1021
8191 1021
$$ packed form
8186a325Q68R33O65L25m45
8191A021
$$ Imaginary data points
##PAGE= N=2
##DATA TABLE= (X++(I..I)), XYDATA
$$ plain form
0 0 0 0 0 0 0 0 -8 8 -8 8 -12 16 -16 24 -32 32 -41 48 -59 72 -80 96 -110 124 -147 164 -188 214 -241 273
30 273 -306 344 -386 429 -480 534 -592 660 -730 809 -899 991 -1100 1217 -1349 1499 -1666
47 -1666 1860 -2080 2339 -2648 3021 -3484 4075 -4858 5962 -7612 10369 -15834 30847 -158401
61 -158401 -557530 -311046 40007 168307 115001 195843 277938 121721 -218165 -363294 -233176
72 -233176 -41086 57051 178622 324393 294576 -9537 -324048 -371529 -182205 13789 142454
83 142454 247898 283881 139942 -112006 -266636 -246530 -160387 -56456 124481 333344 346331
94 346331 78801 -235021 -318154 -195729 -73030 4872 145416 309018 288402 28763 -243825
105 -243825 -309911 -200730 -62848 71834 223613 303660 191447 -58676 -248036 -266774
$$ packed form
0@%%%%%%qJ6j6J6k0K8l2M0n6O4p3Q9j07J31j52J76k06K34k71L11l52M02m55N14
30B73n79O50p30Q15r09J014j126J252j390J539j708J890k091K317k566K848l165
47a666L526l940M419m987N669o505P559q933J0820j3574J7981k6203M6681j89248
61a58401l99129K46484L51053J28300n3306Q0842Q2095j56217l39886j45129J30118
72b33176J92090R8137J21571J45771k9817l04113l14511m7481J89324J95994J28665
83A42454J05444L5983j43939k51948j54630K0106Q6143J03931J80937K08863J2987
94C46331k67530l13822q3133J22425J22699P7902J40544J63602k0616k59639k72588
105b43825o6086J09181J37882J34682J51779Q0047j12213k50123j89360j8738
$$ plain form
115 -266774 -171729 -42441 110722 252532 279334 137836 -83972 -247376 -283873 -190910 7764
126 7764 223829 310166 197678 -4188 -138273 -180906 -199732 -174984 -19945 219571 339865
137 339865 217285 -30510 -204200 -244696 -204529 -97209 88756 266033 283969 118677
147 118677 -83933 -189006 -201705 -173358 -82362 96347 269206 285681 116268 -108753 -246417
158 -246417 -251162 -148479 21879 189462 258104 186357 32086 -113379 -206303 -228595 -146245
169 -146245 38499 223956 276206 166555 -11650 -158582 -232860 -215802 -88532 106728
179 106728 249316 242301 108020 -52348 -168848 -222129 -191748 -55903 136283 262536 231319
190 231319 72722 -102754 -207117 -216677 -139320 4158 159372 242817 199951 51144 -121318
$$ packed form
115b66774R5045J29288J53163J41810K6802j41498k21808j63404l6497R2963J98674
126G764K16065Q6337j12488k01866j34085m2633j8826K4748J55039K39516J20294
137C39865j22580k47795j73690m0496M0167J07320J85965J77277J7936j65292
147A18677k02610j05073j2699K8347R0996J78709J72859J6475j69413k25021j37664
158b46417m745J02683J70358J67583O8642p1747j54271j45465r2924k2292Q2350
169a46245J84744J85457N2250j09651j78205j46932p4278J7058J27270J95260
179A06728J42588p015j34281j60368j16500n3281L0381J35845J92186J26253l1217
190B31319j58597j75476j04363r560P7357J43478J55214Q3445m2866j48807j72462
$$ plain form
201 -121318 -231392 -226673 -108797 65816 206064 237696 149889 -5785 -151617 -223766 -191192
212 -191192 -67608 91027 207480 223126 128616 -32695 -182769 -243612 -177202 -16895 148896
223 148896 230480 192970 65943 -83686 -191015 -211931 -134328 11226 157349 229159 185882
234 185882 45748 -119402 -224955 -213991 -93043 73135 195810 216143 132469 -9382
244 -9382 -143047 -211111 -181786 -62675 92437 205429 214366 112676 -45826 -181190 -224040
255 -224040 -154289 -7263 140683 214629 181221 63893 -79632 -185533 -206364 -126857 20154
266 20154 161766 221608 166650 28036 -121463 -208488 -192181 -81440 68260 181833 204136
277 204136 128735 -6546 -140319 -209051 -175939 -50513 103389 202825 197435 95553 -48754
$$ packed form
201a21318j10074M719J17876J74613J40248L1632q7807j55674j45832p2149L2574
212a91192J23584J58635J16453J5646r4510j61311j50074o0843O6410J60307J65791
223A48896Q1584l7510j27027j49629j07329k0916P7603J45554J46123P1810m3277
234A85882j40134j65150j05553J0964J20948J66178J22675K0333q3674j41851
244i382j33665o8064K9325J19111J55112J12992Q937j01690j58502j35364m2850
255b24040O9751J47026J47946P3946l3408j17328j43525j05901k0831P9507J47011
266B0154J41612N9842n4958j38614j49499q7025J6307J10741J49700J13573K2303
277B04136p5401j35281j33773o8732L3112J25426J53902R9436n390j01882j44307
$$ plain form
288 -48754 -167537 -206056 -143267 -8224 130807 202819 175687 64637 -76684 -183581 -202384
299 -202384 -118552 27862 160484 209011 150615 20612 -114077 -191508 -178516 -80045 60738
310 60738 174031 200946 126827 -9249 -140092 -202498 -164664 -42066 102219 192579 184409
321 184409 87751 -47974 -160681 -196366 -135014 -5627 125655 194237 168293 59965 -81237
332 -81237 -183080 -191481 -101582 36012 152359 193660 141932 20107 -112592 -188841 -170906
343 -170906 -69821 64440 168738 191385 117207 -16165 -140556 -193340 -151137 -35292 97524
354 97524 181575 175380 83184 -49260 -157635 -189690 -127685 -682 125547 187786 156407
365 156407 50029 -80520 -172606 -179780 -97080 33935 146438 186695 135600 17797 -109736
$$ packed form
288d8754j18783l8519O2789J35043J39031P2012k7132j11050j41321j06897j8803
299b02384Q3832J46414J32622M8527n8396j30003j34689p7431J2992R8471J40783
310F0738J13293K6915p4119j36076j30843o2406L7834J22598J44285R0360q170
321A84409r6658j35725j12707l5685O1352J29387J31282O8582k5944j08328j41202
332h1237j01843q401Q9899J37594J16347M1301n1728j21825j32699p6249J7935
343a70906J01085J34261J04298K2647p4178j33372j24391n2784M2203J15845J32816
354I7524Q4051o195r2196j32444j08375l2055O2005J27003J26229O2239l1379
365A56407j06378j30549r2086p174Q2700J31015J12503M0257n1095j17803j27533
$$ plain form
376 -109736 -183704 -165419 -64872 66110 163105 179828 107980 -17732 -134231 -183443 -142632
387 -142632 -33072 92313 173273 169856 80917 -50531 -155575 -181176 -117008 3376 121287
398 121287 180180 150139 44998 -81360 -166973 -169739 -90139 33696 141660 179571 128004
409 128004 13347 -107472 -175646 -157079 -59770 67039 159320 171141 99807 -20005 -129998
420 -129998 -176667 -134971 -25185 95903 168242 158164 71977 -50158 -148230 -172379 -111253
431 -111253 4250 117568 174597 144903 41035 -83296 -163091 -161094 -82121 35664 138193
442 138193 173047 119375 6332 -105683 -163476 -143677 -56352 61545 153798 168673 96559
453 96559 -24062 -130068 -169829 -126237 -20744 94046 162333 150665 65204 -51799 -142737
$$ packed form
376a09736p3968J8285J00547J30982R6995J6723p1848j25712j16499m9212M0811
387a42632J09560J25385Q0960l417q8939j31448j05044k5601O4168J20384J17911
398A21287N8893l0041j05141j26358q5613k766P9600J23835J07964L7911n1567
409A28004j14657j20819o8174J8567R7309J26809R2281J1821p1334j19812j09993
420a29998m6669M1696J09786J21088P2339j0078q6187j22135r8072k4149O1126
431a11253J15503J13318N7029k9694j03868j24331p9795J997P8973J17785J02529
442A38193L4854n3672j13043j12015n7793J9799Q7325J17897R2253J4875p2114
453I6559j20621j06006l9761M3592J05493J14790O8287j1668q5461j17003r0938
$$ plain form
464 -142737 -163949 -104079 6654 113594 165319 135946 39549 -78022 -157536 -158339 -78387 41529
476 41529 138063 163067 108200 4897 -98574 -156897 -141715 -53930 64913 151739 157996 85416
488 85416 -24588 -119887 -160645 -125013 -24571 92241 161835 145800 56708 -55926 -137598
499 -137598 -153466 -96879 6954 109793 159242 129462 33916 -78581 -151372 -148448 -71164
510 -71164 40663 129677 154796 106011 5847 -100293 -160095 -137351 -41787 72501 142816
521 142816 141630 78448 -18989 -113792 -159335 -122386 -16223 96888 153347 131018 51482 -48216
533 -48216 -129584 -153064 -98222 12661 116582 155852 115616 23505 -75902 -140865 -140575 -69855
545 -69855 37767 126333 150908 101359 2058 -99253 -152505 -127785 -38184 67186 136401
$$ packed form
464a42737k1212N9870J10733J06940N1725k9373r6397j17571p9514q03P9952J19916
476D1529R6534K5004n4867j03303j03471n8323J5182Q7785J18843Q6826O257p2580
488H5416j10004r5299m0758L5632J00442J16812O9594j6035q9092j12634q1672
499a37598j5868N6587J03833J02839M9449k9780r5546j12497p2791K924P7284
510g1164J11827Q9014K5119m8785j00164j06140n9802K2744R5564J14288P0315
521A42816j186o3182r7437r4803m5543L6949J06163J13111N6459k2329p9536r9698
533d8216q1368k3480N4842J10883J03921L9270m0236r2111r9407o4963K90P0720
545f9855J07622Q8566K4575m9549r9301j01311n3252K4720Q9601J05370O9215
$$ plain form
556 136401 140844 79260 -23860 -119716 -153605 -105547 -5301 89052 136625 125369 58415 -43892
568 -43892 -133613 -154755 -88753 22958 114354 143594 107318 24935 -72642 -139553 -136617 -61811
580 -61811 43789 123119 141036 92999 1292 -93351 -144531 -123330 -38770 66737 139038 139452
592 139452 69113 -33908 -115239 -138071 -95953 -11547 80125 137812 129219 52336 -54256 -131692
604 -131692 -139028 -77953 17451 103177 140786 110531 23558 -77000 -136603 -126097 -55134 40182
616 40182 116214 138201 92001 -2549 -96154 -140782 -114131 -31254 66063 130251 128861 63989
628 63989 -29788 -107115 -135404 -99728 -12268 86418 141646 121133 38633 -58187 -122649 -127989
640 -127989 -74266 16870 100838 135704 102078 18843 -72978 -129395 -123289 -56292 40843 118327
$$ packed form
556A36401M443o1584j03120r5856l3889M8058J00246R4353M7573j1256o6954j02307
568d3892q9721k1142O6002J11711R1396K9240l6276q2383r7577o6911K936P4806
580f1811J05600P9330J7917m8037r1707r4643n1180K1201Q4560J05507P2301M14
592A39452p0339j03021q1331k2832M2118Q4406R1672N7687q593p6883j06592p7436
604a31692p336O1075R5404Q5726L7609l0255q6973j00558n9603J0506P0963R5316
616D0182P6032K1987m6200r4550r3605m4628K6651Q2877R7317O4188j390o4872
628F3989r3777p7327k8289L5676Q7460R8686N5228k0513q2500r6820o4462n340
640a27989N3723R1136Q3968L4866l3626q3235r1821n6417O106O6997R7135P7484
$$ plain form
652 118327 136386 84438 -10286 -98137 -134522 -103554 -24545 62152 118914 122129 66894 -25227
664 -25227 -109099 -138083 -94098 -2485 86550 131381 112960 39296 -55613 -122442 -124657 -65402
676 -65402 21019 93309 124291 100245 24164 -71344 -133636 -122896 -46814 48420 114260 124302
688 124302 76656 -8110 -91663 -129363 -100863 -23169 61648 115925 118196 64831 -26250 -109850
700 -109850 -134423 -85249 3928 84127 122075 105952 38165 -53244 -118114 -119458 -62130 18328
712 18328 90101 125444 101200 18154 -79195 -129605 -107668 -37325 41870 102140 120358 80399
724 80399 -6045 -92109 -126076 -95184 -21893 58493 113697 118501 61855 -32785 -109502 -124406
736 -124406 -75393 4320 76505 114990 102658 38503 -48887 -112202 -117747 -65404 18482 95458
$$ packed form
652A18327J8059n1948r4724q7851l6385L0968P9009Q6697N6762L215n5235r2121
664b5227q3872k8984M3985R1613Q9035M4831j8421p3664r4909o6829k215N9255
676f5402Q6421P2290L0982k4046p6081r5508o2292J0740P6082R5234O5840J0042
688A24302m7646q4766q3553l7700K8500P7694Q4817N4277K271n3365r1081q3600
700a09850k4573M9174Q9177Q0199L7948j6123o7787r1409o4870j344N7328Q0458
712A8328P1773L5343k4244q3046r7349n0410K1937P0343P9195O0270J8218l9959
724H0399q6444q6064l3967L0892P3291Q0386N5204M804n6646r4640p6717j4904
736a24406M9013P9713P2185L8485j2332o4155q7390o3315n545N2343Q3886P6976
$$ plain form
748 95458 127130 91221 6449 -76674 -114703 -98183 -42292 33647 101915 123006 75853 -12782
760 -12782 -89448 -116422 -91156 -26452 55694 117358 117832 50480 -41061 -101918 -108726 -70927 -4741
773 -4741 69063 116976 105481 34462 -53625 -110464 -111523 -60826 20521 94555 120218 81735
785 81735 4602 -68709 -107228 -99621 -45323 37061 105114 116256 65718 -14023 -81842 -112439
797 -112439 -92540 -24277 62835 117552 105440 39247 -36966 -89754 -104788 -76514 -7126 74834
809 74834 120449 98630 23513 -56959 -104105 -103027 -55699 20818 90012 114052 77876 4721
821 4721 -67236 -107397 -97778 -39668 41790 102977 109863 61166 -15617 -83149 -111256 -84353 -14325
834 -14325 62306 105441 96051 43361 -29028 -91059 -111483 -74359 4317 80615 112417 85790
$$ packed form
748I5458L1672l5909q4772q3123l8029J6520N5891P5939O8268K1091m7153q8635
760a2782p6666k6974K5266O4704Q2146O1664M74o7352r1541o0857o808L7799O6186
773d741P3804M7913j1495p1019q8087n6839j059N0697Q1347P4034K5663l8483
785H1735p7133p3311l8519P607N4298Q2384O8053J1142n0538p9741o7819l0597
797a12439J9899O8263Q7112N4717j2112o6193p6213n2788j5034K8274O9388Q1960
809G4834M5615k1819p5117q0472m7146J078M7328P6517O9194K4040l6176p3155
821D721p1957m0161R619N8110Q1458O1187O886m8697p6783o7532k8107K6903P0028
834a4325P6631M3135r390n2690p2389o2031k0424L7124P8676P6298L1802k6627
$$ plain form
846 85790 20038 -52329 -100161 -100390 -51214 24391 87767 106605 74325 6698 -66005 -108153
858 -108153 -95872 -32703 46776 100188 102315 56194 -16358 -81411 -106621 -78628 -11619 59309
870 59309 100274 94739 43649 -31482 -94158 -108499 -64840 10346 76928 103448 81604 21269
882 21269 -50355 -98665 -98006 -47232 25676 85245 104168 72349 4048 -68578 -106139 -87929
894 -87929 -26341 45287 92591 97017 55921 -14069 -79015 -104455 -76497 -10729 59162 99935
906 99935 92446 38817 -34989 -91686 -100153 -59067 9652 71865 99838 79868 20748 -49717
918 -49717 -96256 -94557 -45931 26149 85129 101734 67289 -900 -68098 -99200 -81932 -25707
930 -25707 41772 90308 95724 53006 -17626 -79890 -100506 -70950 -7540 58283 96104 87500
$$ packed form
846H5790o5752p2367m7832k29M9176P5605O3376J8838l2280o7627p2703m2148
858a08153J2281O3169P9479N3412K127m6121p2552o5053k5210K7993O7009P0928
870E9309M0965n535n1090p5131o2676j4341M3659P5186O6582K6520k1844o0335
882B1269p1624m8310O59N0774P2908N9569J8923l1819o8301p2626l7561J8210
894h7929O1588P1628M7304M426m1096o9990o4946k5440K7958O5768O9891M0773
906I9935p489n3629p3806n6697q467M1086O8719O2213K7973j9970n9120p0465
918d9717m6539J699M8626P2080N8980J6605l4445o8189o7198l1102J7268N6225
930b5707O7479M8536N416m2718p0632o2264k0616K9556O3410O5823L7821q604
$$ plain form
942 87500 35387 -36208 -89237 -96320 -55724 10137 70336 97361 77053 17551 -51746 -95720
954 -95720 -90467 -40215 28866 83120 95804 61652 -2508 -64795 -95456 -79994 -25123 43289
966 43289 90927 92708 47194 -21026 -77292 -95553 -67409 -6509 57993 94067 83634 31359
978 31359 -36295 -85461 -92081 -53672 10360 69228 95559 74050 14901 -52964 -92341 -84537
990 -84537 -36281 27840 78260 92126 60874 -2511 -64983 -93463 -75853 -21595 42725 87695
1002 87695 88503 44527 -21507 -75020 -91665 -63779 -5223 56759 91538 80666 28396 -36928
1014 -36928 -83361 -87869 -50218 12320 69520 92399 69118 11251 -51404 -87704 -80378 -34638
1026 -34638 27271 77604 90385 58085 -5157 -64971 -90974 -71283 -17858 43494 84122 84010
$$ packed form
942H7500n2113p1595n3029p083M0596O5861O0199K7025k0308n9502o9297m3974
954i5720N253N0252O9081N4254J2684l4152o4160o2287l0661J5462N4871O8412
966D3289M7638J781m5514o8220n6266j8261K8144O0900O4502L6074j0433n2275
978C1359o7654m9166o620L8409O4032N8868K6331k1509n9149o7865l9377P804
990h4537M8256O4121N0420J3866l1252o3385o2472k8480J7610N4258O4320M4970
1002H7695Q08m3976o6034n3513j6645K7886N8556O1982L4779j0872n2270o5324
1014c6928m6433m508L7651O2538N7200K2879k3281n7867o2655l6300P326M5740
1026c4638O1909N0333J2781l2300o3242n9814k6003J9691N3425O1352M0628j12
$$ plain form
1038 84010 42008 -21409 -73461 -88439 -60279 -3390 55922 88742 77489 26408 -37967 -82060
1050 -82060 -84619 -46360 13975 67898 88578 64934 9039 -51368 -85593 -77479 -31988 29571
1062 29571 77145 86484 52374 -8117 -63758 -87791 -67827 -14976 44780 82443 79246 37924
1074 37924 -22661 -73168 -86886 -56605 1541 57989 84978 70569 22195 -37972 -79227 -81525
1086 -81525 -42763 16087 67106 85374 61584 7023 -51594 -84123 -74941 -28425 32260 76303
1098 76303 82095 46903 -10224 -61308 -82988 -64892 -14945 43717 81349 77811 35081 -25127
1110 -25127 -72289 -83331 -53027 3005 57013 82811 67381 18690 -38948 -76270 -76461 -40478
1122 -40478 15698 65086 84113 59388 4144 -52260 -81711 -70729 -25481 32466 74292 78923
$$ packed form
1038H4010m2002o3417n2052j4978K8160N6889N9312L2820j1253n1081o4375m4093
1050h2060k559L8259O0335N3923K0680k3644n5895o0407l4225Q114M5491O1559
1062B9571M7574R339l4110o0491n5641k4033J9964N2851N9756L7663l197m1322
1074C7924o0585n0507j3718L0281N8146N6448K6989j4409m8374o0167m1255k298
1086h1525L8762N8850N1019J8268k3790n4561n8617l2529R182M6516O0685M4043
1098G6303N792l5192n7127n1084k1680J8096M9947N8662L7632l538m2730o0208
1110b5127m7162j1042L0304N6032N4008K5798j5430m8691n7638l7322j91L5983
1122d0478N6176M9388J9027k4725n5244n6404k9451J0982M5248N7947M1826M631
$$ plain form
1134 78923 43906 -11570 -60537 -80129 -61676 -12559 44575 79664 73598 30812 -25639 -68353
1146 -68353 -78806 -51473 2680 57239 82863 64430 14361 -39647 -72849 -72899 -39068 16006
1158 16006 66602 82689 54381 -649 -51254 -75432 -65903 -25667 29374 72690 78875 43278
1170 43278 -13595 -61170 -78577 -58155 -8737 44938 76638 69142 28387 -25317 -66964 -76428
1182 -76428 -47906 5593 56145 77225 60872 16201 -36102 -73493 -75324 -36802 23130 68652
1194 68652 75410 46208 -972 -45832 -72571 -66419 -24556 33179 73192 73447 37694 -13903 -58167
1207 -58167 -76201 -57074 -7345 46943 76162 65745 24248 -27779 -66401 -72531 -42865 7418
1219 7418 53479 73196 59452 16238 -38684 -75638 -72048 -29420 25486 62862 69504 46419
$$ packed form
1134G8923l5017n5476m8967j9592J8453M9117N7134L5089o066m2786n6451m2714
1146f8353j0453K7333N4153N4559K5624j8433n0069n4008l3202n0L3831N5074
1158A6006N0596J6087k8308n5030n0605k4178R529M0236N5041M3316O185l5597
1170D3278n6873m7575j7407K0422M9418N3675L1700p496m0755n3704m1647r464
1182g6428K8522N3499N0552K1080j6353m4671n2303l7391j831L8522N9932M5522
1194F8652O758k9202m7180m4860k6739O152M1863N7735M0013K55l5753n1597m4264
1207e8167j8034J9127M9729N4288K9219j0417m1497n2027l8622o130K9666N0283
1219G418M6061J9717j3744m3214n4922l6954L590M2628N4906L7376O642k3085
$$ plain form
1231 46419 1950 -47301 -76493 -64580 -17024 37277 68415 65651 35212 -11562 -56674 -76356
1243 -76356 -55477 -3449 49052 73067 60317 20979 -26837 -63374 -70722 -42405 8159 55257
1255 55257 74394 55780 8985 -42466 -70880 -63754 -26153 21542 59351 70982 47386 -2695
1267 -2695 -53148 -74169 -56109 -12498 34097 64458 66535 36235 -16016 -61200 -73291 -46628
1279 -46628 798 45075 67759 58980 22140 -27265 -64483 -69861 -39483 11416 56387 71587
1291 71587 50533 6031 -40073 -66020 -61582 -27811 21718 62219 70394 41993 -6819 -50086
1303 -50086 -67783 -54309 -15199 32841 67194 67180 31036 -20262 -58494 -66735 -43696 -1076 42597
1316 42597 67801 59583 20099 -29702 -64289 -66004 -35149 13042 54235 67776 48078 6228
$$ packed form
1231D6419m4469m9251k9192J1913M7556N4301L1138k764l0439m6774m5112j9682
1243g6356K0879N2028N2501K4015j2750l9338m7816l6537p348K8317N0564M7098
1255E5257J9137j8614m6795n1451k8414P126L7601M7695L7809J1631k3596n0081
1267b695n0453k1021J8060M3611M6595L0361K077l0300n2251m5184j2091K6663
1279d6628M7426M4277K2684q779l6840m9405l7218n378L0378N0899M4971J5200
1291G1587k1054m4502m6104k5947M438L3771M9529M0501Q175k8401m8812m3267
1303e0086j7697J3474L9110M8040L4353j4l6144n1298l8232q241K3039M2620M3673
1316D2597K5204q218l9484m9801l4587j715L0855M8191M1193J3541j9698m1850
$$ plain form
1328 6228 -38703 -65655 -61254 -25199 24761 61678 65901 37924 -6308 -46868 -67102 -54987
1340 -54987 -13009 37168 66556 60129 25402 -18281 -53599 -65332 -45601 -742 45805 67597
1352 67597 54816 15925 -29882 -61814 -63484 -32703 14692 53131 64255 45539 5301 -38666
1364 -38666 -65234 -58639 -21701 26078 58947 62710 37102 -6952 -48963 -67038 -50365 -7648
1376 -7648 37189 61589 56819 26054 -17216 -54657 -66184 -42430 3840 46856 64142 50952
1388 50952 14596 -29463 -60862 -61799 -29406 16280 51368 61448 43881 5019 -39099 -64994
1400 -64994 -56231 -17893 27370 57368 59861 34378 -8566 -48788 -64421 -46461 -6253 35313
1412 35313 59555 56126 25839 -19661 -56755 -64010 -37899 6190 44574 61513 49645 13514
$$ packed form
1328F228m4931k6952M401L6055M9960L6917M223k7977m4232m0560k0234J2115
1340e4987M1978N0177K9388o427l4727m3683l5318j1733J9731M4859M6547K1792
1352F7597j2781l8891m5807l1932j670L0781M7395L8439J1124j8716m0238m3967
1364c8666k6568O595L6938M7779L2869L763k5608m4054m2011j8075J6673M2717
1376g648M4837K4400m770l0765m3270l7441j1527K3754M6270M3016J7286j3190
1388E0952l6356m4059l1399r37L2393M5686L5088J0080j7567l8862m4118k5895
1400f4994Q763L8338M5263K9998K493k5483m2944m0222j5633J7960M0208M1566
1412C5313K4242l429l0287m5500l7094p255K6111M4089L8384J6939j1868l6131
$$ plain form
1424 13514 -30940 -60192 -57764 -26818 15327 49274 61463 44048 3148 -41627 -64175 -52154
1436 -52154 -14993 26731 54613 57825 33617 -8994 -48247 -62369 -44662 -5403 34890 58506
1448 58506 54903 23565 -20944 -55520 -61124 -34700 7239 43878 59378 47418 11503 -31013
1460 -31013 -58399 -55355 -25812 15862 50064 60342 40877 -607 -41376 -60350 -49119 -14158
1472 -14158 26471 54439 56688 30835 -11370 -47787 -60519 -42406 -3745 36538 58300 52019
1484 52019 19563 -22628 -53114 -57712 -33117 7237 43338 58716 45306 9478 -31738 -57171
1496 -57171 -54241 -23904 17920 50355 58439 36911 -2515 -40364 -57794 -47122 -13701 26727
1508 26727 54182 55174 28582 -12532 -47941 -58824 -39470 -1545 36434 56602 49164 18149
$$ packed form
1424A3514m4454k9252K428L0946M2145L3947J2189j7415m0900m4775k2548J2021
1436e2154L7161M1724K7882L212k4208m2611l9253j4122J7707L9259M0293K3616
1448E8506l603l1338m4509l4576n604K6424M1939L6639J5500j1960l5915m2516
1460c1013k7386L044K9543M1674L4202J0278j9465m1484m0769j8974J1231L4961
1472a4158M0629K7968K249k5853m2205l6417j2732J8113L8661M0283K1762o281
1484E2019l2456m2191l0486m598K4595M0354L6101J5378j3410l5828m1216k5433
1496e7171K930L0337M1824L2435Q084k1528l9426l7849j7430J0672L3421M0428
1508B6727K7455R92k6592m1114l5409j0883J9354L7925L7979K0168p438l1015
$$ plain form
1520 18149 -22983 -52734 -55926 -31181 8696 43248 57166 43348 7506 -32474 -56552 -51861
1532 -51861 -21014 19436 49455 55415 34598 -3534 -39603 -56864 -45806 -11996 27516 53893
1544 53893 53440 26299 -14544 -47695 -56157 -36840 -1038 35052 55014 48457 17171 -23940 -52308
1557 -52308 -53787 -28971 8914 42072 55959 42138 6400 -33306 -55403 -49457 -18974 19121
1569 19121 47638 53467 33919 -3281 -39763 -56609 -44559 -10015 28840 52683 50431 23700
1581 23700 -14536 -45404 -54325 -36551 -962 35897 54494 46080 14410 -24508 -50292 -51192 -27565
1594 -27565 9319 42455 55106 39703 4131 -33431 -53057 -46261 -17967 18793 46852 53446
1606 53446 32686 -5648 -41039 -54759 -40391 -7398 28180 50526 48405 23177 -14718 -45529
$$ packed form
1520A8149m1132k9751l192K4745L9877L4552J3918j3818l5842l9980k4078M691
1532e1861L0847M0450L0019N960k0817l8132l6069j7261J1058L3810L9512K6377
1544E3893m53k7141m0843l3151q462J9317L5802L6090J9962o557l1286m1111k8368
1557e2308j479K4816L7885L3158J3887j3821l5738l9706k2097N946L0483L8095
1569A9121K8517N829j9548l7200l6482j6846J2050L4544L8855K3843k252k6731
1581B3700l8236l0868q921J7774L5589L6859J8597q414l1670l8918k5784r00K3627
1594b7565L6884L3136J2651j5403l5572l7562j9626O796K8294L6760K8059O594
1606E3446k0760l8334l5391j3720J4368L2993L5578K2346k121k5228l7895l0811
$$ plain form
1618 -45529 -53658 -34578 2249 36994 53085 43332 12714 -23998 -49722 -50565 -25594 12354 43064
1631 43064 52053 36013 2836 -31774 -51474 -46199 -17133 20616 48356 51702 28829 -8303
1643 -8303 -40380 -51937 -38098 -6676 28114 50030 47588 20848 -17108 -45632 -51182 -31751
1655 -31751 2923 35957 51630 42146 11259 -25747 -49453 -48421 -23185 12766 41777 50548
1667 50548 34808 2049 -32146 -51655 -44562 -14665 22171 47136 47833 26156 -7810 -38641
1679 -38641 -51056 -37946 -5939 29725 50165 44986 17827 -17981 -44720 -49254 -29999 4192
1691 4192 36406 50614 39712 9113 -25885 -47408 -46026 -22135 12158 41581 50703 33821
1703 33821 -480 -34230 -49710 -40480 -11990 21715 45288 47190 25500 -8958 -39453 -49826
$$ packed form
1618d5529q129J9080L6827L4745J6091r753l0618l6712k5724q43K4971L7948L0710
1631D3064Q989j6040l3177l4610j9700N275K9066L7749K7740L346k2873l7132
1643h303l2077j1557J3839L1422L4790K1916k442k6740l7956k8524n550J9431
1655c1751L4674L3034J5673r484l0887l7006k3706J032K5236L5951K9011Q771
1667E0548j5740l2759l4195j9509P093K9897L6836K4965O97k1677l3966l0831
1679c8641j2415J3110L2007L5664K0440n179k7159l5808k6739m534J9255L4191
1691D192L2214J4208j0902l0599l4998k1523J382K3891L4293K9423R122j6882
1703C3821l4301l3750j5480R230K8490L3705K3573J902k1690l4458l0495j0373
$$ plain form
1715 -49826 -35810 -4003 29588 48849 43348 16433 -19069 -44616 -48057 -27401 6639 36464
1727 36464 48640 36965 7658 -25922 -47221 -44873 -19736 14990 42417 48857 30608 -2760
1739 -2760 -33892 -47619 -38675 -10879 21824 45502 46308 23516 -11450 -39812 -48069 -32990 -2183
1752 -2183 30005 47946 41790 14271 -20466 -43523 -45168 -25226 6153 35334 48501 37115
1764 37115 5915 -28610 -47337 -41613 -16725 15683 40654 46661 28884 -3298 -33900 -46986
1776 -46986 -37118 -9799 22532 45069 45189 21740 -12826 -39755 -46236 -30560 -815 30101 47080
1789 47080 39814 12134 -20267 -42364 -43492 -24509 6460 36355 48703 35053 3038 -29557
1801 -29557 -45028 -39047 -16001 14956 40634 45944 27422 -5295 -34100 -45402 -35609 -9232
$$ packed form
1715d9826J4016L1807L3591J9261n501k6915l5502k5547l441K0656L4040K9825
1727C6464J2176j1675k9307l3580k1299K348K5137L4726K7427O440j8249l3368
1739b760l1132j3727Q944K7796L2703K3678Q06k2792l4966k8362q257J5079L0807
1752b183L2188J7941o156k7519l4737k3057j645J9942L1379K9181J3167j1386
1764C7115l1200l4525j8727N724K4888L2408K4971O007j7777l2182l0602j3086
1776d6986R868K7319L2331K2537J20k3449l4566k6929o481J5676K9745L0916J6979
1789D7080p266k7680l2401k2097j128J8983L0969K9895J2348j3650l2015l2595
1801b9557j5471N981K3046L0957K5678N310j8522l2717k8805j1302R793K6377
$$ plain form
1813 -9232 22906 44833 43762 18975 -14219 -38794 -44324 -29522 -383 30301 45883 38060 11119
1826 11119 -20166 -41043 -43054 -24173 8086 37509 47066 31509 976 -27883 -42916 -38822
1838 -38822 -16032 16364 41552 44857 24780 -6041 -32733 -44069 -35196 -8055 25223 45344
1850 45344 40439 15976 -14444 -36574 -43082 -29438 815 31977 45430 35105 8963 -20165
1862 -20165 -40158 -42580 -22951 10688 38474 44840 27994 222 -25946 -41892 -38703 -15275
1874 -15275 18147 41926 42968 22182 -7033 -32215 -43339 -33941 -5934 26148 43661 38024
1886 38024 14948 -13546 -36326 -43391 -27774 3193 32654 43752 33285 7737 -20450 -40621
1898 -40621 -41489 -20089 12390 37377 41623 26705 1328 -25343 -42321 -38784 -13288 20815 41708
$$ packed form
1813i232L2138K1927j071k4787l3194k4575n530J4802K9139L0684J5582p823k6941
1826A1119l1285k0877k011J8881L2259K9423R557j5557l0533k8859j5033M094
1838c8822K2790L2396K5188L305k0077l0821k6692j1336Q873K7141L3278K0121
1850D5344m905k4463l0420k2130o508J3644L0253L1162J3453j0325k6142k9128
1862b0165j9993k422J9629L3639K7786O366j6846k7772k6168j5946L189K3428
1874a5275L3422K3779J042k0786k9215k5182j1124R398K8007L2082J7513n637
1886C8024k3076k8494k2780p065J5617L0967K9461J1098j0467k5548k8187k0171
1898d0621q68K1400L2479K4987M246j4918k5377k6671j6978L537K5496L4103K0893
$$ plain form
1911 41708 39776 19766 -7490 -31766 -42411 -32397 -3794 26870 42122 36232 13778 -13677
1923 -13677 -36608 -41915 -25940 4330 32086 42930 32526 6434 -22047 -40803 -39008 -16901
1935 -16901 12705 34898 39963 27055 1070 -27691 -43551 -36308 -9037 21009 38510 37895 20248
1948 20248 -6894 -32994 -43629 -30137 -1092 27026 39613 34235 13882 -14026 -36913 -41648
1960 -41648 -23935 6379 32305 40648 30496 5615 -21902 -39697 -37800 -16301 12828 34925
1972 34925 40426 26233 -1593 -29256 -41929 -32444 -7541 19705 36846 37572 20510 -8078 -33942
1985 -33942 -42422 -27803 219 26068 38536 34225 13408 -15227 -37957 -40460 -21164 8303
1997 8303 31138 38291 28584 5858 -21126 -39498 -37727 -15160 14581 36006 38845 24100 -2406
$$ packed form
1911D1708j932k0010k7256k4276j0645J0014K8603L0664J5252n890k2454k7455
1923a3677k2931n307J5975L0270K7756J0844j0404k6092k8481j8756J795K2107
1935a6901K9606K2193N065j2908k5985k8761j5860P243K7271L0046J7501o15j7647
1948B0248k7142k6100j0635J3492K9045K8118J2587n378k0353k7908k2887m735
1960d1648J7713L0314K5926Q343j0152k4881k7517j7795J897K1499K9129K2097
1972C4925N501j4193k7826k7663j2673R485K4903K7246J7141P26j7062k8588k5864
1985c3942q480J4619K8022K5849J2468m311k0817k8635k2730k503J9296K9467
1997H303K2835P153r707k2726k6984j8372J771K2567K9741K1425K839j4745k6506
$$ plain form
2010 -2406 -28296 -40097 -31550 -7245 19686 36634 36925 18982 -9428 -33517 -40260 -26252 201
2023 201 25037 38610 34158 11987 -16862 -37309 -37749 -19122 7665 29556 38234 29225 5436
2036 5436 -22729 -39508 -35354 -13315 14390 34106 37396 23063 -3089 -28178 -39581 -30446 -6772
2049 -6772 19621 36414 36095 17572 -10592 -32774 -38432 -24536 261 25216 38346 32793 10155
2062 10155 -17710 -36091 -35498 -18722 6616 29077 39025 29198 3376 -24078 -38710 -32880 -11945
2075 -11945 13932 33136 36851 22397 -4121 -28346 -38010 -28941 -6267 19881 36603 35532 15852
2088 15852 -11602 -32658 -36981 -23552 941 25399 38037 31257 8505 -17941 -34655 -34684 -18458
2101 -18458 7009 29750 38250 27090 1916 -24335 -36811 -31540 -11410 14020 32614 36206
$$ packed form
2010b406k5890j1801Q547K4305K6931J6948K91j7943k8410k4089o743J4008K6453
2023B01K4836J3573m452k2171k8849k0447m40J8627K6787K1891Q678r009k3789
2036E436k8165j6779M154K2039K7705J9716L290j4333k6152k5089j1403R135K3674
2049f772K6393J6793l19j8523k8164k2182n658J3896K4797K4955J3130n553k2638
2062A0155k7865j8381N93J6776K5338K2461R948r827k5822k7454j4632N830K0935
2075a1945K5877J9204L715j4454k6518k4225r664R069K2674K6148J6722j071j9680
2088A5852k7454k1056m323J3429K4493K4458J2638o780k2752k6446j6714k9J6226
2101a8458K5467K2741Q500j1160k5174k6251j2476N271K0130K5430J8594L592
$$ plain form
2113 36206 21269 -4530 -28258 -37619 -28039 -4860 20427 35970 33253 14246 -11345 -31423
2125 -31423 -36635 -23343 1297 25902 36910 29349 8037 -16927 -33631 -35110 -18336 8272
2137 8272 30863 36887 24642 923 -22495 -34991 -30930 -11364 14116 33403 35443 20208 -5091
2150 -5091 -27615 -36422 -27425 -4479 20912 35146 31858 13721 -11239 -31271 -35855 -22456 2343
2163 2343 25518 35572 28374 7898 -16636 -34136 -34153 -16235 9736 30007 34689 23455 923
2176 923 -22060 -35610 -31028 -10472 15557 32388 33472 18813 -5362 -27233 -36101 -26465 -3266
2189 -3266 20517 33980 31037 13259 -11139 -30754 -35060 -20685 3505 25219 34336 27731 7063
2202 7063 -17386 -34028 -32534 -14806 9094 28456 33904 24095 1262 -22945 -35669 -29503 -8589
$$ packed form
2113C6206j4937k5799k3728r361R580K3179K5287J5543k717j9007k5591k0078
2125c1423n212J3292K4640K4605J1008p561k1312k4964j6704j479J6774K6608
2137H272K2591O024j2245k3719k3418j2496M061J9566K5480J9287K040j5235k5299
2150e091k2524q807Q997K2946K5391J4234l288j8137k4960k0032m584J3399K4799
2163B343K3175J0054p198k0476k4534j7500j7J7918K5971K0271M682j1234k2532
2176I23k2983j3550M582K0556K6029J6831J084j4659k4175k1871q868R636K3199
2189c266K3783J3463k943j7778k4398j9615m306J4375K4190K1714R117o605k0668
2202G063k4449j6642J494J7728K3900J9362N448r809k2833k4207j2724O166K0914
$$ plain form
2215 -8589 15170 31209 32915 18711 -5523 -27625 -34855 -24581 -2440 19873 32805 30402 13466
2228 13466 -11588 -31381 -34356 -19425 4128 24464 33574 26982 6641 -18148 -33642 -31696 -14063
2241 -14063 9363 28087 33629 22965 419 -23485 -34239 -27723 -8118 14983 30890 32549
2253 32549 17729 -6898 -27266 -33589 -23311 -2389 19466 32936 30333 11607 -13406 -30672
2265 -30672 -32093 -17964 3438 23764 33314 26818 5706 -18907 -32957 -30081 -12990 9600 27663
2278 27663 33084 21950 -962 -23201 -33479 -26680 -6963 15513 30154 31175 16387 -7347
2290 -7347 -26814 -33247 -23026 -1465 20791 33208 28522 9297 -13517 -29541 -30764 -18051 3741
2303 3741 25022 34182 25124 3245 -18917 -30955 -28697 -12980 9865 28818 33141 20119 -3364
$$ packed form
2215h589K3759J6039J706j4204k4234k2102p230J0274K2141K2313J2932k403j6936
2228A3466k5054j9793k975J4931K3553K0336R110o592k0341k4789j5494J946J7633
2241a4063K3426J8724N542j0664k2546k3904j0754O516J9605K3101J5907J659
2253C2549j4820k4627k0368o323J0278K0922K1855J3470k603j8726k5013j7266
2265c0672j421J4129K1402K0326R550o496k1112k4613j4050K876J7091K2590J8063
2278B7663N421j1134k2912k2239j0278O799J9717K2476J4641J021j4788k3734
2290g347j9467o433J0221K1561K2256J2417m686j9225k2814j6024j223J2713K1792
2303C741K1281R160r058k1879k2162j2038K258J5717K2845J8953M323j3022k3483
$$ plain form
2316 -3364 -23627 -31728 -25219 -7002 14851 30484 30831 14947 -8765 -27227 -32038 -21108 -520
2329 -520 20611 32345 27328 8977 -13676 -29554 -30657 -16888 5283 25447 32303 22982 2870
2342 2870 -18421 -30911 -28186 -11859 10910 29001 31931 18011 -3581 -22525 -31154 -25019 -6598
2355 -6598 16660 31674 29821 12624 -9841 -26378 -30262 -20095 -561 20464 31969 26873 7661
2368 7661 -14646 -29055 -29213 -15523 5791 24577 31859 22792 1873 -19669 -30831 -27102 -10135
2381 -10135 11555 27457 30159 18024 -3069 -22758 -31872 -24841 -4790 17468 30103 27985 12364
2394 12364 -8669 -25575 -30552 -20214 191 21431 31161 24997 6667 -14625 -28189 -28938 -15309
2407 -15309 6052 25129 31360 21470 839 -19384 -29805 -25732 -9932 11401 27473 30238 17301
$$ packed form
2316c364k0263q101O509J8217K1853J5633L47j5884k3712j8462m811J0930K0588
2329e20K1131J1734n017j8351k2653j5878j103J3769K2171K0164O856r321k0112
2342B870k1291j2490K725J6327K2769J8091K930j3920k1592j8944q629O135J8421
2355f598K3258J5014j853j7197k2465j6537l884J0167J9534K1025J1505n096j9212
2368G661k2307j4409j58J3690K1314J8786P282r067k0919k1542j1162L729J6967
2381a0135K1690J5902K702j2135k1093j9689r114P031K0051K2258J2635k118j5621
2394A2364k1033j6906m977J0338K0405K1240R730o164j8330k1292j3564p49J3629
2407a5309K1361J9077O231r890k0631k0223j0421M073J5800K1333J6072K765j2937
$$ plain form
2420 17301 -4530 -23543 -30566 -22203 -3790 16626 29166 27486 12086 -10014 -26781 -30292 -18403
2433 -18403 2115 21259 30174 23805 6188 -14213 -28605 -28337 -13843 7787 25086 29879 19596
2446 19596 521 -18779 -29172 -26223 -9372 12460 28435 29039 15037 -5637 -22564 -28739 -21715
2459 -21715 -4077 16592 29445 27145 10625 -10556 -25949 -28451 -17865 1480 21320 30166
2471 30166 23944 5297 -15258 -27658 -26820 -12987 7337 24285 29080 19432 248 -19335 -29291
2484 -29291 -24886 -7748 13008 27507 27786 14223 -5830 -22366 -28700 -21438 -2892 17526 29344
2497 29344 25376 9143 -10587 -24717 -28109 -17734 2260 21857 29760 21774 3639 -15153 -26696
2510 -26696 -25877 -12852 7544 25279 28861 18379 -1472 -19508 -28137 -23627 -7170 13392 27195
$$ packed form
2420A7301k1831j9013p023Q363J8413K0416J2540j680j5400k2100j6767l511J1889
2433a8403K0518J9144Q915o369j7617k0401j4392K68J4494K1630J7299M793j0283
2446A9596j9075j9300j0393K949J6851K1832J5975O04j4002k0674j6927o175P024
2459b1715J7638K0669J2853k300j6520k1181j5393k502J0586J9345J9840Q846
2471C0166o222j8647k0555j2400Q38J3833K0324J6948M795r648j9184j9583r956
2484b9291M405J7138K0756J4499K79j3563k0053j6536o334P262J8546K0418J1818
2497B9344l968j6233j9730j4130l392J0375J9994J9597P903p986j8135j8792j1543
2510b6696Q19J3025K0396J7735L582j0482j9851j8036q629M510J6457K0562J3803
$$ plain form
2523 27195 27044 13649 -6137 -22445 -28880 -20394 -1533 18180 28035 24249 8410 -10856 -25418
2536 -25418 -27927 -16037 4315 22009 27893 20347 3544 -14873 -26901 -26131 -11564 9761 25218
2549 25218 27683 16539 -1622 -19529 -28100 -22895 -5591 14141 26710 25781 12662 -6341 -22502
2562 -22502 -28244 -19862 -449 18362 27976 23068 7564 -11368 -25509 -26924 -14361 5035 21323
2575 21323 27184 19959 3283 -15394 -27640 -24966 -9855 10004 24547 26518 16121 -1991 -19957
2588 -19957 -28107 -21528 -4760 14299 25720 24778 12087 -6768 -22889 -27653 -18051 745 18668
2601 18668 26751 22317 7233 -11805 -25346 -25861 -13455 5528 21546 26936 18983 2074 -16204
2614 -16204 -26899 -23496 -8842 9923 24044 26096 15736 -2939 -20046 -27015 -20314 -3827 14365
$$ packed form
2523B7195j51j3395j9786j6308o435Q486J8861J9713R855l786j5839j9266j4562
2536b5418k509J1890K0352J7694N884p546j6803j8417j2028P70J4567K1325J5457
2549B5218K465j1144j8161j7907q571N205J7304J9732J2569r29j3119j9003j6161
2562b2502n742Q382J9413J8811R614m908j5504j8932j4141j415J2563J9396J6288
2575B1323N861p225j6676j8677j2246K674J5111J9859J4543J971j0397j8112j7966
2588a9957q150O579J6768J9059J1421r42j2691j8855j6121m764R602J8796J7923
2601A8668Q083m434j5084j9038j3541n15J2406J8983J6018N390p953j6909j8278
2614a6204j0695L403J4654J8765J4121K052j0360j8675j7107o969O701J6487J8192
$$ plain form
2627 14365 25923 24631 11230 -7876 -23262 -26485 -16567 986 17796 26272 21833 6624 -12199
2640 -12199 -25451 -25149 -12650 5654 21535 26605 18615 1303 -16355 -26328 -22978 -8089 10476
2653 10476 23974 25594 14474 -3819 -19299 -25948 -19851 -3725 14754 25735 24138 9693 -8616
2666 -8616 -22610 -25226 -15577 874 17584 26223 21472 5190 -13327 -24555 -23881 -12097 5746
2679 5746 21241 26009 18082 981 -16554 -25430 -21864 -7555 10593 23566 25023 13796 -3877
2692 -3877 -19904 -25987 -19255 -2694 15050 25368 22520 9094 -8440 -22193 -25133 -15999 1250
2705 1250 18344 26250 20207 4206 -13388 -23845 -23082 -11545 6071 21442 25640 16937 -169
2718 -169 -16818 -24979 -21109 -6846 10629 23517 24383 13370 -4772 -20693 -25417 -17896 -1731
$$ packed form
2627A4365J1558j292j3401j9106j5386l223R918J7553J6810Q476m439j5209j8823
2640a2199j3252L02J2499J8304J5881N070p990j7312j7658r973L350J4889J8565
2653A0476J3498J620j1120j8293j5480o649O097J6126J8479J0981j597j4445j8309
2666h616j3994k616R649J6451J6710Q639m751j6282j8517j1228O74J1784J7843
2679E746J5495M768p927j7101j7535q876L566J4309J8148J2973J457j1227j7673
2692c877j6027o083O732J6561J7744J0318k848j3426j7534j3753k940R134J7249
2705A250J7094P906o043j6001j7594j0457P63J1537J7616J5371M198q703j7106
2718a69j6649q161L870J4263J7475J2888Q66j1013j8142j5921m724P521J6165
$$ plain form
2731 -1731 14965 24215 21936 8844 -8692 -22622 -24973 -14936 2623 18682 25221 19150 3994
2744 3994 -12831 -23611 -23120 -10754 7192 21730 24721 15284 -929 -16605 -24248 -20700 -6829
2757 -6829 11271 23700 24056 11956 -5733 -19665 -24306 -17106 -1741 14681 24514 21995 8020
2770 8020 -10124 -22586 -23572 -13091 3492 18251 24553 18579 3391 -13265 -23825 -22262 -9476
2783 -9476 8524 21293 23333 14656 -1166 -16804 -24683 -20226 -5007 12506 23555 21983 10346
2796 10346 -5631 -18962 -23778 -17064 -977 16177 24660 20236 6114 -10569 -21546 -22694 -12886
2809 -12886 3515 18853 24286 17620 1767 -13876 -23356 -20998 -8527 8452 21000 23272 13903
2822 13903 -2005 -17299 -24213 -18704 -3452 12861 22147 21068 10245 -5497 -19438 -24139 -16045
$$ packed form
2731a731J6696R250k279j3092j7536j3930k351J0037J7559J6059O539o071j5156
2744C994j6825j0780M91J2366J7946J4538K991r437j6213j5676p643L548J3871
2757f829J8100J2429L56j2100j7689j3932m641P200J5365J6422R833k519j3975
2770H020j8144j2462r86J0481J6583J4759O302n974j5188j6656j0560J563J2786
2783i476J8000J2769K040q677j5822j5638p879M457J5219J7513J1049j572j1637
2796A0346j5977j3331m816O714J6087J7154Q483m424j4122j6683j0977j148R808
2809a2886J6401J5338N433o666j5853j5643r480K358J2471J6979J2548K272r369
2822A3903j5908j5294o914N509J5252J6313R286j079j0823j5742j3941m701Q094
$$ plain form
2835 -16045 1136 16940 23338 18446 5483 -9897 -21250 -22901 -12472 5234 19827 23585 15747
2848 15747 1318 -13661 -22625 -20833 -7798 9323 21301 22595 12821 -2740 -16836 -23360 -17698
2861 -17698 -3243 12411 22367 20909 9421 -6606 -20219 -23089 -14400 1606 15790 22267 18723
2874 18723 5954 -10366 -21982 -22326 -10637 5983 18808 22105 15919 1902 -13773 -23463 -20568
2887 -20568 -6672 9991 20539 21159 12199 -2402 -17135 -23319 -17634 -2741 13182 22033 19878
2900 19878 8722 -6774 -19698 -22445 -13866 1506 15836 22165 18242 5073 -10882 -21890 -21018
2913 -21018 -9888 5613 17929 21810 15811 1099 -14620 -22926 -19180 -5804 9397 19818 21254
2926 21254 12741 -2961 -17564 -22938 -16595 -1626 12751 21030 19707 8801 -7160 -19839 -22243
$$ packed form
2835a6045J7181J5804O398m892j2963j5380j1353j651J0429J7706J4593L758p838
2848A5747j4429j4979q964J792J3035J7121J1978J294r774j5561j4096o524N662
2861a7698J4455J5654R956j458j1488j6027j3613k870Q689J6006J4184O477l544
2874A8723j2769j6320j1616l44J1689J6620J2825L297o186j4017j5675r690K895
2887b0568J3896J6663J0548O20q960j4601j4733o184N685J4893J5923Q851k155
2900A9878j1156j5496j2924k747Q579J5372J4330O329l923j3169j5955j1008Q72
2913b1018J1130J5501J2316L881n999j4712j5719q306L746J3376J5201J0421J436
2926B1254q513j5702j4603n374O343J4969J4377Q279j323j0906j5961j2679k404
$$ plain form
2939 -22243 -13111 2210 15467 21703 17684 4456 -11200 -21330 -20481 -9300 5701 17893 21776
2952 21776 14830 90 -14691 -21941 -18075 -5506 8870 19716 21461 12091 -3955 -17976 -21881
2965 -21881 -15166 -1778 12518 21178 19661 7914 -8212 -19662 -20868 -12339 1719 15504 21902
2978 21902 17547 3726 -12166 -20897 -19342 -8879 5652 17842 21638 14439 -412 -14868 -21503
2991 -21503 -17472 -5254 9428 19974 20843 11093 -4959 -17496 -21130 -15014 -1457 12534 20996
3004 20996 18933 6950 -8507 -19093 -20325 -11886 1970 15432 21880 16717 2978 -11559 -20327
3017 -20327 -18827 -8556 5957 18253 21400 13169 -1618 -14696 -20666 -16753 -4922 9573 19937
3030 19937 20116 9765 -5438 -17017 -20408 -14461 -1140 13007 20797 18418 6258 -8886 -19218
$$ packed form
2939b2243R132J5321J3257O236m019j3228j5656j0130Q49J1181J5001J2192L883
2952B1776o946j4740j4781p250L866J2569J4376J0846J745r370j6046j4021l905
2965b1881O715J3388J4296Q660j517j1747j6126j1450j206Q529J4058J3785O398
2978B1902m355j3821j5892q731J555J0463J4531J2190L796p199j4851j4456o635
2991b1503M031J2218J4682J0546Q69r750j6052j2537l634O116J3557J3991Q462
3004B0996k063j1983j5457j0586j232Q439J3856J3462O448n163j3739j4537q768
3017b0327J500J0271J4513J2296L147q231j4787j3078n970L913J1831J4495J0364
3030A9937J79j0351j5203j1579l391N947J3321J4147P790k379j2160j5144j0332
$$ plain form
3043 -19218 -20077 -11374 2890 16354 20867 15694 2436 -11721 -20026 -18787 -8327 6611 18016
3056 18016 20564 12557 -1441 -14445 -20789 -16845 -4360 10604 19723 19182 8701 -4797 -16591
3069 -16591 -20274 -14382 -428 13650 20476 17180 5310 -8845 -18598 -19924 -11056 3192 16084
3082 16084 20750 14866 1490 -12038 -19676 -18008 -7144 7161 18145 19906 11888 -1742 -15107
3095 -15107 -20699 -15866 -3316 10678 19197 18361 8603 -5290 -16879 -20521 -13382 666 13837
3108 13837 19935 16378 5053 -8789 -18560 -19583 -10213 4280 16134 20332 13873 1061 -12219
3121 -12219 -19089 -17493 -6713 7640 18057 19709 11049 -2592 -14827 -19690 -14864 -3357 10492
3134 10492 19274 18338 8289 -6007 -17414 -19762 -12212 819 13195 19572 16364 4529 -9256
$$ packed form
3043a9218q59Q703J4264J3464M513n173j3258j4157q305J239J0460J4938J1405
3056A8016K548q007j3998j3004o344L944J2485J4964R119n41j0481j3498j1794
3069a6591l683N892J3954J4078O826l296j1870j4155r753j326Q868J4248J2892
3082A6084M666n884j3376j3528p638J668J0864J4305J0984J761q018j3630j3365
3095a5107n592M833J2550J3994Q519q36r758j3893j1589l642P139J4048J3171
3108A3837O098l557j1325j3842r771j023R370J4493J1854M198o459j2812j3280
3121a2219o870J596J0780J4353J0417J652q660j3641j2235m863M826J1507J3849
3134A0492Q782r36j0049j4296j1407k348P550J3031J2376O377l208j1835j3785
$$ plain form
3147 -9256 -18597 -18562 -9328 4671 16046 18858 13689 1169 -12046 -19465 -17293 -6137 8090 18079
3161 18079 18624 10126 -2962 -14522 -19177 -14955 -2838 11026 19356 17577 6970 -6578 -16751
3174 -16751 -18545 -11826 1007 13363 19989 15769 3654 -9918 -18578 -17793 -8634 4779 15953
3187 15953 18984 13508 326 -12488 -19231 -16185 -5356 8101 17574 18066 9966 -2822 -14688
3200 -14688 -19335 -14022 -1448 11587 18682 16197 6336 -6442 -16640 -18630 -12054 1405 14389
3213 14389 19188 14720 3142 -9923 -17841 -17497 -8822 5231 16149 18755 12056 -576 -12629
3226 -12629 -18612 -15478 -4695 8383 17143 17858 9566 -3727 -15090 -19093 -13374 -939 11797
3239 11797 18158 16174 6385 -6853 -16962 -18309 -10528 2551 13917 18637 13910 2976 -9750
$$ packed form
3147i256r341L5R234J3999J1375K812n169j2520j3215p419K172J1156J4227R989
3161A8079N45q498j3088j1560m655M222J2117J3864Q330j779j0607j3548j0173
3174a6751j794O719J2833J2356O626m220j2115j3572q660P85R159J3413J1174
3187A5953L031n476j3182j2814o743L046J0829J3457R473M92q100j2788j1866
3200a4688m647N313J2574J3035P095k485r861j2778j0198j990O576J3459J2984
3213A4389M799m468j1578j3065p918L44Q675J4053J0918K606o699j2632j2053
3226a2629n983L134J0783J3078Q760P15q292j3293j1363m003N719J2435J2736
3239A1797O361j984r789j3238j0109j347P781J3079J1366M720m727j0934j2726
$$ plain form
3252 -9750 -17824 -16849 -7886 5774 16306 18325 11281 -838 -12623 -18584 -15322 -4155 8782 17442
3266 17442 17405 8568 -4243 -14762 -18483 -12963 -701 11466 18113 15890 5453 -7352 -16706 -17632
3280 -17632 -9832 2615 13817 18260 13857 2444 -10148 -17571 -16278 -6962 5920 15644 17993
3293 17993 11204 -1000 -12688 -18253 -14627 -3834 9642 17381 16917 8171 -4742 -14589 -17875 -12010
3307 -12010 -738 11397 18205 15273 4902 -7623 -16258 -17294 -9283 2980 13898 18051 13291
3320 13291 1521 -10565 -17342 -15765 -6446 5844 15525 17484 10568 -1790 -12867 -17765 -14098
3333 -14098 -3252 9229 17144 16430 7277 -4781 -14869 -17554 -11691 217 12025 17786 14503
3346 14503 4315 -7843 -16312 -16425 -8571 3478 14307 17486 12350 1114 -10476 -16877 -15095
$$ packed form
3252i750q074R75Q963J3660J0532K019p044j2119j1785n961L262J1167J2937Q660
3266A7442l7q837j2811j0519l721N520J2262J2167O647k223j0437j2805r354r26
3280a7632P800J2447J1202M443m403j1413j2592p423J293R316J2882R724K349
3293A7993o789j2204j1688n565L626J0793J3476P739m64q746j2913r847l286N865
3307a2010J1272J2135O808k932j0371j2525q635j036Q011J2263J0918M153m760
3320A3291j1770j2086o777J577R319J2290R681J959o916j2358j1077m898L667
3333a4098J0846J2481P915p14r153j2058j0088k685N863J1908J1808N761l283
3346A4503j0188j2158q469j13P854J2049J0829L179n136j1236j1590o401J782
$$ plain form
3359 -15095 -6019 6434 15888 16949 9585 -2144 -12564 -17661 -13382 -2528 9916 16959 15733
3372 15733 6782 -5199 -14812 -17360 -10843 711 11986 17491 14028 3750 -8287 -16059 -16235 -8214
3386 -8214 4109 14097 17106 11723 667 -10860 -17097 -14985 -5061 7104 15711 16327 9296 -2819
3400 -2819 -13036 -17225 -12658 -2283 9961 16612 15269 6281 -5530 -14771 -17175 -10373 1264 12425
3414 12425 16766 13340 3256 -8302 -15902 -15738 -7550 4248 14220 16991 11203 148 -11090 -16693
3428 -16693 -14032 -4378 7265 15387 16039 8594 -2750 -13025 -16741 -11921 -1532 9768 16179 14652
3442 14652 5691 -6287 -14738 -16412 -9540 1870 12083 16522 12890 2860 -8659 -15835 -15322 -6829
3456 -6829 5190 13880 16101 10477 -251 -11433 -16216 -13442 -4200 7463 15523 15525 7853 -3210
$$ packed form
3359a5095R076J2453R454J061p364j1729j0420n097M279J0854J2444P043j226
3372A5733q951j1981r613k548O517J1554J1275N505l463j0278j2037p772j76Q021
3386h214J2323R988L009n383j1056j1527o237K112R924J2165Q607O16p031j2115
3400b819j0217m189M567J0375J2244O651j343q988j1811r241k404O802J1637J1161
3414A2425M341l426j0084j1558p600J64Q188J1798R972K771n788j1055j1238n603
3428a6693K661R654J1643Q122O52p445j1344j0275l716M820J0389J1300O411j527
3442A4652q961j1978q451j674O872J1410J0213M439l632j0030j1519p176N13Q493
3456f829J2019Q690K221n624j0728j1182m783K774R242J1663Q060Kp672j1063
$$ plain form
3470 -3210 -13078 -16497 -11568 -1058 9955 16366 14252 5447 -6323 -14817 -15849 -8585 2083 12066
3484 12066 16314 12597 2331 -9212 -15800 -14633 -6192 4863 14124 16105 10145 -887 -11119
3497 -11119 -15983 -13160 -3703 7686 15648 15250 7637 -3844 -13074 -16271 -11070 -451 10189 16057
3511 16057 13457 4920 -6473 -14330 -15487 -8888 2557 12052 16330 12238 1519 -9284 -15471 -14108
3525 -14108 -6320 5146 14068 15945 9526 -1135 -11364 -15819 -12811 -3012 8051 14966 14928 6968
3539 6968 -3954 -13092 -15630 -10456 56 10240 15659 12714 4238 -6672 -14303 -15216 -8143 2588
3553 2588 12548 15754 11093 1242 -9223 -15316 -14084 -5444 5707 13996 15283 8762 -1477 -10989
3567 -10989 -15420 -12567 -2817 8439 15403 14219 5995 -4296 -12881 -15426 -10281 205 10571 15505
$$ packed form
3470c210r868l419M929J0510J1013O411k114q805j1770q494j032P264J0668R983
3484A2066M248l717j0266j1543o588J167Q441J1055R261J981n960j1032j0232
3497a1119m864K823R457J1389P962l98p613j1481r230l197N201J0619J0640N868
3511A6057k600q537j1393p857j157O599J1445R495M278m092j0719j0803o187J363
3525a4108P788J1466Q922J877o419j0661j0229m455L008R799J1063O915l8p960
3539F968j0922r138k538N174J0512J0184N419k945q476j0910p631r13P073J0731
3553B588R960L206m661r851j0465o093J232Q640J1151Q289J287o521j0239r512
3567a0989m431K853R750J1256O964j184q224j0291q585k545N145J0486J0366M934
$$ plain form
3581 15505 12503 3846 -6941 -14568 -14558 -7909 3431 12627 15088 10858 1146 -9071 -15251 -13408
3595 -13408 -4575 5951 13653 14761 8782 -1615 -11191 -15041 -11773 -1773 8683 14678 13684 6097
3609 6097 -4338 -12949 -15173 -9663 937 10625 15156 12257 3119 -7063 -14331 -14299 -7167 3223
3623 3223 12343 14988 10312 550 -9669 -14868 -12756 -4187 6298 13567 14439 8041 -2314 -11882
3637 -11882 -15003 -10631 -1227 8517 14176 13441 5715 -4916 -13308 -14865 -8854 1787 10550 14914
3651 14914 11734 2916 -7186 -14057 -13944 -6380 3938 12318 14613 9717 431 -9468 -14965 -12079
3665 -12079 -4166 6395 13760 13947 7423 -2799 -11557 -14748 -10439 -1509 8487 14540 13357 4978
3679 4978 -5302 -13367 -14195 -8420 1501 10443 14516 11588 2790 -7838 -14305 -12976 -5859 3899 12174
$$ packed form
3581A5505l002q657j0787p627J0O649J1340R196K461m230r712j0217o180J843
3595a3408Q833J0526P702J108n979j0397r576l850L268J0000J0456N995r94p587
3609F097j0435q611k224N510J0600R688M531k899r138j0182p268L2P132J0390
3623C223R120K645m676r762j0219n199K112Q569J0485P269Q72o398j0355r568
3637a1882l121M372R404R744N659p35p726j0631q392j557O011J0641Q763M364
3651A4914l180q818j0102o871J13P564J0318Q380K295m896r286r899n497K886
3665a2079P913J0561P365J87o524j0222q758l191M309Q930R996O053j183q379
3679D978j0280q065q28N775R921Q942M073k928q798j0628o467J329P117R758Q275
$$ plain form
3694 12174 14507 9281 -135 -10044 -14480 -11869 -3737 6493 13361 13687 7074 -2858 -11505 -14497 -10050
3709 -10050 -1030 8818 14160 12624 4564 -5492 -12606 -13684 -8290 1734 10955 14581 10967 2008
3723 2008 -7951 -13900 -12927 -5744 4085 11981 14149 9150 -749 -10180 -14316 -11138 -2895 6542 13494
$$ packed form
3694A2174K333n226r416r909m436K611Q132J0230O868L26o613r932q647k992M447
3709a0050R020R848N342j536q060j0056p114j078N394J0024R221L626l614q959
3723B008r959n949R73P183R829P896K168m999r899r431m136L178Q243R437O952
$$ [...]
##END NTUPLES=NMR FID
##END=
