##TITLE=1H_LR-685A-OC1-AK
 D2O, 8 sc, 
 24.9.2019
##JCAMPDX= 6.0         $$ Bruker NMR JCAMP-DX V2.0
##DATA TYPE= NMR FID
##DATA CLASS= NTUPLES
##ORIGIN= UXNMR, Bruker Analytische Messtechnik GmbH
##OWNER= root
$$ XWIN-NMR		Version 3.5
$$ Tue Sep 24 14:13:24 2019 Russian Standard Time (UT+4h)  she@DPX200
##.OBSERVE FREQUENCY= 200.1315
##.OBSERVE NUCLEUS= ^1H
##.DELAY= (6, 6)
##.ACQUISITION MODE= SIMULTANEOUS
##.ACQUISITION SCHEME= undefined
##.AVERAGES= 8
##.DIGITISER RES= 18
##SPECTROMETER/DATA SYSTEM= spect
##.PULSE SEQUENCE= zg30
##.SOLVENT NAME= CDCl3
##.SHIFT REFERENCE= (INTERNAL, CDCl3, 0, 15.7039)
##AUDIT TRAIL= $$ (NUMBER, WHEN, WHO, WHERE, WHAT)
$$ ##TITLE= Audit trail, XWIN-NMR		Version 3.5
$$ ##JCAMPDX= 5.01
$$ ##ORIGIN= Bruker BioSpin GmbH
$$ ##OWNER= she
$$ F:/spectra/data/she/nmr/H-F/1/audita.txt
$$ ##AUDIT TRAIL=  $$ (NUMBER, WHEN, WHO, WHERE, WHAT)
(   1,<2019-09-24 14:12:17.92 +0400>,<she>,<DPX200>,
      <created by zg, POWCHK disabled, PULCHK disabled
       configuration hash MD5:
       00 E9 B6 7A A2 85 ED C7 34 08 36 98 17 FE 4E 26
       data hash MD5: 16K
       36 92 AF 79 03 5E CF 89 6B 6A C8 1C 60 AB 8E 8F>)
$$ ##END=
$$ 
$$ hash MD5
$$ E3 33 B9 E4 3E 41 C0 51 FE A9 1E 88 7B 48 0F 62
##$RELAX= 
##$RELAX= 
##$RELAX= 
##$RELAX= 
##$RELAX= 
##$RELAX= 
$$ Bruker specific parameters
$$ --------------------------
##$DU= <F:/spectra>
##$EXPNO= 1
##$NAME= <H-F>
##$PROCNO= 1
##$TYPE= <nmr>
##$USER= <she>
##$AMP= (0..31)
100 100 100 100 100 100 100 100 100 100 100 100 100 100 100 100 100 100 
100 100 100 100 100 100 100 100 100 100 100 100 100 100 
##$AQSEQ= 0
##$AQ_mod= 1
##$AUNM= <au_zg>
##$AUTOPOS= <>
##$BF1= 200.13
##$BF2= 200.13
##$BF3= 200.13
##$BF4= 200.13
##$BF5= 200.13
##$BF6= 200.13
##$BF7= 200.13
##$BF8= 200.13
##$BYTORDA= 1
##$CFDGTYP= 0
##$CFRGTYP= 5
##$CHEMSTR= <none>
##$CNST= (0..31)
1 1 145 1 1 1 1 1 1 1 1 1 1 1 1 1 1 1 1 1 1 1 1 1 1 1 1 1 1 1 1 1 
##$CPDPRG= <>
##$CPDPRG1= <>
##$CPDPRG2= <>
##$CPDPRG3= <>
##$CPDPRG4= <mlev>
##$CPDPRG5= <mlev>
##$CPDPRG6= <mlev>
##$CPDPRG7= <mlev>
##$CPDPRG8= <mlev>
##$CPDPRGB= <>
##$CPDPRGT= <>
##$D= (0..31)
0 1.2 0 0 0 0 0 0 0 0.06 0 0.03 0 0 0 0 0.0002 0 0 0 0 0 0 0 0 0 0 0 0 
0 0 0 
##$DATE= 1569319937
##$DBL= (0..7)
120 120 120 120 120 120 120 120 
##$DBP= (0..7)
150 150 150 150 150 150 150 150 
##$DBP07= 0
##$DBPNAM0= <>
##$DBPNAM1= <>
##$DBPNAM2= <>
##$DBPNAM3= <>
##$DBPNAM4= <>
##$DBPNAM5= <>
##$DBPNAM6= <>
##$DBPNAM7= <>
##$DBPOAL= (0..7)
0.5 0.5 0.5 0.5 0.5 0.5 0.5 0.5 
##$DBPOFFS= (0..7)
0 0 0 0 0 0 0 0 
##$DE= 6
##$DECBNUC= <off>
##$DECIM= 24
##$DECNUC= <off>
##$DECSTAT= 4
##$DIGMOD= 1
##$DIGTYP= 9
##$DL= (0..7)
0 120 120 120 120 120 120 120 
##$DP= (0..7)
150 150 150 150 150 150 150 150 
##$DP07= 0
##$DPNAME0= <>
##$DPNAME1= <>
##$DPNAME2= <>
##$DPNAME3= <>
##$DPNAME4= <>
##$DPNAME5= <>
##$DPNAME6= <>
##$DPNAME7= <>
##$DPOAL= (0..7)
0.5 0.5 0.5 0.5 0.5 0.5 0.5 0.5 
##$DPOFFS= (0..7)
0 0 0 0 0 0 0 0 
##$DQDMODE= 0
##$DR= 18
##$DS= 0
##$DSLIST= <SSSSSSSSSSSSSSS>
$$ [...]
##$SUBNAM2= <"">
##$SUBNAM3= <"">
##$SUBNAM4= <"">
##$SUBNAM5= <"">
##$SUBNAM6= <"">
##$SUBNAM7= <"">
##$SUBNAM8= <"">
##$SUBNAM9= <"">
##$SW= 24.0689530833862
##$SWIBOX= (0..15)
0 0 2 0 0 0 0 0 0 0 0 0 0 0 0 0 
##$SW_h= 4816.95568400771
##$TD= 16384
##$TD0= 1
##$TE= 0
##$TE2= 300
##$TE3= 300
##$TEG= 300
##$TL= (0..7)
0 120 120 120 120 120 120 120 
##$TP= (0..7)
150 150 150 150 150 150 150 150 
##$TP07= 0
##$TPNAME0= <>
##$TPNAME1= <>
##$TPNAME2= <>
##$TPNAME3= <>
##$TPNAME4= <>
##$TPNAME5= <>
##$TPNAME6= <>
##$TPNAME7= <>
##$TPOAL= (0..7)
0.5 0.5 0.5 0.5 0.5 0.5 0.5 0.5 
##$TPOFFS= (0..7)
0 0 0 0 0 0 0 0 
##$TUNHIN= 0
##$TUNHOUT= 0
##$TUNXOUT= 0
##$USERA1= <user>
##$USERA2= <user>
##$USERA3= <user>
##$USERA4= <user>
##$USERA5= <user>
##$V9= 5
##$VALIST= <valist>
##$VCLIST= <CCCCCCCCCCCCCCC>
##$VD= 0
##$VDLIST= <DDDDDDDDDDDDDDD>
##$VPLIST= <PPPPPPPPPPPPPPP>
##$VTLIST= <TTTTTTTTTTTTTTT>
##$WBST= 1024
##$WBSW= 4
##$XGAIN= (0..3)
0 0 0 0 
##$XL= 0
##$YL= 0
##$YMAX_a= 308458
##$YMIN_a= -459043
##$ZGOPTNS= <>
##$ZL1= 120
##$ZL2= 120
##$ZL3= 120
##$ZL4= 120
##$ABSF1= 10
##$ABSF2= 0
##$ABSG= 5
##$ABSL= 3
##$ALPHA= 0
##$AQORDER= 0
##$ASSFAC= 0
##$ASSFACI= 0
##$ASSFACX= 0
##$ASSWID= 0
##$AUNMP= <proc_1d>
##$AZFE= 0.1
##$AZFW= 0.1
##$BCFW= 1
##$BC_mod= 2
##$BYTORDP= 1
##$COROFFS= 0
##$CY= 11.3945322036743
##$DATMOD= 1
##$DC= 2
##$DFILT= <>
##$DTYPP= 0
##$F1P= 20.1720416913024
##$F2P= 0.152960286110954
##$FCOR= 0.5
##$FTSIZE= 0
##$FT_mod= 4
##$GAMMA= 1
##$GB= 0.15
##$INTBC= 1
##$INTSCL= 1
##$ISEN= 128
##$LB= 0.24
##$LEV0= 0
##$LPBIN= 0
##$MAXI= 10000
##$MC2= 0
##$MEAN= 0
##$ME_mod= 0
##$MI= 1.114404
##$NCOEF= 0
##$NC_proc= 0
##$NLEV= 6
##$NOISF1= 3.799351
##$NOISF2= 2.8
##$NSP= 1
##$NTH_PI= 0
##$NZP= 0
##$OFFSET= 15.70392
##$PC= 1
##$PHC0= -9570.51
##$PHC1= 8.60095
##$PH_mod= 1
##$PKNL= yes
##$PPARMOD= 0
##$PSCAL= 0
##$PSIGN= 0
##$REVERSE= no
##$SF= 200.130013532006
##$SI= 16384
##$SIGF1= 3
##$SIGF2= 2
##$SINO= 400
##$SIOLD= 16384
##$SREGLST= <1H.CDCl3>
##$SSB= 0
##$STSI= 0
##$STSR= 0
##$SW_p= 3612.71676300578
##$SYMM= 0
##$S_DEV= 0
##$TDeff= 0
##$TDoff= 0
##$TI= <>
##$TILT= no
##$TM1= 0
##$TM2= 0
##$TOPLEV= 0
##$USERP1= <user>
##$USERP2= <user>
##$USERP3= <user>
##$USERP4= <user>
##$USERP5= <user>
##$WDW= 1
##$XDIM= 8192
##$YMAX_p= 0
##$YMIN_p= 0
$$ End of Bruker specific parameters
$$ ---------------------------------
##NTUPLES= NMR FID
##VAR_NAME=  TIME,          FID/REAL,        FID/IMAG
##SYMBOL=    X,             R,               I
##VAR_TYPE=  INDEPENDENT,   DEPENDENT,       DEPENDENT
##VAR_FORM=  AFFN,          ASDF,            ASDF
##VAR_DIM=   8192,          8192,            8192
##UNITS=     SECONDS,       ARBITRARY UNITS, ARBITRARY UNITS
##FACTOR=    0.0002076,     1,               1
##FIRST=     0,             0,               0
##LAST=      1.7004516,     0,               0
##MIN=       0,             -459043,         0
##MAX=       1.7004516,     308458,          0
$$ Real data points
##PAGE= N=1
##DATA TABLE= (X++(R..R)), XYDATA
$$ [...]
3137E227l763m030k732l1K911L343L548J258j581l746l973k222Q95L409M016K635
$$ 5227 1464 -2566 -5298 -5329 -2418 925 4473 5731 4150 404 -3569 -5791 -4896 -1487 2529 5164
3153E164J80k475m271k987j586J925L876M168J650j053l024m006k435n77K398
$$ 5164 5344 2869 -1402 -4389 -5975 -4050 -174 3994 5644 4591 1567 -2439 -4874 -5451 -3053
3168c053L702M194J166k186l449m007j867N39L244M022K515R84k734m121l403
$$ -3053 649 4843 6009 3823 374 -3633 -5500 -4961 -1717 2305 4820 5804 3070 -1051 -4454
3183d454j411J704L459L833K488m31l239m066l103m30K709L852L564J077j448
$$ -4454 -5865 -4161 -702 3131 5619 5188 1949 -2117 -5220 -5650 -2941 911 4475 5552 4104
3198D104l492l996k010L36K953M141L005M86k371m023l469j064R92L594M005K263
$$ 4104 612 -3384 -5394 -5058 -2105 2036 5041 5527 3156 -867 -4336 -5400 -4408 -814 3191 5454
3214E454k89l056m143k696q43K213L734L875J586j591l458m259k097M12L144L934
$$ 5454 5165 2109 -2034 -4730 -5573 -3360 374 4249 5835 4244 786 -3473 -5570 -5158 -2014 1920
3230A920L115M41k020m296l356j373J171L321M594K159o60k933l965l010o11J874
$$ 1920 5035 5476 3456 -840 -4196 -5569 -4398 -1077 3517 5676 5016 2083 -1882 -4892 -5503 -3629
3246c629M169L558J662j358l347m121k337J83L233L798L223N48k459l523l437
$$ -3629 540 4098 5760 4402 1055 -3066 -5403 -5220 -1987 1811 5034 5582 3123 -400 -3837
3261c837j814R26L956M150K328p11k612m024l375p46K098L897L806J437j048l298
$$ -3837 -5651 -4725 -769 3381 5709 4998 2386 -1638 -5013 -5759 -3661 236 4042 5479 4431 1133
3277A133l867k481m7K638M245L287P56k383l534l320k169J068L263M392K457l10
$$ 1133 -2734 -5215 -5262 -2624 1621 4908 5664 3281 -253 -3573 -5742 -4674 -1411 2981 5438 5128
3293E128k605l555l706j044K210L857L525J730q80l134m121k694K30K476M102
$$ 5128 2523 -1032 -4738 -5782 -3572 285 3810 5540 4660 1526 -2595 -5289 -5059 -2583 1519
3308A519L204P33j558l750l864k057J262L228L989K214qj983m338l090q42J582
$$ 1519 4723 5456 3898 148 -3716 -5773 -4511 -1283 2706 4920 4912 2929 -1409 -4499 -5341 -3759
3324c759L750L767J757r53l158l451k943p65K690M273L172Q84j456l530l760j833
$$ -3759 -9 3758 5515 4562 1404 -2047 -4990 -5755 -3065 1208 4380 5264 3808 278 -3482 -5315
3340e315N38L273L750K782L99k606m128l245r97J885L155L799K136q23k943l918
$$ -5315 -4777 -1504 2246 5028 5427 2821 -1307 -4552 -5549 -3664 -509 3290 5426 4603 1660 -2258
3356b258k994m9K532L721L554J056j404l585l985k148P98L448L517K937J36k335
$$ -2258 -5252 -5301 -2769 952 4506 5562 4158 573 -3412 -5560 -4762 -1314 2203 5140 5276 2941
3372B941l790l478j072J599L402L557K313m58l192l783k683m83K009L821L370
$$ 2941 -849 -4327 -5399 -3800 -398 3159 5472 5014 1822 -1961 -4644 -5127 -3118 703 4073
3387D073J627j883l535l510k164R24K566L516L702J71k568l930l166j027J448
$$ 4073 5700 3817 282 -3228 -5392 -4468 -1902 1614 5316 5487 2919 -1011 -4177 -5204 -3756
3402c756L421L701K048o80k497m252l162o0K252L628L355J384j622l066l762k349
$$ -3756 -335 3366 5414 4734 2237 -2015 -5177 -5237 -2985 643 3998 5382 3760 694 -3068 -5417
3418e417O31K859L816L062J01j930l661l207j635J185L321L909K542p93k939l395
$$ -5417 -4786 -1927 1889 4951 5052 3122 -539 -3746 -5381 -4196 -875 3034 5576 4783 1844 -1551
3434a551k877m67J473L997L298J292j178l216l586k005J85K372M015K769Q58k066
$$ -1551 -4428 -4895 -3422 575 3873 5165 3987 771 -2815 -4820 -4635 -2263 1752 4521 5379 3313
3450C313l697l372j524J102L296L588K496l07k236m083l092j088J717M475L053
$$ 3313 -384 -3756 -5280 -4178 -882 2706 5202 4895 2659 -1424 -4516 -5604 -3887 588 3641
3465C641J475j077k926l608k551m6K678L689L400O21j748l651l642j392Q13L244
$$ 3641 5116 4039 1113 -2495 -5046 -5092 -2414 1275 4675 5296 3548 -103 -3745 -5137 -4324 -1080
3481a080L419K683o6k652l792k878q28K021L108L371J932p53l274l739k279k99
$$ -1080 2339 5022 4956 2304 -1488 -4366 -5194 -3173 -65 3306 5238 4485 1211 -2528 -4807 -5106
3497e106L113L115K933J038j785l281l367j756N69L417L606K164M3k121l655k999
$$ -5106 -1993 1122 4055 5093 3308 27 -3340 -5096 -4527 -1110 2496 4660 4703 2582 -1073 -4072
3513d072j040J408L326L658J740q45k764l527k368k75J687L725L644Q47j512l586
$$ -4072 -5112 -3704 -378 3280 5020 4175 1411 -2116 -4484 -4759 -3072 653 4297 5144 3632 46
3529D6l309j715Q63K385L636K459Q45k506l364l015j555J435L400L425J921j39
$$ 46 -3263 -4978 -4115 -1730 1906 4365 5210 2704 -660 -3675 -5230 -3795 -395 3030 4951 4812
3545D812l364l352k637k53J761L884L226J051j653k898l333j990r3K922L673K847
$$ 4812 1448 -1904 -4541 -4794 -3033 851 4077 5128 3475 577 -2756 -4746 -4839 -1917 1756 4603
3561D603K95k307l276k979j239Q30L360L839K151n93k808l452k789o99J882L656
$$ 4603 4898 2591 -685 -3664 -4903 -4073 -713 3126 5277 4684 1876 -1576 -4365 -5064 -3182 474
3577D74L419R21j000l206l395j904K02K957L147K595L77j595l258l259j488J088
$$ 474 3893 4814 3814 608 -2787 -4691 -4489 -1532 1615 4210 4587 2992 -266 -3525 -5013 -3925
3593c925L406L567K112j200k373l150l057o10J947L591L452J087p41l153l593
$$ -3925 -519 3048 5160 3960 1587 -1563 -4620 -5230 -3283 308 3760 4847 4106 953 -2640
3608b640j973L7K319L964K573P09j949k896l397j729R81L108L302K201J02k091
$$ -2640 -4613 -4576 -2257 1707 4280 4989 3040 144 -3253 -4982 -4001 -893 2409 4610 4712 2621
3624B621l799l013r05K121L108L255R80m84k385l755k529k01K815L676K473Q29
$$ 2621 -1178 -4191 -5096 -2975 133 3388 4368 3884 1499 -2256 -4785 -4986 -2171 1505 3978 4807
3640D807j554l028l459j850J113K721L671K031k65j757l552k674j136J578L430
$$ 4807 3253 225 -3234 -5084 -3971 -1250 2421 4452 4187 2430 -1122 -3796 -4932 -3354 76
3655G6L437J154p36k483l501k614J70K485L210K305J025r53l264l156j983P09
$$ 76 3513 4667 3931 1448 -2053 -4667 -4497 -2012 1198 3503 4528 3575 311 -2845 -4828 -4119
3671d119K928L223K283Q4j628l359l404q60J649L067K752K080n85k762l013k760
$$ -4119 -1191 2032 4315 4399 2771 -588 -3992 -4852 -3203 -136 2616 4696 4111 1349 -1664 -4424
3687d424l74K216L670K727R06j252k875l304j806M85K569L239K419N13j818l611
$$ -4424 -4798 -2582 1088 3815 4721 3469 594 -2710 -4516 -4031 -1462 1777 4196 4709 2891 -720
3703g20k948j128J377K891L322J813m57k552l530k417k02K066L145K872J173j115
$$ -720 -3668 -4796 -3419 -528 2794 4607 4150 1598 -1932 -4349 -4551 -2485 660 3532 4705 3590
3719C590k971l283j981O75K551K917K607L23j816l241l010r74J026L005L194J939
$$ 3590 619 -2664 -4645 -3970 -1419 1498 4105 4428 2612 -629 -3639 -4613 -3587 -582 2612 4551
3735D551m82k264l398k428l49J592K968K977J660j086l100l256j844M37K375L081
$$ 4551 4069 1805 -1593 -4021 -4370 -2778 190 3167 4827 3741 641 -2615 -4459 -4022 -1647 1434
3751A434K438P31j673l315l028j082J019K556L131K220j98k717k830k563o40J205
$$ 1434 3872 4603 2930 -385 -3413 -4495 -3476 -920 2211 4431 4233 1516 -1314 -3877 -4517 -3312
3767c312L715K875J131q69k918k711k186Q0K071L303K461Q51j746l323k404j275
$$ -3312 403 3278 4409 3540 622 -2089 -4275 -4195 -2124 1179 3640 4491 2745 -578 -2982 -4257
3783d257Q42K410L092K483m39k091l290k722k42J160K965K658J532l82k958k818
$$ -4257 -3415 -1005 2087 4570 4131 2040 -1250 -3972 -4214 -3054 -89 2569 4101 3719 761 -2057
3799b057j990o1K091L333K236P28j388k868k965j605R49K628K936K125R6k165
$$ -2057 -4047 -4108 -2017 1316 3552 4280 2892 24 -2941 -4546 -3597 -969 1967 4092 4188 2023
3815B023l047k525o41J118L110L086J466r82k548l084k014k00J897L214L126J77
$$ 2023 -1024 -3549 -4190 -3072 38 3124 4590 3608 1060 -2024 -4038 -4238 -2341 873 3999 4176
3831D176j036l170l141j069P71K550K804K070L34k265k813k944n25J450K348L283
$$ 4176 3140 -30 -3171 -4240 -3469 -919 1885 3955 4289 2024 -789 -3733 -4258 -2808 -460 2823
3847B823J558p26k477l235k213P6K282K566K724P26j125k606k998j768R52K208
$$ 2823 4381 3655 1178 -2057 -4270 -4194 -1912 654 3378 4104 2979 373 -2625 -4393 -3441 -1233
3863a233K817K564R2k025k717k928o01N77L177L157J449l81k927k673k033L8J414
$$ -1233 1584 4148 4240 2215 -502 -3430 -4031 -3454 -277 2880 4329 3948 1021 -1652 -3685 -3647 -2233
3880b233K687L111P71j426k729k653j591K56K424K968K406M7j822k842k895m57
$$ -2233 454 3565 4336 2910 181 -2472 -4063 -3807 -1383 1585 3991 4038 2216 -626 -3521 -3978
3896c978O47K865L039J459m60k092k984k609j01J631L323K438Q43j118k428k605
$$ -3978 -3331 -466 2573 4032 3572 1480 -1504 -4113 -4214 -2583 740 3178 4021 2903 475 -2130
3912b130j841K64K411L109K016R9j869k787k428j130J024K586L019J623m04k130
$$ -2130 -3971 -3707 -1296 1813 3829 3928 2059 -728 -3156 -4286 -3262 -676 2343 3966 3562 1432
3928A432k905k302l95J835K554K893R33p28k806k837j557L27K092K244K782M59
$$ 1432 -1473 -3775 -4170 -2335 219 3112 4045 3317 511 -2326 -3883 -3556 -1464 780 3562 4021
3944D021j431l316k319j046J013K671K372K014j96k326k671k404k53J569K516
$$ 4021 2590 -726 -3045 -4091 -3078 -407 1965 3979 3783 1457 -1214 -3618 -3871 -2302 214
3959B14K627J316q98k406k999j561L60K017K596K221L80j448k530k945p80O91
$$ 214 2841 4157 3259 853 -2146 -3707 -3347 -1330 1266 3487 3867 2419 -111 -3056 -3836 -3145
3975c145K391K933J594k7k286k489k438m35J222K440K873J361j036j977k801j594
$$ -3145 -754 2179 3773 3746 1460 -1029 -3467 -3902 -2680 -240 2633 3994 2958 981 -1820 -3414
3991c414j19J754L167J721J142j739k490k972r83O84K565K504J866J37k061k839
$$ -3414 -3533 -1779 1388 3109 4251 2512 22 -2950 -3933 -3249 -684 1820 3686 3823 1762 -1077
4007a077k364j94J157K705K445J114m80k390k556k157l8K096K350K682K86q96
$$ -1077 -3441 -3635 -2478 227 2672 3786 3306 916 -1640 -3797 -3835 -1739 611 3293 3579 2683
4023B683k575k649j489Q91K135K529K154j26j613k796k240n17R39K314K658J626
$$ 2683 108 -2541 -4030 -3139 -1004 1525 3679 3553 1940 -856 -3096 -3613 -2674 -360 2298 3924
4039C924p98k171k661j771j71J608K783K411P47j563k064k607j419L50K376K333
$$ 3924 3126 955 -1706 -3477 -3648 -2040 743 3154 3901 2338 274 -2333 -3752 -3402 -1026 1307
4055A307K119L54j881k640k343o54Q42K717K719J144m97j788k991j919K23J290
$$ 1307 3426 3780 1899 -741 -3084 -3738 -2896 -179 2540 3684 3187 1399 -1592 -3511 -3288 -1998
4071a998K628K521M97r05k490k455j635O59J838L082J520J25j285k592k158o67
$$ -1998 630 3151 3648 2743 253 -2202 -3837 -3178 -1340 1742 3262 3387 2102 -490 -2648 -3315
4087c315L32K507K718J283l01j863k403j987l60J592K133K687P78r91k418k279
$$ -3315 -2983 -476 2242 3525 3224 1361 -1042 -3029 -3389 -1797 336 3023 3801 2810 392 -1887
4103a887j640K71K259K247J981J04j127k486k274r07M89K514K501J286j31j833
$$ -1887 -3527 -3256 -997 1250 3231 3335 2208 -278 -2552 -3459 -2970 -456 2045 3331 3200 1367
4119A367k595k157j68J230K667K278J281r91k236k463j802M06J705K521K149K82
$$ 1367 -1228 -3385 -3553 -2323 344 2622 3903 2912 676 -1787 -3589 -3183 -1478 1043 3192 3474
4135C474j055k768k406q57R13K111K311J801j23k045k274k264k65J257K274K418
$$ 3474 2419 -349 -2755 -3612 -2699 -588 1723 3524 3401 1356 -918 -3182 -3447 -2190 84 2502
4151B502Q19m78k226k352j775P6J910K467K102L50j096k270k356j103O46K091
$$ 2502 3321 2843 617 -1735 -3510 -3434 -1524 943 3045 3395 2299 29 -2327 -3430 -2784 -693
4167f93K624J469j24j659k658j893k68R06K350K194J244p86k074k445j533J45
$$ -693 1931 3400 3276 1617 -1041 -2934 -3202 -2296 54 2248 3492 2706 632 -1813 -3346 -3201
4183c201J749K308J785Q56j165k481k144q72M19K218K131J278N24j530k801j907
$$ -3201 -1452 856 2641 3497 2332 -149 -2293 -3165 -2746 -528 1603 2881 3405 1875 -926 -2833
4199b833q15J566K147J913J509p52j842k250j724k32J549K422K039N59q06k383
$$ -2833 -3648 -2082 65 1978 3487 2735 893 -1357 -3081 -3313 -1764 658 2697 3256 2450 67
4215F7k024j371M02J985K785J420R5j564k662j781r02J179K540K146J214m52k003
$$ 67 -1957 -3328 -2926 -941 1844 3264 3359 1795 -867 -2648 -3550 -2371 169 2315 3529 3077 1074
4232A074k515j595K2J392K139J808R59p35k258k268j248J53K166K307J242N41
$$ 1074 -1441 -3036 -3014 -1622 517 2325 3284 2549 291 -1977 -3225 -3072 -906 1401 2643 3184
4248C184j268k522j770j061J143K285J967J366o52j543k435j485l16J437K118
$$ 3184 1916 -606 -2376 -3437 -2294 -9 1958 3324 2672 1129 -1306 -2791 -3107 -1670 448
4263D48K096P61p58k487k055j172L76J660K125J733M06j351k080j997j105J179
$$ 448 2544 3305 2547 60 -1995 -3167 -2791 -1131 994 2727 3133 1782 -298 -2295 -3400 -2221
4279b221J973J934J122l20j069k723j695r0J191K325K306L56m02k102k339j258
$$ -2221 -248 1686 2808 2488 1419 -1304 -2999 -3089 -1898 427 2733 3089 2687 585 -1754 -3012
4295c012%J801K317K112k71j061k302j541j039N95K058K216J226r1j866k006j662
$$ -3012 -3012 -1211 1106 3218 2947 1886 -416 -1957 -2996 -2401 -343 1873 3099 3008 1142 -864 -2526
4312b526q03J253K336J747Q19n70j520k226j542O13J282K071J669L29o00k194
$$ -2526 -3329 -2076 260 2007 2826 2256 736 -1490 -3032 -2419 -1137 934 2603 2932 2332 138
4328A38k402j227R40J890K080J444q8j240k430j554m95J203J703K300P93l73k022
$$ 138 -2264 -3491 -2551 -661 1419 2863 2775 1535 -895 -2449 -2944 -1741 -38 2262 3055 2682 660
4345F60k018j363L4J409K136J728N54j185k099k009j000P17J402K469J214L36
$$ 660 -1358 -2721 -2687 -1278 858 2586 3140 1955 -144 -2153 -3153 -2436 -1034 1435 2649 2985
4361B985j433k287j373p99J055J717J989R66R4j995k394j251M00Q95K498J425
$$ 2985 1552 -735 -2108 -2907 -1852 -135 1854 2820 2914 919 -1475 -2726 -2326 -1431 1067 2492
4377B492L68q71k112j851q54L88J591K200J724k90j635k163r60r20Q81J840K166
$$ 2492 2860 1989 -123 -1974 -2828 -2440 -849 1351 3075 2785 1150 -1013 -1973 -2893 -2012 -172 1994
4394A994R79k46k242j764j169j97J175K246J846L28r96j542k152r92L88J603K216
$$ 1994 2973 2727 485 -1279 -2448 -2645 -1470 776 2622 2950 1954 412 -1740 -2732 -2344 -741 1475
4411A475J340L6j344k028j700q12O63K109K091J252l96j596j894j783P8R12K235
$$ 1475 2815 2851 1507 -521 -2221 -3033 -2370 -261 1830 3082 2686 1090 -804 -2587 -2509 -1597 638
4428F38J604M41q55j340k039j189J26J590J899J692K85j475j752k110l46O29K343
$$ 638 2242 2683 1828 488 -1551 -2740 -2614 -1024 875 2567 2852 1377 -375 -2485 -2831 -2202 141
4445A41J391R71j43j171j930j727k36J179K062J533O52o15j657k006j372K16J612
$$ 141 1532 2503 2360 1189 -741 -2468 -2704 -1525 537 2070 2722 2107 450 -1556 -2928 -2712 -1100
4462a100K317J367P0j122j619k110n89O02J983J726J172J32j498k065j481l81
$$ -1100 1217 2584 2654 1532 -87 -2197 -2786 -2184 -201 1525 2697 2829 1331 -734 -2215 -2596
4478b596R12J916J752P81n06j410k351j102N00J008J790J638O50r77k054j791
$$ -2596 -1684 232 1984 2765 2259 849 -1502 -2604 -2104 -1096 694 2332 2982 2005 -49 -1840
4494a840j095Q08J760J686J311j77j127k055j697q6R53J509K049O77l83j678j808
$$ -1840 -2935 -2127 -367 1319 2630 2453 1326 -729 -2426 -2512 -1559 -50 1999 2676 2293 615 -1193
4511a193j477K80J102J711J959N00j245j775j639p72K92J412K190J262L51k058
$$ -1193 -2670 -2390 -1288 423 2382 2882 1637 -138 -1777 -2549 -2257 -845 1345 2607 2958 900
4527I00j471j519n59R08J417K041P84N2j872j852j161J6J055J895J136O71n19
$$ 900 -571 -2090 -2649 -1741 -324 1717 2501 2553 681 -1171 -2332 -2316 -1261 634 1770 2441 1922
4544A922j623j809q99J11J211K402J234n0j164j711j515q09O00K157J595P37l99
$$ 1922 299 -1510 -2409 -2298 -1087 1315 2549 2499 1335 -376 -1891 -2700 -2100 57 1652 2389 1990
4561A990j164j655j603j9J333J503J387P76n61j437j877j095J04J395J974J339
$$ 1990 826 -829 -2432 -2451 -1118 385 1772 2548 1987 550 -1327 -2422 -2318 -923 1051 2390
4577B390%j017j936j434p72J020J314K065R35k29j242j963j265o15J501J434J967
$$ 2390 2390 1373 -563 -1997 -2769 -1749 -435 1630 2565 2336 1094 -869 -2134 -2749 -1248 186 2153
4594B153M59m96j511j698j543N41J048J994R87J31n42j559j692p63M76J635J606
$$ 2153 2612 2116 605 -1093 -2636 -2095 -1047 947 1934 2065 1523 -36 -1728 -2491 -2015 -380 1226
4611A226J008rj222j846j261J11K45J539J948R00q51j221j600j460PJ400J870
$$ 1226 2234 2225 1003 -843 -2104 -1993 -1748 -209 1739 2639 1788 567 -1033 -2493 -2486 -1086 784
4628G84J165O27r57j732j741n52M05J634J128J248N0j186j660j109o70R39J736
$$ 784 1949 2576 1619 -113 -1854 -2406 -2001 -367 761 2009 2059 873 -787 -1896 -2566 -1627 109
4645A09J538P28l02j602j601j088j40J380J360J713K01o95j699j425p20N06J330
$$ 109 1647 2375 2073 471 -1130 -2218 -2358 -978 382 2095 2296 1601 -98 -1523 -2243 -1737 -407
4662d07J651R21J24j055j854j510j95P26J631J490P41l82j359j650q78J12O15
$$ -407 1244 2165 2289 1234 -620 -2130 -2325 -1599 32 1522 2263 1881 522 -1128 -2006 -1894 -1279
4679a279J697J367L85n60j416j911n16L43J332J717Q18J72j228j453j067m57M47
$$ -1279 418 1785 2170 1610 194 -1717 -2233 -1890 -558 1159 1977 2149 921 -532 -1599 -2056 -1609
4696a609J836Q82J191m67j332j296j059k10J102J252J281P45o20j506j576p13
$$ -1609 227 1109 2300 1833 501 -795 -1854 -2064 -962 290 1571 2316 1696 190 -1386 -2099
4712b099m1J529J196J686p7q44j695j650l57Q04J205J676O86l74p42j768j393
$$ -2099 -2140 -611 585 2271 2194 1350 -345 -1995 -2352 -1548 -343 1333 2019 1645 903 -865 -2258
4729b258K10Q18J474J418Q83q30j330k089j62q8J015J872J184K76j365j239j529
$$ -2258 -2048 -1230 244 1662 2545 1715 385 -1704 -1866 -1954 -939 933 2117 2393 1028 -211 -1740
4746a740m70P66J318J316J279O4j866j357j103m61J163J266J430O11q19j083j504
$$ -1740 -2210 -1444 -126 1190 2469 2533 667 -690 -1793 -2254 -1091 175 1605 2216 1397 314 -1190
4763a190q63q8J317J390J373K7n13j506j594m47M06J314J772O57j43j141j555
$$ -1190 -2053 -2141 -824 566 1939 1966 1453 -53 -1647 -2094 -1688 -374 1398 2055 1912 771 -784
4780g84r79n91R77J619J259N92l15j162j427j350K7J302J118J730J53q54j389
$$ -784 -1763 -2354 -1377 242 1501 2093 1778 616 -811 -2161 -2134 -832 286 2016 2169 1315 -74
4797g4j212p54M52J061J296J233k00q65j414j374j87O31J430J213P57m47q87j740
$$ -74 -1286 -2040 -1588 -527 769 2002 1802 937 -477 -1851 -2038 -1407 23 1236 1993 1546 659 -1081
4815a081p71J77R59J211J300K25n33j372j590o25L07J219J539R27K6o91j727j187
$$ -1081 -1852 -1675 -716 495 1795 2020 1487 115 -1475 -2100 -1793 -574 965 1892 1918 1227 -500 -1687
4833a687k69N17J355J450Q42m00j349j423p72k5Q23J582J002M04m03j740j316
$$ -1687 -1956 -1439 -84 1366 2208 1808 459 -964 -1736 -1761 -938 644 1646 2050 1647 -93 -1409
4850a409o23L75R74J437J211r5r01j180j232o17M32J475J311N07J58q67j834j097
$$ -1409 -2032 -1657 -683 754 1965 1870 969 -211 -1443 -2060 -1628 -153 1158 1665 1823 956 -878 -1975
4868a975L7J075J030J276Q50p65j300j662o31L37R60J629R66J23p36j440j136
$$ -1975 -1938 -863 167 1443 2293 1528 228 -1434 -2065 -1728 -768 861 1827 1950 1214 -226 -1362
4885a362m29J46J256J381Q99n7p99j774q85k24Q24J191J319O17n02j329j522p31
$$ -1362 -1791 -1645 -389 992 1891 1834 1035 -739 -1624 -1848 -1024 167 1486 2103 1601 272 -1250 -1981
4903a981K74J391J017J052J15o17j221j488l91K65J130J346J140n70o70j376j271
$$ -1981 -1707 -316 701 1753 1868 1251 30 -1458 -1849 -1584 -454 892 2032 1462 792 -584 -1855
4920a855m8O99J195J463R6J31j181j222j375K77J170J144J162O3n05j030j408
$$ -1855 -1903 -1204 -9 1454 1550 1681 500 -722 -2097 -1820 -650 494 1656 1719 1214 184 -1224
4937a224p33L11J520J171R34k5j094j304r73n28M70J569J146Q22m18j085j259
$$ -1224 -1957 -1646 -126 1045 1979 1954 860 -444 -1417 -1945 -1475 94 1240 2062 1644 559 -700
4954g00j332K84Q36J431J077N29p14j751r87n49J07J474J212J106l88o72j408
$$ -700 -2032 -1748 -912 519 1596 2125 1411 -340 -1327 -1876 -1769 -295 917 2023 1635 963 -445
4971d45j093n38R88J044J021Q29r0j103j278r95k27R87R71J287N68j009o68j546
$$ -445 -1538 -2076 -1088 -44 977 1806 1716 613 -665 -1660 -1887 -900 71 1358 1926 917 249 -1297
4989a297m62K42J117J262P20N1o23j394j246j90L61J456J017R39J37j629j087
$$ -1297 -1759 -1517 -400 862 1582 1633 1010 -384 -1630 -1820 -1459 -3 1014 1953 2090 461 -626
5006f26j094J23P42J068J421L26o07j073j419p46M57Q71J074J130J40o65j374
$$ -626 -1720 -1597 -855 213 1634 1960 1353 280 -1139 -1885 -1428 -557 517 1647 1787 1122 -252
5023b52j204l64L77J077J600N41j83q54j217r37q17J163J295J068M56k41j032
$$ -252 -1456 -1820 -1443 -366 1234 1775 1592 738 -479 -1416 -2233 -1070 225 1293 1749 1508 476
5040D76j409q79K62J126R02J015J49m21j356r78p92N88N23J947L66Rr60r28r47
$$ 476 -933 -1812 -1550 -424 478 1493 1642 1221 -135 -1113 -1905 -1317 -794 1153 1519 1528 568 -360 -1307
5059a307k05M43J142J086N61j95r69j426p93k35J191R39J202L63p29q01j782p0
$$ -1307 -1512 -1069 73 1159 1720 1525 556 -870 -1663 -1898 -707 232 1434 1797 1068 267 -1515 -1585
5077a585l17J667R84P60N92j275j129r83k10K74J321R00L93k32o88j054q75k59
$$ -1585 -1902 -235 749 1509 2101 826 -303 -1286 -1496 -1222 99 999 1392 1160 472 -582 -1457 -1716
5095a716R77Q46J339Q5k97j380p56r32L73R18J154J327l43o35j272j046k51P42
$$ -1716 -739 107 1446 1531 1234 -146 -902 -1834 -1461 -543 611 1938 1595 960 -312 -1358 -1609 -867
5113h67N51J326O80q0j139j199r13K39M43J200P38N18Mj596q21q24J18P74J180
$$ -867 -316 1010 1690 1610 471 -728 -1641 -1402 -959 241 979 1497 1501 -95 -916 -1740 -1622 -848 332
5132C32J182L26p86j231j141m05K86J243J152L22J05r11j082q83k87R03J233P30
$$ 332 1514 1840 1054 -177 -1318 -1723 -1437 -194 958 1280 1385 474 -608 -1491 -1778 -875 358 1088
5150A088N12m44o09j684m90K36P27J035P21M94o32r73j228n19K69J324J221M30
$$ 1088 1600 1156 547 -1137 -1627 -1391 -664 371 1092 1586 954 -19 -1247 -1766 -1497 -173 1048 1478
5168A478j43q00j006r05l2N08R82J232O92q77j075p44q29J93M21J231R67K67o58
$$ 1478 1335 535 -471 -1376 -1408 -900 82 1314 2006 1129 54 -690 -1519 -1326 -905 326 1293 1560 902
5187I02r17q12j071N19J206P96J073r5j094j090q29k14Q08Q57J396L11j25j436
$$ 902 -15 -827 -1898 -1379 -173 623 1696 1601 507 -583 -1412 -1626 -818 39 1435 1746 1621 185
5205A85j087p43K61Q76P56J295J0l64j091j332k59L46N63J182J018k63n10j201
$$ 185 -902 -1645 -1384 -508 248 1543 1553 1189 98 -1234 -1493 -1147 -584 598 1616 1353 843 -358
5223c58j002l11P17P18J403K15k39r26j040q08R4N65J133J074M13o94j128n95
$$ -358 -1360 -1671 -954 -236 1167 1382 1143 217 -823 -1631 -1537 -972 161 1235 1648 954 -174 -769
5241g69o68J27P50J195Q18J40o05j421j007k27M00Q91J531N17l63q40q15q33j96
$$ -769 -1437 -1310 -560 635 1453 1593 988 -433 -1440 -1667 -1267 -376 1155 1672 1309 469 -346 -1179 -1375
5260a375M61J264R49K49j83j201q47o39k01J000J048Q67O1l86j305p40p24L43
$$ -1375 -914 350 1299 1548 1365 164 -683 -1322 -1523 -523 525 1392 1453 1067 -238 -978 -1702 -1359
5278a359J023P45J537p55p62r36o63j31L05J100J120N21n62j342o10o65K20R41
$$ -1359 -336 409 1946 1191 429 -507 -1170 -1301 -996 104 1224 1745 1183 -159 -769 -1434 -1214 -273
5296b73O39Q98K75m62j073r96m25R1J008R62J032m45o31r90r23k61K31J379R85
$$ -273 366 1264 1539 1077 4 -992 -1417 -1326 -318 644 1676 1231 600 -390 -1313 -1574 -1343 36 1021
5315A021L97l26l20j178j224M4P03J129R93L86o28j169p44o97J71R71J289O13
$$ 1021 1418 1092 772 -406 -1630 -1586 -883 246 1239 1625 997 -172 -916 -1613 -1442 -471 818 1431
5333A431l3q88q98q26j40L34R68J076N02l93q57q53p31j57P92J189P31L88p93
$$ 1431 1398 510 -388 -1214 -1354 -1020 -52 1024 1526 1133 276 -577 -1308 -1465 -673 516 1247 1635 842
5352H42q63q91m45L64N65J371J71M57o91j019j314K2M41R47Q12M07K81j223m85
$$ 842 -21 -912 -1357 -993 -428 943 1114 1571 880 -139 -1453 -1431 -990 -43 769 1176 1457 234 -251
5371b51j001k53P52R81J054J9l14r11r28p36M49Q69J046Q32k61m24j200o24p21
$$ -251 -1252 -1505 -753 228 1282 1301 987 76 -852 -1588 -1139 -270 776 1608 1347 923 -277 -901 -1622
5390a622N02J020Q44O46p9q49q18r86j90P26J065N66P22k96r89j092m65J46M17
$$ -1622 -1120 -100 744 1390 1311 462 -356 -1342 -1532 -806 259 825 1547 1251 262 -830 -1295 -1149 -732
5409g32J154P85J12k90j147j093l41N41O46J028N11J78n90j254p14m82Q55J120
$$ -732 422 1207 1319 1029 -118 -1211 -1552 -1011 -365 663 1174 1352 762 -492 -1206 -1688 -833 287
5427B87P52N88m94r90j186j7j72M16J300M85K41m80p49p19m23R9P67R59P24k18
$$ 287 1039 1627 1133 143 -1043 -1060 -1232 -816 484 969 1210 730 -19 -738 -1161 -1062 -295 664 1388 1170
5447A170l03r89j102p4K66J014O54R43o68o62q43o60J90J54J416O59K67k11j019
$$ 1170 867 -122 -1224 -1298 -1032 -18 636 1579 911 249 -594 -1254 -1064 -910 506 1165 1432 1221 202
5466B02j190l67kQ27J219N82j27n59r61p83k49M99Q97R37M24r3o71j042q74O2
$$ 202 -988 -1355 -1357 -530 689 1271 1144 585 -376 -1159 -1408 -909 -12 925 1349 1256 585 -457 -1331 -1269
5486a269O96R26Q86Q6m54m28j108j126Q98M62J093O46q0k70j053r42l81K75J158
$$ -1269 -573 353 1239 1325 871 443 -665 -1791 -893 -431 662 1308 1228 958 -95 -1037 -1418 -1143 15
5505A5R74M04m43n97p51p70k47Q58Q70O69M46k64o74j096o26Q1Q64N61P47M41
$$ 15 989 1393 950 353 -398 -1168 -1415 -557 313 982 1428 1164 490 -606 -1232 -1151 -287 274 1021 1462
5525A462n79j114o89p3k84J167M45P26J79p74p57j138J02K89P59J101N32J0j048
$$ 1462 883 -231 -920 -993 -1277 -110 335 1061 1240 466 -291 -1429 -1327 -1038 -279 822 1354 1364 316
5544C16j001o97P5O84Q07J113R2l59j208o47n78J92J005P60Q71l66j13j491p38
$$ 316 -685 -1382 -1307 -623 184 1297 1389 1030 -178 -825 -1403 -1211 -206 554 1425 1059 946 -545 -1283
5563a283K1L38Q74J000P51m39j050p48p35R9O69O72P98L60j75p84j085n80J42
$$ -1283 -1262 -924 -50 950 1701 1262 212 -536 -1271 -1172 -503 169 967 1327 1152 368 -717 -1297 -1155
5582a155O73J167Q06j46n72j063j177K8K17Q28J303L80K8q57j250n37n9O24P26
$$ -1155 -482 685 1491 1345 773 -290 -1467 -1439 -1222 -394 909 1289 1317 460 -790 -1327 -1386 -762 -36
5601c6J070K56j47j016j228k64L49N67J005N28N30p81r54q97l50K15J028R85N17
$$ -36 1034 1290 1143 127 -1101 -1365 -1016 -449 556 1084 1614 833 -121 -1018 -1368 -1153 -125 860 1377
5620A377J97j249q54p21k77N62R72J049J65k28r66o49o76o1P67J055P25R3k62
$$ 1377 1574 325 -529 -1250 -1527 -965 7 1056 1221 993 27 -622 -1298 -1359 -592 463 1188 1281 1019
5639A019j155p58o11K95J200P01N19J41p94q34q48k95L58J261P45N28m27n00j396
$$ 1019 -136 -894 -1505 -1210 -10 691 1210 1351 557 -277 -1125 -1420 -1062 199 944 1472 1045 545 -851
5658h51o40o2P79J213Q27rn22p74r53n33N49N50J226N45l37k01j365o34k89M95
$$ -851 -1491 -1553 -774 439 1266 1257 735 -39 -992 -1525 -976 -426 800 1345 1008 807 -558 -1192 -1481 -986
5678i86P89R98M71J73j302m12j316K56P89N82Q17K75l78j080n66n45J93Q69J179
$$ -986 -197 801 1272 1445 143 -269 -1585 -1329 -540 42 859 1134 756 -324 -890 -1435 -1242 -373 806
5697H06O02j2n39q78j020m00L84J017Q53J92L31j018j048j89l12M09J183P21L44
$$ 806 1408 1396 857 -21 -1041 -1441 -1057 -40 813 1005 1336 318 -730 -919 -1231 -822 361 1082 1426
5716A426n37q20o61n60K3P66J133M16R7n17p78q27m66n4J221Q58Q60k69p84j088
$$ 1426 889 69 -592 -1152 -1129 -363 770 1186 1283 766 -12 -839 -1305 -1359 -138 720 1580 1311 527 -561
5736e61o92l36N75J138R82M79n75p53r81o17K41M75N39J267M92q09r26q16l53
$$ -561 -1253 -1589 -1014 124 1106 1585 1010 257 -724 -1341 -1100 -625 -86 1181 1673 864 -62 -878 -1231
5755a231J57J073O88N90j16q22p66p26k56N70J007Q49K46j53j001p61r07L66N46
$$ -1231 -1074 -1 687 1277 1161 339 -427 -1153 -1409 -839 168 1017 1263 1110 109 -652 -1559 -1193 -647
5774f47Q53R82M4r3r58j109j93l6O33J539N45j55p16j291n40p3K24R71Q89Q07
$$ -647 206 1188 1232 1139 181 -928 -1121 -1157 -524 1015 1560 1405 689 -602 -1142 -1215 -991 -20 869 1676
5794A676n93p81r85k80l28P24P61P54N43k89j277p69m41J5P82R87Q48j95k66q66
$$ 1676 1083 302 -683 -963 -1291 -567 194 948 1491 1202 -75 -844 -1285 -1270 -488 499 1347 1152 886 20
5814B0j071m58O81R70Q86L25k24p76r97q44K78N45R13R91J18l18j078r20j78j03
$$ 20 -1051 -1509 -828 142 1028 1353 1129 353 -644 -1488 -1210 -665 248 1239 1357 1039 -39 -959 -1137 -1240
5834a240J142L30J149j0q29p16p95l29K60Q85P88R88l20p60r17p10o0L36J034
$$ -1240 -98 232 1381 1371 542 -174 -969 -1298 -1038 -153 635 1623 1303 543 -374 -1084 -1144 -808 226
5853B26N13P02n96o47n89q67P7O48J050N84N01p30j190q23j66L70M87J019Q27
$$ 226 739 1441 845 198 -391 -1258 -1181 -533 517 1101 1602 872 -318 -1141 -1307 -937 -450 569 1396
5872A396m57k56j125p80K41O5J211N85O69o07j008p10n36K22L29J143P28K74o07
$$ 1396 939 683 -442 -1222 -981 -916 295 880 1549 942 -66 -776 -1312 -1090 -761 382 1110 1384 777
5891G77r95p69k80K09O56J091P10k72n76q79j074Q1M41Q76R12l6J36p43j046o53
$$ 777 -218 -987 -1267 -1058 -402 689 1399 1127 551 -328 -1402 -1321 -880 -4 908 872 1008 265 -781 -1434
5911a434J66O57J217N68k9k23r58j308j77K46R35J200M17K6p73p40j174J39M2
$$ -1434 -1268 -611 606 1174 1145 922 -36 -1344 -1521 -1275 -340 860 1277 1303 530 -210 -1384 -1245 -1203
5930a203J306O34P88k26j051q00p27j43P66R44O31K07l05p55q91l09j33J132N19
$$ -1203 103 737 1525 1299 248 -552 -1279 -1422 -656 288 919 1126 821 66 -825 -1134 -1267 -135 384
5949C84R82j75l09r57j048k04K98R58R56L96j70p16o91j119K26K60J202P20N16
$$ 384 1366 1191 882 -75 -1123 -1327 -1029 -71 885 1281 1111 395 -296 -1415 -1189 -929 273 993 1509
5968A509n46j107p99m24J84O44J062P84l8l79r87q20k44Q6J093N15Q66j83p60
$$ 1509 963 -144 -943 -1367 -1183 -539 523 1307 1269 890 -97 -917 -1161 -1075 18 533 1399 1216 456
5987D56q74o41j94K00J106P86O00l42j141q44l77J92O19J018M40N68r87p22p08
$$ 456 -418 -1059 -1253 -1053 53 839 1439 1097 -44 -888 -1265 -1073 -454 564 1004 1572 585 -137 -845
6006h45m67M58P64R07N40J10j053r00q08J81O7J291N84M77j96n99j306m44K11
$$ -845 -1312 -854 -90 817 1357 1467 414 -486 -1294 -1113 -1046 245 829 1306 1110 511 -795 -1239 -1028
6025a028L26J154L28L80n25p44q30o01M73P72J195L96J30r35r34l90l32L63P18
$$ -1028 -702 452 780 1160 635 -109 -939 -1540 -1067 -295 900 1296 1426 491 -443 -833 -1165 -802 -84
6044h4J033J80O6j063j054k32K8M89J109O32QJ5j007j138n01L89P12J048P04m9
$$ -84 949 1129 1195 132 -922 -1154 -1126 -637 472 1104 1112 1127 120 -1018 -1519 -1130 -418 630 1334 1285
6064A285q55n55j058Q4L20O91Q30O82rr83j160l87J78M19P48N99O48p70q01p06
$$ 1285 430 -125 -1183 -1099 -779 -88 742 1424 1415 432 -728 -1115 -937 -518 230 829 1477 707 -94 -800
6084h00n15J87Q83O02J031k33m35r54r46k14K15J250O87L43n0n79r75o54l87O65
$$ -800 -1315 -1128 -245 357 1388 1155 720 -234 -1180 -1394 -1179 71 758 1101 1051 472 -503 -1157 -1544 -879
6104h79J215N95K44K11j193o37r85L51O50Q92Q15k31l34q88r04R8j04Q54J034
$$ -879 336 931 1175 1386 193 -444 -1429 -1078 -428 464 1279 1048 714 -174 -1078 -980 -1084 -230 804
6123H04P34k23p25q22j059j52Q32N73J134M02o73o84r41l51k48Q76J086N57L6
$$ 804 1538 1315 590 -232 -1291 -1443 -611 -38 1096 1498 825 141 -800 -1151 -1399 -523 563 1120 1156
6142A156l7j144o82o63O44M14Q61P48k06m29p67j120k86P47N14J108K73j78n74
$$ 1156 1119 -25 -707 -1370 -726 -312 549 1297 1091 662 -105 -1225 -1511 -764 -250 858 1131 953 379
6161C79j082n76K12M23Q07Q16P4r6j067q94l83M91O56R96L38K0o04p97j184M07
$$ 379 -703 -1279 -1067 -644 163 979 1053 957 -110 -1004 -1387 -896 -240 756 1094 1114 510 -287 -1471 -1064
6181a064J65J130R10J31n4r00j046p68K96O35P13R02J06n93n37r37p13O76N63
$$ -1064 -899 231 1141 1272 1218 318 -728 -1496 -1200 -565 148 1050 1156 563 26 -911 -1624 -948 -385
6200c85R34N48P8n99j000o46j60M43J034M61N32l43o33p22r30J71O36R38J019
$$ -385 549 1097 1175 576 -424 -1070 -1230 -787 247 708 1240 897 264 -458 -1388 -1217 -581 357 1376
6219A376k50k96n10j230m07M85N55O62M20M19n12q98q98R0L55O71P57R4K10p60
$$ 1376 1126 830 320 -910 -1317 -832 -277 385 805 1224 712 -186 -1084 -994 -639 32 789 883 1093 333
6239C33r86m70r2K46J316R71j53k65p10j027l55j0Q55J023K80J26o51q50o48l40
$$ 333 -653 -1123 -1215 -969 347 1318 1165 900 190 -837 -1192 -1202 -347 676 956 1082 431 -419 -1067 -1407
6259a407L52R85P95N71m8q32j106m66l33Q37R00Q44j41j02n79j027o07l5J021
$$ -1407 -1055 -70 725 1296 1248 416 -690 -1156 -1489 -652 248 1092 951 849 270 -757 -1364 -1399 -378
6278c78R11N67J62n30j166p46q2J27J250M97M78L04j164p46o92m9Q76K38J027
$$ -378 533 1100 1262 732 -434 -1180 -1262 -1135 115 612 1090 1394 230 -516 -1208 -1257 -381 -143 884
6297H84L13m19p85o01p28J48L67J356R27k19p00p09o78m07M53O11Q12P07k79p00
$$ 884 1197 778 -7 -608 -1336 -1188 -821 535 1462 1243 543 -166 -844 -1251 -798 -187 625 1332 1053 353
6317C53q53o57k5L28Q76R39L23n00m75q73o99J20N25J095O98J5l82r70r25l04
$$ 353 -500 -1157 -1182 -854 22 961 1284 784 309 -564 -1263 -1143 -618 477 1175 1190 808 -162 -1087 -1391
6337a391L89P90P82N84J2n88r73p88j99M82J058O55M55k54r31q19k93j07M98J053
$$ -1391 -1002 -212 570 1154 1166 578 -395 -1183 -1382 -900 158 813 1268 1014 83 -736 -1029 -1136 -638 415
6357D15Q55r2m22j091p21l67Q9J213N25Q03j52l87r98n29n71N13Q57J220J00o5
$$ 415 1270 1178 756 -335 -1056 -1423 -1334 -121 404 1207 1055 668 -330 -859 -1430 -917 -60 1160 1260 1195
6377A195q56q55o30K10O28R12N19K52m34r94p95m29J33O73J302J88J70n90j057
$$ 1195 339 -516 -1146 -936 -308 604 1123 1375 941 -53 -848 -1277 -1144 -471 831 1019 1189 599 -458
6396d58p67J87J38Q66J025J80K43j048q50o06J26K11R22J181J5l61q53q31p37
$$ -458 -1225 -1038 -900 -34 991 1171 1414 366 -484 -1090 -964 -753 169 1350 1365 1004 151 -680 -1417
6415a417K58O57J026N35K65o49p34r63k70O25L74J244J64J98m73j234o23k26L83
$$ -1417 -1159 -502 524 1059 1324 675 -59 -1022 -1292 -667 -293 951 1115 1313 840 -394 -1017 -1243 -860
6434h60J149Q00K5k09r32j179j69M03R12N42Q41K2p19n61j120k36M01Q09P47P35
$$ -860 289 1089 1114 905 -27 -1206 -1375 -972 -60 482 1323 1345 626 65 -1055 -1291 -890 -81 666 1401
6454A401j34q32p35p20m53N81R15Q24K76j11j027p66n39K88M53J090O11K74o06
$$ 1401 1267 435 -300 -1020 -1473 -892 23 847 1123 1012 -15 -781 -1320 -1032 -579 511 1122 1396 790
6473G90j040q29l44N14O91Q56Q37l67j060l66o64l26O67O04J068J06k24r85n04
$$ 790 -250 -1079 -1423 -909 -218 638 1475 1108 48 -318 -982 -1308 -641 -37 1031 1137 913 -72 -576
6492e76p66M50K00J058P66J65m85j133p42n05N95P68R32L51j25j74j253o32k98
$$ -576 -1342 -892 -692 366 1132 1297 812 -321 -1063 -1568 -973 -205 727 1078 953 779 -474 -1106 -1404
6511a404O14R76O30M03l91p00o69o85J66Q7J358O56L13o20j118l76o73J40R33
$$ -1404 -790 186 816 1219 828 128 -541 -1226 -1060 -973 385 1041 1354 734 -384 -760 -1433 -1293 -360
6530c60J106L95K92q24q67o90n73P30J035P24M56k56r38p65q53N69K48J102N30
$$ -360 746 1141 1433 609 -258 -948 -1521 -791 244 968 1424 1168 230 -535 -1388 -819 -571 531 1061
6549A061L27o52p73q03m55N80M00J020O09j61m68j013n29m00J79R36Q16M64l27
$$ 1061 1388 736 -37 -840 -1295 -715 -315 705 1314 1153 685 -328 -857 -1257 -1078 -142 674 1138 811
6568H11o11q67l30k54O98R00O74M20o78m31r87o92J5Q03R80O73l4m56j303j63
$$ 811 200 -667 -997 -1251 -553 347 1021 1441 763 332 -655 -1347 -1332 -529 451 1124 1090 634 -669 -832
6588h32k59L14O26R98L20j89m56j281o33L98L44J189M36K87l22o86j248k53J23
$$ -832 -1091 -777 -151 847 1167 978 522 -759 -1392 -994 -650 539 975 1262 940 254 -994 -1247 -1124
6607a124N84J106P52k74n17n75j095l3L29Q19P88M13m35m87o24r08lP50P08P89
$$ -1124 -540 566 1318 1044 527 -48 -1143 -1176 -847 -28 760 1173 738 251 -373 -1281 -1284 -534 174 963
6627I63K8p0r21n62n00M0Q47M69Q89n5n65j033l66m55J24P67J216M51k93m92j246
$$ 963 991 921 0 -562 -1062 -1022 -175 294 1183 1128 563 -470 -836 -1291 -1167 -400 816 1267 974 482 -764
6648g64o57L12L73Q02P36L73k31r14p61l09P6K07Q18J034J1k43r64r43m00N36
$$ -764 -1421 -1109 -736 66 802 1175 944 30 -731 -1040 -964 -757 61 1095 1106 863 -101 -1044 -1444 -908
6668i08Q26P86M20K60n13j197p64k54P41M99J089K67m7r21j061m07k4P32J144
$$ -908 -82 704 1124 1384 871 -326 -1090 -1344 -603 -104 985 1252 1205 284 -777 -1184 -1208 -476 668
6687F68J79L33k64r69q68l02M24N63P41Q26q4o52j205m93m54P78P43Q50O35q11
$$ 668 847 1180 916 -53 -921 -1223 -799 -236 505 1331 1247 595 -610 -1103 -1557 -779 -36 814 1449 638
6707F38m52p44j48p09J022L77J041J11l48n48j209m64K33P50J228O1K86n06j114
$$ 638 186 -558 -706 -1415 -393 -16 1025 1136 788 240 -969 -1433 -1200 -450 778 839 1125 619 -495
6726d95m33l41M47R04Q62J57j58p94m51o99q9O54P83P19J52n28p09r74l39N33
$$ -495 -928 -1269 -822 82 944 1101 943 149 -302 -1001 -1090 -436 347 1066 1218 690 -19 -993 -1332 -799
6746g99N85J008O87l04q68n35p08j97L64Q45Q44L35j94j035n00n80k45O82R02
$$ -799 -214 794 1481 1177 309 -226 -934 -1131 -767 78 922 1257 1063 28 -472 -1052 -1297 -615 287
6765B87P17L16m13j111l84o55J14P23Q27Q89j06l57j126p80k56P72L38J020M98
$$ 287 1004 1320 907 -204 -588 -1243 -1129 -406 421 1310 1204 847 -279 -1059 -1315 -543 -205 815 1313
6784A313l46n30j133k09j21L08P95P65N57m51p61q96p64N76N56N88J145n04Lj237
$$ 1313 967 437 -696 -905 -1026 -718 77 842 1399 948 187 -709 -1473 -897 -341 247 1392 888 891 -346
6804c46n21l70L79R12P25O33r7j003j046n53K19Q1J118P30J04k42o80o30n96J59
$$ -346 -867 -1237 -858 54 779 1412 1315 312 -734 -1287 -1068 -987 131 861 965 723 43 -587 -1183 -1024
6824a024P08Q37M97J04k55q32q96j55J87N87J009N84n41l93j070m12p6N17M95
$$ -1024 -316 521 1018 1122 867 35 -861 -1016 -829 -242 767 1351 810 417 -653 -1065 -1141 -624 -129
6843a29R00M83o41n16r26m7m41Q49P48K80P54q02p34n38k76n5J055O43K10J29
$$ -129 771 1254 613 97 -829 -876 -1317 -468 280 560 1314 512 -222 -760 -1036 -1091 -36 607 817 946
6863I46o14n59j135L39M26P14O13P38m23j008n18r09KR71Q07M60L24k97j011q53
$$ 946 332 -227 -1362 -1023 -597 117 730 1468 1045 37 -481 -1390 -1388 -417 390 850 1174 877 -134 -987
6883i87k21J67O23J067J99N18q37o38o92j20J25Q66R40J57n47o26l13o48J9K94
$$ -987 -1208 -1041 -418 649 848 1366 529 -109 -801 -921 -796 70 1010 1167 620 -6 -319 -967 -948 -654
6903f54P55O80K50k28r62m09n03L89M74N94M93J38m04q63m87m64K59J069N38L79
$$ -654 101 781 1031 803 -159 -568 -1071 -682 -208 386 879 1017 613 -250 -737 -1201 -942 127 665 1044
6923A044p9o26p68p94n1R74N51Q02M5m09o75r95j19L01L43J141L33j36n66j071
$$ 1044 965 339 -429 -1223 -1274 -300 251 1053 1098 689 14 -981 -1100 -799 -456 685 1018 882 316 -755
6943g55j15k51L61M39J224K97j28r78m96o15m7L35R04O06L99l12q09q33n41N07
$$ -755 -870 -1121 -760 -321 903 1200 1072 94 -402 -1017 -1064 -729 175 781 1180 868 59 -774 -1315 -808
6963h08O60P53K77K30l60p69r67q2L02O92P12Q36p57k20j165j29l25N83P70O41
$$ -808 -148 605 882 1112 752 -17 -984 -1066 -764 -72 640 1476 719 499 -666 -795 -1120 -537 233 874
6983H74J20j00r08p47l11J04O59P27O62J8k98p68r45j52K09Q35P23K30K87r01
$$ 874 994 894 -14 -761 -1072 -968 -309 418 1080 1098 800 32 -913 -1065 -856 -21 702 932 1219 318
7003C18n05q54l1L47J053M76L06l59n55n53r08J63Q65M93O73j83P2r44o50m75
$$ 318 -187 -1041 -1072 -725 328 804 1110 751 196 -357 -1265 -1102 -237 256 929 746 818 -126 -776 -1251
7023a251L49P39N79O85j6p20o76o05k26M98N64J041J63k78q03p77m85K02O69O60
$$ -1251 -902 -163 416 1101 1085 365 -311 -916 -1142 -644 -80 961 1124 846 43 -734 -1219 -1017 -348 312
7043C12P24J14l24q80o07m03L57L17J267K51m1n03p89o92j74L65O69Q14K11q3
$$ 312 1036 1150 826 -54 -661 -1064 -707 -390 877 1128 1087 584 -205 -897 -1071 -706 -37 777 988 905
7063I05o19j109k89K03O92Q47L15J50k90n38r64k12j23Q89P32M43nm27p32o01
$$ 905 286 -823 -1112 -909 -217 630 945 1095 805 267 -697 -909 -1032 -143 589 1032 1027 600 -132 -733
7083g33n28O14O41Q48L95k40m59j423j12Q3M33O83N19L35l32n21p15p33L30N91
$$ -733 -1261 -647 -6 842 1237 997 538 -885 -997 -914 -481 202 721 1056 724 203 -512 -1245 -915 -324
7103c24Q00O45n5q39m70p03Q8Q0N56O35O52j86o98p27l88l6L36P40P38M37l66
$$ -324 476 1121 1066 227 -243 -946 -858 -778 -222 413 1065 879 181 -546 -934 -970 -634 106 844 1281 915
7124I15j059m78j65j95R85K56Q80k73l48p77o68n8Q0O94O73N76k93n48q72k74
$$ 915 -144 -622 -787 -982 3 259 1139 866 518 -259 -927 -985 -905 -211 462 1038 745 197 -675 -949
7144i49m37Q73O25P26L38m90o15r75j92K7Q59O48M90J16n77p55m68m77K57Q37
$$ -949 -1386 -513 112 838 1176 686 71 -904 -1096 -1069 -210 438 928 1044 467 -288 -756 -1233 -976 -139
7164a39N96Q73m47l93p00q48R4M21Q68N15O2k6n49q20m38P8L47P56R00r7m72o51
$$ -139 457 1330 883 490 -210 -1058 -964 -543 325 840 902 876 327 -493 -931 -853 -506 250 1150 1053 581 -70
7186g0n26m53M35M46P14M62n6n66j092l3l15N67Q83J77O21m61n61n31p84L47L60
$$ -70 -596 -1049 -614 -168 546 1008 952 386 -706 -739 -1054 -487 396 573 1194 733 172 -359 -1143 -796 -436
7207d36P19O44j9r4q14p33j12j46Q39N81O27k06l24q48o78j36N34O87N10N53l12
$$ -436 283 927 908 814 0 -733 -845 -991 -152 429 1056 850 526 -322 -1000 -1136 -602 85 595 1148 836
7228H36m56j018q7m11O40Q17M30M34p38l25o14m03M6P01M45Q25o6l81q78n88l2
$$ 836 380 -638 -725 -1136 -496 321 751 1185 447 122 -492 -895 -849 -148 297 1122 1056 675 -203 -791 -823
7249h23j37Q18P83M81k74o71n90n46J68M50K55J155J08m74q82m24l81J48M31O84
$$ -823 -960 -142 641 1122 848 177 -413 -959 -791 -341 -86 1069 1177 703 -179 -603 -984 -836 -405 279
7269B79N98q3l50q18m59m54O11O90M94N43k8n26j215J9l06L71Q10N91K65l96n54
$$ 279 877 794 444 -374 -833 -1287 -676 14 508 1051 1023 497 -718 -699 -1005 -634 176 767 1032 636 82
7290H2o26n05L71L65P77O31j41n65l74q04k93L88L20J080K58j19m56p93n99N9
$$ 82 -544 -1049 -678 -313 464 1095 954 389 15 -789 -1082 -694 -374 706 964 845 389 -404 -1003 -944
7310i44M46L39R62k1O7o92q02l88n3N27Q55O85K05k51o94r68m76N97M34P40L58
$$ -944 -498 -159 803 782 849 157 -645 -1033 -1086 -559 296 981 1186 935 241 -727 -1203 -606 -172 568 926
7331I26K7n90q82m72J01O33K31P26M32k85m93q82j77k3J52R22N73k1n03m36p52
$$ 926 953 363 -519 -991 -890 -257 -26 700 1132 847 354 -528 -705 -728 -576 346 919 898 395 -41 -793
7352g93l5l3P36O48N35l50m68o08m06R8j34J016M43N70l74o70o30o14M15L76N72
$$ -793 -828 -861 -125 523 1058 708 240 -368 -774 -676 -810 206 649 1219 845 175 -455 -1069 -654 -278 294
7373B94L67L71j69q10n45o20L88O86M01L45j01k37p59m42j10L82N63Q17p3m6l80
$$ 294 661 1032 863 53 -492 -1112 -724 -38 363 708 607 370 -389 -831 -941 -559 4 821 748 702 322
7394C22q70l99m1M09R28L24L21l03p03p65M7j66O21P60N13j82l24n95p03J20n
$$ 322 -548 -947 -988 -579 349 673 994 691 -12 -777 -730 -896 -275 485 998 816 492 -103 -806 -686 -691
7415f91Q06M82N11k49n76r61p5k65N17Q66K96K60o04j83o56r7l66O96J009K29
$$ -691 115 597 1108 859 283 -678 -753 -1018 -501 365 661 921 317 134 -522 -619 -985 -289 720 949
7435I49K6m24o68m99mj76L87R94O15o97n37k15r45L49L58M32P65J83l05l58q35
$$ 949 975 551 -117 -616 -620 -796 -409 585 1200 503 -34 -249 -1194 -845 -487 -55 710 893 588 230 -605
7456f05n02K07P53J86P93l4m7o64r10O0K01N38Q28J44k11l36j094K23n25M11P21
$$ -605 -1107 -900 -147 39 832 798 751 87 -823 -763 -562 -24 804 948 737 401 -693 -470 -995 -584 137
7477A37N67Q4K5q14k66n92P0N42O17L23P3j93r81p6m75K06M14Q82K24J50m63p81
$$ 137 704 788 813 -1 -267 -859 -789 -247 370 693 766 573 -408 -484 -959 -753 -339 543 767 917 454 -327
7499c27m18r8P0O03P36K37%n68p04k60j06M57O31M43K45l59p03m01r9J21L08L85
$$ -327 -745 -843 -773 -170 566 803 803 235 -469 -729 -835 -378 253 696 941 582 -121 -522 -621 -500 -192 193
7521A93N68o8o13l38k56l81L61O57N25p2L4n59l17l43n3L25O28M91L96o49q02
$$ 193 761 693 80 -258 -514 -895 -534 123 648 576 610 51 -266 -609 -662 -337 291 782 1178 529 -273
7542b73l25m10K14N98N97O34M7p70o40m02jL39L62R07J30n18m68n33k73N6L38
$$ -273 -598 -1008 -794 -196 401 1035 1082 312 -328 -730 -731 -392 -30 877 1007 489 21 -512 -785 -729 -391
7563c91M46P20q8k17n44o53k94L69M58N63M77k45k11n01l85n98P79K45N63J36
$$ -391 55 775 687 470 -74 -727 -1021 -652 -194 369 846 601 390 -111 -496 -1094 -315 -70 493 629
7583F29r9k32n34m23k00L76P44N23J34k78p42n53j48J58N80N44p4N07n43m54o68
$$ 629 530 298 -236 -659 -859 -483 261 784 918 640 -102 -655 -803 -645 -65 479 405 912 369 -85 -753
7604g53n7K73J08R43J03K97p18p26p8j76M06N78O46K21m67k88o93q40L17O17N43
$$ -753 -810 -537 -429 514 617 914 196 -530 -608 -784 -378 200 846 1067 600 312 -381 -1221 -904 -287 256
7625B56O62n72R5o13o22m7K95N12L91N43j56l44q03n99K12J57P75K51M88n82k32
$$ 256 918 346 441 -172 -794 -841 -546 -34 357 900 744 400 -403 -1002 -790 -633 142 393 881 299 67
7646F7l46n77J37M05P31M44j60l26r8r36k68L02L39O97N02k09p14k96o69Q2L75
$$ 67 -279 -856 -719 -314 417 861 701 375 277 -659 -927 -625 -286 411 913 704 -10 -306 -975 -893 -518
7667e18N24N80J30j90m40n89l71N2M92N55M78N7k53o54m58r3K06L10Q99J53o9
$$ -518 6 586 716 526 86 -503 -874 -822 -330 225 703 760 507 -147 -605 -698 -492 -182 717 870 801
7688H01n58l02m45m73K62N54P15K39j67o37l75m90K12O48L46J88K1j81m56o43
$$ 801 243 -59 -504 -977 -715 -161 554 793 626 -11 -386 -876 -664 -16 330 518 539 358 -98 -741
7708g41J45rO80M12M83k61o93l50m34n9J77Q73N95j52j51n81j96l78JN28K26P05
$$ -741 -596 -605 75 487 970 709 16 -334 -768 -827 -650 223 818 666 515 -66 -262 -640 -639 -111 115 820
7730H20o9m04l41p10N3qM69O46M45J41p71l89n75j93M42O78L54J98j24l01p20
$$ 820 751 347 6 -704 -651 -659 -190 456 901 1042 271 -118 -693 -886 -444 234 588 786 662 361 -359
7751c59k41J00M27L04M96J82k05o67m85q79J076L06M53L53j04l79o70k95j05L47
$$ -359 -600 -500 -73 231 727 909 704 37 -448 -1327 -251 55 508 861 757 378 -292 -587 -692 -345
7771c45M45L27K55k09m47o29Q5m75O47L35M97L56m10l72o52mK3N94J14M01J18
$$ -345 100 427 682 473 26 -603 -518 -993 -346 -11 486 842 432 60 -592 -596 -573 21 135 536 654
7792F54l00n08m67j21L05O70K05N33m40n22k82n16N3M78M11P10J16m79o22l55
$$ 654 354 -154 -621 -742 -437 233 438 971 531 9 -273 -789 -736 -258 153 863 979 500 -122 -477
7812d77k12j79L83Q24O05k80k40n64n24j36J96O16O53L70j16o01n35n42OM84L36
$$ -477 -689 -868 -485 339 944 664 424 -140 -664 -800 -604 12 665 1035 919 318 -217 -759 -753 -269 67
7833F7N82j76j27l59k46j21q2L20J79N77J02r0p55m54o1j20O47R33p1K73q24l01
$$ 67 649 473 346 -13 -259 -380 -462 -142 37 614 716 626 -129 -583 -644 -764 -117 816 745 1018 194 -107
7855a07m26k12L67N91M82j3N5n79o77l32R2N01N21M92k06J38p19n37j13k00Q53
$$ -107 -533 -745 -378 213 695 682 737 158 -519 -851 -759 -258 263 755 549 687 -32 -569 -682 -882 -29
7876b9K69O28l52j78q25n0j70L92K1J105j56j20n63k56l19k90N93O18M99L9k88
$$ -29 240 868 516 338 -487 -537 -707 -315 -294 811 655 535 -28 -284 -603 -893 -300 318 817 856 568
7897E68p09l47j73M87Q3M44L21J14p12l15n46j2K88L56O01L41L0r35m68k7K41
$$ 568 -141 -488 -661 -174 -91 353 674 788 76 -239 -785 -797 -509 -153 448 789 819 -116 -584 -611 -370
7918c70J45L21N92K07n07n56m9n39L64K62M11L19j05l42l81l47k66K71N95K59
$$ -370 -225 96 688 895 388 -168 -217 -756 -392 -130 281 600 495 153 -228 -575 -841 -570 25 284
7938B84J40J30m53j80o66L15K42J43P11Q5o10K34r09m15L85M33L46O95k21k72
$$ 284 424 554 101 -79 -745 -430 -188 -45 666 751 141 375 -534 -949 -564 -131 215 910 689 417
7958D17o81j89J1o7P18J94K11j28l14k94l92p2J16P36L96J05l62l26n31m53L92
$$ 417 -264 -453 -442 -509 209 403 614 486 172 -122 -514 -586 -470 266 662 767 405 79 -452 -905 -513
7979e13J38Q98K96l2m68p05j23k10L21L04N03L89m33r7m80k51j29N31O02M6Q7
$$ -513 -375 523 819 787 319 -386 -509 -719 -398 -94 409 798 365 268 -212 -463 -592 -61 541 587 674
8000F74l4m86m26l09J81K7P45L1L39j48k58q22k06L16J90L82N72j45r2r72k29
$$ 674 640 154 -272 -581 -400 -373 372 403 742 594 336 -486 -692 -376 -186 196 768 623 531 -441 -670
8021f70m2M26N49N6M37j08m42m43n66q5Q93L07L06p3p9n28m79J4J87K29K51K00
$$ -670 -712 -286 263 319 756 648 206 -237 -803 -888 5 312 618 545 466 -62 -541 -527 -340 -111 140 340
8043C40L86j76n81o24Q5K14M52N16o6J54q50j14j97k36M38L99M30L59l35o59m86
$$ 340 726 550 -31 -655 -570 -356 96 612 546 700 -150 -264 -461 -697 -259 140 570 929 594 -65 -551
8064e51l14K78P98M7M32k6l78o08j02j12K27K89J38Q45l97j72q35j32l47M65P44
$$ -551 -865 -587 211 258 690 664 286 -322 -424 -536 -309 -20 118 963 566 394 -441 -573 -920 -455 289
8085B89M51n1k05m83m58j32K99N6P54J25Q3n86j18o04r1K71L24O32r6J67n44n76
$$ 289 740 689 484 1 -457 -589 -290 -234 520 645 728 142 24 -580 -671 -400 -76 556 460 627 83 -493
8107d93k40j08N70L76K80L87m78j24m62k72q0O51M22N9K04m18n19l64J14j87M60
$$ -493 -733 -841 -271 105 385 772 294 170 -292 -564 -644 7 429 488 692 274 -245 -609 -495 -682 -222
8128b22J054j09K6p18j36m86J73L76L18q6M58k45l40j41n73J57K46N69M49n2o75
$$ -222 832 723 749 31 -105 -591 -418 -42 276 190 648 403 63 -78 -651 -494 -248 321 770 718 43
8149D3k39k87m9K61O12k90J30K68n28k5k37l47K65N14M66LJ88o50n70J39j6J7
$$ 43 -196 -483 -532 -271 341 51 181 449 -79 -104 -341 -688 -423 91 557 560 748 98 -472 -333 -349 -332
8171c32M23N82j06j46o60k54j1j02M58K08N48r3m19j10m45k68L72O30K82J83
$$ -332 91 673 567 421 -239 -493 -504 -606 -148 60 608 515 96 -14 -459 -727 -355 275 557 740
8191G40
$$ Imaginary data points
##PAGE= N=2
##DATA TABLE= (X++(I..I)), XYDATA
0@%%%%%%qJ6j6J6j6K3l1L2m0M8n6O4p2Q8j04J21j43J64j87K15k44K79l15L55m01
$$ 0 0 0 0 0 0 0 -8 8 -8 8 -8 15 -16 16 -24 24 -32 32 -40 48 -56 65 -78 86 -101 114 -130 149 -166 189 -212
31b12M48n01N61o29O99p73Q61r57J058j173J302j440J593j766J961k179K428k717
$$ -212 236 -265 296 -333 366 -407 454 -503 555 -618 684 -756 837 -929 1032 -1147 1281 -1436
49a436L052l448L924m512N259o235P583r572J2793j8888L4349j40900l41012K56207
$$ -1436 1616 -1832 2092 -2420 2839 -3396 4187 -5385 7408 -11480 22869 -118031 -459043 -202836
63b02836L47340J4764j83916M4386J67809n2956k64314r8663J36141J07463l3728
$$ -202836 144504 159268 -24648 19738 187547 134591 -129723 -228386 -92245 15218 -18510
74a8510M3907J73919M4536k38228k53050J2780J88239J04467O621L7713M4407
$$ -18510 25397 199316 243852 5624 -247426 -234646 -46407 58060 64681 102394 146801
85A46801q0589j46757m6033M9796K336j6736J20632K05602J4823k45476k22364
$$ 146801 66212 -80545 -126578 -76782 -74446 -91182 29450 235052 249875 4399 -217965
96b17965L3610J52245M1670k9676P2985J26666k2378j83262j33463K4341P2792
$$ -217965 -184355 -32110 9560 -20116 52869 179535 157157 -26105 -159568 -135227 -62435
107f2435K7908N0183J14272O2249r8253j76459q6872L9397P9986O6381O2252M4974
$$ -62435 -34527 15656 129928 192177 93924 -82535 -169407 -130010 -50024 16357 78609 123583
119A23583j2465p0173q7009p6470l7043N6726J50563J27937j6375j23930q8768
$$ 123583 111118 40945 -46064 -122534 -159577 -102851 47712 175649 159274 35344 -53424
130e3424q502r133m1194J8642J29794J33821j443j21603j15312m3587k522K2893
$$ -53424 -61926 -71059 -112253 -93611 36183 170004 168561 46958 -68354 -111941 -114463 -91570
142i1570P7063J14598N9802n4848j11014p1050j1829M644J0718N5448J02760P5859
$$ -91570 -14507 100091 159893 105045 -5969 -77019 -88848 -84204 -73486 -18038 84722 160581
154A60581k7292j22892j30372m5725N9256J10359Q3693K0122k5501l9420m9052
$$ 160581 133289 10397 -119975 -165700 -106444 3915 87608 107730 82229 42809 -6243
165f243o2851n0109R652Q1492J06095O2601j6741q3068j05616p0150N811P8055
$$ -6243 -69094 -119203 -109551 -28059 78036 140637 123896 40828 -64788 -134938 -129127 -51072
177e1072R9394O1652k248m8992o0584n0661l5993j3482L1667Q8097J03158L7378
$$ -51072 48322 109974 107726 58734 -1850 -52511 -88504 -101986 -70319 17778 120936 158314
189A58314p3601j31111q6073J0859O9444O6257M5414L2528M751m8205q5442o6875
$$ 158314 84713 -46398 -132471 -121612 -52168 14089 59503 92031 96782 48577 -36865 -103740
201a03740q139M4609P1595P7279M9010k3232r5977j05038l7881M2195P6178O2475
$$ -103740 -111879 -67270 4325 81604 130614 107382 11405 -93633 -131514 -89319 -13141 49334
213D9334L5867Q103k8687o5144p5372m0782K0941P4815Q9041N2965j5201p2310
$$ 49334 85201 93304 64617 -527 -75899 -116681 -95740 -20925 68116 121081 105880 33570
225C3570q5497n0940K800M6376O6983O2526L0115k1453o6232p7884m8461N998
$$ 33570 -51927 -102867 -100067 -53691 13292 75818 105933 84480 18248 -59636 -108097 -102099
237a02099N9014Q3951O3125N468n3320p7426o0140j9213K5529N9085O8637M6918
$$ -102099 -43085 40866 103991 109459 56139 -21287 -81427 -100640 -75111 -16026 52611 99529
249I9529j223n2436q0105o4899j2338M9257Q1067O6559J8109l2736o2306o2564
$$ 99529 98306 45870 -34235 -99134 -111472 -62215 18852 85411 103520 70784 8478 -54086
261e4086l8362K185M5911P1880O2333J6798l9693p6031p1426k8036K9301O9839
$$ -54086 -92448 -90263 -44352 27528 89861 106659 66966 -9065 -80491 -108527 -79226 -9387
273i387P1129L5119j2667n0165o2721n0502j6223K9616O5288P0896L6215k1820
$$ -9387 61742 96861 84194 34029 -28692 -79194 -95417 -65801 -513 70383 106598 84778
285H4778o8226p5281m1459J1136N3838O8721N0202Q464l5740o0561n8236l0832
$$ 84778 16552 -58729 -100188 -89052 -35214 33507 83709 92173 56433 -4128 -62364 -93196
297i3196J2105N4239P3512N1975j869n5286p4990n2598o912L6949O1961N8086
$$ -93196 -81091 -26852 46660 98635 96766 41480 -33510 -86108 -93020 -56071 5890 63976
309F3976K7609j6640n3570o3589m4499k782M1986O9371O1166J6288l7125o8867
$$ 63976 91585 74945 21375 -42214 -86713 -89495 -47509 21862 83028 99316 62191 -6676
321f676o1252k4693K0560N3687O1131M1243Q60m0843o4029n5460j8384K9847O3403
$$ -6676 -67928 -92621 -72061 -18374 42757 84000 84860 44017 -20012 -75472 -93856 -64009 -606
334f06O4342L1129j8397n6931o5030m0224K895M2796O1384N0639J6233k6766n7656
$$ -606 63736 94865 76468 19537 -45493 -85717 -82822 -40026 21358 71997 88230 61464 3808
347C808o2246l2640J4004N4868O4881M1251p21m1128o1185n3105j6803K8406N8415
$$ 3808 -58438 -91078 -77074 -22206 42675 83926 83205 42077 -19108 -72213 -89016 -60610 -2195
360b195N8429L0203j1843m9596o3022m3367k203L9821O0893N2037J7850k5916
$$ -2195 56234 86437 74594 24998 -38024 -81391 -83594 -43773 17120 69157 87007 61091
372F1091n7390n8457l0356J2233M7868N9898M3968M399l8820o2292n1228j5077
$$ 61091 3701 -54756 -85112 -72879 -25011 34887 78855 83254 44434 -17858 -69086 -84163
384h4163K6350N2803N4918L1851p843m5961o1771m4518l947L7767N9889N0993
$$ -84163 -57813 -5010 49908 81759 73916 27955 -33816 -78334 -82281 -44514 15375 66368
396F6368J7410k4367n3583n6401l0550J0166M4633N7146M1798N981l2357n6433
$$ 66368 83778 59411 5828 -50573 -81123 -70957 -26324 30822 72620 78601 46244 -10189
408a0189n2254k1024K1257N3940N7922L1758j0607m5520n6038m0209n913L1754
$$ -10189 -62443 -83467 -62210 -8270 49652 81410 70803 25283 -30755 -70964 -76877 -45123
420d5123N4299N0059K1057j9677n0351n4913l2594N502M1901N7469M3317P532
$$ -45123 9176 59235 80292 60615 10264 -44649 -77243 -71741 -29840 27629 70946 78478
432G8478l3139n4838m9325j8458J8787M7022N2843L3586l858m0945n6358m1699
$$ 78478 45339 -9499 -58824 -77282 -58495 -11473 41370 74956 71098 30153 -26205 -67904
444f7904o962K9700N0372M8700K3813j4674m9709n6922l1868P509M0216N1186
$$ -67904 -74866 -45166 5206 53906 77719 63045 13336 -43586 -75454 -67945 -27729 23457
456B3457M0027J0737k6481n3081m9359k0087J7984M3490N0283L3684q19l6777
$$ 23457 63484 74221 47740 -5341 -54700 -74787 -56803 -13313 36970 70654 69835 33058
468C3058n4894m2637r755K6946N1583N0357K1597j9466m6844m6916k7041n68K8564
$$ 33058 -21836 -64473 -74228 -47282 4301 54658 76255 56789 9945 -36971 -64012 -64580 -36016
481c6016N0595M8259J4666l0069n3924m4457j7615J1439L7340N2509M0187j539
$$ -36016 14579 62838 77504 47435 -6489 -50946 -68561 -57122 -19782 32727 72914 71375
493G1375m2741n4062l3696l994K0336L8939M5913K9002q317m4027n3504l3793
$$ 71375 28634 -25428 -59124 -63118 -42782 -3843 42070 71072 62755 18728 -34776 -68569
505f8569J395L4696N1153M0751R128k4658m3760m3354k5263Q487M2159N2284L0285
$$ -68569 -67174 -32478 18675 59426 68554 43896 136 -43218 -68481 -59994 -17835 34449 64734
518F4734m860l0174l9171l8510k2794J3496N2583N8186K1840k3397m3736l8206
$$ 64734 59874 29700 -9471 -47981 -70775 -57279 -4696 53490 75330 51933 8197 -30009
530c0009k3876o424K1876M7347M6947J4973k5360m5663m1070k1033O285L2987
$$ -30009 -53885 -60309 -38433 8914 55861 70834 45474 -189 -41259 -62292 -56007 -23020
542b3020M7970L8385M836l3402n1788m0369p410K4806M0497L6106K0242k194k8263
$$ -23020 24950 63335 68171 34769 -17019 -57388 -64798 -39992 505 36611 56853 54659 26396
555B6396m7717m1776o290L4865N2337L6472O732j9391l6356m0749k7686M714L8039
$$ 26396 -21321 -63097 -69387 -34522 17815 54287 61019 41628 5272 -35477 -63163 -58449 -20410
568b0410M9424L1275k595k9322l7959l2230j8017P785L9118N3328L1388j4438
$$ -20410 29014 60289 57694 28372 -9587 -41817 -59834 -52049 -12931 40397 71785 57347
580E7347m5812m3293j9393J129J6488L3324M3567K5692j6923m9460m5486j6371
$$ 57347 11535 -31758 -51151 -50022 -33534 -210 43357 69049 52126 2666 -42820 -59191
592e9191J1712K7838L6764L4968J1240k6338m7615l8492j0656J7652L5296M0100
$$ -59191 -47479 -19641 17123 52091 63331 36993 -10622 -49114 -59770 -42118 -6822 33278
604C3278K4720m635l1589m1566l2464p918K3182M5790M1031R987k1486l4085l1140
$$ 33278 57998 53363 21774 -19792 -52256 -60174 -36992 8798 49829 59816 38330 4245 -26895
617b6895k3313n250K5125M8939M1466K482l3204m1997k8748j1003Q867L1146M2404
$$ -26895 -50208 -55458 -30333 18606 60072 62554 29350 -12647 -41395 -52398 -43531 -12385 30019
630C0019K7590m379l2677l9726k8764o621J8162L8308L8922J8717j2372l8239
$$ 30019 57609 53230 20553 -19173 -47937 -54558 -36396 1912 40834 59551 47179 8940
642H940m2992k3663Q932L2336L5427K3073P146j1827l2680m2835k4497J3355M1813
$$ 8940 -34052 -57715 -48783 -16447 18980 42053 49199 37372 4692 -38143 -62640 -49285 -7472
655g472M1490K0342n702k7194l8169l1215o009K2676L5931L0260J4749n702k7972
$$ -7472 34018 54360 48658 21464 -16705 -47920 -53929 -31253 4678 34938 49687 43985 16013
668A6013m0321l0326M28K9697M1319L1223O847k1106l9190l4640j0945J3814K6804
$$ 16013 -24308 -54634 -54206 -24509 16810 48033 54880 33774 -5416 -40056 -51001 -37187 -10383
681a0383K9802K5873O576k1994m1780l5227q144J9689L6836L6734J7465j3757
$$ -10383 19419 45292 51868 29874 -11906 -47133 -55277 -35588 1248 37982 55447 41690
693D1690l4711l4007j7090J146J7136L1446L4986J5770j8191l9444l4841j4941
$$ 41690 6979 -27028 -44118 -42972 -25836 5610 40596 56366 38175 -1269 -36110 -51051
705e1051Q029K8440L9079K7965l307l1539l3979j9633o463N970K6027M0803K6766
$$ -51051 -43022 -14582 24497 52462 49155 17616 -16363 -35996 -42459 -36489 -10462 30341 57107
718E7107j0581l6323l5120j9581l080J9402L9114L5557M194k5070k8735k0024
$$ 57107 46526 10203 -24917 -44498 -47578 -28176 10938 46495 50689 25619 -3116 -23140
730b3140j6258o865K1121M5187L4849m372l2772l1325j9585j1392N630L1722M2230
$$ -23140 -39398 -46263 -25142 20045 54894 50522 17750 -13575 -33160 -44552 -38922 -7200 35030
743C5030J7884j6535k9673k2469j7787j1934R382L9493M1234R593k3205l2712
$$ 35030 52914 36379 6706 -15763 -33550 -45484 -36102 3391 44625 54218 31013 -1699
755a699k6418j5737K447K6092L5620K1770j807j6592k4415k9664k0405R041L7737
$$ -1699 -28117 -43854 -41407 -15315 20305 42075 40268 23676 -739 -30403 -50808 -41767 -4030
768d030L8324J3362j2284k2735k5890k5095q997J9796L6882K7034M546j0386j9870
$$ -4030 34294 47656 35372 12637 -13253 -38348 -47345 -27549 9333 36367 40913 30527 10657
781A0657k9159k7785k326L0133M0508K2204l358j9309k6425k5689j3114J0090
$$ 10657 -18502 -46287 -48613 -18480 22028 44232 40874 21565 -4860 -30549 -43663 -33573
793c3573K7235K8696J7364J306j9003l4189l1115m895K3870L3462K3036P578p730
$$ -33573 -6338 22358 39722 41028 22025 -12164 -43279 -48174 -24304 9158 32194 39772 32042
806C2042k3004l1334k1214M750K4393K7552J9444Q229r219k9837l5753j5751J5840
$$ 32042 9038 -22296 -43510 -38760 -14367 13185 32629 40858 31639 1802 -33951 -49702 -33862
819c3862L2604K7396J1368l229j6872k7084k4922p368J5153K7935K7038J4410
$$ -33862 -1258 26138 37506 34277 17405 -9679 -34601 -41969 -26816 1119 28157 42567
831D2567o504k6627l3207j9804N503K4283K7803J9311M479j2250k5858k6848j3386
$$ 42567 36063 9436 -23771 -43575 -38072 -13789 14014 33325 37804 25554 -304 -27152 -40538
844d0538P343K3584K8544K0332R24k1010l2218k3912l350J7547K6245K3145J0882
$$ -40538 -33195 -9611 18933 39265 40189 19179 -13039 -36951 -40301 -22754 3491 26636 37518
857C7518n864k1641k7633j9615r37J8972K8976K4473P240j5120k8805k6446r813
$$ 37518 31654 10013 -17620 -37235 -38172 -19200 9776 34249 41489 26369 -2436 -28882 -38695
870c8695R433K1745K3892J7203L134j5716k8761k5642o806J4520K5886K5029J3253
$$ -38695 -29262 -7517 16375 33578 36712 20996 -7765 -33407 -40213 -25693 193 25222 38475
883C8475n886k3027k8612j7799K248J8664K4037J9868Q430r069k4057k7380j5437
$$ 38475 32589 9562 -19050 -36849 -34601 -15937 8100 27968 36398 27329 3272 -24108 -39545
896c9545O380K3752K7319J7818n19j8599k6489j9419n207J0220K0906K4074J6885
$$ -39545 -33165 -9413 17906 35724 35205 16606 -9883 -29302 -34509 -24289 -3383 20691 37576
909C7576l093k3927k9189j6460K202J6146K2809K1595R888j0238k6862k5810r753
$$ 37576 34483 10556 -18633 -35093 -32891 -16745 6064 27659 37547 27309 447 -25363 -35116
922c5116P587J7887K1306J8827N824j3721k8834k5397n929J4394K3293K0965J1396
$$ -35116 -27529 -9642 11664 30491 36315 22594 -6240 -31637 -37566 -23172 121 21086 32482
935C2482l044j7253k4531j9275l154J5061K4909K2350P879j0714k2302k2343j2804
$$ 32482 29438 12185 -12346 -31621 -34775 -19714 5195 27545 35424 24710 2408 -19935 -32739
948c2739K518J7447K5363J9206K341j6478k3668j9235o962P066J9355K3749J6964
$$ -32739 -30221 -12774 12589 31795 34136 17658 -6010 -25245 -32207 -25141 -5786 17963 34927
961C4927k476k1342k6476j5724J073J3183J9331J9170J1407n132k1618k6280j4816
$$ 34927 32451 11109 -15367 -31091 -30018 -16835 2496 21666 33073 27941 6323 -19957 -34773
974c4773N093J9684K2001J5371L266j0474k2050k2958r233R512K1114K1347J2451
$$ -34773 -29680 -9996 12005 27376 30642 20168 -1882 -24840 -34073 -24561 -3447 17900 30351
987C0351k061j5002k2429j8835n064J3021K3501K1292P501q782j9414k0702j2183
$$ 30351 28290 13288 -9141 -27976 -33040 -20019 3482 24774 32275 23493 4079 -16623 -28806
1000b8806P59J4570K1700J8946N658j3028k3085k0342o992P831J7193K0503J4062
$$ -28806 -28047 -13477 8223 27169 32827 19799 -3286 -23628 -30620 -22789 -5596 14907 28969
1013B8969Q21j5893k4076j7269k445J1827J9382J8873R831m413j8775k2943j3735
$$ 28969 29790 13897 -10179 -27448 -29893 -18066 1316 20189 30020 25607 6832 -16111 -29846
1026b9846K129J5395K1235J5833M287j0243j8626k0096j0032M562J9013K2232
$$ -29846 -27717 -12322 8913 24746 29033 18790 164 -19932 -29964 -25402 -6389 15843
1038A5843J3616k690j5070j9557j5227n142P904J9772K0850R946o237j8040j9966
$$ 15843 29459 26769 11699 -7858 -23085 -28227 -20323 -551 20299 30245 24008 5968 -13998
1051a3998j2884m48J3146K1199J8539L978j1469j9766j6790q347L840J4677K0317
$$ -13998 -26882 -27330 -14184 7015 25554 29532 18063 -1703 -18493 -26840 -23000 -8323 11994
1064A1994J4979O78j4036k0263j6355n479Q957J9089J9438R223o050j6170j8237
$$ 11994 26973 27651 13615 -6648 -23003 -28482 -19525 -436 19002 28225 22175 6005 -12232
1077a2232j2038j631J1109J9569J7653O260r202j8771j8290r510L401J5752K0156
$$ -12232 -24270 -25901 -14792 4777 22430 28690 19488 717 -17573 -27083 -23682 -7930 12226
1090A2226J3463q8j2849j7784j5206n553O241J6586J9616J0769l946j6207j8685
$$ 12226 25689 25601 12752 -5032 -20238 -25791 -19550 -2964 16652 27421 23475 7268 -11417
1103a1417j2223j718J0883J8885J6526N712q354j6080j7008j0151J733J3644J9497
$$ -11417 -23640 -25358 -14475 4410 20936 26648 18294 2214 -14794 -24945 -23212 -9568 9929
1116I929J4166J413j2123j7304j5637o184O750J6062J7851J0031k997j3091j7062
$$ 9929 24095 25508 13385 -3919 -19556 -25740 -18990 -2928 14923 24954 21957 8866 -8196
1129h196j3840l359R946J8946J6618N134p603j4661j5990j0795R72J3300J8526
$$ -8196 -22036 -25395 -15449 3497 20115 25249 17646 2985 -13005 -23800 -22828 -9528 8998
1142H998J2662J522q390j5504j6670q920N836J7453J8034Q040k768j0692j5522
$$ 8998 21660 23182 14792 -712 -17382 -26302 -20466 -3013 15021 23061 20293 9601 -5921
1155e921j4496m561R979J7508J4585N237l735j2179j7294j3494M6J4985J9469
$$ -5921 -20417 -24978 -14999 2509 17094 22331 18596 6417 -10877 -24371 -24325 -9340 10129
1168A0129J0411K76p412j2733j5617r142M290J5445J6234R474n25r406j5910j5617
$$ 10129 20540 20816 13404 671 -14946 -24088 -19798 -4353 11881 21355 20830 11424 -4486 -20103
1182b0103m585R817J6948J3888O024l892j2911j6227j0902J501J0745J4276J1675
$$ -20103 -24688 -14871 2077 15965 21989 18097 5186 -11041 -21943 -20442 -9697 4579 16254
1195A6254O324m739j6535j8101p532P092J3770J3238Q937K124q202j6909j5407
$$ 16254 22578 17839 1304 -16797 -24329 -17237 -3467 9771 18708 20832 12630 -4279 -19686
1208a9686k673R424J2859J1878Q459m58j1963j7633j2133J054J1359J4299J1981
$$ -19686 -22359 -12935 -76 11802 20261 19803 7840 -9793 -21926 -20872 -9513 4786 16767
1221A6767M630n819j4947j4609o456L257J0278J3504J3175L043j1158j7962j2012
$$ 16767 21397 15578 631 -13978 -20434 -17177 -6899 6605 19780 22823 11665 -6297 -18309
1234a8309p55O233R718J3560J0733k86j4360j7862q782K947Q131J0165J2700Q059
$$ -18309 -19064 -12831 -3113 10447 21180 20894 6534 -11328 -20110 -17163 -9032 1133 13833 21892
1248B1892m511j5929j6485n850N234J0866J1853R569L099p292j4667j4075m940
$$ 21892 17381 1452 -15033 -20883 -15649 -4783 7070 16639 19738 12446 -2221 -16296 -21236
1261b1236O169J3553J3784P290k654j0431j3299j0324k541P496J4167J3386N198
$$ -21236 -15067 -1514 12270 19560 16906 6475 -6824 -17148 -19689 -12193 1974 15360 20558
1274B0558o437j2439j2244o938Q9Q459J4439J2679K457r526j4409j1539k799M312
$$ 20558 14121 1682 -10562 -17500 -17411 -8952 5487 18166 20623 11097 -3312 -14851 -17650 -13338
1288a3338R691J1895R581J218r931j5497j1824r83Q995J2329J0704N067k809j0517
$$ -13338 -3647 8248 17829 19047 9116 -6381 -18205 -19188 -10193 2136 12840 17907 15098 4581
1302D581j4154r587J719J0543J2849Q987J981m965j1329j2848p311L379J2538
$$ 4581 -9573 -19160 -17441 -6898 5951 14938 16919 11954 625 -12223 -19534 -16155 -3617
1315c617J4486P263k210r488j1267q349l937M614J1135J3554P238l966j2540j2362
$$ -3617 10869 18132 15922 6434 -4833 -13182 -17119 -12505 -1370 12184 19422 15456 2916 -9446
1329i446o562N78O857J1451J1683M475o527j3903j1217l551L139P941J1174R922
$$ -9446 -16008 -15430 -8573 2878 14561 19036 12509 -1394 -12611 -16162 -13023 -5082 6092 16014
1343A6014J890q002j4524j0695k116O271J1332J0878N525k626r204j1364q501
$$ 16014 17904 9902 -4622 -15317 -17433 -11162 170 11048 16573 13947 4743 -6621 -15122
1356a5122j358P098J2575J1056L578o583j1164j0455n204J101Q298J3358R237
$$ -15122 -16480 -9382 3193 14249 17827 11244 80 -10375 -15579 -14478 -6180 7178 16415
1369A6415l62q751j0832q156l277K196R747J2872P974k663j1321j1632o513n17
$$ 16415 16053 7302 -3530 -11686 -14963 -12767 -3020 9852 17826 15163 3842 -7790 -14303 -14820
1383a4820O436J0639R691M213m158j0591j0833n943J271Q478J1469Q797Q74o692
$$ -14820 -8384 2255 11946 16159 12001 1410 -9423 -15366 -14095 -5617 5852 14649 15523 8831
1397H831j1204r543m065M485J0347J0414N507j312q008j0598q241k534O328J1431
$$ 8831 -2373 -11916 -15981 -11496 -1149 9265 14772 13460 5452 -5146 -13387 -15921 -9593 1838
1411A838J0376L539m590r836j0219n214J123P457J0208Q559J813o047j0808r189
$$ 1838 12214 15753 11163 1327 -8892 -14106 -12983 -5526 4682 13241 15054 9007 -1801 -10990
1425a0990m008L613R137J0462O356q76p978j0716q020j110N561R557R306M046
$$ -10990 -14998 -11385 -2248 8214 14570 13694 5716 -5000 -13020 -14130 -8569 988 10294 14340
1439A4340k579q974j0743o213Q91P194J0727P550K042n539r598q925m129K726
$$ 14340 11761 2787 -7956 -14169 -13278 -6084 4643 12193 14235 8696 -902 -9827 -13956 -11230
1453a1230Q271R780O643J27p531j0341q270j608N591R256Q681M001k207p971r732
$$ -11230 -2959 6821 13464 13591 6060 -4281 -12551 -14159 -8568 688 9369 13370 11163 3192 -6540
1468f540o606K25O512R565Q075K568m484r373r445m385K939Q523R077N806o18
$$ -6540 -13146 -12921 -6409 3156 11231 13799 9315 -58 -9503 -13888 -10949 -2426 6651 12457 11839
1483A1839n356r037q271k728M311Q860R185M775k054q373r452o128K99O327Q554
$$ 11839 6483 -2554 -10825 -13553 -9242 -382 8803 13578 11524 3151 -6301 -12429 -12130 -5803 2751
1498B751P316K843l579q449r004m812K039P287Q782O677Q21n676r652q207k186
$$ 2751 10067 12910 9331 882 -8122 -12934 -10895 -3608 5174 11851 12672 6996 -2656 -10863 -13049
1513a3049M612P676P995M695o80o476r756p067l11N814Q522P455L210l100q422
$$ -13049 -8437 -761 7234 11929 11249 4773 -4983 -12050 -12361 -6547 1975 9430 12640 9540 1118
1528A118r119m549K384N893P961O775K004n124r100q075k466L546P069Q154N299
$$ 1118 -8001 -12550 -10166 -4273 3688 10463 12467 7343 -1757 -9832 -12298 -8752 -1683 6471 11770
1543A1770n34p070q642o041p60M618P270P853L888k682q027q906m133J331N680
$$ 11770 11236 4166 -4476 -10517 -11277 -6659 611 8464 12352 9670 1643 -7263 -11396 -10065 -4385
1558d385P910O597J681m848q390p402k103K000O449Q052O090k80o819q997n650
$$ -4385 3525 10122 11803 6955 -1435 -8837 -10940 -8940 -2491 5561 11651 11371 4552 -4445 -10095
1573a0095q11L882P612P381L543k078p566p797m515J38M992P998O923K266m491
$$ -10095 -10906 -7024 588 7969 11512 9434 1868 -5929 -10444 -10306 -5314 2684 9607 11873 7382
1588G382q053p001l389K021O439Q488M868p76n364p215o167k080L029P818P997
$$ 7382 -671 -7672 -11061 -9040 -2601 5887 10755 9979 4615 -2600 -8767 -10847 -7818 0 7997
1603G997L441k480p050o989m528o86M602P863P020J850m098o843p150l233R53
$$ 7997 11438 8958 1908 -5081 -9609 -10295 -5693 2170 9190 11040 6942 99 -7051 -10284 -9331
1618i331N662P993N868j50n282p083n883k376L219O402P399M036j636n830p426
$$ -9331 -3669 4324 10192 10042 4760 -2323 -8206 -10582 -7363 -961 6438 10474 8838 3008 -4418
1633d418n172m86M560P726N886K004k835o345o607m165O06N216Q085N420L77m537
$$ -4418 -9590 -10076 -5516 2210 8096 10100 7265 920 -5687 -9852 -9246 -4030 4055 9475 9852 5315
1649E315o524n873k961K228O634P339L768j214n613o054n340j367L242P208P029
$$ 5315 -1209 -7082 -10043 -7815 -1181 6158 9926 8712 3099 -2955 -8295 -9662 -6420 788 7817
1664G817K802l019o697o488l831J146M416O908N322R63l543o336o275k947J875
$$ 7817 10619 7600 903 -5585 -9416 -8270 -3854 3054 8376 9339 5796 -540 -6815 -9762 -7887
1679g887O183O832M179n64m945o476n473j239L450O272O128K741j854n182o102
$$ -7887 -1704 5128 9307 8743 3798 -2678 -8151 -9390 -5940 332 6460 9201 7347 2165 -3937
1694c937n180j88M446P392N916R69m064n331n593l336J053N265O928M629o42m453
$$ -3937 -9117 -9305 -4859 2533 8449 9418 5354 23 -5570 -8906 -7853 -2588 4340 8969 8327 3874
1710C874n902m818k078K139O414O612L360k234n477o080l491o88L335O605N502
$$ 3874 -2028 -6846 -8924 -6785 -371 6241 9601 7367 1890 -4190 -7681 -8369 -5034 1571 7073
1725G073J821k832n782n439l579J149M789O600M055K84l401o118n314k219K362
$$ 7073 8894 6062 280 -5159 -8738 -7589 -2800 3800 7855 8139 4738 -1380 -6694 -8913 -6551
1740f551O023N985L006j078m623n592m893j117M182O405M976J438k641m515n024
$$ -6551 -528 5457 8463 7385 2762 -2830 -7723 -8840 -4658 1747 6723 8161 5520 1005 -4019
1755d019l993j57M782O662M744J95l822n353m887k437J724N148O063L537j164
$$ -4019 -8012 -8169 -3387 3275 8019 8214 4392 -961 -5848 -8285 -6561 -1413 4650 8187 7023
1770G023l998n500m412j257L027N470N689K146j477n353n892l659Q46M532M926
$$ 7023 3025 -2475 -6887 -8144 -5117 353 6042 8188 6711 1358 -4534 -8193 -7347 -2815 2111
1785B111M102J172j805m891o298k975J706N558N820K521L04l572n430n012j642
$$ 2111 6213 7385 5580 689 -5609 -8584 -6878 -1320 4500 7021 7325 3753 -1677 -6689 -8331
1800h331K893N944M890J776p74m166n413m207m91L880N930M660J414k807n467
$$ -8331 -5438 506 5396 7172 6398 2232 -3181 -7388 -7879 -3999 1931 6591 8005 5198 -269
1815b69m394k290P28L982M624M355J267l671o123m762j034K869M417M211L548
$$ -269 -4663 -6953 -6225 -2243 2381 6736 8003 4332 -1791 -6553 -7587 -4718 -301 3910 7458
1830G458o42m099o147l968N68L517M475L898K359j373n196n758k884J048M362
$$ 7458 6816 2717 -3430 -7398 -6830 -3313 1162 5060 7419 6046 850 -4908 -7792 -6744 -2382
1845b382N428L531L9l127m375m050k104J220M566N175L346n92m423n038l597k15
$$ -2382 3046 6577 6616 3489 -886 -4936 -7040 -5820 -1254 3921 7267 6675 2252 -2786 -6383 -6598
1861f598J958N121N034K141k075m787m440k358k30K896M796M664J348k733n443
$$ -6598 -4640 481 5515 7656 5581 794 -3646 -6004 -6234 -3338 1458 6122 7470 4737 -706
1876g06m510j697J340L898M899L083n36k719m257m710j388K697N052M523J724
$$ -706 -5216 -6913 -5573 -1675 3224 6307 5771 3052 -1205 -5915 -7303 -4606 446 4969 6693
1891F693j190l376m912l678m75L500N664L569O08k460l301m481k949L91L824O332
$$ 6693 5503 2127 -2785 -6463 -6938 -3438 2226 5795 6403 3943 642 -3839 -6788 -6397 -2573 3759
1907C759K715p27l049l870l888j741J955M002N118K132n65l823m394l568r22L273
$$ 3759 6474 5747 2698 -1172 -5060 -6801 -4846 -844 4274 6406 5841 2018 -2376 -5944 -6866 -3593
1923c593M820L883J569j809m075m612l237J105L977M302L026P07k229m178m840
$$ -3593 1227 5110 6679 4870 795 -3817 -7054 -5949 -1972 2330 5356 6063 3834 -344 -5184
1938e184j853K225M285M629K092n12l380l977m141o82K612M485L967J938j444
$$ -5184 -7037 -4812 -527 4102 6194 5682 2302 -1675 -5816 -6498 -3886 599 4566 6504 5060
1953E060l690m703k885L40L650M511L081R49k213m654m028j699J519L645M148
$$ 5060 1370 -3333 -6218 -5878 -2228 2283 5364 6313 4100 -554 -4582 -6281 -4762 -1117 3031
1968C031K920K46k774n347m161l92K847M391L164K058o32l759m399l268L33K744
$$ 3031 5951 6197 3423 -1924 -6085 -6477 -3630 761 3925 5983 5351 1592 -2807 -6075 -5742 -2998
1984b998M232L631J242j533m369m478k471J849L666L981K629N58k660m392m226
$$ -2998 1234 4865 6107 4574 205 -4273 -6744 -4895 -1229 2752 5381 5939 3279 -1113 -5339
1999e339q94K044L944L697K428l80l250n169l158L05L244L812L200J353j292m204
$$ -5339 -6233 -4189 -245 3452 5880 5500 2250 -2919 -6077 -5772 -2528 1284 4484 5837 4545 341
2015C41m312k093R97L430L899K868R09k470m674l987q84J431L906L859K217J01
$$ 341 -3971 -6064 -5067 -1637 2262 5130 6039 3569 -1105 -5092 -5976 -4545 -639 3220 5437 5538
2031E538l130m805l234j23K430M069L578J649r24m066m623k177L36L383L896L035
$$ 5538 2408 -2397 -5631 -5754 -3324 745 4323 5972 5048 982 -3641 -5818 -5482 -2099 1797 4832
2047D832J208k185m437l665j914J428L564M121L069o36k966m101l240r15K166
$$ 4832 6040 3855 -582 -4247 -6161 -4733 -1169 2952 6021 5385 2419 -1682 -4922 -5837 -3671
2062c671L437M101K258j126l593m411k667K88K666M313L462Q60k321l665l725
$$ -3671 -234 3867 6125 4999 1406 -3005 -5672 -5384 -2718 1595 5057 5917 3596 -69 -3794
2077c794k096J082L347L972L038O5k525m244m122p90J836M036L915J638n59l229
$$ -3794 -5890 -4808 -1461 2511 5549 5614 3089 -1155 -5277 -6067 -4231 -195 3720 5358 4799 1570
2093A570l693l072k38K211M110L894J323j871l974l607k143M24L223L688L380
$$ 1570 -2123 -5195 -5433 -3222 888 4782 6105 4234 260 -3347 -5490 -5066 -1843 1845 5225
2108E225N75k638l972l561j152J292L387L695K636K87l318m627l184J57K576L482
$$ 5225 5800 3162 -810 -4371 -5523 -4231 -844 2851 5487 5774 2456 -2171 -5355 -5198 -2622 860
2124H60L185J295o07l408m676k603O49L314L548L254J040k243l570l978j965J247
$$ 860 4045 5340 4733 1325 -3351 -5954 -5305 -1991 1557 4811 5851 3608 38 -3940 -5905 -4658
2140d658L407L954K322L03k646m330k850q08J499L554M096K638j586m050l891
$$ -4658 -1251 2703 5025 5328 2682 -1648 -4498 -5306 -3807 -253 3843 6481 4895 845 -3046
2155c046j859J38K266L182L701J910j970m580m308p65J340K592L339L282M79k844
$$ -3046 -4905 -4767 -2501 681 4382 6292 4322 -258 -4566 -5331 -3991 -1399 1940 5222 5701 2857
2171B857m692k667r13J661L058L957K261n75l043m245k563o20K041M542L453J344
$$ 2857 -1835 -4502 -5415 -3754 -696 3261 5522 4947 1904 -2341 -4904 -5524 -3483 1059 4512 5856
2187E856k296l238l367j919m76L152M199L863k34l122l438k953j005N89L141M577
$$ 5856 3560 322 -3045 -4964 -5440 -2288 1911 5774 5540 2418 -1020 -3973 -4978 -4389 -1248 3329
2203C329K817j129l495l603k449j019K054L719L989J756j949l208l826k436M86
$$ 3329 6146 5017 1522 -2081 -4530 -5549 -3495 224 4213 5969 4020 812 -3014 -5450 -4964
2218d964K925L668L167N09k101k970l918k268J154L960M111J967r10k241k806
$$ -4964 -2039 1629 4796 5305 3204 234 -3684 -5952 -4798 -838 3273 5240 4330 2089 -717
2233g17l984j254K023M715L661P88j385k511l471l280n23L086M547L093N95j861
$$ -717 -4701 -5955 -3932 783 4444 5232 3847 1336 -2135 -5415 -5938 -2852 1695 4788 5383 3522
2249C522l392l658j908M53L847L665K196O46k464m156l780q37K115L773L284J588
$$ 3522 130 -3528 -5436 -4983 -1136 2529 4725 5371 2907 -1249 -5029 -5866 -3751 22 3306 4894
2265D894j22k666m471k973k06L483L339K954J159j111l337m749k336R98M183L738
$$ 4894 4772 2106 -2365 -5338 -5544 -2061 1278 4232 5391 4280 943 -3806 -6142 -5144 -961 2777
2281B777J729L58j469l889l958j471J929L567L681K249l85l311l903l035l55K551
$$ 2777 4506 4864 3395 -494 -4452 -5923 -3994 -427 3254 5503 5118 1807 -2096 -5131 -5486 -2935
2297b935L658L232J746j525l651m082k057Q19K746L964K888J010k377m145l833
$$ -2935 723 3955 5701 4176 525 -3557 -5614 -4795 -2049 1915 4803 5813 3436 -709 -4542
2312d542j012J627L071L518K599l7k927m278l162k75K252L710L262J907j031l808
$$ -4542 -5554 -3927 -856 2662 5261 5224 2297 -1981 -5143 -5418 -3166 544 3806 5713 4682 874
2328H74l921k675P14K818L618L319M82j571m178l371j752J001K945M529K755l08
$$ 874 -3047 -5722 -5008 -2190 1428 4747 5229 3658 -520 -3891 -5643 -4642 -1697 2832 5587 5279
2344E279l075l374l131j139J507L562M296K058j309l812l688k457K62K210L951
$$ 5279 2204 -1170 -4301 -5440 -3933 -371 3925 5983 4674 862 -2826 -5283 -5021 -2811 1140
2359A140L916R84k514l529l711j898Q76K781M001L392K79k596m058l761j138J894
$$ 1140 5056 6040 3526 -3 -3714 -5612 -4736 -1955 2046 5438 5717 3121 -937 -4698 -5836 -3942
2375c942L513L948J976l91l343m164k825n2K222M025L493J299j848l531l854k054
$$ -3942 -429 3519 5495 5104 1761 -2403 -5228 -5280 -3058 967 4460 5759 3911 380 -3474 -5528
2391e528M58K783M762K965j6k585l505l503j415J251L551L981K862q66l159l977
$$ -5528 -5070 -2287 2475 5440 5424 2839 -666 -4169 -5584 -4333 -782 3199 6061 5195 2036 -1941
2407a941l025l97K392L671L587J545j399l596l991k434L61K918M295L120Q07k764
$$ -1941 -4966 -5363 -2971 700 4287 5832 4433 837 -3154 -5588 -5227 -2309 1986 5106 5913 3149
2423C149l815l616j487P82L938M061K361j47k788l925l204q37J827L816M335J338
$$ 3149 -666 -4282 -5769 -4987 -1049 3012 5373 5226 2438 -1487 -4691 -5528 -3701 115 4450 5788
2439E788j547l227l626k591j67K760M101L373P47j895l834l489k183P97L471M686
$$ 5788 4241 1014 -2612 -5203 -5370 -2610 1491 4864 5611 3716 -118 -3607 -5790 -4993 -1522 3164
2455C164K270j46k928l532l276j665K353L948L737J699j038l344l619k950n36
$$ 3164 5434 5288 2360 -1172 -4448 -6113 -3760 188 3925 5624 4586 1242 -2377 -5327 -5863
2470e863K900M494L436P02k208l289l506j999K71L492M101L174l2k835l831l686
$$ -5863 -2963 1531 4967 5669 3461 172 -3334 -5333 -5062 -1570 2531 5705 5673 2838 -993 -4679
2486d679j241J755L809M163J580p22k707l791l330n02K507M261L441J088j684
$$ -4679 -5920 -4165 -356 3807 5387 4665 1958 -1833 -5163 -5665 -3158 1103 4544 5632 3948
2501C948l027m270k572O71L787M447K214K73k200l913l390j774J379L644M113
$$ 3948 921 -3349 -5921 -5250 -1463 2984 5198 5471 3271 -642 -4032 -5806 -4427 -783 3330
2516C330K197l78l124m099k919r52K368M169L762J357j452l496l986k134K6L007
$$ 3330 5527 5149 2025 -2074 -4993 -5945 -3577 592 4354 5711 4259 763 -3223 -5357 -5331 -2324
2532b324M259K892J212k464m001m126j630J806L701L445K575k10k776m217l415
$$ -2324 1935 4827 6039 3575 -426 -4552 -6182 -4376 -675 2770 5345 5135 2359 -1858 -5273
2547e273m72K297M028L453J734j192l478l489k985l17L229M141L277R04k320l969
$$ -5273 -5745 -3448 580 4033 5767 4575 1097 -2392 -5377 -5694 -2465 1676 4953 5857 3537 -432
2563d32l419k081J216L274M303L049q45k551m272k877p28J464L743M014K144j338
$$ -432 -3851 -5932 -4716 -1442 2861 5910 5065 2514 -1758 -4635 -5363 -3899 -156 3858 6002 4664
2579D664l640m132k695O15K519M198K951J204j635m014l910j998R71L514M198
$$ 4664 1024 -3108 -5803 -5188 -2669 1529 4480 5684 4049 35 -3875 -5873 -4902 -1388 2810
2594B810K513j35k489l742l084j916J912M116M076J520j031l294l768k794m51
$$ 2810 5323 5188 2699 -1043 -4127 -6043 -4131 -15 4061 5581 4550 1256 -2512 -5306 -5757
2609e757K687M205L810R70j755m020l669k370P51L713L898L039J76k844l828l332
$$ -5757 -3070 1135 4945 5915 4160 140 -3529 -5899 -5148 -1435 2463 5502 5678 2834 -994 -4326
2625d326j670J937L408L964K602r85l068m159l149j86K806L812L584J088j280
$$ -4326 -5996 -4059 -651 3313 5915 4930 1862 -2297 -5446 -5632 -2826 986 4570 5658 4378
2640D378l762l950k410O39L104M051L271O76k784m056l709j155J345L816L966
$$ 4378 616 -3334 -5744 -5105 -2001 2050 5321 5997 3213 -843 -4552 -5707 -4362 -546 3420
2655C420K344n20l114m403l282j5K197L692M050J451j416m014l336k816O70K760
$$ 3420 5764 5244 2130 -2273 -5555 -5570 -3373 319 4369 5820 4404 390 -2946 -5762 -5092 -2332
2671b332M269L045Q76k160m213l983j520J680L710L861K540m80l272m075l114
$$ -2332 1937 4982 5858 3698 -515 -4498 -6018 -4338 -628 3233 5773 5293 2021 -2054 -5168
2686e168o08J756M289L971J678j409l380m481k180J84K559M208L483J218k681
$$ -5168 -5776 -4020 269 4240 5918 4509 1129 -3352 -5532 -5348 -2789 1419 4902 6120 3439
2701C439l960l699j483J014L301M249K599J88l255m244l145p45J999L938L900
$$ 3439 -521 -4220 -5703 -4689 -1388 2861 5460 5648 2393 -1851 -4996 -5741 -3742 196 4096
2716D096J752j213l226l894l178L5K940M449K751J436k080l804m209j669P30L741
$$ 4096 5848 4635 1409 -2485 -5663 -5628 -2688 1761 4512 5948 3868 64 -4145 -5814 -5084 -1343
2732a343M145K840j44k958l912l552j267K175L699M346K164j149l600m701k368
$$ -1343 2802 5642 5498 2540 -1372 -4924 -6191 -4016 -317 4029 6193 5044 1444 -3257 -5625
2747e625N9K671M013L359J587j538m218m054k395R97L756L976K616L49k348m471
$$ -5625 -5566 -2895 1118 4477 6064 4526 308 -3746 -6141 -5144 -1388 2588 5204 5553 3205 -1266
2763a266l467r61J620L725L970K140p04l273m254k830j79K274L934L987J348j857
$$ -1266 -4733 -5694 -4074 -349 3621 5761 5057 1784 -2470 -5300 -5479 -3205 729 4716 6064 4207
2779D207l861m046k178O18L241M418K620J114k973m359l429j022J083L865M237
$$ 4207 346 -3700 -5878 -5260 -2019 2399 5019 6133 3160 -1199 -4628 -5650 -4567 -702 3535
2794C535K205l56l650m342k573o25K535M100L988J251j594l927l937k338M04L431
$$ 3535 5740 5384 1734 -2608 -5181 -5806 -3271 829 4817 6068 4474 547 -3390 -5728 -5324 -1893
2810a893M145K867R81k623m240l379j716J243L526M468K318l65k997m348k936
$$ -1893 2252 5119 6100 3477 -763 -4142 -5858 -4615 -1089 3379 5697 5332 2335 -2013 -4949
2825d949p53K264M069L672J468j233l516m139k673L76L092M182L575N62k455l853
$$ -4949 -5702 -3438 631 4303 5771 4538 1022 -3117 -5790 -5414 -2322 1860 5435 5997 3542 -311
2841c11l776j658J272L296M201K631l36k744m024l512j251K187M591L942J699
$$ -311 -4087 -5745 -4473 -1177 3024 5655 5319 2575 -1449 -4961 -6212 -4025 566 4508 6207
2856F207j319l840m137k665Q3K971M602L282O42j982l989l821k078R95M016L739
$$ 6207 4888 1048 -3089 -5754 -5671 -2700 1902 5184 5826 3844 -145 -3966 -6044 -5049 -1033 2706
2872B706L136p19k660l841l392r65K095L751L853J725p84l148m627k907m9L040
$$ 2706 5842 5123 2463 -1378 -4770 -5735 -3640 111 3964 5689 4905 1757 -2870 -5777 -5826 -2786
2888b786M205L375Q67j764l665m274k111J045L568L869K826M85k558m559l595
$$ -2786 1419 4794 5661 3897 232 -4042 -6153 -5108 -1540 2329 5155 5640 3082 -1477 -5072
2903e072q31J983L629M077K043o11l379m301k986k56K557M343L710J204j999l869
$$ -5072 -5903 -3920 -291 3786 5829 5218 1839 -2462 -5448 -5704 -3147 1196 4906 6110 4111 242
2919B42l847k317R87L149M060L048N37k560m403l575j133J524L760L810K552m23
$$ 242 -3605 -5922 -4935 -1786 2274 5322 5859 3299 -1104 -4679 -5812 -4288 -528 3282 5834 5411
2935E411l324m563l091R9K514L611L683J891j773l930m100k426R88L131M141L104
$$ 5411 2087 -2476 -5567 -5468 -2954 657 4340 6231 4458 528 -3572 -5998 -5010 -1879 2262 5366
2951E366L12k135m385l690j418J093M199M098K616o62l522m311k710p86K409M297
$$ 5366 5678 3543 -842 -4532 -5950 -4857 -658 3440 6056 5394 1872 -2439 -5149 -5935 -3526 771
2967G71L881J649k009l844l937j794K86K599L983L472J088k259m670l582j423
$$ 771 4652 6301 4292 448 -3489 -5283 -4997 -2398 1585 5057 6145 3886 -784 -4366 -5789
2982e789J348L652L926K439Q9l010m808k916o70K328L850L620J932j379l640m132
$$ -5789 -4441 -789 3137 5576 5665 2655 -2153 -5069 -5739 -3411 439 4059 5991 4612 972 -3160
2998c160k949P04K739N002K955L33k281l694l439j954P26L489M635K819p45l189
$$ -3160 -6109 -5405 -2666 2336 5291 5624 3343 -351 -3790 -5744 -5018 -1529 3106 5925 5180 1991
3014A991l764k902r92J712L988M210J789j068m294l810k200M5K566L830L736J169
$$ 1991 -1773 -4675 -5667 -3955 33 4243 6032 4964 670 -3140 -5340 -5295 -2729 1101 4837 6006
3030F006k031l973m166j887J675L199M190K001N9k103m269m017q22K379M317L628
$$ 6006 3975 2 -4164 -6051 -4376 -1177 3013 5014 5073 2970 -1299 -5316 -6138 -3759 558 4186
3046D186J413j169k800l817l265m69L113M209L634L01j713l673l279k375O57L615
$$ 4186 5599 4430 1630 -2187 -5452 -5921 -2808 1401 5035 5336 3623 -50 -3329 -5704 -5047 -1432
3062a432M144L070l77k944l899l001j012J755L102M035K483j047l260m437k817
$$ -1432 2712 5782 5405 2461 -1438 -4439 -5451 -3696 -594 3441 5924 4877 1617 -2820 -5637
3077e637j9L058M249K896J075j457l630m555k200J027L819L525K665P47k322l597
$$ -5637 -5656 -2598 1651 4547 5622 4165 535 -4020 -6220 -5193 -1374 2151 4816 5563 3241 -356
3093c56m119j707J993M367L803J438o61k944l882l086o76K419M358L787J139j705
$$ -356 -4475 -6182 -4189 178 3981 5419 4758 1814 -2068 -5154 -5830 -3411 947 4734 5873 4168
3109D168l880l988j673M27K998L603L615P48k773m303l661q38J695L143M035K467
$$ 4168 288 -3700 -5373 -4946 -1948 1655 5270 6018 3245 -1058 -4719 -5557 -3862 -719 3316 5783
3125E783m34k951m768l013o8K471L743L488J295j224l313m235k501M08L411M066
$$ 5783 5349 2398 -2370 -5383 -5451 -2980 763 4251 5546 4322 1009 -3226 -5727 -5319 -1908 2158
3141B158K700P21j966m031l748j675J274L862L766K580o13k999l980k816p69K275
$$ 2158 4858 5579 3613 -418 -4166 -5841 -4567 -705 3061 5641 5028 2029 -1951 -4767 -5536 -3261
3157c261L638M026J421j124l849m231k106O18K731L829L062J117k253l842m146
$$ -3261 377 4403 5824 4700 851 -3380 -5486 -4868 -2137 1692 4754 5871 3618 -224 -4370
3172d370j352J329L744L607K539l7k765m345l364o77K119L930L504J892j447l291
$$ -4370 -5722 -4393 -649 2958 5497 5460 2695 -1650 -5014 -5691 -3572 358 3862 5754 4307 1016
3188A016l714l000L06K995M250K889Q92j966l903l528j862R30L451M232K160N69
$$ 1016 -2698 -5698 -5392 -2397 1853 4742 5634 3668 -235 -3763 -5625 -4695 -1244 2988 5148 5717
3204E717l297m072l119r20J871L906L712J741p30l657l726k659j64K644M044L095
$$ 5717 2420 -1652 -4771 -5691 -3820 86 3798 5539 4809 1152 -2574 -5233 -5397 -2753 1291 4386
3220D386J342j759l911l885k248J689K966L941K752L60k661l933l897q41J782
$$ 4386 5728 3969 58 -3827 -6075 -4386 -1420 2521 5273 5633 2972 -961 -4858 -5699 -3917
3235c917L667L975K070q87k976m322l246N31K263L800L655J017j655l428m200
$$ -3917 -250 3725 5795 4908 1932 -2390 -5636 -5105 -2842 958 4613 5630 3975 547 -3653
3250c653j762O09L270L892K681K60k595l654l650q64J648L403L508K579q57l045
$$ -3653 -5415 -4806 -1536 2356 5037 5297 2702 -952 -4602 -5466 -3818 -415 3093 5672 4815 1770
3266A770m315k404j59J970M120L341J510j925l838l464j716L12K816M122L035
$$ 1770 -2545 -4949 -5108 -3138 982 4323 5833 3908 70 -3394 -5110 -4798 -1982 2140 5175
3281E175J72k270m285l130j293J575L279M089K369p95l114m147k568n58K322L976
$$ 5175 5347 3077 -1208 -4338 -5631 -4056 -777 3312 5681 4886 1772 -2375 -4943 -5501 -3179 797
3297G97L439J336j479l602l786k200L71L055M223L198m9k320l695l755j339J226
$$ 797 4236 5572 4093 491 -3295 -5495 -5124 -2069 2154 5352 5303 2983 -712 -4467 -5806 -4580
3313d580M012L782K307n17k719m111k959o79J813M372L446J505j702l201l492
$$ -4580 -568 3214 5521 5004 2285 -1826 -4785 -5464 -3651 721 4167 5672 3970 769 -2723
3328b723k336J02K568M299K894M27k184l286l512j750J153L433M083K187k67k765
$$ -2723 -5059 -4957 -2389 1910 4804 5231 3047 -239 -3751 -5501 -4348 -915 3168 5355 5088 2323
3344B323l943l009q02K101L738L397J933j573k783m445k394J87L262L909K811
$$ 2323 -1620 -4629 -5431 -3330 408 3805 5738 4165 1382 -3063 -5457 -5270 -2008 1901 4712
3359D712Q01k005l837l622j920J161L922L931K067n63k521l470k949j223K339
$$ 4712 5513 3508 -329 -3951 -5871 -4710 -788 3143 5210 4647 2126 -1344 -4293 -5516 -3177
3374c177L368L709J582j166l406l682k440J29K712M155K643Q97j906l692l684
$$ -3177 191 3900 5482 4316 910 -2772 -5212 -5083 -2371 1784 4427 5324 3418 -274 -3958
3389c958j533J407K971L700K667L7k997l989l082p20K067L828L332J351q35l159
$$ -3958 -5491 -4084 -1113 2587 5254 5291 2294 -1695 -4777 -5497 -3430 398 3730 5081 4246 1087
3405A087l606k617K08K526L510L475P50j821l822l524j498Q34L271L525K727r1
$$ 1087 -2519 -5136 -4928 -2402 1108 4583 5333 3512 -310 -3834 -5332 -4498 -1227 2298 5025 4934
3421D934k450l834k822j327J818L487L413K227r70k943m043k571J80K341L268
$$ 4934 2484 -1350 -4172 -5499 -3681 -194 3219 5446 4476 1533 -2510 -5081 -4901 -2560 708
3436G08L684R48j597l642l700j648O81K965L801K896J68k386l775l166j319J577
$$ 708 4392 5340 3743 101 -3599 -5247 -4566 -1601 2200 5096 5264 2878 -897 -4063 -5382 -3805
3452c805L421L466J963m45l067l463k728l38J944L980L456R12j273l615l386k108
$$ -3805 -384 3082 5045 4600 1533 -1930 -4658 -4996 -3052 928 4384 5296 4023 408 -2978 -5086
3468e086R07K278L526K794O93k070l948l051j004J264K935L687K188n26k991l809
$$ -5086 -4179 -1901 1625 4419 5112 3042 -906 -3957 -4961 -3697 -762 2925 5113 4587 1596 -2213
3484b213k567j86K225L073L417J499j242l242l590k468P97K456M045K639L69k018
$$ -2213 -4780 -4966 -2741 332 3749 5248 4006 764 -2826 -5294 -4497 -2041 2004 4643 5012 2994
3500B994l747l108j182R64L337L465K413m49k557l644k988l09J882L283L251J507
$$ 2994 -753 -3861 -5043 -4079 -742 2723 5136 4687 2130 -1514 -4502 -4811 -2929 354 3605 5112
3516E112q58l404l908j910L73K359L418K952J034j615l915l333j407J451L090
$$ 5112 4254 850 -3058 -4968 -4595 -2236 1182 4134 5168 3553 -362 -3695 -5102 -3651 -561
3531e61L130K218j90k363l427l199q11J716L593L706J142j011k946l552k374L93
$$ -561 2569 4787 4597 2234 -1193 -4392 -5203 -3487 106 3812 4954 3943 997 -2555 -4929 -4536
3547d536K323L935K694N28j634l475l157j811J080K819L254K860J53k729m035
$$ -4536 -2213 1722 4416 4944 3310 -165 -3322 -5133 -4053 -1234 2020 4880 5033 2304 -1731
3562a731k410n88J267L246L324J726p15k939l508k697L26K275L560K982J115j596
$$ -1731 -4141 -4729 -3462 -216 3108 4834 4119 1180 -2328 -5025 -4699 -2424 1136 4118 5233 3637
3578C637l656l132j660P59K641L325K580J10j959l553l055j018J581K949L666
$$ 3637 -19 -3151 -4811 -4052 -1411 1914 4494 4604 2645 -908 -3963 -4981 -3400 -451 3215
3593C215K010j039k841l575j990m05J525L807L140R05j433l190l134j814O48K136
$$ 3215 5225 4186 1345 -2230 -4220 -4625 -3100 707 3847 4752 3319 129 -3005 -4819 -4171 -2035
3609b035M053K559N84k739l250k741j124J117L099L468J723l47k582l242k874
$$ -2035 2018 4577 5161 2422 -828 -3569 -4693 -3576 -477 2991 4714 4367 1785 -1457 -4331
3624d331l31J921L699L057O57j395k848l139k236O29K523L539K558N50k161l234
$$ -4331 -4662 -2741 958 4015 4672 3277 429 -2710 -4946 -4317 -1794 1745 4303 4853 2692 -542
3640e42k767j421O31L097M360J472n12k748l105k745o65J957L475L096R08o37
$$ -542 -3309 -4730 -4099 -1002 3358 4830 4318 1570 -1535 -4280 -4945 -2988 487 3583 4491 3854
3656C854l177l345j762n2K861L570K065L20j346l057l139j818R32L245L796J682
$$ 3854 677 -2668 -4430 -4482 -1621 1949 4014 4334 2988 -69 -3208 -5026 -4094 -849 2947 4629
3672D629m31k216l174k892q65J776L316L360J219j411k523k825k407j43K617L610
$$ 4629 4198 1982 -1192 -4084 -4949 -3173 143 3503 4722 3311 788 -2037 -4444 -4587 -1970 1640
3688A640K531L61j474l573k911j231R70K672L075K491j62k432k905l181n28J431
$$ 1640 4171 4532 3058 -515 -3426 -4657 -3687 -1015 2060 4551 4389 1957 -948 -4129 -4657 -3226
3704c226L292L356R00r99k108l498k292J34K593L050K590R17j667k888l379j580
$$ -3226 66 3422 4322 3323 1215 -2283 -4575 -4441 -1848 1202 3792 4709 3042 154 -3225 -4805
3720d805N91K972L394K409p9k432l031k946p00J463L197L028J550p42k908l200
$$ -4805 -4214 -1242 2152 4561 4482 2050 -981 -3927 -4627 -3164 33 3061 4611 3869 961 -2239
3736b239j936l04K074L198K860J027j223l484k990j822J018K614L074K154L92
$$ -2239 -4175 -4479 -2405 793 3653 4680 3457 -27 -3017 -4839 -3821 -1207 1867 4021 4413
3751D413j978l390k671j095J543L144K680J932o78k510l338k331K9K003L036K834
$$ 4413 2435 -955 -3626 -4721 -3178 -34 2646 4578 3900 1390 -1948 -4279 -4250 -2247 789 3623
3767C623R14j471k653l471j519P65K274L067K516K20j826l169k894o15J108K778
$$ 3623 4537 3066 413 -3058 -4577 -3812 -1538 1529 4045 4265 2439 -730 -3624 -4239 -3131 -353
3783c53K985J647j74k747l041k427j01K078K742K757J090j089k860k821k019L71
$$ -353 2632 4279 4105 1358 -1683 -4110 -4211 -2133 609 3366 4456 3367 507 -2314 -4333 -3962
3799c962K368L158K393K44j810l099k251j667J120L004L004K141o99k502k962
$$ -3962 -1594 1564 3957 4201 2391 -708 -2959 -4626 -3506 -502 2502 4643 3944 1442 -1520
3814a520k357l73J608L330K579J213j103k917k843j582K56K013L116K304N54j681
$$ -1520 -3877 -4250 -2642 688 3267 4480 3377 460 -2383 -3965 -3709 -1696 1420 3724 4278 2597
3830B597l047l113r57Q63K972L179J773p29j762k959k900j58J752L083K577O25
$$ 2597 -450 -3563 -4520 -3657 -685 2494 4267 3538 1776 -1183 -4083 -4241 -2489 594 3171 3796
3846C796m64k681k994j860L28K148L255K202L91j792k541k672j246N27K913K864
$$ 3796 3332 651 -2343 -4203 -3875 -1727 1528 3730 4121 2329 -212 -2884 -4130 -3603 -690 2174
3862B174J851L4k228k962k744J0J389K716K735J250n80k682l232j895M78J819
$$ 2174 4025 4059 1831 -1131 -3875 -3865 -2476 240 2975 4225 3645 963 -2269 -4164 -3686 -1867
3878a867L061K450O99j387l196l150q93Q14K683K957J954n03j950k676k619n26
$$ -1867 1194 3644 4343 2956 -240 -3390 -4283 -3469 -786 2171 4125 3622 1672 -1004 -3623 -4149
3894d149J328L029K749J154p26k697k587j878m3K006K651K558P67j412k802k880
$$ -4149 -2821 208 2957 4111 3385 688 -1899 -3777 -3820 -1814 837 3395 4162 2750 -52 -2932
3910b932j491R17K475K995J991j70j961k722k605q00J233L019K777J507p21k592
$$ -2932 -4423 -3506 -1031 1964 3955 3785 1824 -898 -3503 -4303 -3070 -51 2726 4233 3512 920
3926I20k846j717l30J884L293K368L17j012k711k996j404R14K391K878J779J13
$$ 920 -1926 -3643 -3973 -2089 1204 3572 3889 2877 166 -2830 -4234 -3320 -929 1949 3728 3841
3942C841j423l260k655o70J397K803K660J439q78k136k869k006k4K033K491K317
$$ 3841 2418 -842 -3497 -4167 -2770 33 2693 4132 3254 1118 -1751 -3757 -3781 -1748 743 3060
3958C060J023j162k757k829j508O84K300K788K398K8j957k837k235j042J109K609
$$ 3060 4083 2921 164 -2665 -4173 -3489 -1189 1599 3997 4025 2068 -769 -3004 -4046 -2937 -328
3974c28K637J531j17k605k887j765k68J869K526K659O10r62k477l043j453M82
$$ -328 2309 3840 3723 1118 -1769 -3534 -3802 -1933 593 3252 3862 2900 423 -2620 -4073 -3591
3990c591K498K699J628N12j331k857k313j116Q02K641K714J548l82k053k776j996
$$ -3591 -1093 1606 3234 3746 2415 -442 -2755 -3871 -3069 -428 2286 3834 3452 1399 -1377 -3373
4006c373l59J486K924K135J167j135k455k865j018j44K195K622K352O30j847k815
$$ -3373 -3732 -2246 678 2813 3980 2845 390 -2475 -3493 -3637 -1442 1180 3532 4162 2315 -500
4022e00k563p69N66K514K683J860l81j879k804k110m77J577K376K726J087q32
$$ -500 -3063 -3832 -3266 -752 1931 3791 3410 1531 -1273 -3383 -3860 -2283 93 2819 3906 3074
4038C074k618k483j656L62J748K434K623J67j415k559k284j137P17K555K329K214
$$ 3074 456 -2027 -3683 -3321 -1573 861 3484 3651 2236 -323 -2607 -3744 -3027 -472 1857 4071
4054D071n35j966k910k011j70J169K456K332J703j446j980k614j432o8J654K459
$$ 4071 3536 1570 -1340 -3351 -3521 -2352 104 2436 4139 2693 713 -1901 -3333 -3401 -1747 712
4070G12K438O72j497k447k272j075N58K142K518J622K5j609k800k203n63J142
$$ 712 3150 3822 2325 -122 -2394 -3469 -2911 -769 1749 3371 3396 1787 -1013 -3216 -3779 -2637
4086b637K490K701J429p56k139k913j675P2J899K437J993O99j192k311k486r49
$$ -2637 -147 2554 3983 3227 1088 -1825 -3500 -3428 -1529 908 2901 3600 2408 97 -2389 -3338
4102c338J74K287K739J638J22j980k461j990p33J288K248K523J421q09k089k922
$$ -3338 -3164 -877 1862 3500 3622 1642 -819 -2809 -3542 -2254 -6 2517 3938 3129 1040 -1882
4118a882j463k85J793K579K217N95j008k380k688j041O97J939K350J700J97j305
$$ -1882 -3345 -3630 -1837 742 2959 3554 2546 166 -2522 -3563 -2866 -927 1423 3123 3320 2015
4134B015k496k618n47R94K405K686R03k10k266k318j751m07J897K299K357L47
$$ 2015 -481 -3099 -3646 -2652 -247 2439 3342 3132 866 -1452 -3203 -3610 -1713 586 2943 3290
4150C290r03k135k391j458N59J925K384K004J28j389k530k375p09P24K351L057
$$ 3290 2387 252 -2139 -3597 -3038 -1113 1271 3275 3403 2014 -516 -2891 -3600 -2876 -525 2532
4166B532P36j13k167k155j945J8J085K578J881J139p84k296k559j230J53J866
$$ 2532 3268 3155 988 -1167 -3112 -3094 -2009 569 2450 3589 2805 509 -2050 -3280 -3127 -1261
4182a261K481J708K27j220k284j917j114N08K356K753J088l72k073k083j539n79
$$ -1261 1220 2928 3155 1935 -349 -2266 -3380 -2872 -516 2237 3325 2953 880 -1203 -2742 -3321
4198c321J591J817K427P02p36k236k119j368M1J988K184K149K46j118k719j789
$$ -3321 -1730 87 2514 3216 2480 244 -1875 -3243 -3202 -1214 970 3119 3365 2247 -472 -2261
4214b261j017N89K259K020J586k98j576k759j319l73J306K173K016R11n41k301
$$ -2261 -3278 -2689 -430 1590 3176 2878 1302 -1457 -2776 -3149 -1843 330 2346 3257 2716 415
4230D15j929j458k2J293K602J905L71j003k270k467o50N33K075K455J292k2j745
$$ 415 -1514 -2972 -2994 -1701 901 2806 3177 2174 -96 -2563 -3213 -2680 -605 1850 3142 3120 1375
4247A375k342j745n92J243K266K171R22o36k211k134j540M57J686J903J803O48
$$ 1375 -967 -2712 -3304 -2061 205 2376 3298 2662 451 -1683 -3223 -2766 -1080 823 2626 3274
$$ [...]
8191H5
##END NTUPLES=NMR FID
##END=
