##TITLE=1H_LR-685A-M1
 CDCl3, 8 sc, 
 29.7.2019
##JCAMPDX= 6.0         $$ Bruker NMR JCAMP-DX V2.0
##DATA TYPE= NMR FID
##DATA CLASS= NTUPLES
##ORIGIN= UXNMR, Bruker Analytische Messtechnik GmbH
##OWNER= root
$$ XWIN-NMR		Version 3.5
$$ Mon Jul 29 16:40:08 2019 Russian Standard Time (UT+4h)  she@DPX200
##.OBSERVE FREQUENCY= 200.13155
##.OBSERVE NUCLEUS= ^1H
##.DELAY= (6, 6)
##.ACQUISITION MODE= SIMULTANEOUS
##.ACQUISITION SCHEME= undefined
##.AVERAGES= 8
##.DIGITISER RES= 18
##SPECTROMETER/DATA SYSTEM= spect
##.PULSE SEQUENCE= zg30
##.SOLVENT NAME= CDCl3
##.SHIFT REFERENCE= (INTERNAL, CDCl3, 0, 15.7039)
##AUDIT TRAIL= $$ (NUMBER, WHEN, WHO, WHERE, WHAT)
$$ ##TITLE= Audit trail, XWIN-NMR		Version 3.5
$$ ##JCAMPDX= 5.01
$$ ##ORIGIN= Bruker BioSpin GmbH
$$ ##OWNER= she
$$ F:/spectra/data/she/nmr/H-F/1/audita.txt
$$ ##AUDIT TRAIL=  $$ (NUMBER, WHEN, WHO, WHERE, WHAT)
(   1,<2019-07-29 16:39:06.26 +0400>,<she>,<DPX200>,
      <created by zg, POWCHK disabled, PULCHK disabled
       configuration hash MD5:
       00 E9 B6 7A A2 85 ED C7 34 08 36 98 17 FE 4E 26
       data hash MD5: 16K
       6E BE 42 98 93 08 B6 D4 25 A4 1F 0A BE BD AD 5C>)
$$ ##END=
$$ 
$$ hash MD5
$$ 35 92 E7 27 FF 57 37 1C 30 D1 30 BF 55 19 73 C8
##$RELAX= 
##$RELAX= 
##$RELAX= 
##$RELAX= 
##$RELAX= 
##$RELAX= 
$$ Bruker specific parameters
$$ --------------------------
##$DU= <F:/spectra>
##$EXPNO= 1
##$NAME= <H-F>
##$PROCNO= 1
##$TYPE= <nmr>
##$USER= <she>
##$AMP= (0..31)
100 100 100 100 100 100 100 100 100 100 100 100 100 100 100 100 100 100 
100 100 100 100 100 100 100 100 100 100 100 100 100 100 
##$AQSEQ= 0
##$AQ_mod= 1
##$AUNM= <au_zg>
##$AUTOPOS= <>
##$BF1= 200.13
##$BF2= 200.13
##$BF3= 200.13
##$BF4= 200.13
##$BF5= 200.13
##$BF6= 200.13
##$BF7= 200.13
##$BF8= 200.13
##$BYTORDA= 1
##$CFDGTYP= 0
##$CFRGTYP= 5
##$CHEMSTR= <none>
##$CNST= (0..31)
1 1 145 1 1 1 1 1 1 1 1 1 1 1 1 1 1 1 1 1 1 1 1 1 1 1 1 1 1 1 1 1 
##$CPDPRG= <>
##$CPDPRG1= <>
##$CPDPRG2= <>
##$CPDPRG3= <>
##$CPDPRG4= <mlev>
##$CPDPRG5= <mlev>
##$CPDPRG6= <mlev>
##$CPDPRG7= <mlev>
##$CPDPRG8= <mlev>
##$CPDPRGB= <>
##$CPDPRGT= <>
##$D= (0..31)
0 1.2 0 0 0 0 0 0 0 0 0 0.03 0 0 0 0 0 0 0 0 0 0 0 0 0 0 0 0 0 0 0 0 
##$DATE= 1564403945
##$DBL= (0..7)
120 120 120 120 120 120 120 120 
##$DBP= (0..7)
150 150 150 150 150 150 150 150 
##$DBP07= 0
##$DBPNAM0= <>
##$DBPNAM1= <>
##$DBPNAM2= <>
##$DBPNAM3= <>
##$DBPNAM4= <>
##$DBPNAM5= <>
##$DBPNAM6= <>
##$DBPNAM7= <>
##$DBPOAL= (0..7)
0.5 0.5 0.5 0.5 0.5 0.5 0.5 0.5 
##$DBPOFFS= (0..7)
0 0 0 0 0 0 0 0 
##$DE= 6
##$DECBNUC= <off>
##$DECIM= 24
##$DECNUC= <off>
##$DECSTAT= 4
##$DIGMOD= 1
##$DIGTYP= 9
##$DL= (0..7)
0 120 120 120 120 120 120 120 
##$DP= (0..7)
150 150 150 150 150 150 150 150 
##$DP07= 0
##$DPNAME0= <>
##$DPNAME1= <>
##$DPNAME2= <>
##$DPNAME3= <>
##$DPNAME4= <>
##$DPNAME5= <>
##$DPNAME6= <>
##$DPNAME7= <>
##$DPOAL= (0..7)
0.5 0.5 0.5 0.5 0.5 0.5 0.5 0.5 
##$DPOFFS= (0..7)
0 0 0 0 0 0 0 0 
##$DQDMODE= 0
##$DR= 18
##$DS= 0
##$DSLIST= <SSSSSSSSSSSSSSS>
##$DSPFIRM= 0
$$ [...]
##$SUBNAM2= <"">
##$SUBNAM3= <"">
##$SUBNAM4= <"">
##$SUBNAM5= <"">
##$SUBNAM6= <"">
##$SUBNAM7= <"">
##$SUBNAM8= <"">
##$SUBNAM9= <"">
##$SW= 24.9336996594482
##$SWIBOX= (0..15)
0 0 2 0 0 0 0 0 0 0 0 0 0 0 0 0 
##$SW_h= 4990.01996007984
##$TD= 16384
##$TD0= 1
##$TE= 0
##$TE2= 300
##$TE3= 300
##$TEG= 300
##$TL= (0..7)
0 120 120 120 120 120 120 120 
##$TP= (0..7)
150 150 150 150 150 150 150 150 
##$TP07= 0
##$TPNAME0= <>
##$TPNAME1= <>
##$TPNAME2= <>
##$TPNAME3= <>
##$TPNAME4= <>
##$TPNAME5= <>
##$TPNAME6= <>
##$TPNAME7= <>
##$TPOAL= (0..7)
0.5 0.5 0.5 0.5 0.5 0.5 0.5 0.5 
##$TPOFFS= (0..7)
0 0 0 0 0 0 0 0 
##$TUNHIN= 0
##$TUNHOUT= 0
##$TUNXOUT= 0
##$USERA1= <user>
##$USERA2= <user>
##$USERA3= <user>
##$USERA4= <user>
##$USERA5= <user>
##$V9= 5
##$VALIST= <valist>
##$VCLIST= <CCCCCCCCCCCCCCC>
##$VD= 0
##$VDLIST= <DDDDDDDDDDDDDDD>
##$VPLIST= <PPPPPPPPPPPPPPP>
##$VTLIST= <TTTTTTTTTTTTTTT>
##$WBST= 1024
##$WBSW= 4
##$XGAIN= (0..3)
0 0 0 0 
##$XL= 0
##$YL= 0
##$YMAX_a= 271606
##$YMIN_a= -622227
##$ZGOPTNS= <>
##$ZL1= 120
##$ZL2= 120
##$ZL3= 120
##$ZL4= 120
##$ABSF1= 10
##$ABSF2= 0
##$ABSG= 5
##$ABSL= 3
##$ALPHA= 0
##$AQORDER= 0
##$ASSFAC= 0
##$ASSFACI= 0
##$ASSFACX= 0
##$ASSWID= 0
##$AUNMP= <proc_1d>
##$AZFE= 0.1
##$AZFW= 0.1
##$BCFW= 1
##$BC_mod= 2
##$BYTORDP= 1
##$COROFFS= 0
##$CY= 11.3945322036743
##$DATMOD= 1
##$DC= 2
##$DFILT= <>
##$DTYPP= 0
##$F1P= 20.1537800932815
##$F2P= 0.134698688090026
##$FCOR= 0.5
##$FTSIZE= 0
##$FT_mod= 4
##$GAMMA= 1
##$GB= 0.15
##$INTBC= 1
##$INTSCL= 1
##$ISEN= 128
##$LB= 0.24
##$LEV0= 0
##$LPBIN= 0
##$MAXI= 10000
##$MC2= 0
##$MEAN= 0
##$ME_mod= 0
##$MI= 1.114404
##$NCOEF= 0
##$NC_proc= 0
##$NLEV= 6
##$NOISF1= 3.799351
##$NOISF2= 2.8
##$NSP= 1
##$NTH_PI= 0
##$NZP= 0
##$OFFSET= 15.70392
##$PC= 1
##$PHC0= -9580.186
##$PHC1= 14.20097
##$PH_mod= 1
##$PKNL= yes
##$PPARMOD= 0
##$PSCAL= 0
##$PSIGN= 0
##$REVERSE= no
##$SF= 200.130013532006
##$SI= 16384
##$SIGF1= 3
##$SIGF2= 2
##$SINO= 400
##$SIOLD= 16384
##$SREGLST= <1H.CDCl3>
##$SSB= 0
##$STSI= 0
##$STSR= 0
##$SW_p= 3612.71676300578
##$SYMM= 0
##$S_DEV= 0
##$TDeff= 0
##$TDoff= 0
##$TI= <>
##$TILT= no
##$TM1= 0
##$TM2= 0
##$TOPLEV= 0
##$USERP1= <user>
##$USERP2= <user>
##$USERP3= <user>
##$USERP4= <user>
##$USERP5= <user>
##$WDW= 1
##$XDIM= 8192
##$YMAX_p= 0
##$YMIN_p= 0
$$ End of Bruker specific parameters
$$ ---------------------------------
##NTUPLES= NMR FID
##VAR_NAME=  TIME,          FID/REAL,        FID/IMAG
##SYMBOL=    X,             R,               I
##VAR_TYPE=  INDEPENDENT,   DEPENDENT,       DEPENDENT
##VAR_FORM=  AFFN,          ASDF,            ASDF
##VAR_DIM=   8192,          8192,            8192
##UNITS=     SECONDS,       ARBITRARY UNITS, ARBITRARY UNITS
##FACTOR=    0.0002004,     1,               1
##FIRST=     0,             0,               0
##LAST=      1.6414764,     0,               0
##MIN=       0,             -622227,         0
##MAX=       1.6414764,     271606,          0
$$ Real data points
##PAGE= N=1
##DATA TABLE= (X++(R..R)), XYDATA
0 0 0 0 0 -8 8 -8 8 -16 16 -24 28 -32 48 -56 64 -80 96 -113 136 -160 188 -221 255 -295 339 -389 443
27 443 -504 570 -646 726 -817 917 -1026 1146 -1276 1417 -1578 1751 -1940 2150 -2381 2634
43 2634 -2918 3233 -3585 3985 -4435 4953 -5555 6264 -7114 8154 -9459 11159 -13471 16821
57 16821 -22133 31898 -55826 237960 161769 -318325 -13670 271606 210457 -6698 103277
68 103277 214655 109762 -72462 -18527 99303 111760 -4675 -104656 -144076 -45130 85493
79 85493 78295 -79881 -126156 -41816 -57954 -208462 -199196 -18132 35471 -87751 -95039 10624
91 10624 -58786 -259883 -224276 25507 93726 -80791 -148859 -22702 39314 -29345 -34349 30227
103 30227 4328 -73408 -45946 40637 79823 120818 175187 103514 -61043 -67934 102666 175641
115 175641 88033 81298 190972 176099 26034 4585 133257 161695 62947 47982 115907
126 115907 93506 32958 93593 170492 82614 -52407 -45045 17297 -2390 -7438 79414 100036
138 100036 -26918 -118047 -72904 -45394 -98170 -85769 -162 -19167 -131927 -134647 -38170 -46500
150 -46500 -147926 -152063 -79412 -97888 -162934 -118145 -25427 -39466 -108256 -112000 -103168 -149172
162 -149172 -149523 -47565 18416 -29528 -68495 -36575 -38434 -90462 -65447 24517 27920 -41217
174 -41217 -28103 51491 56117 11887 38158 77812 18031 -47701 15129 112185 99645 51304
186 51304 81981 106057 32751 -25107 34352 99881 71460 41553 76126 85474 27861 4348
198 4348 46043 53399 5567 -6695 23418 21167 2532 29349 50889 -2458 -63142 -49421 -22747
211 -22747 -46011 -44897 18709 32930 -49533 -98786 -47760 -16789 -68179 -89107 -29730 -2694
223 -2694 -54045 -75655 -24331 179 -43419 -71867 -49556 -35054 -40466 -17601 18324 14303 -9631
236 -9631 -10011 -12317 -35138 -24805 30995 54141 20873 11492 49226 53446 9614 4564 51805
249 51805 60758 18736 19380 76151 93983 53544 36456 59529 54506 19234 21055 60463 75233
262 75233 59581 53748 53347 32967 14026 19398 26338 19518 23850 39448 30252 1443 957 19276
276 19276 2163 -37873 -35257 -268 800 -25328 -18640 8478 -7722 -55923 -66305 -36967 -25903
289 -25903 -39952 -37877 -18761 -17876 -35831 -45998 -45064 -44665 -42000 -34443 -32618 -30959 -16566 -4065
303 -4065 -17824 -36919 -28477 -12104 -20196 -31491 -7302 26617 22801 -2407 -2798 13678 7835
316 7835 -10229 504 30025 39141 26685 23580 33506 33836 20293 10727 13950 23268 31626 34006
330 34006 31566 31745 33554 24140 4941 -2326 11361 21530 12267 5226 17442 25516 5071 -19854
344 -19854 -18505 -5403 -8660 -21094 -15992 -8 -878 -19885 -31691 -27985 -26038 -35924 -43274 -33832
358 -33832 -17000 -12508 -23519 -32658 -31580 -30118 -37585 -43791 -31917 -12876 -8693 -19435 -20045 -8680
372 -8680 -7196 -22014 -28133 -12806 4040 4424 617 9694 19911 13888 -2016 -3038 11380 20890
386 20890 17691 17760 29071 38587 32169 17718 13909 21879 24674 18791 20127 34051 43815 34135 18113
401 18113 14907 20830 17799 6079 6068 20292 28561 18664 5620 5967 8378 -1756 -15605 -13011
415 -13011 2001 7048 -3687 -11639 -6891 -3983 -15908 -29659 -26949 -14347 -10775 -16481 -15572 -6942
429 -6942 -7409 -22474 -33197 -25326 -12657 -12826 -19707 -13678 553 1866 -10653 -16654 -9665 -5524
443 -5524 -11881 -11670 3715 18123 13778 853 -513 6675 8596 2732 2369 12596 23005 21986
457 21986 14749 14558 19810 16903 5419 1278 14548 27661 24087 13206 14442 21399 14827 -652
471 -652 -2468 9182 13241 5491 3930 13423 15319 1789 -10963 -9721 -3990 -4060 -6887 -4732 299
486 299 827 -7046 -15876 -16710 -11793 -12586 -20100 -19750 -5911 2556 -8716 -22661 -18541 -10500 -17941 -27297
502 -27297 -16019 2848 783 -15592 -16333 -2860 -2177 -15365 -18689 -8187 -17 -744 -392 4635
516 4635 6870 3270 -3885 -8389 -3759 8002 13570 6678 3757 14229 18715 4732 -6396 4606
530 4606 17735 9825 555 13847 28186 16247 -2827 661 14662 10580 -1300 1701 14312
543 14312 16057 9479 6520 4852 -198 -3948 -3497 -2356 719 8780 9041 -3910 -11934 -3089 2121
558 2121 -10967 -18763 -5818 4275 -7157 -15258 -2083 6565 -11568 -27171 -15485 -1059 -7036
571 -7036 -14097 -4085 5937 -4099 -15868 -14156 -8147 -7998 -5672 -976 -1244 -2239 2961 3802 -5620
586 -5620 -8101 3322 6532 -6500 -7300 13648 23298 6585 -4089 8557 13559 -2306 -5593 15714
600 15714 26645 11000 1022 11983 17519 5814 -318 8890 13455 7646 6748 11754 11041 7953
614 7953 9168 4819 -7231 -6147 8209 10689 -2867 -2009 12798 8211 -16942 -20675 1583 7562
628 7562 -11650 -15583 1962 4812 -13816 -19215 -4673 -2167 -15844 -18916 -8522 -5069 -9024 -5572
642 -5572 -2760 -10355 -16239 -11069 -8738 -12528 -5941 8886 5134 -12060 -10898 4630 2918 -12473
656 -12473 -6332 13832 10454 -8282 -2601 19527 17812 -3352 -5126 10089 10595 911 6954 20658
670 20658 17494 6004 5074 6492 3003 5216 14738 13853 3166 5238 15191 7943 -6252 -90 14312
685 14312 4870 -13410 -4662 14632 8343 -9380 -5578 5936 -5330 -22628 -13176 5610 1760
698 1760 -11086 -8301 -2068 -10616 -18296 -10318 -4122 -10120 -11398 -4769 -5959 -12640 -6669 3018 -6316
713 -6316 -19291 -10572 4033 -2267 -11142 2094 15219 92 -16722 -6415 9630 3889 -4653
726 -4653 7402 17443 5106 -5483 5385 15267 6396 -370 7243 11226 5053 6574 16372 14395
740 14395 3827 3141 7043 1426 -1046 11538 19877 5981 -5534 4401 10663 -3661 -11111 5426
754 5426 14734 -1727 -13093 295 10137 -2111 -12001 -3733 418 -9980 -13112 -1516 4358 -2787
768 -2787 -6917 -5618 -10849 -14485 -6466 722 -4635 -8776 -773 886 -11156 -12777 1387 4501 -10428
783 -10428 -14327 3032 10352 -3686 -8480 5379 9287 -6180 -11685 1880 10678 4170 1309 7609
797 7609 7681 433 -1277 3050 4156 4390 9624 9263 1527 879 9942 10418 -888 -2542 7536 7455 -3375
814 -3375 -765 14446 13587 -3431 -8838 2822 5541 -4012 -3924 7114 8480 -2737 -6671 -1031 435
829 435 -4290 -4336 -2216 -3461 -3627 -61 -729 -5635 -5221 -651 -5338 -13461 -8141 4139 2951 -7822
845 -7822 -6555 1898 -2124 -12793 -9438 3857 3502 -6570 -5892 3326 3002 -4211 -4773 384 617 -2932
861 -2932 -1273 2835 3941 3677 3877 352 -3196 291 4914 2288 -594 5896 11889 4805 -3892 525
877 525 8650 4110 -2801 2252 10505 6714 -1471 1327 8647 5523 -2647 -2567 2671 3851 1607 3364
893 3364 4112 1716 -1311 -2669 -3501 -2619 1436 2786 -1849 -4656 -153 1949 -4605 -8824 -2770 1350
909 1350 -5042 -9415 -2119 4340 -1152 -8943 -6298 -1535 -4426 -8335 -4026 1848 665 -4060 -4439
924 -4439 -2707 -1843 -2247 -2857 -2870 -927 2477 2845 -782 -858 2810 3012 -2391 -2559 5174 8304 2057 -472
942 -472 5937 9093 2849 -2901 1976 7399 5298 2064 4540 7926 5457 739 -97 3051 4181 3049
958 3049 1195 716 3304 4302 2257 -1950 -1919 554 -912 -4126 -2071 3666 2123 -5045 -6725 -2114
974 -2114 -671 -6165 -7726 -2537 399 -3447 -6694 -3622 -478 -3335 -7961 -7006 -2590 -690 -2597
989 -2597 -3729 -2130 -378 -1464 -4461 -4150 -429 2308 -101 -2111 1621 5274 2918 -1933 -1306 3635
1005 3635 4223 843 1612 5988 7274 3182 490 3255 5463 3553 824 2710 6255 6258 3462 1431
1021 1431 2730 3748 1183 -831 899 3892 3685 -279 -1245 930 2194 -1823 -4864 -2809 781
1036 781 -491 -3620 -3071 72 -646 -5462 -6928 -3271 -1202 -3120 -5093 -3391 -109 -1317 -4997 -5662
1052 -5662 -2716 -1111 -2678 -4051 -1392 1257 138 -2685 -2362 462 1128 -1540 -2062 1853 4474 2046
1068 2046 -460 925 3491 2242 -438 316 3856 5431 2641 1052 3244 5130 2677 -333 774
1083 774 3831 3594 1398 925 3389 3995 611 -1953 -173 2765 1892 -1065 -1100 2166 2104 -1920 -3710
1100 -3710 -1461 525 -1178 -3833 -1968 950 482 -2960 -4023 -1589 -515 -2611 -4198 -2064 723
1115 723 -91 -2924 -2840 -708 -157 -2601 -3960 -1114 1615 366 -1722 -982 993 317 -1875 -2070 656
1132 656 2151 371 -1067 1198 3478 1653 -1453 -906 1654 2330 522 -59 2379 3396 1417 -835
1148 -835 345 2627 1970 -619 -301 2658 3531 767 -1123 391 2093 328 -1584 -861 2376 2224
1164 2224 -706 -1573 794 1499 -1222 -2808 -1097 1755 970 -1336 -1498 817 677 -1909 -3290 -1316
1180 -1316 620 -240 -2283 -1695 745 405 -2296 -3173 -1106 754 -848 -2439 -1048 1229 771 -2338
1196 -2338 -2248 244 647 -1651 -1838 638 2174 417 -1795 -1068 1348 892 -686 -1107 884 2928 1066
1213 1066 -398 618 2250 1646 -846 -1056 1913 3310 1372 -308 1226 2848 1095 -1231 -318 2817
1229 2817 2586 -266 -341 2119 2510 334 -1449 -427 1419 615 -1221 -387 1151 870 -1295 -2044 -658
1246 -658 510 -603 -2462 -2239 409 838 -2198 -2543 -1058 -133 -2348 -3804 -1343 1166 -375 -2999
1262 -2999 -1920 901 481 -2253 -2521 131 998 -63 -1279 87 1638 572 -1364 -1291 1008 2603
1278 2603 1095 -435 602 2583 2088 -384 38 2198 3057 522 -132 2445 3511 1555 -224 648
1294 648 2333 1436 -277 410 2378 2169 -244 -721 872 1118 150 -1142 -901 570 374 -983 -1798
1311 -1798 -823 442 -1496 -2901 -2143 592 -151 -2500 -2752 -396 -30 -2166 -3602 -1668 19 -1056
1327 -1056 -2381 -1351 517 -209 -1680 -1729 211 746 35 -922 -89 809 1306 -44 -218 1022 1596 434
1345 434 -414 1313 3245 1978 -181 123 1942 2222 299 154 2392 2748 750 -366 1070 2358
1361 2358 993 -609 -483 758 989 155 -714 415 1000 -470 -1804 -1252 51 762 -1233 -2055 -374
1378 -374 321 -887 -2599 -1139 -56 -891 -2554 -1708 464 286 -1739 -2186 -658 164 -1039 -1957 -290
1395 -290 537 258 -960 -708 445 234 -177 -685 552 1579 969 -236 -438 1266 1819 583 -312 803
1413 803 1639 827 -71 811 2388 1275 -616 -503 1260 1405 293 182 879 1665 -195 -989 51 1471
1431 1471 389 -511 -777 125 876 5 -723 -255 340 -215 -1408 -1317 296 959 -728 -1791 -777 385
1449 385 -154 -1848 -968 726 134 -1651 -1355 465 946 -874 -1363 -501 484 65 -831 -262 761 311
1467 311 -685 -587 -49 318 238 -89 141 713 479 -731 -672 379 1901 298 -723 34 1085 562 -611
1486 -611 -61 1237 713 -722 -662 951 1553 828 -418 175 1230 230 -534 93 999 1073 194 -714 -150
1505 -150 535 332 -307 -451 147 357 -500 -669 264 1157 -177 -1442 -955 438 253 -804 -560 535
1523 535 471 -1456 -1330 -68 437 -238 -1037 -593 519 -398 -1198 -930 231 339 -750 -889 -391 543 297
1542 297 -423 -416 165 438 -619 -1116 585 1169 469 -713 -534 865 865 -241 -284 961 1163 93 -46
1561 -46 751 1264 684 -326 143 893 779 188 80 962 935 57 -289 -379 822 804 -150 -368 212 763 -424
1582 -424 -963 -237 639 -137 -1098 -853 31 132 -892 -946 -120 -127 -1131 -1627 -510 105 -15 -642 -809 -119
1602 -119 -243 -555 -1009 -292 431 31 -848 -525 469 753 -572 -578 328 668 -35 -334 789 1159 454 -169
1622 -169 138 960 1018 365 71 912 1313 643 78 306 1042 523 -40 -508 456 874 -47 -325 75 795
1642 795 297 -873 -846 27 528 -678 -1017 -158 458 -1020 -1356 -643 -71 -361 -855 -767 118 -253 -911 -853
1662 -853 -495 -165 -466 -1067 -626 481 -141 -366 -1124 -126 344 -46 -289 -67 710 650 -546 -377 706
1681 706 809 -280 -204 525 887 731 -230 599 630 715 -140 -83 469 1026 378 88 -26 620 613 -341 -184 406
1703 406 501 -193 -608 -110 530 -361 -755 -470 336 -103 -906 -470 50 187 -1045 -904 -76 93 -77 -722
1723 -722 -613 254 130 -281 -570 -181 65 -465 -695 -159 609 188 -387 -855 223 538 -276 -341 223 424
1743 424 434 -253 -16 594 286 61 -365 521 824 208 -440 220 918 210 -50 -47 599 333 -228 -288 342
1764 342 528 56 -344 -92 292 264 -406 -575 87 701 -42 -350 -136 586 78 -512 -253 547 728 -101
1784 -101 -452 15 173 -434 -415 -186 348 -37 -495 -595 -62 472 -124 -879 -308 328 66 -367 -348 365 435
1805 435 -526 -480 63 239 -256 -666 -81 286 313 -186 -212 136 432 -341 -655 172 580 69 -464 -165 465
1826 465 382 -67 -14 414 816 57 -382 213 606 356 -194 -232 876 402 148 -368 299 516 168 -411 -263
1847 -263 336 179 -383 -373 265 448 -140 -515 -217 229 -216 -544 -302 349 -41 -410 -739 -36 364 -240
1867 -240 -705 -378 223 127 -871 -592 13 -6 -641 -786 32 547 112 -680 -306 66 155 -215 -277 127 657
1888 657 254 -172 86 717 458 -208 -109 719 796 99 -2 405 940 221 -281 124 763 278 -23 -134 412
1909 412 755 -153 -524 -6 483 173 -196 -164 148 399 -324 -691 -246 243 -175 -588 -477 -39 229 -220
1929 -220 -788 -104 397 -674 -1106 -239 593 -55 -674 -50 74 -59 -282 -583 269 157 -256 -122 92 606
1949 606 119 -11 -127 226 439 338 -137 126 638 610 -158 -120 763 747 -223 -376 909 834 302 -454 600
1970 600 764 231 -396 -19 123 123 -198 29 140 -31 -302 -442 -532 20 63 -150 -367 -108 375 141 -867
1991 -867 -657 139 140 -822 -844 384 272 -602 -770 196 329 -463 -747 338 415 -73 -233 -145 9 -136 250
2012 250 -68 79 166 189 361 -550 -74 681 458 -388 -215 914 235 -633 -160 974 439 -931 -460 409
2032 409 607 -413 -326 457 351 -435 -442 -5 399 111 -460 8 -197 -92 7 -414 -467 29 679 -87 -671
2053 -671 51 749 112 -887 -228 294 -120 -735 -461 841 338 -768 -138 624 243 -330 -336 403 561 -196
2073 -196 -77 191 238 93 502 -209 -233 155 549 147 -379 510 610 -332 -722 78 892 -101 -448 -89 835
2094 835 -104 -633 -56 578 190 -748 -122 135 -3 -195 -179 155 -155 -265 -61 -97 99 243 616 -30 -438
2115 -438 172 491 -455 -658 464 884 -180 -716 383 912 -213 -926 -69 932 -230 -356 259 833
2133 833 113 -178 0 328 -50 -60 203 167 -47 63 357 -668 -407 473 53 -859 -678 679 490 -696
2153 -696 -765 668 849 -1002 -1214 236 649 14 -500 200 264 -446 -496 2 206 97 18 19 -3 -69 616 228
2175 228 -268 -273 774 77 21 -257 1208 731 -714 -485 687 667 -682 -370 908 790 -506 -308 733
2194 733 773 -531 -842 -183 554 8 -250 44 12 -274 -106 -360 -482 -566 278 -237 -836 -395 284 52 -955
2215 -955 -540 513 172 -706 -684 386 337 -856 -473 667 597 -762 -433 85 383 14 137 233 -103 -132
2235 -132 350 434 307 279 460 159 -307 225 749 154 -822 133 889 305 -809 -19 843 148 -788 -621
2255 -621 783 538 -647 -428 247 -40 -411 -349 -115 -221 -353 -210 -324 -468 -162 -109 -117 -941 267 408
2275 408 -273 -633 -46 548 -310 -934 68 832 237 -491 90 763 3 -602 -98 557 306 -204 187 458
2295 458 171 31 -135 130 320 427 182 200 27 387 570 -175 -171 500 197 -405 -807 378 917 -417
2315 -417 -860 -381 692 -134 -1041 -28 346 174 -628 -608 -46 -18 -311 -311 -430 -111 -204 -144 -266 -200 116 -212
2337 -212 -622 -473 387 188 -573 -517 205 395 -574 -445 100 582 182 -460 264 762 52 -219 87 555
2357 555 296 1 -158 272 501 39 -231 -144 214 316 36 -405 74 559 135 -730 -304 315 434 -705
2377 -705 -421 307 369 -42 -693 67 346 -205 -379 -330 -44 -184 -538 -353 192 236 -37 -275 -117 103 184
2398 184 -310 -464 167 183 7 -285 30 481 97 -656 -401 245 422 -242 -225 75 173 -114 -301 225 770
2419 770 -43 -88 -320 161 502 -97 -466 -20 234 -65 -528 -482 223 457 -218 -672 275 162 274 -377 100
2440 100 633 31 -568 -53 205 142 -264 -527 271 705 244 -316 -136 404 170 -186 -431 129 154 -83 -173
2461 -173 149 511 206 -305 -164 545 457 -236 -292 250 305 78 -194 -250 623 723 -256 -420 87 424 -217
2482 -217 -380 -23 251 126 -346 -487 337 177 -310 -620 58 407 -245 -231 -138 573 -164 -215 84 167 171 -207
2504 -207 -404 -199 -27 256 -254 -118 212 102 -132 -378 263 491 167 -332 -222 329 178 -97 -206 392
2524 392 314 -3 -121 3 363 78 -59 -258 124 -115 -210 -291 -139 193 -207 -338 -83 183 41 -421 -300
2545 -300 30 91 -272 -449 42 290 -298 -205 -122 75 26 -151 -148 309 525 43 -350 -204 541 35 -62 -98 442
2568 442 554 -84 -216 353 481 269 -40 199 483 680 -243 -163 289 248 62 -81 143 564 182 -334 -270
2589 -270 89 354 -308 -252 343 231 -153 -582 -194 194 116 -676 -214 442 438 -287 -601 145 273 -302 -419
2610 -419 -53 175 -45 -323 -84 -58 272 -229 -241 -222 434 241 -201 59 -87 189 -206 -434 141 590 215
2631 215 -293 -183 509 409 -80 -54 592 529 157 -119 231 313 316 56 24 360 385 -44 -302 -191 269 8
2653 8 -159 -242 67 147 -360 -625 21 388 -137 -761 -205 484 -30 -621 -73 -139 -65 -309 -223 235 353 93
2675 93 -287 -221 21 271 80 -74 88 305 34 38 -181 526 529 10 -189 475 240 184 -293 228 704 133
2697 133 -351 -28 302 62 -454 126 322 147 -263 -337 -147 -73 -280 -288 -337 -296 346 -150 -701 -448 308 154
2719 154 -455 -208 219 421 -270 -421 122 246 -391 -570 455 130 70 -412 190 334 -32 -89 54 308
2739 308 141 61 70 -81 137 445 -49 -539 146 787 245 -669 -124 316 308 -379 -94 346 376 -352 -376 564
2761 564 307 -182 -156 233 138 -299 -477 172 414 121 133 -119 -152 11 106 -154 -381 -274 137 -104 -618 -289
2783 -289 188 -173 -664 -105 429 89 -348 -189 185 350 -273 -317 141 233 170 49 167 -20 124 88 199
2804 199 -78 147 165 -78 -199 126 534 -195 -206 298 421 -147 -550 338 507 32 -453 -264 145 72 -405
2825 -405 -317 370 147 -440 -175 -66 -172 -10 -43 -57 82 11 338 -385 -378 -8 180 -6 -458 201 452 -203
2847 -203 -313 395 241 -156 -424 262 734 307 -222 -53 546 95 33 -66 310 184 -243 33 161 220 -72
2868 -72 328 -254 -140 -8 115 -73 -88 51 586 -354 -610 299 456 -208 -491 -47 46 -285 -368 155 46
2889 46 -62 -340 -200 -67 -240 -4 -49 121 0 -95 323 -30 -36 109 202 -168 -273 275 269 -293 -144 444 347
2912 347 -340 -239 518 308 -161 -2 459 634 -220 -312 477 345 59 -71 -110 146 82 58 164 182 63 298
2934 298 -105 -167 -53 282 173 -336 -261 299 -9 -310 -492 204 -69 -509 -516 23 44 -364 -245 -144 284 184
2956 184 -262 -216 -17 116 2 -225 -117 175 284 -170 -161 207 561 -81 -203 92 387 169 -317 -11 345
2977 345 223 -322 -348 124 225 -299 -54 117 203 -257 -205 -44 52 -11 -335 -45 171 -41 -7 -222 -189 -115 126
3000 126 -195 -211 146 218 -149 -471 82 375 -120 -293 -129 294 78 -143 -140 347 276 -227 -150 133 310 134
3022 134 -90 -110 192 315 -185 -74 -111 342 202 -85 74 216 288 -138 28 129 277 143 -317 103 183
3043 183 66 -151 -259 -180 -109 -220 -481 2 305 -111 -365 -81 -63 83 144 -141 -80 79 -326 -207 -142 241
3065 241 -63 -230 -202 55 27 -116 -235 130 -70 -118 -364 122 468 382 -149 -27 117 481 142 -24 -148
3086 -148 215 257 -172 -114 100 4 -77 -1 -4 231 -9 -481 -233 244 222 -302 115 74 -21 73 -156 -166 150 -110
3110 -110 -179 -173 197 74 -180 -386 -133 -20 -144 -319 -172 208 308 189 -140 219 94 -179 -29 47 335
3131 335 -252 -337 364 34 40 5 -241 156 454 299 31 258 155 185 -106 5 576 252 13 -78 35 182
3153 182 14 88 -179 119 333 -162 -279 -187 -18 -264 -194 -51 78 -117 -342 -278 70 -47 -9 -27 35 -51 -118
3176 -118 -162 -255 231 43 109 -252 193 47 -38 76 -215 334 360 -235 -31 405 280 -229 -13 -138 279 11
3198 11 51 40 259 -139 -170 236 124 517 -88 41 170 3 -214 -85 -216 210 323 9 -376 174 244 -9
3220 -9 -164 -303 52 78 -286 -368 393 70 -88 -278 -49 35 -69 -129 -301 40 202 -190 -336 86 349 91
3242 91 -328 -71 209 16 -106 -244 -59 305 -43 -209 201 -38 -172 116 -134 188 203 144 3 58 -179
3263 -179 11 -213 -323 373 236 -42 86 15 -42 -101 -394 43 110 101 -265 -128 247 -26 -142 13 258 57
3285 57 -305 -269 -28 296 -196 -245 -129 106 59 -17 -257 1 181 11 92 -179 269 75 -198 106 106 37 7
3308 7 -186 220 191 -64 208 -201 89 279 15 274 -105 123 155 178 -12 -48 405 -206 -262 -235 142 -149 47
3331 47 -9 305 99 15 -191 -171 -56 -99 -290 -211 -67 197 -344 -134 14 45 -108 -124 -28 237 -103 -338 -104
3354 -104 301 287 231 83 93 150 13 122 107 84 -471 253 282 432 92 -517 -88 -1 -112 183 -165 9 229
3377 229 307 18 -183 -135 421 50 -306 183 395 54 -375 -405 32 334 -48 -154 67 23 -440 -259 147
3398 147 106 19 -161 -295 -49 102 -83 94 -133 98 -190 -182 -160 -86 -62 -214 -122 332 221 -101 -304 111 161
3421 161 -105 -275 168 135 -105 -103 2 -20 193 370 114 -7 68 169 -33 27 84 57 -84 -91 5 -63 182 -267
3445 -267 -162 336 -9 50 -424 -26 331 -179 -99 -111 101 -281 -198 7 -209 21 -51 -261 -26 -23 -145 -233 71
3468 71 59 203 -115 -140 353 231 56 -188 -156 332 149 -73 35 134 272 -235 -64 -10 508 184 -44 -34
3490 -34 304 -67 30 85 47 217 19 43 -9 213 300 -145 -174 96 -178 -108 -266 87 5 -232 -275 -114 175 2
3514 2 -330 -196 186 317 -90 -204 -60 137 9 -234 191 95 41 53 185 81 126 135 -119 50 -55 145 27
3537 27 -189 -95 273 14 -25 79 230 292 -47 -27 109 -62 -270 160 148 4 -13 -271 274 59 -144 -77 -98
3560 -98 -119 68 -186 205 -189 142 74 53 -177 -235 -36 -343 -45 -18 160 -15 -302 44 137 -62 -493 -235
3582 -235 234 -193 -10 209 317 -95 48 -388 -153 198 -32 176 112 -14 204 94 -157 49 -102 63
3602 63 -3 303 -225 289 -397 -14 83 -38 -156 -39 157 126 204 -204 199 69 -122 -348 -149 50 202 -4
3624 -4 377 48 -186 190 79 -302 -215 186 277 -149 -346 169 153 265 -218 327 -156 196 -361 57 195 -280
3646 -280 96 239 104 -298 -121 -13 250 -29 147 -7 121 -164 -117 -305 45 273 312 -56 -87 8 63 -477
3668 -477 202 102 174 124 54 -136 -164 -2 6 -115 113 64 -67 -98 78 -8 -9 140 16 -157 -155 185 159 34 58
3693 58 195 -7 42 10 253 121 124 -43 65 227 -22 157 -76 321 -274 17 301 30 -38 -92 18 -15 -15
3716 -15 -57 -199 -85 140 143 -183 24 137 7 -85 -53 -36 114 -167 -160 -149 71 26 -207 24 -82 130 -176 -267
3740 -267 -285 -229 -299 -165 -31 -90 -71 -261 -63 -59 13 -2 -205 135 -183 87 -103 -166 124 285 188 -418 -48 150
3764 150 -103 -33 177 326 -8 -99 180 -7 10 -71 -91 -2 276 -62 44 -195 -40 290 187 260 143 9
3786 9 -197 -320 -133 -3 -105 -172 -228 135 -52 -126 82 175 -53 -167 259 112 -80 -400 -62 125 -151 -39
3808 -39 -78 209 195 219 163 -31 -38 86 216 -80 -205 25 53 208 -306 186 163 -107 251 -201 -27 70 10 85
3832 85 149 25 143 -119 459 -171 -18 1 -158 -309 -86 110 -207 -99 121 -158 -153 -202 64 28 -129 3
3854 3 -67 32 149 113 -61 80 96 -108 23 190 61 -59 85 258 164 -51 -12 -239 -27 116 -374 -64 100
3877 100 40 170 -106 3 46 -20 -8 79 151 -2 -363 -216 -263 167 276 215 51 16 66 -187 -11 88 369 51
3901 51 -66 78 -201 -9 -73 -137 193 117 57 -366 67 -144 -145 165 -22 -222 96 107 98 23 29 -55 122 -278 46
3926 46 26 38 -115 132 53 -209 -19 91 271 -116 35 -17 -202 127 92 84 189 -160 100 -52 -231 -54 -135
3949 -135 -23 -80 156 -33 -124 -31 -24 -285 -100 105 162 321 -227 7 99 93 -40 50 -59 -342 17 61 21 -95
3973 -95 136 80 -413 -49 -28 261 205 229 50 246 -21 -32 69 -197 148 5 -224 207 7 73 -202 -135 233
3996 233 33 -92 -317 -99 36 -216 -75 -141 -138 -5 150 -44 229 276 142 -71 216 100 100 -13 -150 148
4018 148 -122 -212 21 72 189 -25 22 -163 51 -184 57 174 -72 341 103 8 -36 301 58 98 32 87 202
4041 202 -338 -63 -49 -31 278 -253 -123 222 -95 -124 -59 230 -155 -253 167 317 218 40 -257 -198 183 -67
4063 -67 105 -55 189 29 -30 -249 -160 32 -161 -94 31 235 -4 108 -20 60 -15 -2 -277 -230 97 -242 -135
4086 -135 275 91 37 21 236 -54 217 -251 176 136 -47 -201 -37 1 -88 174 -342 116 1 -310 -13 -163
4108 -163 40 103 -115 41 -36 -323 48 -99 -213 -100 86 -22 206 -63 17 30 -121 -147 134 54 18 27 98
4131 98 -113 87 -319 -368 128 332 -37 -55 279 130 91 -73 -168 133 386 4 -20 201 387 487 308 1
4153 1 -40 -48 -163 71 -107 -7 61 -308 199 -368 -52 -111 -56 -97 -136 238 -160 -136 -243 -62 104 -180 83 254
4177 254 -334 -273 64 216 -4 162 65 -136 47 -14 -49 190 138 218 -215 -218 207 96 -500 88 100 -271 98
4200 98 -86 -173 241 85 326 -135 228 -184 -104 -35 -49 150 29 63 240 278 -63 -405 -2 22 -54 98 -171
4223 -171 164 9 119 -164 65 171 -123 -83 -186 147 286 38 31 -452 37 149 98 -205 -129 104 -171 -325
4245 -325 12 -376 -48 31 -72 256 2 -16 -199 218 78 -41 -155 12 159 -56 -142 -20 54 458 -309
4266 -309 -25 110 -119 130 -24 210 -473 15 -109 -43 176 34 -239 -104 -165 317 244 4 29 18 -88 -142
4288 -142 -163 176 93 -212 -193 116 88 167 -183 -230 110 224 48 131 -200 7 -87 113 190 -75 191 48 123
4311 123 163 323 7 -102 265 211 32 -193 -39 228 248 294 -135 88 119 147 -152 86 176 -191 -189 10 96
4334 96 -43 115 -62 -154 56 268 -354 -99 -16 -35 -115 -9 44 88 -42 -138 38 -18 -188 -256 274 571 -24
4357 -24 -91 -57 22 -37 155 180 -221 33 1 -134 164 255 163 -37 8 231 51 309 21 -143 -37 179 -75
4380 -75 -140 -7 -22 -183 -67 -80 -27 100 -232 -85 -4 102 82 -56 118 -58 -169 -133 -266 16 15 -62 -60 58
4404 58 96 142 -124 54 -125 -83 -90 -163 25 -294 182 -214 167 245 18 140 69 98 386 -150 -13 46 -266 182
4428 182 -162 270 106 180 -96 210 -114 107 4 -241 -35 -75 34 -50 135 244 189 -131 54 274 259 -188
4450 -188 -374 -240 -96 -50 -76 -54 -72 90 13 -4 -69 -216 25 62 20 12 -70 78 86 196 150 -90 -83 121 71 206
4476 206 278 -40 163 -151 183 121 9 368 168 -18 -69 120 51 212 233 299 100 198 -95 -61 181 36 276
4499 276 159 -239 70 -31 46 -99 146 12 -185 51 287 -23 -93 -12 -217 -98 160 74 117 -58 145 171
4521 171 -147 -51 -158 -300 -150 54 85 285 86 -186 -27 21 -13 405 -284 67 -23 -170 46 152 238 -151
4543 -151 118 2 -67 -55 5 -140 46 -139 -55 60 173 97 106 -33 20 -52 32 -76 42 -65 265 300 -133 67
4567 67 -144 76 -122 199 -315 -5 7 -119 -55 1 -330 136 46 -78 -21 37 221 149 -100 -347 -153 142 -9
4590 -9 21 75 -80 -3 212 -111 95 47 212 49 102 -287 97 168 -282 -177 -120 20 -287 -4 30 -22 -97 68
4614 68 218 44 196 -94 85 -166 126 -214 56 -75 110 -247 -168 -4 -40 105 -3 100 6 -107 8
4635 8 173 261 110 -233 3 -61 234 68 -134 -262 -184 125 -153 44 -152 -70 -208 -192 129 -116 -69 194 -101
4658 -101 190 -201 -171 -135 -156 -58 -75 15 -68 269 116 -405 -129 86 90 -152 -232 -266 -71 78 -243 49 99 148
4682 148 -48 157 167 316 -26 29 -28 0 88 16 -105 -58 140 -265 -98 -245 -114 32 -143 -253 -243 165 -82
4705 -82 72 93 240 75 -37 -414 161 -27 -20 145 36 157 -228 -57 27 34 65 -45 -68 45 -40 -101 21 -32
4729 -32 55 163 107 81 -24 121 -19 63 69 -64 -188 88 105 107 2 -73 -98 -62 59 -5 86 -122 -53 -6 -80 -230
4755 -230 -26 84 18 -18 87 -85 -44 -136 -124 143 -186 322 -3 -292 -4 -146 100 -54 -139 32 170 440
4777 440 -24 97 201 -210 71 49 27 -133 354 -18 41 62 143 -147 130 192 -95 80 229 -237 174 -105
4799 -105 -34 -155 -20 -196 10 -68 147 -233 -46 57 72 43 -114 377 14 35 -32 63 124 67 -138 -39 -81 -93
4823 -93 -25 -31 -284 72 -341 -87 73 16 -255 -100 -144 -195 212 -82 -313 354 117 151 51 -71 -128 -64 36
4846 36 -114 -314 -97 -131 181 -85 383 -154 -236 32 59 152 -107 -129 155 -81 79 -237 96 -227 -197 -71
4868 -71 -127 263 -182 95 109 50 69 99 -133 202 175 -22 -244 -8 -293 55 91 -223 -294 -193 184 -96 -41
4891 -41 231 66 -4 -298 -363 -118 -144 171 119 71 -119 -168 135 180 -86 -212 -81 -177 -180 -142 -136 23 103 -56 -186
4916 -186 -85 -12 28 133 -21 3 -19 226 -133 -167 125 -22 10 102 301 99 242 141 126 -214 -49 -86 -114
4939 -114 -156 95 -1 -123 -54 -104 -164 74 -41 358 197 15 -113 -137 -56 141 36 -137 102 2 36 21 17 -208
4963 -208 189 46 -51 244 262 -194 -28 -172 -20 -194 -105 219 -39 187 -170 -176 152 -138 -5 -62 233 214
4985 214 -85 -77 137 104 149 -143 167 -48 -135 19 -150 5 -125 12 143 -105 123 212 -9 265 151 -4
5007 -4 312 24 171 -1 12 -23 -10 318 13 -77 176 97 202 -91 135 27 -144 -240 -232 -7 86 -232 56 -97
5031 -97 46 -81 146 109 103 -19 -35 62 -160 210 -114 0 -99 -184 -70 107 119 -165 -91 75 -142 29 121 46
5055 46 22 149 197 210 42 -39 -55 54 -35 -282 -265 180 143 131 -2 -168 102 114 44 -151 26 -257 81 36
5079 36 46 -42 -77 -57 104 -30 -71 11 -36 -65 105 84 34 -73 109 271 -35 248 311 -42 -192 -229 -90 332
5103 332 122 -96 -179 -178 -46 -12 -220 -14 251 145 -165 34 -150 147 -118 45 -112 53 56 -38 -140 205
5125 205 48 205 -135 169 75 41 101 -69 214 -38 114 -89 -190 121 72 19 160 0 79 244 -61 -279
5147 -279 -38 -3 -2 -21 -76 -277 -173 -97 -103 -101 165 -160 206 206 -248 -112 94 53 -7 32 64 181 229 -123 44 -43
5173 -43 70 -161 -153 119 74 117 -134 16 -87 103 9 -10 -19 194 -35 -26 -213 154 -170 -242 48 -119 107 -71
5197 -71 14 -22 -116 23 -146 60 -245 83 97 13 -53 -39 -199 1 277 -16 53 -375 -341 128 20 111 291 49
5221 49 115 -37 16 135 148 -71 202 -126 -64 45 128 11 -276 -116 -295 -112 -259 -265 231 277 -120 -144 62
5244 62 97 211 244 121 -72 4 -178 -164 -72 272 -96 -179 260 -11 -59 -116 -99 -166 -238 -8 -68 128 60 49 -299
5269 -299 -230 -129 -236 -2 42 349 -286 -224 294 221 -27 116 69 -4 -122 140 -120 98 -289 -87 152 32
5291 32 335 23 -8 -378 37 71 -113 -56 -11 -12 44 -51 93 1 -100 -269 70 142 270 -97 -81 -128 -118 -185 -74
5316 -74 -43 122 -19 -14 282 -203 -44 116 24 0 -48 26 161 205 -389 74 -95 -120 246 142 147 70 180 -48
5340 -48 -3 184 -460 25 -73 66 -5 -35 -168 -152 -10 -229 -4 -159 273 79 141 41 53 -21 21 -166 -204 96
5364 96 -32 -229 -153 156 108 -9 -144 -118 -343 60 -70 -91 157 359 69 -47 112 -30 131 169 -108 -101 -240
5387 -240 83 424 -320 -30 3 16 6 -217 128 -23 10 164 -274 -151 140 -159 50 33 -53 161 319 -12
5409 -12 -144 -76 -163 -116 -19 -34 301 -100 105 134 11 -224 -35 -36 63 -90 -50 90 85 187 -255 -120 5 48 -7
5434 -7 74 -137 -102 377 -89 -37 -71 -175 -2 -319 -37 97 -134 314 25 -314 -190 33 59 -216 202 -236
5456 -236 -7 56 9 15 229 16 57 -107 -282 -175 107 0 -63 -68 -112 64 253 161 -158 -217 149 -107 207 -191
5480 -191 145 10 -14 -281 -103 -77 137 -43 -135 -84 163 23 45 -6 28 213 206 -103 6 -41 -175 -60 -71 261
5504 261 -92 -50 -193 361 -110 124 232 -55 199 -43 -44 182 -68 222 -105 -270 100 204 124 141 -193 -20
5526 -20 -69 -393 214 -176 190 11 49 -120 200 -147 94 124 -211 138 379 -1 199 -75 55 169 0
5547 0 -192 108 179 54 -101 -23 -109 -23 60 -22 -260 -135 234 31 -14 -64 -374 -116 204 34 245 158 257 108
5571 108 235 101 41 52 209 -22 32 -59 -205 129 -3 18 55 -358 130 -10 -242 -264 222 -121 52 127 17
5594 17 177 -120 53 -57 -115 -166 -128 -220 -17 -88 83 208 -92 22 98 -137 261 -34 -158 20 -98 -197 203
5617 203 156 19 -84 148 -1 -243 165 -80 -336 161 -285 99 156 2 -77 -128 55 126 153 -203 33 98
5639 98 62 268 149 -33 -358 115 -22 146 44 -174 379 -99 181 -166 217 95 -196 -170 79 131 -45
5660 -45 64 218 -62 247 71 186 107 3 -12 -70 -282 79 283 -62 201 311 97 -26 163 -440 60
5681 60 -104 35 -91 -74 -64 58 187 -121 97 -137 -166 -315 -174 -192 30 -1 75 264 -77 -38 5 286 48
5704 48 -166 -68 8 46 242 -79 158 -112 189 -122 95 -45 -146 -26 145 -11 37 -23 -213 81 -48 174
5726 174 -336 -157 179 26 -97 -224 54 -298 140 -21 -140 224 31 113 351 -92 -139 -51 202 239 111
5747 111 -87 119 -238 26 222 -308 -146 370 -136 -19 -124 16 205 -80 -142 108 -148 -56 72 171 187
5768 187 22 301 -108 134 60 161 -138 -108 -6 157 -152 -129 -378 74 -27 100 98 -128 46 -116 111 63
5790 63 -227 109 -11 298 78 -67 46 -6 148 169 104 -184 -34 -66 37 -12 141 -45 -257 -109 -299 72
5812 72 233 29 -29 146 133 2 95 245 -127 41 52 73 2 -7 -126 -109 2 139 243 -139 27 -152 -291
5835 -291 297 167 -99 53 -74 -124 -212 230 106 411 179 52 42 47 66 369 -133 11 -106 -320 -34 98
5857 98 191 39 -51 17 370 -121 -110 -232 -105 -87 -166 36 -66 173 -254 333 95 117 186 -38 144 52 -23 -90
5881 -90 -51 139 3 -59 -97 -69 -27 -198 -225 -56 197 -5 -11 9 69 -254 174 -238 -137 21 -214 41 -107 197
5905 197 -115 -70 -160 15 -222 61 -78 144 -233 79 118 141 200 -109 178 -162 156 -2 33 -8 -33 31 25 -75
5929 -75 6 -27 74 -21 67 -186 -53 -31 -132 124 64 -134 -179 -283 -94 167 -110 -295 242 -161 76 94 -115
5952 -115 189 244 36 -297 -165 -121 173 91 100 70 80 86 110 42 116 228 158 -159 -200 27 -68 -86 -89 188 -43 8
5978 8 -360 93 31 107 375 -174 39 210 -180 220 29 -70 -65 312 129 -382 91 -199 -199 259 -32 11 -76 -97
6002 -97 150 -417 63 112 -25 184 -135 -299 -208 -146 -79 -93 196 20 -219 96 -187 -31 -6 146 -179 178
6024 178 123 197 -42 244 -101 240 -123 -77 63 51 104 14 169 44 60 176 51 276 -46 -10 -131 58 -53
6047 -53 -262 44 -128 -275 104 49 -50 -176 -80 -142 176 136 -191 251 259 4 198 -89 -259 -104 -268 17 62
6070 62 -35 50 181 28 175 81 112 19 -269 -138 131 5 50 25 189 -18 95 55 -104 81 48 -134 -51 37
6094 37 211 17 -14 41 455 41 -30 -70 211 -5 -145 -42 -51 293 167 295 31 16 37 -1 -192 272 159
6117 159 114 225 26 149 -406 23 90 23 -130 -216 27 -7 -151 136 126 167 -193 204 14 3 -32 140 -11
6140 -11 41 -141 -125 -101 -227 -90 369 36 38 -10 -72 181 43 20 -77 -109 -372 -310 26 -250 162 -51 -82 70
6164 70 104 -124 168 -58 145 -113 -89 -17 -28 36 35 122 -63 88 -153 -34 -57 -32 -294 -101 -113 45 57 -104
6188 -104 -130 -99 -105 183 -174 -109 130 41 157 266 22 -71 18 -73 -87 61 -241 -66 -30 137 -57 8 170 437
6212 437 175 50 102 56 80 69 -92 -96 417 -165 34 -81 -15 -8 -269 -114 163 87 17 15 -146 -62 -81 -28 20 145
6238 145 111 103 -208 -114 -185 -164 -147 101 -88 274 46 141 207 43 -115 -207 -176 71 -188 107 -164 -12 85 7
6262 7 -29 64 -182 -34 12 125 110 5 81 40 -84 -275 -114 -168 -40 -182 -40 12 -160 0 -45 -98 -142 -230 162
6287 162 -214 -81 -118 120 -135 -110 115 -94 104 1 -146 152 -50 166 137 -3 7 -18 -33 -29 281 138 66
6310 66 82 -4 121 -72 -101 -124 55 28 88 166 134 200 238 181 175 -68 -46 159 89 67 -105 -289 -241 -131 163 149
6336 149 3 -52 41 41 149 142 -16 26 -34 19 -96 403 187 45 279 57 -58 183 -398 -24 -5 24 -59 -59 62
6361 62 -226 112 -49 37 142 97 -56 -288 40 79 -104 21 168 143 61 -37 -50 56 -53 24 -120 -20 91
6384 91 79 210 -66 81 106 98 -197 -109 -186 48 105 80 234 227 149 -92 7 -203 -118 154 136 22 105 -21 374
6409 374 231 54 -80 265 13 124 -16 -52 -26 -39 -274 -54 198 73 115 2 -179 -110 160 -121 18 -84
6431 -84 -52 -210 -163 177 -78 113 -114 -153 68 64 -148 198 124 -259 18 -86 -90 161 -122 117 -217 -118 180
6454 180 -100 -42 46 149 -153 179 -165 159 -45 138 -41 -249 -55 35 -25 -107 51 208 -66 90 123 -121
6476 -121 47 129 -305 -111 -195 347 -333 -298 -37 -173 -246 23 -103 -50 -74 -18 -314 -65 48 -18 114 -62 150
6499 150 91 -7 -285 -113 52 33 -4 175 -277 10 -205 94 27 22 -94 -1 -56 -259 74 -64 -63 -117 -225 -28
6523 -28 1 -3 20 -286 157 26 -63 -120 123 121 98 -36 180 110 -93 224 7 304 -87 -146 -127 94 28 33 -23 56
6549 56 -122 161 123 -37 168 59 -172 3 -30 101 229 10 -135 0 388 -43 -69 -125 208 -108 -19 -310
6571 -310 -64 174 13 60 100 193 102 -119 -246 13 288 229 -254 123 -13 -84 -140 -79 -34 40 -175 216 -104
6594 -104 -139 159 365 5 50 -68 32 -70 -76 9 122 206 1 29 -97 174 -131 87 37 281 -105 83 -127
6617 -127 65 -9 86 -109 -1 79 49 12 15 32 -194 -124 -92 16 -104 -266 227 -180 72 -314 124 296 66
6640 66 61 -86 2 -225 110 205 173 -42 -171 -12 82 32 -35 44 132 40 -31 208 131 22 47 62 -19 -7 -174 171
6666 171 -354 -107 95 -188 -240 118 7 59 -15 -189 9 -202 68 -266 -57 219 85 -26 23 -220 115
6687 115 135 87 -195 -73 -3 -216 -192 117 -175 -118 -231 -27 -90 167 -76 -18 -10 181 92 -106 27 -164 131
6710 131 -5 143 65 200 -147 23 82 29 -63 1 46 212 -158 149 223 -14 -32 -46 14 -35 -118 -20 11 -5 -90
6735 -90 84 211 126 -2 -121 -38 -145 -91 213 -86 -207 -205 74 66 -163 -119 -136 60 179 -141 -7 -18 -44 -242
6759 -242 49 -192 65 -29 82 -109 217 -101 -48 -8 235 214 -104 54 108 82 -440 -179 -133 239 -86 -264
6781 -264 -28 93 255 230 -115 82 -7 -37 -57 -114 -67 146 -102 73 51 -13 30 36 -49 -26 -108 22 -111 -146 222
6806 222 -87 -42 -87 20 43 -190 -146 -196 103 196 46 107 -120 10 15 -12 225 24 -80 189 106 -83 147 -139
6830 -139 47 499 138 -248 -25 -330 11 239 176 322 28 82 184 138 24 216 304 113 123 -136 -119 -97
6852 -97 97 -210 220 184 -55 -92 20 92 63 -29 -9 128 -261 95 -4 -150 -138 -60 80 -126 -61 -148 -55 -239
6876 -239 151 -84 322 78 280 302 169 239 48 168 58 -63 32 -32 -111 274 131 -144 -98 138 200 6
6898 6 1 -110 -151 -24 95 -56 -194 86 -31 91 -128 -170 101 -28 -8 -201 -179 80 -53 6 -31 91 92 12
6922 12 87 4 2 -5 4 13 290 249 298 -255 248 -49 -77 22 153 -369 24 -185 -3 247 -35 61 -178 -55 -16 -301
6948 -301 115 172 80 -83 13 81 -97 -31 -226 -220 -30 -12 -249 -318 -143 -66 91 -65 46 -363 113 83 -163 22
6972 22 17 -52 -126 331 134 -332 -314 -9 66 -111 134 2 15 52 -44 112 32 -16 57 119 -72 -29 27 -240 287
6997 287 196 -1 215 176 275 103 -189 37 51 148 -100 143 -126 320 -203 66 25 50 -54 -3 34 390 100
7020 100 -91 -1 144 274 -185 -37 -132 167 -168 -282 -38 134 -212 -196 -69 71 -131 -11 -82 102 -380
7041 -380 -96 131 32 -72 12 291 -89 39 -63 55 -179 146 -58 152 193 -93 142 -158 -12 121 -56
7062 -56 233 -147 -51 -56 -72 56 116 -192 -171 -82 -32 117 -2 98 -158 -22 -183 49 -173 101 -293 -230 -218 -89
7086 -89 -12 -149 90 107 -17 21 45 127 102 -75 -104 164 116 -79 -131 221 -49 255 -116 357 214 -213 8
7109 8 36 11 -158 62 5 -15 47 150 311 -33 -194 30 -74 189 213 -422 107 379 6 -138 -84 122 -186
7132 -186 29 10 -170 2 0 -342 86 111 -280 -247 -141 86 80 184 125 -93 145 -237 -289 238 -172 43 -95
7155 -95 -21 146 -140 222 130 79 21 138 74 132 -73 -75 35 74 -180 129 121 96 -78 -24 79 -9 -94 62 39 -50
7181 -50 -52 -34 111 -93 -331 159 -248 280 68 -322 -105 -38 3 86 296 169 -350 -154 -111 -132 -101 -185 -63 60
7205 60 42 48 -104 43 -60 -66 -70 -264 175 163 42 -120 330 134 164 109 -130 -10 -226 160 22 -40 58 -173
7229 -173 158 -208 185 43 -249 -12 14 125 -130 93 -128 148 97 -72 137 -32 -105 16 14 -331 559 -73
7251 -73 68 -189 21 196 -74 77 -91 236 -231 -76 83 -117 -24 -14 -224 -303 -128 58 -86 64 -11 109
7273 109 31 79 290 49 -256 -82 -123 344 -190 -66 141 280 179 -41 72 58 223 191 33 221 23 94
7295 94 46 -158 115 -191 -44 -177 82 123 19 41 69 -173 69 136 -88 101 -56 -128 25 112 66 -78 95
7318 95 40 83 64 92 154 -327 214 84 222 -52 -5 291 48 187 157 -267 -71 191 -118 241 -155 -77 81
7341 81 32 -42 -190 62 -242 -216 5 -139 189 13 -144 -53 131 -188 -103 -212 165 65 -181 90 -26 -146
7363 -146 -56 220 -107 -187 -79 111 81 165 -195 11 -224 -215 -24 -154 -31 -68 127 141 -36 151 -205 223 70
7386 70 19 170 -134 -67 299 144 62 -65 -64 195 197 155 -7 22 -170 283 -47 158 -282 267 155 267 99
7409 99 -121 -91 63 17 -176 232 -96 27 -91 -8 -73 216 -39 -148 25 67 -10 -17 -71 -9 -233 100 180 -141
7433 -141 174 -257 -152 131 60 -134 -8 39 121 2 -65 -129 144 206 -23 118 -48 40 236 5 -24 164 -102
7456 -102 33 -129 51 52 54 -70 -231 109 -168 -168 -157 -38 26 -53 -90 22 317 159 -58 -31 -83 -135 -105 -196 180
7481 180 -195 250 -66 152 -170 26 80 -87 37 80 -60 -172 -21 6 -80 108 183 -47 -45 247 34 -52 60
7504 60 94 -25 -181 176 -199 0 -183 -511 -52 -31 -138 39 -44 -299 70 200 -104 -290 -135 85 137 69
7526 69 -307 77 110 -241 222 142 -151 -331 31 154 -24 62 191 90 -341 -354 -41 44 48 -246 -45 -188 -354
7549 -354 -109 72 80 -110 -68 -167 -124 -59 68 166 115 -104 114 -20 118 7 -25 124 -189 210 170 42 151
7572 151 -247 42 -109 49 -64 225 -134 -63 16 190 -10 -61 109 -390 -270 -13 0 -261 -17 -130 -236
7593 -236 -169 144 -11 -189 -375 -38 76 80 133 45 -439 -172 122 210 91 -233 219 201 72 141 -36 128 339
7616 339 121 16 92 -14 133 -97 -142 370 -228 79 -2 126 110 -206 -55 182 -2 -77 66 -141 82 -55
7638 -55 -103 190 -92 -204 29 374 21 47 19 -239 141 105 -131 -140 -107 277 238 49 125 93 10 -37 69 245
7662 245 31 -55 74 81 86 -110 17 229 151 -284 -164 75 206 -116 191 -37 -172 -35 149 216 -107 -35 78
7685 78 -68 72 -82 28 -21 150 -2 -104 156 -129 -214 1 16 92 -158 -80 273 -5 -117 164 -23 147
7707 147 -120 -16 79 100 225 -74 55 8 -153 -94 -63 -6 -4 -114 -210 79 131 183 102 92 -259 19 134 -129
7731 -129 300 -8 165 -324 -74 115 -66 44 285 -32 -64 -39 -148 32 99 67 75 -22 -190 8 53 109 -76
7754 -76 69 -6 -4 -112 169 -101 74 44 328 80 -6 96 216 -133 -230 39 -288 171 -60 101 57 -148 -64
7777 -64 75 278 -183 -116 135 159 -156 196 203 80 128 -157 -96 110 271 8 71 -23 84 93 -286 -61 95 -108
7801 -108 -199 -158 55 129 -149 30 -251 -32 103 78 -77 -269 160 144 -52 -100 121 142 243 -146 -34 -120 -6
7824 -6 -165 128 379 343 252 -50 -129 -155 126 233 -240 96 358 -136 -165 -129 41 -123 -29 -30 46 101 -181 114
7848 114 -14 69 -152 3 136 -264 88 113 -13 94 55 -315 -220 94 59 135 -206 -138 97 -327 -10 -192
7870 -192 -190 92 -49 -275 -41 -179 20 97 -114 -139 -11 84 -98 -374 -117 61 147 50 -232 102 68 8 57
7893 57 -24 -338 139 199 195 161 -101 97 -118 -97 67 -216 -211 -177 170 193 109 3 228 -227 -202 196 -190 -21
7917 -21 65 34 -160 4 -39 -196 -133 136 78 -227 -152 137 124 -443 120 -180 59 -136 -296 28 -45 88 -320
7940 -320 -27 216 -170 180 -310 38 58 89 251 -91 273 176 64 -58 -3 142 -48 -21 255 18 -192 -234
7962 -234 -134 -239 -6 112 -2 -126 43 -129 4 -194 -65 -58 304 -41 42 -40 -137 -219 -149 26 57 -34 -216
7985 -216 -256 95 322 267 -90 67 179 92 148 185 -3 -150 62 -161 -125 194 375 -28 225 -318 -39 -1
8007 -1 -158 -174 280 298 180 95 -236 -49 179 -181 183 27 107 262 -143 55 20 28 76 -103 -104 46 -69 23
8031 23 -188 -52 21 -188 181 -18 -218 -1 68 273 302 207 208 64 11 63 102 -91 -62 2 59 123 -60 -37 276
8056 276 64 -243 94 -177 64 168 108 -72 118 201 200 -70 281 124 114 215 -47 72 81 236 -1 20 177
8079 177 53 147 -222 -203 1 -95 -155 395 84 -69 -80 1 -266 27 123 81 87 291 -151 -203 -16 -38 -69 -139 -26
8104 -26 -25 110 202 -19 -27 245 -72 42 264 63 -33 107 -27 -21 -45 85 -219 -33 -50 63 150 -100 -29 221
8128 221 -195 -57 -45 -70 1 -65 5 132 101 -86 224 15 -89 216 -42 -125 -129 -207 -47 228 -173 86 -235
8151 -235 -40 234 -307 171 50 -46 64 143 73 11 -18 -154 -93 -98 -57 -66 126 -109 148 -113 115 119 95 125 130 -202
8177 -202 151 78 -111 383 208 4 -94 -136 80 150 -114 -165 -15 -104
8191a04
$$ Imaginary data points
##PAGE= N=2
##DATA TABLE= (X++(I..I)), XYDATA
0 0 0 0 0 2 -8 0 -8 8 -8 14 -16 24 -24 32 -40 48 -56 64 -79 90 -107 123 -142 163 -190 215 -247 279 -316
29 -316 356 -400 449 -505 562 -627 698 -776 862 -953 1058 -1173 1298 -1436 1591 -1764 1960
46 1960 -2178 2428 -2717 3058 -3461 3948 -4551 5324 -6347 7779 -9926 13498 -20527 39644
60 39644 -198801 -622227 -190209 168793 41872 -229424 -142541 -10451 -118836 -278375
70 -278375 -186313 -39289 -53100 -179154 -227780 -179049 -53484 44686 -3247 -160014 -184538
81 -184538 -63090 -31476 -128282 -87258 101600 140976 -8068 -42115 64764 37259 -100545
92 -100545 -19648 231684 264090 53451 -16169 136485 208854 116689 84273 148244 136694
103 136694 70897 109855 204897 216385 184827 170838 89828 -32657 2818 183909 232992
114 232992 101548 47072 125109 101107 -43724 -54301 83011 105540 -15063 -45989 28424
125 28424 18958 -50680 -18106 35924 -56153 -174813 -130291 -23002 -24844 -53240 -5451 -8070
137 -8070 -131926 -197437 -108949 -37991 -73016 -70720 1889 -15224 -116056 -105900 3356 5673
149 5673 -88423 -80534 15162 19230 -36712 5439 89886 60178 -24887 -22949 20783 11897 24483
162 24483 112936 151955 73439 11932 44618 62277 25899 46751 123268 113484 32089 34771
174 34771 107205 99797 31813 33888 66544 17861 -34381 31284 115451 73747 -10314 -4295 16781
187 16781 -44859 -88267 -19548 44139 -1454 -56730 -35888 -26471 -80991 -101805 -54629 -40805
199 -40805 -86421 -96030 -56147 -49198 -72961 -61560 -46983 -92966 -136579 -99092 -45846 -53114 -57562
212 -57562 -11610 -8464 -85810 -118492 -47166 894 -41014 -59090 2367 31146 -20859 -42159
224 -42159 12348 37429 -7863 -31686 7523 37793 33101 43753 66309 50948 17293 16281
236 16281 28419 23049 37374 82842 90990 43806 22722 53441 56439 13297 7955 54204 60952
249 60952 15888 11564 58443 62211 6986 -18229 7430 9951 -18835 -13844 24451 29424 -2478
262 -2478 -20292 -20067 -32494 -43903 -30454 -14936 -19552 -20693 -11537 -21751 -47721 -46016 -23918
275 -23918 -32568 -60218 -46756 -4549 -1850 -30913 -28674 -4065 -17802 -55460 -49149 -4260 13818
288 13818 -1870 -3497 14700 14471 -4122 -8668 2756 12764 19400 27459 31615 31469 38937 43978
302 43978 28221 11882 23308 43641 38937 28644 47265 69896 52989 18940 16766 35305
314 35305 32281 16340 26493 50692 48525 23696 12858 18906 16219 942 -5793 1853 11603
327 11603 13389 7433 -1692 -8382 -11735 -21091 -34409 -34129 -17004 -7927 -20020 -30060 -21938 -18428
341 -18428 -38360 -56782 -45881 -24435 -24118 -34391 -28436 -13746 -17802 -36959 -43147 -30587 -21092
354 -21092 -24193 -24207 -9922 5105 3514 -9993 -18101 -11551 -3904 -4864 -4103 10257 26357 23935 9631
369 9631 7253 17610 18759 6765 5405 23481 38119 32513 21802 24523 29209 19445 5171 7575
383 7575 23551 30143 21714 16150 20899 22678 9309 -6235 -7128 2557 5950 -470 -1339 6864 7985
398 7985 -7919 -25285 -24812 -15247 -15051 -23214 -21087 -7583 -4100 -18464 -31386 -28794 -22402 -27359
412 -27359 -33372 -24613 -8208 -5735 -18740 -25900 -18452 -13380 -21238 -27312 -16882 -155 3241 -3484
426 -3484 -3791 2948 1969 -9590 -12911 1722 17184 16393 8854 13627 24365 21454 7806 4233 14536
441 14536 20871 16592 17028 29420 36482 24700 8242 7483 17258 19270 13266 12661 21173 26033 18337
456 18337 6368 4325 8206 5280 -3366 -3731 8925 17447 7689 -6684 -7295 -831 -7310 -19287
470 -19287 -16703 -2443 1319 -8718 -12347 -5249 -5883 -19400 -27658 -20197 -9156 -7928 -11184 -9297
484 -9297 -5390 -7390 -14807 -19761 -15452 -7176 -5445 -9397 -6628 5490 9639 -3957 -15583 -7842
498 -7842 4449 839 -5618 6771 22051 14975 -3306 -2819 11514 12418 501 -862 13147 20302
512 20302 15422 11570 13213 12318 6754 1194 1790 9004 18328 19293 9044 3368 10058 11746 -1671
527 -1671 -10585 2536 14813 5694 -5323 3768 13523 -1129 -20341 -13662 3071 -306 -12915
540 -12915 -9096 2913 1556 -9687 -14363 -13119 -15217 -15629 -11422 -7293 -5519 -1943 -4483 -16137
554 -16137 -21153 -10496 -3080 -13167 -18500 -4290 6422 -5018 -14406 -2110 5012 -10432 -21339
567 -21339 -4471 12746 5952 -3760 4597 12405 1415 -9267 -2817 7674 8992 8728 12227 10968
581 10968 7525 9879 10214 2906 1077 12051 15813 4177 3102 20310 24743 4168 -7715 5506
595 5506 12612 -333 -3410 15559 21947 1957 -10854 849 7962 -4003 -9861 406 5718
608 5718 -2266 -5323 -723 -2282 -7645 -8563 -9932 -16585 -13371 1515 2888 -11601 -13620 -844 -4645
623 -4645 -25188 -23833 1360 7629 -12012 -16578 1908 5321 -12813 -16621 222 5105 -7650
636 -7650 -9622 4143 8736 2355 2191 5146 -217 -4426 3451 9046 6835 10420 19367 13493 -3668
651 -3668 -1670 15743 15110 279 5030 23004 18305 -1729 1987 21916 17331 -5753 -6631 11620
665 11620 13133 1424 3729 14322 7884 -7089 -8037 -1797 -3018 -2520 4518 1825 -9707 -9327 -150
680 -150 -5662 -18390 -12271 2209 -5740 -21889 -12610 6902 -999 -20761 -16525 -1843 -9338 -22853
694 -22853 -10377 9402 3324 -13482 -10299 -1029 -6609 -12066 -2269 5988 16 -3075 4049 4557
708 4557 -2019 2838 11062 3292 -7090 3306 18349 12016 744 9813 19971 4996 -10339
721 -10339 2729 20809 13505 1537 10008 17580 4498 -6870 4618 14435 4407 -4390 2989
734 2989 8486 1529 -55 6496 3360 -8312 -8916 -1878 -3581 -6417 2895 7572 -7347 -18363 -7415
749 -7415 743 -10800 -16839 -1070 7452 -9357 -19994 -5148 5269 -7434 -17761 -7091 280
762 280 -7854 -10266 1816 6571 -2738 -8456 -5112 -4884 -5752 2521 9167 3173 -2145 4085 6292 -3115
778 -3115 -3999 9903 12876 -1540 -5004 12143 18030 2582 -4296 8940 12806 -1524 -6005 9517
792 9517 17552 7505 947 5778 6431 -1150 -2394 3933 5524 3784 5527 3859 -3113 -3422 4025
807 4025 3912 -6972 -7915 2578 3549 -6882 -5286 6786 3924 -13094 -15992 -1618 3204 -6565
821 -6565 -7591 2539 2252 -9368 -12374 -3618 -814 -5148 -5501 -2210 -2060 -2888 -320 -618 -5098 -4632
837 -4632 163 -2007 -7377 -1106 9711 6925 -5078 -4536 4530 2435 -6757 -1516 11209 9331 -2056
852 -2056 -1856 7745 7501 -1148 -1114 5536 5887 1720 3058 7165 6463 3826 2725 462 -1670 2112 6414
869 6414 3998 665 4252 7762 227 -7610 -2305 6251 1931 -5329 -927 6852 1540 -7235 -3979
884 -3979 2841 -396 -8436 -6567 271 1098 -2689 -2759 -1841 -4383 -6772 -6418 -5211 -3349 -359 -49 -4169
901 -4169 -6970 -2773 -62 -5558 -8201 -1282 3311 -2261 -6346 821 6662 -100 -7640 -3562 3172
916 3172 1623 -1956 2503 7351 4646 -906 -476 2642 3570 2947 3029 3320 4821 6649 5618 1813 1446
933 1446 4733 4399 187 579 7363 8815 1393 -1588 3826 6012 -455 -4882 597 5698 2565 -1873
949 -1873 -339 2251 -938 -5523 -4736 -1500 -263 -2238 -3801 -4005 -1909 -1609 -4463 -7281 -5925 -3098
965 -3098 -3367 -5330 -3399 1076 -1369 -7439 -8145 -1948 -115 -4105 -4880 587 3038 -1304 -3998 -157
981 -157 2676 95 -3495 -745 4504 5443 2652 941 2608 4302 3004 515 1421 5645 7486 4174
997 4174 1939 4528 7109 3761 -1019 706 5925 5634 1830 1613 5153 4934 -435 -2621 685 2782
1013 2782 331 -2431 -293 2721 1279 -2991 -4521 -3010 -1931 -3624 -4723 -2439 -70 -1254 -5246
1028 -5246 -5879 -2881 -1630 -5063 -6789 -3423 135 -1399 -4601 -3623 -918 -1184 -4933 -4745 -366 1867
1044 1867 -61 -1951 248 3036 880 -1719 -1361 2198 3917 1735 758 2968 5347 3123 36
1059 36 1086 3912 4495 1532 1435 4877 5787 2897 -385 1217 3613 2093 -206 357 3909 3775 164
1076 164 -1521 283 1703 -851 -3045 -1519 1597 821 -2349 -2807 -163 -67 -3122 -4995 -2540 277
1092 277 -989 -3340 -3290 -234 -936 -4286 -4927 -2171 298 -1634 -3388 -1659 1325 391 -3297 -3571 -342
1109 -342 977 -808 -1877 455 2853 1190 -1354 -582 1566 1950 -491 -972 2181 4194 2359 -319
1125 -319 493 2631 2008 -139 210 2901 3852 1085 -297 1872 3263 1104 -1556 -788 2365 2850 321
1142 321 -102 1827 2155 -336 -2388 -597 1684 740 -1357 -1173 1450 1494 -1432 -3033 -1308 772 -663
1159 -663 -2727 -1419 1307 552 -2198 -3179 -306 211 -2038 -3174 -855 1802 437 -2448 -1715 9
1175 9 212 -1632 -2734 -206 1727 881 -1376 -1002 714 595 -1797 -2014 599 2547 500 -1138 703
1192 703 2612 1348 -1377 -1196 1817 2183 87 -244 2034 2979 659 -1018 200 2418 1904 -270
1208 -270 1 2162 2698 1011 -457 289 1674 845 -1182 -843 2115 2700 -78 -2063 -417 1604 -300
1225 -300 -2451 -1310 1733 1001 -2132 -2275 138 786 -2311 -3483 -1256 402 -789 -2566 -1609 223
1241 223 -527 -2721 -2846 -1062 -119 -703 -2407 -1544 853 910 -1840 -2256 337 1232 -871 -1759 988 2735
1259 2735 750 -1487 -31 2649 1993 -605 -387 2096 3223 1323 1 1609 2889 1517 -165
1274 -165 38 2603 3187 1634 -412 791 2350 1481 -575 -467 1785 2037 -672 -1379 870 1989 -663
1291 -663 -2534 -1106 710 -330 -1932 -1503 372 -306 -2580 -2693 -1017 -536 -1539 -2568 -1707 -540
1307 -540 -504 -2133 -2522 -1222 -184 -1381 -2758 -920 1042 671 -2105 -1717 759 1284 -1076 -1641 580
1324 580 2047 846 -238 812 2114 1255 -156 291 2130 2679 1520 677 1509 2398 2101 525 295
1341 295 1500 1852 725 -92 1457 2776 934 -1366 -663 1589 952 -1067 -933 993 1425 -1201 -2181
1358 -2181 -348 463 -741 -2214 -1521 -88 -476 -1183 -1745 -895 -917 -1556 -2446 -1661 -76 -62 -1457 -1924
1376 -1924 -527 321 -1214 -1851 -707 736 0 -1589 -333 1815 1158 -824 -990 822 1354 226
1392 226 -440 1287 1888 1182 -126 114 1335 1462 936 180 1324 2154 957 -187 -101 1328 1533 -90
1410 -90 -1078 600 1541 208 -1185 139 1196 302 -1748 -1175 575 804 -695 -1284 331 6 -1326
1427 -1326 -1838 -505 724 -142 -1594 -1331 -122 233 -439 -1087 -758 -77 -473 -1445 -740 914 972 -671
1445 -671 -1804 -275 1030 261 -955 -539 1403 693 -811 -798 979 1299 -288 -771 460 1481 527
1462 527 -313 247 1075 705 -219 -333 520 1044 603 179 204 1007 472 -382 -583 625 1114 123 -879 -77
1482 -77 1202 465 -995 -433 1168 746 -1148 -958 918 1040 -187 -1469 -648 481 -76 -990 -144 695
1500 695 369 -923 -1217 -167 575 -68 -542 -779 -14 175 -740 -813 132 450 -237 -1546 -526 507 241
1519 241 -746 -516 468 259 -1174 -1308 461 1029 184 -1054 245 744 274 -526 -172 733 609 -27 -675
1538 -675 305 1303 863 19 -263 629 592 -27 -14 717 1565 641 -431 1 1219 1061 -334 -232 891
1557 891 1111 -235 -390 640 765 -241 -900 -217 239 347 -514 -36 -133 -154 -759 -1204 -516 66 195 -978
1577 -978 -1031 -253 -27 -1100 -1466 -431 294 -416 -1172 -811 283 299 -871 -783 289 60 -572 -896 304
1596 304 1129 479 -176 -72 431 540 386 24 418 1144 695 171 54 1303 1137 -211 -104 874 1361
1615 1361 309 359 749 1061 485 -507 395 949 940 -314 -527 179 402 -258 -793 -418 182 -432 -808 -1046
1635 -1046 -152 239 -414 -1104 -911 13 -849 -1161 -803 125 28 -851 -1146 -65 -22 -737 -864 -113 376 30
1655 30 -631 -578 124 84 -414 -354 730 576 461 -80 216 1097 469 -45 -11 395 1083 294 219 582 1026 742
1677 742 -411 132 644 1110 4 -110 597 794 210 -302 9 611 -39 -603 -326 187 376 -309 -658
1696 -658 -120 149 -263 -999 -737 158 -82 -641 -757 -320 145 -354 -863 -663 308 97 -678 -355 116 342
1716 342 -491 -512 207 256 -480 -685 -160 629 310 -343 -315 38 428 98 -170 157 944 257 -6 -212 865
1737 865 601 15 -296 290 912 497 -121 -61 355 280 -404 -151 530 286 -210 -396 111 541 1 -368 -161
1758 -161 432 190 -291 -538 22 585 -143 -582 -433 267 176 -513 -286 516 238 -537 -1103 -49 322 -6
1778 -6 -696 -333 328 578 -211 -631 103 332 -289 -592 349 396 34 -412 -400 128 506 -372 -521 -25 365
1799 365 87 -417 177 421 167 -406 -155 123 463 -48 -583 -38 755 79 -129 -23 478 515 -112 -228
1819 -228 565 573 65 -209 -40 375 243 -151 -232 458 352 260 -443 -168 745 -15 -444 -235 -5 515 -440
1840 -440 -330 -140 187 -325 -763 79 554 312 -576 -297 -3 256 -455 -788 -419 405 -168 -471 -347 186
1860 186 166 -661 -629 16 758 -99 -470 -237 690 171 -416 -459 361 85 -233 -50 195 786 217 -377 228
1881 228 375 521 -195 -90 787 771 573 -106 391 803 328 -287 -215 468 593 -33 -388 156 541 125 -580
1902 -580 -389 430 2 -437 -501 323 85 -353 -1155 -287 86 -251 -466 -439 -113 -50 -328 -378 -379 -247 -126 -922
1924 -922 -462 247 283 -509 -223 -11 425 -498 -360 250 466 263 -124 109 907 648 -273 18 707 372
1944 372 115 271 426 824 431 90 -41 375 598 100 6 366 418 204 -638 -250 533 514 -340 -689 52
1965 52 381 -469 -892 -194 214 -251 -782 -324 85 -383 -624 -476 -279 -154 -385 -495 -511 166 212 -158 -340
1986 -340 -135 140 -92 -807 -354 445 236 -344 -829 453 558 -32 -525 470 821 -197 -248 514 904 208
2006 208 -222 386 373 284 -76 476 322 196 63 155 -32 -101 633 147 -213 -112 355 339 -512 -149 607 397
2028 397 -1091 -232 517 174 -497 -302 374 200 -531 -992 92 209 -311 -139 -49 102 218 -72 -73 -389
2048 -389 28 371 -294 -461 203 614 -59 -777 6 750 342 -587 -164 959 442 -587 -225 384 429 -483
2068 -483 -134 433 93 -67 -275 235 213 -304 -112 -391 -444 295 595 96 -198 250 322 -383 -802 214 905
2089 905 99 -935 -202 830 -76 -1010 177 625 73 -732 -28 458 389 -269 -259 243 -204 -127 241 207
2109 207 69 604 185 -10 -360 189 342 -276 -304 97 684 -348 -684 696 748 -218 -693 259 801 -134
2129 -134 -503 -74 566 -355 -679 25 -44 -127 -480 -190 -32 -401 12 -54 -287 -153 697 332 -716 -325 208
2150 208 695 -334 -933 733 545 -158 -657 527 1106 -577 -559 66 620 -82 -252 465 702 187 -93
2169 -93 98 -123 68 345 49 1 -360 530 813 -234 -30 846 237 -569 -807 643 589 -685 -940 446
2189 446 461 -1003 -385 364 451 -791 -887 81 345 -569 -541 80 -102 -244 234 42 -425 -6 188 -18 -633
2210 -633 -194 578 82 -890 -183 1099 701 -617 -618 563 626 -568 -168 813 424 -384 -251 595 646 23
2230 23 66 348 34 180 193 190 -32 -29 103 277 -663 293 616 -74 -765 -357 381 -73 -554 -264 623 67
2252 67 -1004 -248 678 85 -748 -357 -116 94 -436 -288 262 -239 -185 -273 -20 -265 161 211 -59 -196 187
2273 187 768 143 -497 311 797 69 -661 350 904 182 -455 316 1028 463 -533 46 476 155 -204 -130
2293 -130 615 283 -250 -226 -158 81 -152 -154 -535 -186 411 299 -537 -544 190 54 -541 -480 388 232 -324 -1147
2315 -1147 -195 396 -246 -717 -362 201 -9 -429 -485 27 203 55 9 50 179 70 -160 -166 -33 267 117
2336 117 -535 53 529 345 -168 -146 613 690 -181 -378 554 511 -288 -93 178 582 41 -246 -69 524 33
2357 33 -233 -15 80 83 -123 -182 -429 -58 300 -218 -708 -277 304 67 -504 -218 378 122 -686 -523 215 435
2379 435 -344 -498 24 2 -184 -567 -177 540 131 -204 -359 152 306 103 -220 74 217 292 -72 -117 319
2400 319 570 50 -253 243 675 61 -376 5 499 382 -383 -172 520 128 -226 -225 39 256 -214 -401 -242
2421 -242 133 319 -331 -389 -92 324 -63 -411 -304 193 15 -358 -327 -210 410 -258 -303 319 668 21 -460
2442 -460 -290 179 203 -323 -311 140 775 -236 -453 -39 482 152 33 -307 217 372 65 -343 346 563
2462 563 -11 -193 -329 177 220 -264 -310 -77 227 -289 -417 52 426 99 -276 -333 -32 256 -282 -555 45
2483 45 98 -210 -239 -133 202 56 -319 -426 -10 35 84 -447 -244 318 224 -174 -116 195 443 -224 -345 69
2505 69 934 35 -194 -331 409 250 -459 72 372 188 -72 -334 142 380 -57 -395 -268 183 345 -180
2525 -180 -432 77 219 89 -456 -543 -16 203 -513 -587 -284 219 -189 -556 -171 161 116 -419 -123 264 -113
2546 -113 62 -411 42 308 99 -290 -122 223 321 -316 33 -183 402 226 -338 338 593 187 -74 -72 410
2567 410 343 -236 -242 77 521 -153 -192 -296 252 188 -307 -95 34 293 64 -113 -357 233 -170 -541 3 139
2589 139 303 -326 -602 121 -135 -166 -453 -393 224 -191 -596 -310 605 619 -344 -461 123 111 83 -110 211 374
2611 374 182 -14 68 128 381 7 -210 47 516 138 -119 -131 113 6 73 -410 351 625 136 -342 -157
2632 -157 329 68 -326 -219 238 135 -332 -585 28 188 118 -585 -139 66 31 -463 -489 -252 1 -17 -420
2653 -420 -453 313 101 -116 -521 313 267 -180 -472 -99 325 -6 -553 149 367 238 -17 -178 271 450 180
2674 180 -197 334 254 265 235 123 84 401 21 -8 7 226 281 -350 -213 288 477 -20 -627 -104 542 -210
2696 -210 -507 338 541 37 -341 -190 136 94 -336 -495 92 -169 -10 -116 -174 14 21 -526 -500 -335 252 197
2718 197 -460 -529 397 612 -450 -569 253 673 208 -1 521 745 40 70 225 85 -184 -105 194 -3 207
2739 207 174 207 48 16 363 -187 -195 72 308 354 -257 -162 455 40 -331 -344 268 276 -342 -454 180 127 -489 -493
2763 -493 -97 263 -321 -366 217 -128 54 38 -245 -188 96 282 -209 -318 -2 373 -262 -420 424 583 -132
2784 -132 -349 -104 457 524 -324 -271 571 354 -410 -359 -31 195 -42 -134 54 127 -110 -286 237 232 47 88 -465
2807 -465 -110 -74 206 -191 -443 7 181 -344 -527 19 530 -92 -681 -175 246 109 -549 -40 131 61 -616
2828 -616 173 24 -202 -417 -185 -398 57 65 10 23 -299 288 112 -61 -594 465 389 -341 -337 231 528 -208
2850 -208 -240 237 561 66 -332 26 361 -44 -76 -242 -31 -188 -202 -24 -198 289 93 -2 -324 -60 194
2871 194 161 -150 -286 273 227 -361 -372 167 401 -507 -330 136 310 -308 -157 45 189 32 -246 251 369
2892 369 35 -141 -108 184 15 16 -86 -149 132 234 37 -42 15 437 121 -591 -136 382 277 -506 -163 213
2914 213 459 -238 -90 117 382 116 -457 43 132 -130 -215 -268 -95 93 130 -183 -289 -38 -73 -191 -242 144
2936 144 181 -263 -425 -183 387 76 -250 -299 239 257 -194 55 225 288 -510 -376 304 414 112 164 34 -26
2958 -26 209 368 -73 30 276 120 -101 84 220 209 101 -333 80 201 -16 -549 -298 376 127 -565 170
2979 170 200 -90 -248 -405 94 250 -23 -143 -199 55 -71 -248 -92 205 71 -130 85 -15 343 190 -213
3000 -213 -26 149 8 -19 -268 67 377 -213 -151 -75 179 42 -22 -95 -38 406 45 -108 72 93 248 23
3022 23 238 218 197 -40 -143 -212 -94 235 -123 159 673 85 -406 -309 17 217 -237 -351 -10 13 128 -220
3044 -220 -291 168 -52 -110 -24 -268 -10 30 -273 -2 -187 99 -87 -24 -147 128 94 -189 148 189 179 -526 -158
3067 -158 260 -64 -51 -137 67 224 -138 -333 -125 314 -248 -304 -72 310 179 -94 -181 26 85 -174 -502 8
3089 8 78 55 -150 -636 -282 83 -80 -500 -21 352 71 -264 -89 -111 40 -331 -99 158 381 -39 -443 -140
3111 -140 54 46 -180 126 -42 -14 130 -304 -287 198 331 -296 -124 264 287 -147 -150 124 -49 85 -279 -194 147
3134 147 509 -83 -272 139 109 -55 -102 381 210 50 -275 -189 171 -38 -433 -340 20 -10 -226 -153 -145 221 -253
3157 -253 -95 -29 -1 49 -73 -180 -417 192 -15 -120 -220 24 198 34 -265 76 135 -24 -46 142 294 55
3179 55 126 -40 258 208 127 204 99 129 -36 -154 101 292 202 83 -180 215 144 161 -72 55 -81 83 218
3202 218 -116 197 -148 -299 -179 -232 157 86 -184 -393 187 273 -153 -133 148 231 -211 -303 130 275 87 -279
3224 -279 -258 -27 167 -155 -294 19 246 35 -134 32 281 208 -83 91 159 203 340 -304 104 426 276
3245 276 50 -18 234 39 247 3 227 119 -118 130 54 70 -124 -76 -63 -48 142 143 -3 -9 111 115 -226 -443
3269 -443 -42 -148 -29 -266 -126 -28 -205 -367 -255 138 18 -100 -38 156 -148 191 17 63 177 21 -84
3290 -84 175 288 277 -213 86 368 417 -79 328 21 277 49 106 83 187 -89 -24 180 -69 263 296 76
3312 76 -93 148 88 -197 -278 58 148 4 -405 93 4 135 75 -260 -9 275 6 165 68 74 65 -85 -376 120
3336 120 188 -31 -180 -30 -163 -103 -194 -75 140 -120 82 -378 205 103 56 -171 17 625 252 -136 139
3357 139 195 -112 -376 -102 -13 404 69 -81 26 86 -154 -37 -89 108 -118 -10 0 -126 336 153 -199 128
3379 128 -3 241 -80 -349 66 295 82 -357 41 178 -84 -123 -149 -10 192 -67 -215 91 236 -36 70
3400 70 -95 262 66 100 -9 318 109 352 -74 84 39 -68 57 52 551 -7 -163 218 123 319 135 -28
3422 -28 -43 -337 -136 -176 -33 21 -181 -78 -1 39 18 -233 39 -117 -72 45 -300 -210 50 39 89 -235 -286 -37
3446 -37 -24 -53 -31 251 194 207 -340 87 56 -12 -250 -12 90 61 110 116 251 190 251 174 206 261 200 192 44 300 54
3473 54 -113 -314 -85 286 33 -181 -215 235 44 -191 68 -167 40 214 -174 41 -110 -177 168 -42 -75
3494 -75 30 -157 -21 -59 65 185 -187 -190 155 102 100 132 -40 165 -293 -224 -33 93 -13 -74 -252 182 -37
3517 -37 -38 -182 66 167 79 -66 54 106 -33 -71 -217 -117 62 95 16 -289 287 98 12 -223 -20 -118 129
3540 129 -199 -248 380 106 -336 -168 113 -128 -222 169 -89 -51 -3 -306 113 57 -102 -97 79 122 194 147 33
3563 33 195 -23 30 -122 3 86 187 35 -222 27 3 75 -219 -1 209 256 -91 51 306 189 -66 -205
3585 -205 137 222 9 246 30 158 90 48 -96 -62 -9 113 109 -314 -76 120 167 -74 -75 132 -182 -226 -125 303
3609 303 -25 -387 -122 23 115 -193 -97 192 85 -55 -82 138 59 -133 260 1 261 112 -62 -222 -275 -63
3631 -63 -84 30 95 -3 -44 3 -236 241 158 -67 88 327 169 5 -104 -29 376 84 -71 -82 -278 324 186
3654 186 -115 118 -260 -42 -22 -90 -96 -176 119 -20 -195 -87 129 -93 -309 49 131 -60 -97 -2 208 -241 -301
3677 -301 121 245 -80 -287 111 136 262 -226 187 354 100 -109 -85 56 19 96 -15 -270 78 203 180 68
3699 68 13 37 218 -450 9 -42 106 88 -220 4 109 -4 -80 -13 288 -160 -24 -193 -85 -66 -316 83 -169
3722 -169 53 -78 20 -156 293 -6 -195 -11 -76 191 309 -184 -107 493 85 -12 -91 374 160 6 -131 -54
3744 -54 304 16 -50 228 89 -96 47 -121 171 -58 35 -121 -124 50 42 85 -20 339 -146 -71 -178 118 121 -116
3768 -116 -346 -367 210 -105 28 224 93 -113 -30 -8 -266 -52 118 20 -84 -184 -12 -272 2 1 53 147 -71
3791 -71 -226 2 10 57 113 195 -165 257 -170 -98 99 -9 19 -117 194 159 72 6 -130 -326 -278 66 36 192
3815 192 69 150 69 38 -89 -110 -75 -127 202 70 -149 201 177 223 -521 -107 -116 -119 -63 15 -42 154 -117 60 -158
3840 -158 64 -11 -44 -292 -75 147 -223 190 -97 125 63 -269 -26 197 129 -24 121 -163 25 56 28 -220
3862 -220 -168 86 -118 40 -64 48 15 67 227 49 69 -240 -147 298 -123 -307 -176 169 -77 157 267 -224
3884 -224 -173 -9 -98 -25 -199 162 62 -42 -29 256 96 67 -87 168 -190 -69 -55 -209 218 224 -74 -4 -191
3907 -191 109 -27 -345 100 177 -43 94 -66 -204 87 39 80 246 -96 341 135 84 305 36 -107 100
3928 100 13 -124 -92 -69 -172 -126 -82 -105 -111 96 80 -233 253 8 148 21 -64 -227 106 49 -8 -87 -35 -150 -206
3953 -206 -140 -37 237 -69 -129 77 369 -59 -108 95 31 214 -70 -54 74 -191 -17 70 -4 115 24 -252 -74
3976 -74 55 -223 -95 47 -3 317 216 -114 -280 44 16 -134 46 210 -22 126 -14 33 207 204 17 -206
3998 -206 75 66 -54 31 36 373 -91 108 207 -364 -44 -125 -136 -195 129 -15 251 110 -10 -107 -176 284 17 9
4022 9 10 -46 220 -16 63 -118 -210 315 -91 -173 -262 255 186 -66 -110 25 107 -186 -36 64 121 -8 -41 -307 -44
4047 -44 132 -152 33 20 -123 -77 -495 -274 -80 87 92 -252 262 -162 -217 -150 -135 -17 -125 70 -98 -205 118
4070 118 86 172 48 118 211 -129 -355 3 234 83 -180 307 -154 33 252 -60 144 -147 -205 -32 -26 12 -13
4093 -13 -115 -61 314 48 102 -27 -34 63 31 -160 82 205 191 -6 -14 73 24 80 -151 -149 120 -120 -6 250 -54
4118 -54 6 -334 -305 174 -24 -80 -146 44 291 85 -93 -128 94 -240 -42 112 119 204 -38 18 -403 66 -32 -224
4142 -224 -117 153 -91 -74 -67 190 -176 -59 -33 -168 -43 441 -225 92 89 -66 42 -253 95 246 -279 -130
4164 -130 -138 58 -14 -125 -136 240 208 7 67 -483 63 189 4 -137 260 -108 -375 -287 -115 140 -26 133
4186 133 -236 166 311 -105 -303 111 197 -34 -83 50 -158 -32 -177 55 -22 163 -69 -61 -65 343 121 -211
4208 -211 83 -63 48 -84 234 210 147 0 59 -201 14 -98 32 -51 -59 67 -307 -149 -38 162 185 -21
4230 -21 -75 128 301 -469 -119 93 206 264 55 93 237 58 -197 -153 97 5 -228 213 244 -271 -45 -89 174
4253 174 -166 253 138 77 130 -107 -134 -78 -36 202 -9 113 27 74 234 -128 237 -261 141 -38 -275 -25
4275 -25 -15 245 -246 -121 -25 -107 -141 50 -31 10 -48 -127 -153 115 -48 140 -120 -147 39 20 -75 -241 27 160
4299 160 93 -7 170 253 -54 -175 141 -24 300 -67 -45 60 -78 -77 -65 36 149 84 146 153 50 111 53 225
4323 225 -67 -44 123 -40 -268 3 -53 -318 -185 -1 -99 -28 -232 -27 -36 170 -220 61 352 47 188 -57
4345 -57 136 -25 45 -399 -113 199 -82 21 34 100 -164 -205 -60 36 294 181 45 82 -142 371 62 116 -44
4368 -44 -127 314 15 115 59 -23 17 -90 104 388 -51 -133 -10 168 -29 -87 -123 18 111 -60 116 -6 115
4391 115 -190 83 52 154 -138 -178 -161 78 -68 180 -174 77 -5 -194 -120 295 -19 252 -40 -482 -65 302
4413 302 -43 103 -16 61 -101 25 178 -156 165 -61 -124 -304 24 -52 100 59 -9 18 -99 111 -184 199
4435 199 -160 198 107 128 40 -140 -308 356 -55 -52 -76 -278 -78 -249 -408 -110 297 -164 -103 -186 181 99 -251
4458 -251 -105 149 47 374 -173 53 -103 -37 106 -196 -23 211 -94 58 -149 276 428 -62 300 270 3
4479 3 -161 -84 28 322 -223 77 -20 -96 33 18 16 15 77 45 -32 219 117 -165 -340 -104 189 13 -89 -87 273
4504 273 32 -105 -190 -41 117 186 -145 -186 198 -225 162 -80 235 -133 224 115 -156 40 -184 -197 139
4525 139 100 -26 161 100 98 45 -105 31 42 -28 148 280 -307 -219 268 35 -8 -61 97 -244 33 24 292 -118
4549 -118 -43 -161 -17 134 -134 -31 -356 387 35 33 -261 96 254 203 72 116 81 126 -103 -198 40 167 -212
4572 -212 -144 -117 188 70 272 -162 304 -96 -297 87 -17 142 35 -260 -279 208 -131 -11 -5 154 130 248
4594 248 29 -150 193 62 -307 -27 9 41 -95 5 32 -169 128 -119 -198 -46 -123 -199 -60 128 -39 -192
4616 -192 72 37 307 101 54 -227 -88 -136 -44 175 -5 95 98 23 63 8 150 0 -60 -43 466 -16 -153 -63
4640 -63 -175 -246 163 83 119 -95 -5 40 61 97 -105 105 -125 23 -253 -117 220 -111 -176 -181 412 -56 -298 -48
4664 -48 -145 218 -2 -108 34 -120 52 -47 -109 -11 -150 84 -7 -40 49 -235 -59 60 353 -24 -59 -143 -17
4687 -17 -120 -27 -56 -215 -46 182 264 194 -82 -141 -87 -149 131 248 67 -18 -19 169 -297 -41 -166 56 52 155
4711 155 -175 67 -165 29 -128 -316 -186 -5 157 -152 -67 114 -20 45 -120 -8 59 95 -141 -371 -34
4732 -34 -121 -55 28 90 -138 104 -176 24 -130 16 328 -196 -383 -20 -64 -117 -169 235 -182 -53 171 13 -6
4755 -6 140 242 133 133 213 -72 -151 216 274 78 -249 152 -30 -98 -14 -109 103 -17 92 137 237 -214 -293 -23
4779 -23 -130 -120 -138 15 105 -157 165 -119 410 129 112 43 274 134 240 128 84 -205 -130 295 -26 64 -50
4802 -50 -25 57 52 -293 -180 129 -28 -17 79 199 -43 -145 -47 79 -32 311 153 -192 161 53 32 41 66 210
4826 210 159 -58 -189 295 -219 -183 12 -161 189 -133 -102 125 342 -89 -66 84 -121 -161 130 76 120 197 -100
4849 -100 -187 166 631 -20 -42 36 143 -334 -47 270 -24 70 -221 -146 -1 -109 -115 -55 -292 93 34 -267 -121
4872 -121 146 -408 14 204 -69 318 -84 68 -36 34 -67 176 92 141 -97 -118 11 -171 -100 -89 45 -260
4894 -260 -142 55 -145 -67 -201 -152 91 -182 -218 -279 204 112 146 38 -155 43 -13 -53 -66 -137 -4 34 -23 78
4918 78 -93 34 254 -25 56 -264 -86 -29 27 -302 -121 -85 -150 36 -123 -248 68 62 -83 -9 165 -72 -43
4941 -43 132 -247 125 -80 87 -331 -42 38 114 -210 42 51 32 24 79 127 222 -125 -132 -101 65 -136 -116 -181 3
4966 3 30 -17 -96 -124 -88 16 -178 551 -55 -363 -288 293 89 -126 33 85 3 90 141 33 107 54 -22 -141 132
4991 132 -112 -54 20 -68 302 79 106 -106 -57 29 -128 -132 -90 0 283 -243 -175 -224 1 -197 114 7 149 4
5015 4 210 -191 70 72 1 -9 -17 -95 -39 -139 -101 -186 13 35 37 121 -31 241 -265 -161 -15 82 -97 248 292 94
5041 94 -8 175 121 -40 -154 32 72 -81 32 293 -74 -337 169 71 217 41 486 133 -262 256 -11
5062 -11 1 -267 -147 115 -105 -180 -118 -182 230 135 -54 -45 -51 38 -22 -227 -153 -84 -46 90 251 156 -175 -2 48 -39
5088 -39 143 111 -165 281 15 337 -143 24 55 196 92 -74 -310 -10 79 -152 190 28 41 112 -30 191
5110 191 51 5 -130 69 80 -303 -41 42 -24 -87 -26 58 59 110 126 149 55 344 323 -94 -36 -41 521 -11 -92 204
5136 204 -165 17 -162 226 23 -111 3 12 7 -299 24 72 149 43 161 -20 152 50 -189 -100 11 -17 -116
5159 -116 105 183 -53 -53 -114 107 -186 88 52 94 74 86 -219 -246 -58 99 85 156 116 109 -28 -100 21 185 49
5184 49 -313 160 -51 229 -158 42 25 79 114 116 -31 -311 102 253 246 25 59 -42 38 -121 22 -155 -87 250
5208 250 -18 -11 101 -217 -187 168 -20 225 66 36 8 -69 62 -9 -85 -141 273 128 -199 192 -139 145 25
5231 25 34 26 261 141 -2 134 -153 -94 -121 -70 1 301 243 -66 46 50 230 15 171 -76 -77 64 -187 -63 11
5256 11 -246 50 348 -56 -29 -176 -290 -83 167 -193 -341 -6 66 -165 -10 158 -42 -130 -164 139 -201 -177
5278 -177 -23 175 162 77 28 -160 -20 266 -78 -75 25 203 -90 81 273 151 57 128 -190 106 -120 74
5300 74 26 -248 159 166 221 -143 -3 -4 -240 -130 263 227 -132 -64 -13 -57 19 157 -86 -44 75 -74 -228 -221 32
5325 32 -224 83 11 -24 150 -206 -156 202 39 76 179 1 -12 -307 215 104 83 -202 144 159 42 222 -236
5348 -236 53 -59 175 128 5 122 -203 78 100 -76 -68 -34 174 -127 -180 -32 -144 189 -14 66 -100 112
5370 112 -154 103 87 -153 32 -159 -82 -38 -38 261 -130 -31 -42 111 -13 -45 62 153 -19 -187 17 288 -33
5393 -33 132 75 -40 -189 -120 -53 280 -132 182 77 -200 74 -126 -83 29 32 -36 17 301 -275 -181 197 343
5416 343 38 -118 91 -24 114 88 -195 80 -111 -133 102 126 121 -22 -40 -45 -42 -189 -79 -67 -84 81 -95 -29
5440 -29 -13 44 30 20 127 -15 4 102 173 -64 35 -153 24 101 192 -82 -171 224 94 -34 -7 -103 -3 -114 -132
5465 -132 64 75 72 -56 77 -12 -82 -14 254 -31 185 -65 -244 16 24 -69 59 123 -96 -123 330 -24 -55 204
5489 204 -104 -120 26 0 -141 5 83 217 -17 -58 -2 -107 116 -138 129 5 222 141 -166 7 -116 -81
5511 -81 273 -425 17 158 249 110 -12 -113 42 44 -88 47 -69 -102 196 -152 33 179 -89 186 -61 -306
5533 -306 329 264 158 -222 -55 98 -68 -23 414 -233 -79 163 -91 478 95 -250 -206 -48 91 -13 78
5554 78 279 79 342 27 9 -281 -103 -136 262 -27 -209 63 238 -172 -113 26 218 -81 -91 107 -87 -145
5576 -145 82 -37 -126 18 40 -71 -1 66 -14 -123 150 187 -9 -109 -244 223 79 167 -50 -2 -118 54 192
5599 192 -110 -111 -329 5 145 -55 26 83 166 55 -147 -19 108 166 -23 -70 -276 -43 91 -57 94 -349
5621 -349 -62 56 63 -79 -245 -12 86 -140 82 56 9 113 188 28 -206 303 -223 -91 196 -71 -32 -34 271
5644 271 -104 56 -252 -54 102 -43 107 -38 266 127 371 -199 63 93 -210 17 -183 -213 -42 -19 185
5665 185 102 313 120 163 -192 -17 -277 -88 258 94 -75 -12 155 -226 -81 -304 -135 301 -21 -84 -174 92
5687 92 13 102 -52 -133 212 168 169 -12 27 12 -128 -199 193 -25 -72 68 -148 -153 271 67 -214 103 218 310 -7
5712 -7 22 -100 259 6 -40 34 269 -60 -171 -118 -16 -194 59 13 64 128 -365 346 59 49 -110 255 -76
5735 -76 286 -31 -103 30 -78 -38 70 -138 -223 -109 -27 -72 55 36 27 -134 62 307 -117 -15 -95 -36 -23 -24 454
5760 454 -6 -35 -103 -226 276 -37 32 121 -261 -205 241 107 8 -85 -55 8 -32 -71 -276 -17 185 -210 -125 96
5784 96 -313 121 227 93 -35 -179 -108 -110 63 -52 -180 188 -116 18 75 -6 275 83 -14 -95 11 128 189
5807 189 122 -164 101 16 -127 -217 153 -227 -115 152 111 69 163 -10 -9 -116 -187 120 -61 -118 -140 54 194 183
5831 183 95 145 -46 -202 180 69 -300 -186 157 -61 -154 101 279 75 -9 94 16 156 104 52 -201 -27
5853 -27 -141 267 1 113 240 -128 -20 -207 -232 54 164 -137 -295 172 139 86 43 -18 -157 64 -12 -308
5875 -308 -57 -141 151 42 2 -4 137 75 -388 0 -159 -64 -63 -351 135 19 107 210 151 -49 -77 109 2 -3
5899 -3 116 125 255 114 1 61 -238 -149 -265 -58 2 -113 -50 91 95 -38 223 -117 -43 -168 153 28 2 317
5923 317 25 362 218 -95 -390 -249 71 -211 48 -153 -361 118 138 106 10 15 -257 115 -194 -58 3 13
5945 13 155 -22 85 -51 70 98 -192 300 -103 -168 -75 114 -225 -138 178 134 173 -264 38 221 278 -108 46
5968 46 -158 -111 117 -66 10 119 1 90 -215 38 178 128 -110 -334 -202 166 -35 -162 -251 108 259 -254
5990 -254 344 24 -478 -13 183 -236 29 27 61 -153 228 118 -130 -169 -14 229 24 97 -118 -25 -9 -187
6012 -187 -13 76 68 -70 -139 39 -347 -122 12 -36 162 66 233 81 -240 -210 149 139 -171 -242 -264 -27 0 -135
6036 -135 232 -144 -123 131 54 -164 -85 160 119 82 -326 151 -203 -88 207 -138 -10 119 30 63 -290 -111
6058 -111 33 -256 38 261 114 -133 -94 20 74 64 -170 15 199 -62 168 -48 13 -239 78 151 -61 -124
6080 -124 -54 -71 171 226 92 49 40 19 -3 42 116 -105 69 -57 -78 -85 116 -304 -85 55 -93 -244 70 33 -37
6105 -37 18 10 4 15 289 99 180 -56 38 115 65 -232 -55 -39 -18 250 -120 214 99 97 21 168 326 19 -73 -22
6131 -22 138 99 63 -282 -17 160 -291 -61 146 -65 123 141 -17 263 364 121 10 -77 -51 66 247 -59
6153 -59 26 101 -119 76 66 -51 -110 -94 -45 -126 -17 65 117 -23 288 -62 163 -122 -42 138 225 -70 -183 -78
6177 -78 -141 -14 110 -12 -38 192 3 -75 286 -88 76 -137 159 -104 -188 26 160 -125 192 131 -142 -69
6199 -69 364 -147 -114 22 -94 239 -83 71 102 -144 -8 45 -167 -3 -3 -47 193 -218 -213 16 5 22 46 201
6223 201 227 90 -225 -43 21 -118 75 -72 -134 169 187 154 -221 -69 16 -47 118 -40 -56 88 86 -9 -74 102
6247 102 -388 -60 241 -22 62 -53 104 -54 -58 -134 -65 168 328 -154 88 -194 18 170 24 124 2 185
6269 185 121 -144 -27 -150 -35 65 40 -2 -338 -230 -109 127 -158 41 -98 222 -183 74 -156 107 -127
6290 -127 -34 39 -6 19 -40 -20 150 96 37 -192 -21 -62 -9 34 18 88 -69 -5 -73 -226 -51 76 3 10 -104 18
6316 18 -123 -30 -115 187 -42 105 -132 -71 -61 75 -179 -265 -86 151 -429 -147 58 -101 -128 277 -12 -269
6338 -269 -95 -192 33 154 -108 28 135 117 5 -84 93 -138 -48 -274 -44 131 -43 1 226 300 -66 81
6360 81 -33 287 -168 234 74 152 77 -63 236 -148 12 -29 71 218 4 106 37 260 61 153 -232 80
6382 80 128 121 -184 298 201 163 32 -104 -50 -90 95 272 56 108 30 -49 -9 353 143 76 -9 -2 394 -59 5 -64
6408 -64 242 64 182 -184 129 -100 -27 -137 133 214 -216 221 -250 -64 279 -23 -326 111 90 -32 255
6429 255 -337 -2 110 34 -98 78 -13 48 -167 -202 -92 -102 -137 231 -26 -40 -245 -155 91 62 215 192 190 120
6453 120 -33 -158 -24 -22 179 -64 -244 -226 121 -238 -269 149 198 -11 -17 -13 20 131 -192 218 359 95 89 -61
6477 -61 -490 -11 -128 -88 95 34 263 67 -18 -63 362 116 40 -17 -192 62 69 -107 -120 157 -32 -250 229
6500 229 -3 -286 2 -138 13 117 50 -77 8 109 73 57 -50 190 65 95 124 167 -155 34 -246 85
6522 85 124 134 107 -311 235 -379 212 307 6 -169 229 -108 173 -210 159 164 -131 -193 85 -1 -168 -193 -150 -41
6546 -41 43 245 -76 132 115 -11 21 -222 -170 -364 22 173 214 96 -91 -281 110 -39 282 128 68 -314
6568 -314 163 125 -81 -210 -253 -36 -100 -44 174 65 -116 86 50 -90 -124 93 84 35 -253 -197 160 111 21 -87
6592 -87 -155 121 -18 48 -51 98 52 116 -283 41 -442 -388 177 36 153 -47 79 -112 113 -132 185 -127
6614 -127 -45 -5 250 -84 -13 19 73 -122 -86 -58 387 183 -97 19 -84 80 -209 -38 -317 -158 -201 107 73
6637 73 199 97 -42 20 -49 122 -158 -94 11 -95 -137 57 92 168 -216 151 244 -151 132 -2 2 218 185 -110
6661 -110 -195 -42 -357 200 197 -22 -46 109 118 64 -58 -22 -12 -223 10 -144 -3 151 -164 -4 11 246 -530
6684 -530 -91 90 -97 157 -87 45 3 -69 -320 299 300 190 0 167 -6 295 118 9 -32 -219 19 -216
6706 -216 -50 -6 -18 45 -26 -153 27 -304 73 123 97 239 -182 -21 -75 -324 -151 254 -229 -140 167 -116 -154
6729 -154 86 126 41 183 150 -69 63 -42 118 164 -99 -201 -205 30 66 126 177 -153 234 96 143 -87 107
6752 107 194 -248 21 134 -227 -35 -4 74 -130 -147 -95 132 177 -189 90 106 -58 -13 25 -78 -16 156 -23
6775 -23 23 -387 32 4 -120 -99 203 46 -8 19 -249 -126 -229 -138 -73 -199 -314 110 -126 -234 -77 55 152
6798 152 264 -10 -54 74 -36 159 53 -154 30 -40 69 228 -148 -172 157 -39 -188 50 -32 -239 -129
6819 -129 103 -166 -285 67 99 199 10 -59 -257 348 65 359 92 116 -173 125 203 -117 41 81 -51 34
6841 34 54 163 -165 49 0 47 -119 244 35 -135 123 -187 102 -96 -337 182 370 -234 -47 177 74
6862 74 -121 7 -112 73 -255 -121 25 49 34 21 -61 -31 54 55 62 -193 -49 18 -177 -285 -75 74 106 71 -211
6887 -211 -200 92 150 -176 168 40 -299 23 -400 81 -103 115 44 -2 57 -122 -203 230 120 -188 -137 61
6909 61 194 117 -26 152 -180 41 -206 53 -122 173 -41 -406 45 -114 -84 -67 194 41 -151 -64 71 32
6931 32 147 89 126 -202 192 219 339 -139 -294 58 324 -207 23 182 -193 -107 137 -87 -224 24 -333 49
6953 49 -52 174 -92 -167 -145 9 3 -4 28 -119 138 -96 117 -145 -42 -14 -138 15 -207 66 25 -265 -105
6976 -105 -278 -24 -175 -191 -39 -173 -514 -148 -55 48 49 -7 -11 -203 54 -3 -131 -59 11 -154 51 90 -27 -134
7000 -134 -36 6 268 77 83 199 156 -38 77 -74 288 93 -12 153 -13 -236 -59 -41 -118 101 124 -8 -81
7023 -81 -161 -118 -67 -213 -99 -97 29 129 -70 41 -147 76 55 189 -201 -14 -133 25 -245 108 88 47 -213
7046 -213 71 250 -188 -165 5 24 -184 165 -81 77 130 -251 55 -113 11 -34 -178 -118 87 -91 -17 -91
7068 -91 211 250 -127 -78 -30 62 -43 303 14 123 -147 -88 136 94 -43 112 70 -78 -192 31 241 64 172
7091 172 -6 -24 123 322 -56 -14 -184 83 -59 -107 192 249 25 -339 -71 -51 -32 184 -167 -23 -238 145
7113 145 90 -261 24 121 -227 92 -136 230 -237 60 -332 -382 168 299 -290 87 -116 189 -175 -133 352
7134 352 -196 -9 203 280 109 17 -164 267 -384 279 -48 425 -172 93 85 200 242 -51 -202 -50 25 424
7156 424 -4 27 -67 6 -130 -85 136 167 -308 -156 -25 1 -49 -270 -81 -42 -135 -14 -34 -113 -256 -280 -29 104
7180 104 -210 -34 237 -29 94 -115 -52 -217 -109 25 56 36 170 174 65 -35 -21 -93 106 -61 -135 -42 -12
7203 -12 34 -69 50 -4 192 9 132 189 -90 134 191 49 61 -128 -137 260 -222 -87 -38 46 4 -158 -81 105
7227 105 -135 -94 -72 -113 170 -177 224 113 228 -54 -94 -93 112 169 71 -35 364 18 312 -41 -61 105 42
7250 42 -66 264 50 -75 -7 47 4 -150 123 -103 -145 95 -90 -55 87 -4 -94 -98 -219 -19 84 -143 -194 -48
7274 -48 -55 449 116 220 -190 -144 50 -27 -122 -13 121 235 146 -81 98 7 -11 -132 -84 -157 72 -123 -67 -73 242
7299 242 48 -81 -24 -199 92 -30 198 282 103 -145 4 -179 -263 78 134 40 -58 -350 416 14 262 -77
7321 -77 -277 -57 87 -140 -65 187 -70 -277 -150 165 -236 112 -115 37 95 -125 -130 -67 7 -38 25 74 85 125
7345 125 90 26 -272 -124 -49 -8 99 -103 30 -119 148 -34 -74 -116 -90 -219 248 135 113 13 50 36 8 16
7369 16 -81 220 -59 210 -161 -190 103 -71 57 28 -129 -86 -191 -63 -58 31 74 -128 -34 -87 14 -71 -181 180
7393 180 49 -25 57 -155 -55 -95 -244 77 152 79 -82 12 -147 57 121 -165 259 -69 61 -32 217 -180 181
7416 181 -70 210 -17 48 59 40 -109 23 213 113 181 3 -112 -121 -11 -65 -248 58 99 295 209 -74 380
7439 380 -45 34 46 224 -175 92 -59 216 -112 201 -297 28 89 -104 -18 -193 -101 -23 139 73 24 -208 -16
7462 -16 -106 112 164 -50 131 165 -85 -3 -30 120 62 246 41 88 9 -105 385 57 -150 121 -51 155 76
7485 76 -78 282 14 -163 -26 -122 35 14 137 73 43 125 55 -62 196 46 215 84 -15 -110 9 368 -170
7508 -170 -76 39 75 -32 -48 -236 98 -65 255 -9 -8 -45 5 103 -71 77 66 26 -62 -97 162 70 155 -112 103
7533 103 163 -203 142 -267 124 -63 -62 -13 50 -17 -172 -220 -94 -44 146 -223 -66 -194 -53 450 -178 267 -109
7556 -109 105 -11 19 36 -160 117 192 219 43 69 -17 -17 78 -216 -145 254 210 101 -138 -66 122 308 -24 134
7580 134 -151 169 -276 -164 59 108 85 -59 -9 -106 5 -186 76 132 -244 34 43 -54 68 -48 -181 -141 -65
7603 -65 -164 -109 111 101 -132 -45 -130 -265 124 179 128 -19 -12 -18 275 -16 82 -221 51 -66 -1 120 -52 330 9
7628 9 -254 -170 197 -65 -70 211 72 -8 -60 -162 44 -48 28 177 102 -31 -94 104 -186 -13 117 -45 -162 -118
7652 -118 44 -231 86 154 -188 23 97 4 -195 65 8 -39 -5 20 5 -42 76 -234 -47 -42 -84 15 83 -351 -111
7677 -111 -95 -171 -94 -314 35 -171 388 -119 -136 109 -25 144 84 -290 -38 -227 -99 -294 -178 -53 108 13
7699 13 19 -90 -12 -172 -68 139 146 -363 -137 340 17 -129 -148 -33 16 129 96 -142 102 100 237 118 -37 -153
7723 -153 -26 24 -1 -191 224 -220 -333 -15 -248 -250 145 -29 -98 28 63 144 24 111 45 62 -331 151 -83
7746 -83 -61 146 151 -43 -217 -33 -11 112 -72 -216 20 95 265 -91 -203 -167 -6 -170 83 -90 -31 191 -98
7769 -98 -2 151 -143 243 103 54 -100 153 249 22 174 40 69 63 17 -205 51 242 -189 -236 102 -51 16
7792 16 47 -40 -56 -75 -167 40 97 -207 161 -161 148 -38 40 22 -76 -259 136 132 -89 -422 165 -102 -162 73
7816 73 212 9 44 -84 -11 127 -23 47 -92 -343 159 112 -73 86 103 143 36 99 -99 218 249 -111 87
7839 87 -121 44 -451 115 430 -138 -255 -179 -46 24 -23 170 17 -331 -229 -139 243 -273 110 176 -19 -191
7861 -191 59 115 -130 195 -86 144 -128 -63 164 18 118 -26 -26 -318 -72 119 -64 85 16 53 -14 334
7883 334 205 45 12 -234 174 -123 -180 -5 -380 -5 203 275 -171 -146 19 -257 180 -151 48 -305 -165
7904 -165 144 -286 21 -165 80 -13 102 0 -25 152 5 162 119 190 213 240 -9 -38 -62 12 -112 -146 164
7927 164 -132 39 105 184 -189 -250 -362 86 -220 -102 -293 -111 30 17 -228 -174 149 16 -78 -172 78 -285
7949 -285 32 -138 189 18 -143 43 -15 -200 -2 139 21 -83 63 119 -172 20 229 26 28 114 -123 -175
7971 -175 -9 -46 -251 -3 -30 80 28 23 -13 -62 64 65 127 147 116 8 -365 -90 -51 75 131 -340 -42 -104 -26
7996 -26 -80 -38 -31 282 201 -32 -248 -185 -46 74 79 123 8 214 61 107 102 286 18 -206 -221 116 131 -87 -16
8021 -16 15 134 -122 198 -19 158 -106 -71 45 193 142 -61 -103 54 -229 57 217 -78 -59 204 7 -83
8043 -83 51 332 -158 -198 138 135 -219 -77 -135 -190 -90 -147 258 -133 132 -43 -293 121 48 -61 -285 -15 -200
8066 -200 -158 20 1 113 -17 -109 29 168 -183 73 65 216 49 26 -88 -170 129 122 -53 55 65 -39 -56 -261
8090 -261 28 28 -188 76 67 9 168 25 -355 114 16 50 -21 101 10 110 197 57 184 21 35 -10 91 -63
8114 -63 -211 85 -3 -184 120 147 -120 -11 -42 -69 126 -62 -244 214 -66 38 -106 -40 157 153 99 -329 -74
8137 -74 29 223 69 121 -44 -381 -23 -214 112 -176 -29 156 -66 4 157 -4 -22 -94 215 183 -231 -220
8159 -220 -152 109 176 -41 -273 54 83 195 -30 82 95 122 -9 -67 -12 -128 -107 9 90 -112 -135 91 99 -48
8183 -48 21 -7 -233 94 -71 -45 -43 89
8191H9
##END NTUPLES=NMR FID
##END=
