##TITLE=1H_LR-685A-AK2
 D2O, 8 sc, 
 1.6.2020
##JCAMPDX= 6.0         $$ Bruker NMR JCAMP-DX V2.0
##DATA TYPE= NMR FID
##DATA CLASS= NTUPLES
##ORIGIN= UXNMR, Bruker Analytische Messtechnik GmbH
##OWNER= root
$$ XWIN-NMR		Version 3.5
$$ Mon Jun  1 12:02:14 2020 Russian Standard Time (UT+4h)  she@DPX200
##.OBSERVE FREQUENCY= 200.1315
##.OBSERVE NUCLEUS= ^1H
##.DELAY= (6, 6)
##.ACQUISITION MODE= SIMULTANEOUS
##.ACQUISITION SCHEME= undefined
##.AVERAGES= 8
##.DIGITISER RES= 18
##SPECTROMETER/DATA SYSTEM= spect
##.PULSE SEQUENCE= zg30
##.SOLVENT NAME= D2O
##.SHIFT REFERENCE= (INTERNAL, D2O, 0, 15.7039)
##AUDIT TRAIL= $$ (NUMBER, WHEN, WHO, WHERE, WHAT)
$$ ##TITLE= Audit trail, XWIN-NMR		Version 3.5
$$ ##JCAMPDX= 5.01
$$ ##ORIGIN= Bruker BioSpin GmbH
$$ ##OWNER= she
$$ F:/spectra/data/she/nmr/H-F/1/audita.txt
$$ ##AUDIT TRAIL=  $$ (NUMBER, WHEN, WHO, WHERE, WHAT)
(   1,<2020-06-01 12:01:15.64 +0400>,<she>,<DPX200>,
      <created by zg, POWCHK disabled, PULCHK disabled
       configuration hash MD5:
       00 E9 B6 7A A2 85 ED C7 34 08 36 98 17 FE 4E 26
       data hash MD5: 16K
       D3 13 D1 0B 1B 61 F9 44 8D 54 C6 DC 86 1D B7 59>)
$$ ##END=
$$ 
$$ hash MD5
$$ 57 0B 83 E2 3A 46 83 E6 F7 10 A6 BE AA AF 43 B4
##$RELAX= 
##$RELAX= 
##$RELAX= 
##$RELAX= 
##$RELAX= 
##$RELAX= 
$$ Bruker specific parameters
$$ --------------------------
##$DU= <F:/spectra>
##$EXPNO= 1
##$NAME= <H-F>
##$PROCNO= 1
##$TYPE= <nmr>
##$USER= <she>
##$AMP= (0..31)
100 100 100 100 100 100 100 100 100 100 100 100 100 100 100 100 100 100 
100 100 100 100 100 100 100 100 100 100 100 100 100 100 
##$AQSEQ= 0
##$AQ_mod= 1
##$AUNM= <au_zg>
##$AUTOPOS= <>
##$BF1= 200.13
##$BF2= 200.13
##$BF3= 200.13
##$BF4= 200.13
##$BF5= 200.13
##$BF6= 200.13
##$BF7= 200.13
##$BF8= 200.13
##$BYTORDA= 1
##$CFDGTYP= 0
##$CFRGTYP= 5
##$CHEMSTR= <none>
##$CNST= (0..31)
1 1 145 1 1 1 1 1 1 1 1 1 1 1 1 1 1 1 1 1 1 1 1 1 1 1 1 1 1 1 1 1 
##$CPDPRG= <>
##$CPDPRG1= <>
##$CPDPRG2= <>
##$CPDPRG3= <>
##$CPDPRG4= <mlev>
##$CPDPRG5= <mlev>
##$CPDPRG6= <mlev>
##$CPDPRG7= <mlev>
##$CPDPRG8= <mlev>
##$CPDPRGB= <>
##$CPDPRGT= <>
##$D= (0..31)
0 1.2 0 0 0 0 0 0 0 0.06 0 0.03 0 0 0 0 0.0002 0 0 0 0 0 0 0 0 0 0 0 0 
0 0 0 
##$DATE= 1590998474
##$DBL= (0..7)
120 120 120 120 120 120 120 120 
##$DBP= (0..7)
150 150 150 150 150 150 150 150 
##$DBP07= 0
##$DBPNAM0= <>
##$DBPNAM1= <>
##$DBPNAM2= <>
##$DBPNAM3= <>
##$DBPNAM4= <>
##$DBPNAM5= <>
##$DBPNAM6= <>
##$DBPNAM7= <>
##$DBPOAL= (0..7)
0.5 0.5 0.5 0.5 0.5 0.5 0.5 0.5 
##$DBPOFFS= (0..7)
0 0 0 0 0 0 0 0 
##$DE= 6
##$DECBNUC= <off>
##$DECIM= 24
##$DECNUC= <off>
##$DECSTAT= 4
##$DIGMOD= 1
##$DIGTYP= 9
##$DL= (0..7)
0 120 120 120 120 120 120 120 
##$DP= (0..7)
150 150 150 150 150 150 150 150 
##$DP07= 0
##$DPNAME0= <>
##$DPNAME1= <>
##$DPNAME2= <>
##$DPNAME3= <>
##$DPNAME4= <>
##$DPNAME5= <>
##$DPNAME6= <>
##$DPNAME7= <>
##$DPOAL= (0..7)
0.5 0.5 0.5 0.5 0.5 0.5 0.5 0.5 
##$DPOFFS= (0..7)
0 0 0 0 0 0 0 0 
##$DQDMODE= 0
##$DR= 18
##$DS= 0
##$DSLIST= <SSSSSSSSSSSSSSS>
##$DSPFIRM= 0
$$ [...]
##$SUBNAM2= <"">
##$SUBNAM3= <"">
##$SUBNAM4= <"">
##$SUBNAM5= <"">
##$SUBNAM6= <"">
##$SUBNAM7= <"">
##$SUBNAM8= <"">
##$SUBNAM9= <"">
##$SW= 24.9337058887773
##$SWIBOX= (0..15)
0 0 2 0 0 0 0 0 0 0 0 0 0 0 0 0 
##$SW_h= 4990.01996007984
##$TD= 16384
##$TD0= 1
##$TE= 0
##$TE2= 300
##$TE3= 300
##$TEG= 300
##$TL= (0..7)
0 120 120 120 120 120 120 120 
##$TP= (0..7)
150 150 150 150 150 150 150 150 
##$TP07= 0
##$TPNAME0= <>
##$TPNAME1= <>
##$TPNAME2= <>
##$TPNAME3= <>
##$TPNAME4= <>
##$TPNAME5= <>
##$TPNAME6= <>
##$TPNAME7= <>
##$TPOAL= (0..7)
0.5 0.5 0.5 0.5 0.5 0.5 0.5 0.5 
##$TPOFFS= (0..7)
0 0 0 0 0 0 0 0 
##$TUNHIN= 0
##$TUNHOUT= 0
##$TUNXOUT= 0
##$USERA1= <user>
##$USERA2= <user>
##$USERA3= <user>
##$USERA4= <user>
##$USERA5= <user>
##$V9= 5
##$VALIST= <valist>
##$VCLIST= <CCCCCCCCCCCCCCC>
##$VD= 0
##$VDLIST= <DDDDDDDDDDDDDDD>
##$VPLIST= <PPPPPPPPPPPPPPP>
##$VTLIST= <TTTTTTTTTTTTTTT>
##$WBST= 1024
##$WBSW= 4
##$XGAIN= (0..3)
0 0 0 0 
##$XL= 0
##$YL= 0
##$YMAX_a= 240802
##$YMIN_a= -173939
##$ZGOPTNS= <>
##$ZL1= 120
##$ZL2= 120
##$ZL3= 120
##$ZL4= 120
##$ABSF1= 10
##$ABSF2= 0
##$ABSG= 5
##$ABSL= 3
##$ALPHA= 0
##$AQORDER= 0
##$ASSFAC= 0
##$ASSFACI= 0
##$ASSFACX= 0
##$ASSWID= 0
##$AUNMP= <proc_1d>
##$AZFE= 0.1
##$AZFW= 0.1
##$BCFW= 1
##$BC_mod= 2
##$BYTORDP= 1
##$COROFFS= 0
##$CY= 11.3945322036743
##$DATMOD= 1
##$DC= 2
##$DFILT= <>
##$DTYPP= 0
##$F1P= 16.9975609425685
##$F2P= -3.02152046262296
##$FCOR= 0.5
##$FTSIZE= 0
##$FT_mod= 4
##$GAMMA= 1
##$GB= 0.15
##$INTBC= 1
##$INTSCL= 1
##$ISEN= 128
##$LB= 0.24
##$LEV0= 0
##$LPBIN= 0
##$MAXI= 10000
##$MC2= 0
##$MEAN= 0
##$ME_mod= 0
##$MI= 1.114404
##$NCOEF= 0
##$NC_proc= 0
##$NLEV= 6
##$NOISF1= 3.799351
##$NOISF2= 2.8
##$NSP= 1
##$NTH_PI= 0
##$NZP= 0
##$OFFSET= 15.70392
##$PC= 1
##$PHC0= -9791.022
##$PHC1= 11.00082
##$PH_mod= 1
##$PKNL= yes
##$PPARMOD= 0
##$PSCAL= 0
##$PSIGN= 0
##$REVERSE= no
##$SF= 200.130013532006
##$SI= 16384
##$SIGF1= 3
##$SIGF2= 2
##$SINO= 400
##$SIOLD= 16384
##$SREGLST= <1H.CDCl3>
##$SSB= 0
##$STSI= 0
##$STSR= 0
##$SW_p= 3612.71676300578
##$SYMM= 0
##$S_DEV= 0
##$TDeff= 0
##$TDoff= 0
##$TI= <>
##$TILT= no
##$TM1= 0
##$TM2= 0
##$TOPLEV= 0
##$USERP1= <user>
##$USERP2= <user>
##$USERP3= <user>
##$USERP4= <user>
##$USERP5= <user>
##$WDW= 1
##$XDIM= 8192
##$YMAX_p= 0
##$YMIN_p= 0
$$ End of Bruker specific parameters
$$ ---------------------------------
##NTUPLES= NMR FID
##VAR_NAME=  TIME,          FID/REAL,        FID/IMAG
##SYMBOL=    X,             R,               I
##VAR_TYPE=  INDEPENDENT,   DEPENDENT,       DEPENDENT
##VAR_FORM=  AFFN,          ASDF,            ASDF
##VAR_DIM=   8192,          8192,            8192
##UNITS=     SECONDS,       ARBITRARY UNITS, ARBITRARY UNITS
##FACTOR=    0.0002004,     1,               1
##FIRST=     0,             0,               0
##LAST=      1.6414764,     0,               0
##MIN=       0,             -173939,         0
##MAX=       1.6414764,     240802,          0
$$ Real data points
##PAGE= N=1
##DATA TABLE= (X++(R..R)), XYDATA
0 0 0 0 0 0 0 0 0 0 0 8 -8 8 -8 8 -16 16 -18 24 -26 32 -39 43 -51 59 -67 79 -89 103 -115 131 -148 165 -187
33 -187 209 -233 259 -289 322 -357 397 -438 486 -538 595 -659 731 -812 903 -1009 1129 -1270
51 -1270 1442 -1645 1902 -2233 2677 -3309 4280 -5987 9845 -39021 83175 210778 111056
64 111056 10025 -12948 -5944 -81628 -146958 -97234 45742 125928 105973 58552 38307 -15173
76 -15173 -116640 -173939 -92085 61419 149522 122268 55028 918 -53474 -113338 -119019 -45429
88 -45429 46967 86559 85677 84606 59268 -36810 -151419 -164901 -47744 85721 124900 85981
100 85981 47859 20674 -39034 -116305 -130431 -50105 56451 106271 96030 64359 21031 -49082
112 -49082 -120086 -127512 -49542 55532 114603 107718 59442 -3562 -65995 -103190 -92468 -40245
124 -40245 26935 86159 116586 91924 6585 -91947 -130481 -85695 -7923 46590 73169 88210
136 88210 78432 19404 -70189 -124304 -100964 -24219 50003 91525 98754 69344 2086 -77841
148 -77841 -119320 -90177 -13568 56092 86526 81439 53829 6409 -53943 -101087 -99911 -42757
160 -42757 43313 107877 113390 57316 -25118 -85437 -98013 -66677 -15123 39018 80309 90574
172 90574 59505 -3229 -67129 -100324 -86335 -29772 44239 98762 103939 54919 -21499 -83923
184 -83923 -100648 -67339 -6576 49455 78533 76274 48205 -65 -57646 -98024 -91207 -29586
196 -29586 53806 105371 95427 37934 -28159 -73415 -86640 -66191 -15545 46285 86378 82829
208 82829 41923 -13897 -62936 -89389 -77984 -24180 49317 98432 92678 38420 -29486 -76120
220 -76120 -85746 -59069 -9007 44820 80028 80417 43381 -15434 -69046 -91849 -69625 -11449 52996
233 52996 89767 81291 34799 -25294 -71377 -84614 -59887 -7649 48134 81539 77453 38299
245 38299 -19583 -70680 -89128 -63299 -5493 54372 85580 75311 30745 -26194 -69636 -80881
257 -80881 -55806 -6203 47380 80853 76963 35483 -24612 -73642 -86020 -55989 383 54905
269 54905 81259 69547 27352 -26140 -67793 -78993 -54112 -3383 50248 80647 73613 30529
281 30529 -27818 -73665 -82724 -50629 4143 55232 78411 65530 24062 -27468 -67107 -76759
293 -76759 -51122 -498 51922 80082 69676 25241 -31169 -72591 -78604 -46873 6826 55754
305 55754 76635 61902 20639 -29048 -66481 -75145 -48017 2832 54277 79644 65678 20680
317 20680 -33904 -71116 -74642 -42372 8794 55266 75152 59573 18018 -31258 -66727 -72389
329 -72389 -44449 6616 55347 77404 61641 16900 -35569 -70124 -71163 -39104 10965 54961
341 54961 73303 57442 15331 -33658 -67875 -70325 -39930 10139 55758 75004 57922 13368
353 13368 -37335 -69674 -68555 -35335 13286 55040 71755 55253 12807 -36254 -68398 -68090 -35089
366 -35089 14401 56408 71970 54104 10381 -38435 -68706 -66176 -32664 15497 56477 70751
378 70751 51735 8495 -38712 -67416 -64619 -31592 16233 56617 70325 50421 6803 -39887
390 -39887 -67100 -62963 -30188 17179 56877 70123 49803 4972 -41689 -67590 -61359 -26954
402 -26954 19026 56440 67553 47242 4258 -40979 -67033 -60994 -26503 20115 57954 68056
414 68056 46060 2253 -42534 -66749 -59369 -23913 22248 57261 65462 42889 1162 -41739
426 -41739 -65019 -58324 -23906 22495 58537 66415 42478 -1066 -43669 -65701 -56369 -21008 23984
439 23984 57915 64254 40701 -2244 -43270 -63986 -55285 -20423 24247 57620 64600 40083 -3518
452 -3518 -44863 -64516 -53609 -17991 25350 57780 62977 38420 -4979 -45883 -63610 -51403
464 -51403 -16214 25995 56408 61675 37825 -5050 -46156 -63962 -51053 -14874 27368 57254
476 57254 60943 35587 -6991 -46130 -62864 -49401 -13278 28455 57052 59066 32766 -8294
488 -8294 -45091 -60779 -48926 -14431 28083 59131 61027 31813 -12308 -47821 -59362 -45486
500 -45486 -11848 28011 57068 59439 30905 -12832 -47897 -58572 -43509 -10928 27755 56446
512 56446 59363 31480 -12892 -49845 -61016 -43084 -6575 31753 56182 54046 26813 -12411
524 -12411 -46141 -58503 -44673 -8215 33191 57938 53876 24311 -14334 -45661 -57558 -44275
536 -44275 -8253 35115 60761 53818 20416 -18856 -45955 -52792 -39831 -8415 30793 57820
548 57820 55410 23480 -18607 -49135 -56017 -38249 -3394 33613 56337 52376 22284 -18525 -50169
561 -50169 -56382 -35588 -53 34069 52502 48261 22833 -14793 -47974 -59084 -39773 198
573 198 39586 56766 45929 16073 -18754 -45519 -53643 -36763 -1189 36641 55939 47396 16842
586 16842 -20278 -46967 -52827 -35413 -956 35440 57237 50066 16579 -25468 -51609 -50409 -27757
599 -27757 3008 32406 50771 48467 20363 -21562 -52865 -54690 -29035 7176 36811 50303
611 50303 43670 16688 -21138 -50631 -53527 -29163 7368 37618 50634 42069 14630 -21373 -48713
624 -48713 -52011 -29935 6504 39074 53921 42515 9843 -25910 -47570 -47045 -27070 4319 35913
637 35913 53670 44795 11364 -27959 -51212 -47959 -23559 8935 36492 50084 41225 11086 -25806
650 -25806 -49806 -48321 -24132 9049 37857 50089 39859 9904 -26243 -49519 -49058 -23989 12328
663 12328 40913 49104 34643 6291 -23598 -45012 -47865 -27256 9229 42512 53369 36555
675 36555 3486 -29181 -47325 -44985 -21419 12627 40421 48710 33689 4391 -26369 -45976
687 -45976 -45306 -23234 11581 41417 50693 35254 3169 -29719 -48768 -44041 -17947 15499 40076
700 40076 45294 31515 4700 -25282 -46535 -46427 -20905 15149 42956 48647 32473 1564 -30935
713 -30935 -49107 -41964 -14283 17361 38483 43255 31181 4119 -27990 -48571 -43891 -16076 17384
726 17384 41050 45933 31102 597 -32235 -49107 -40268 -11214 18559 36864 41346 30834 4197
739 4197 -29351 -49976 -42551 -12730 19603 40296 44327 30204 -1052 -34611 -48913 -36227 -8128
752 -8128 17771 34952 41882 31771 1809 -33417 -50690 -38484 -8755 20485 38380 42233 28902
765 28902 -1706 -34603 -48233 -34787 -6410 19285 35288 40607 29824 107 -33792 -49665
777 -49665 -36820 -7321 21770 40088 42272 25054 -6173 -34501 -43827 -32230 -8284 17555
789 17555 38365 43936 26818 -6007 -36187 -45722 -32297 -6184 20393 39695 41980 23532 -8807
802 -8807 -35341 -42712 -29627 -6763 18039 37750 42989 26055 -7867 -37317 -45358 -30687 -4682
815 -4682 22121 39718 39731 20098 -9807 -33082 -40532 -31025 -7672 20691 41435 42097 20266 -11939
829 -11939 -35733 -41745 -29035 -4468 22501 40923 38974 17720 -12135 -33794 -38890 -28372 -6575
842 -6575 20833 41159 41787 19005 -13751 -37150 -40677 -26462 -1883 23491 39027 36532 16312
855 16312 -11553 -33336 -39987 -28706 -3485 24023 41535 38521 15660 -14058 -36082 -39845 -25572
868 -25572 -373 25130 38810 35035 14444 -12388 -33602 -39044 -27159 -1945 25078 41447
880 41447 36637 13539 -15758 -35760 -38787 -23893 930 25456 38244 33567 12921 -13595 -33822
893 -33822 -39090 -25618 274 26830 40528 33988 10601 -16603 -35341 -36661 -21991 1865 25421
906 25421 38414 33282 11435 -16061 -34742 -37480 -23023 1965 26896 39689 32937 9569 -17840
919 -17840 -35461 -35845 -20203 2920 25715 37408 31646 10578 -16444 -35174 -37367 -21496 4666
932 4666 28612 38759 29828 6958 -18288 -33930 -34668 -20304 3289 27370 38817 30291 6735
945 6735 -18788 -34237 -34622 -19805 4796 28127 38813 29501 5240 -20232 -34533 -32923 -17277
958 -17277 5073 26274 37122 30003 6586 -20184 -36552 -34055 -16386 7795 28478 35980 27121
971 27121 5167 -18983 -34580 -33724 -16800 7930 29136 36366 26107 4085 -19565 -34294 -33427
984 -33427 -16797 8824 29980 36601 25074 2300 -20403 -33285 -31397 -15733 7435 28680
996 28680 36890 25933 1582 -22604 -34496 -30204 -13012 9227 27664 34718 25544 2449 -21721
1009 -21721 -35457 -31142 -12392 11019 28663 34051 23859 1966 -21553 -34902 -30923 -11296
1021 -11296 12168 29223 33356 22218 1073 -21041 -33647 -30629 -12175 11928 30667 34617
1033 34617 21200 -1228 -22730 -33015 -28422 -10986 11483 29447 33875 21857 -1382 -23460
1045 -23460 -33801 -27957 -9800 12433 29423 33612 20936 -1650 -24039 -33785 -27050 -8636 13139
1058 13139 29388 32378 20020 -1995 -23326 -33781 -27490 -8592 14591 30498 31751 18207
1070 18207 -3489 -22831 -32320 -26820 -8617 14575 30668 32554 17295 -4588 -24026 -31948 -25795
1083 -25795 -7965 14502 30734 31516 16794 -5184 -23857 -31678 -25344 -7480 14639 30803 31776
1096 31776 16725 -5947 -25127 -31754 -24048 -5531 15878 29507 29938 15383 -5863 -24035 -31258
1109 -31258 -24152 -5672 16032 30672 30490 14842 -7381 -25325 -30918 -22682 -3925 16217 29896
1122 29896 28958 14127 -7107 -24717 -30780 -23094 -4401 17022 30633 29329 13673 -8444 -25991
1135 -25991 -30589 -21477 -3106 17142 29771 27820 13089 -7941 -25158 -30213 -22060 -2872 18182
1148 18182 30716 27892 11509 -9149 -25407 -29640 -20793 -2090 17984 29825 26944 11616 -9205
1161 -9205 -25252 -29503 -20812 -1641 18999 30267 26758 9942 -10036 -25123 -28922 -19997 -889
1174 -889 19226 29820 25917 9548 -10120 -25220 -28863 -19723 -192 20080 29831 24813 8291
1187 8291 -10734 -24587 -28161 -19356 -161 20118 29840 24742 7890 -10736 -24702 -28356 -18526
1200 -18526 1319 21388 30019 22900 6205 -11172 -24190 -26991 -18451 888 20505 29740 23810
1213 23810 6441 -12207 -25363 -27318 -16979 2642 21238 29153 21950 5751 -12319 -24839
1225 -24839 -27012 -16193 3054 20847 27874 21778 6759 -11684 -26305 -28505 -15493 5367 22436
1238 22436 26778 19832 5330 -11501 -25003 -27342 -15467 5051 21918 27251 20305 5159 -12089
1251 -12089 -25650 -27530 -14750 6002 22670 27409 19453 3882 -12820 -25231 -25623 -12975 5450
1264 5450 20932 26508 20302 4832 -14203 -26747 -26135 -11515 7552 21319 25254 18982 4695
1277 4695 -13559 -26633 -26159 -11738 7843 22026 24933 18081 4147 -13289 -25950 -26336 -11772
1290 -11772 8642 23194 25602 16563 1858 -13962 -24500 -24299 -11830 7234 22773 26521 17646
1303 17646 846 -16059 -24843 -22367 -10044 6742 21497 26155 18377 493 -16674 -25384 -22098
1316 -22098 -8665 7931 21206 25451 17789 1053 -16923 -26261 -22819 -7967 9602 21695 24043
1329 24043 15729 725 -15475 -24917 -22845 -9077 9678 23357 25297 14582 -1507 -16029 -23763
1342 -23763 -21686 -8859 8933 23247 25616 14416 -2141 -16912 -23563 -20468 -8459 8909 22472
1355 22472 25578 15783 -2328 -18530 -24741 -19430 -5508 10075 21188 23167 14810 -1337 -17211
1368 -17211 -25380 -20682 -5875 11508 22556 22536 12887 -2004 -16554 -24723 -20716 -5412 12373
1381 12373 22969 21999 11682 -2539 -16093 -24053 -20450 -6326 11827 23588 23357 11777 -4394
1394 -4394 -18109 -23365 -18248 -4585 11604 22030 22830 12245 -3888 -18452 -24061 -18397 -3231
1407 -3231 12587 22203 21338 11404 -3616 -18029 -24220 -17549 -2568 12787 21385 20524 10945 -3489
1421 -3489 -17608 -24490 -18445 -2983 13595 22822 20473 9315 -5566 -18021 -22259 -16626 -2970
1434 -2970 12757 22228 21062 9354 -5530 -18554 -23013 -16660 -2140 13522 22532 20617 9135
1447 9135 -6633 -18943 -22208 -14867 -1022 12649 21327 20255 9448 -6032 -19085 -23003 -15533
1460 -15533 -791 14075 22332 19681 7780 -7343 -18450 -21404 -14738 -1049 13723 22079 19444
1473 19444 7696 -7284 -19139 -22015 -14436 -113 14547 22340 18918 6948 -8059 -18890 -21160
1486 -21160 -13328 333 13791 21605 19166 6855 -8441 -19382 -21148 -13604 943 14838 21672
1499 21672 18302 5935 -8162 -18718 -20832 -12922 889 15097 21639 17927 6028 -9142 -19957
1512 -19957 -20604 -11970 1768 14960 21008 17608 5538 -9259 -19365 -20351 -11592 2064 14942
1525 14942 21288 17525 4774 -9691 -19903 -20351 -10897 3181 15097 20563 16361 4726 -9408
1538 -9408 -19212 -19901 -11517 2879 15575 21082 16588 3918 -10495 -19719 -18923 -9913 3282 15187
1552 15187 20446 16269 3802 -10479 -19292 -18947 -10011 3435 15510 21039 15986 3096 -11357
1565 -11357 -19979 -18141 -9104 4067 15363 20038 15348 3080 -10772 -19509 -18491 -9054 4337
1578 4337 16163 20543 15059 1993 -11953 -19590 -17414 -8028 4606 15999 20384 14811 1309
1591 1309 -11935 -19297 -17691 -7927 4631 16173 20172 14214 1038 -12534 -18987 -16837 -7342 5186
1605 5186 16208 19922 14034 711 -12382 -18920 -16948 -7447 5357 16672 19780 13234 -37
1618 -37 -12459 -18557 -16276 -7365 5776 16600 19635 12889 -479 -12959 -19046 -16230 -6469 6668
1632 6668 16682 18960 12030 -797 -12593 -18538 -16178 -6121 6546 16716 18814 11798 -764
1645 -764 -13055 -18565 -16034 -5748 7454 17138 18607 10866 -1575 -12352 -18195 -15790 -5919 7383
1659 7383 17220 18740 10650 -1928 -13194 -18234 -15010 -4821 7644 17371 18219 10571 -2330 -13657
1673 -13657 -18262 -14463 -4447 7864 17183 18086 10427 -2619 -13637 -18431 -14272 -3662 8676
1686 8676 16469 17350 9740 -2675 -13653 -18532 -14125 -3520 9015 17033 17082 9105 -3075 -13777
1700 -13777 -17764 -13507 -3192 9052 17185 17219 8487 -3427 -13868 -17731 -13619 -2777 9298 17160
1714 17160 17227 8143 -4349 -14213 -17334 -12559 -2321 9058 16572 16957 8548 -4293 -14827 -17727
1728 -17727 -12189 -1638 9929 16731 16016 7636 -4592 -14737 -17061 -12122 -1617 9912 16516
1741 16516 15843 7481 -4625 -14453 -17482 -12148 -806 10379 17028 15231 6539 -5484 -14396 -16483
1755 -16483 -11605 -1465 9784 17060 15551 6932 -5580 -14779 -16510 -10969 -460 10808 16743
1768 16743 15080 5829 -6277 -14624 -16188 -10307 -623 10045 16503 15264 6159 -6083 -15390 -16675
1782 -16675 -9961 589 10692 16502 14305 5535 -6163 -14999 -16095 -10116 661 11038 16536
1795 16536 13998 5084 -6306 -15006 -16051 -9623 1210 11545 16662 13166 3864 -6902 -14352 -15393
1809 -15393 -9805 311 11505 17061 14091 3637 -7506 -14642 -15300 -8960 1456 11224 16191 13770
1823 13770 3911 -7617 -14659 -15190 -8438 1871 11121 16175 13326 3703 -7605 -15282 -15137 -8314
1837 -8314 2727 11844 15414 12082 3246 -6968 -14773 -15538 -8775 2690 12624 16284 11804 2052
1851 2052 -7509 -14633 -14575 -8283 2626 12301 16335 11544 2081 -7838 -14160 -14219 -7560 2578 12573
1866 12573 16106 11809 1810 -8876 -14752 -13964 -6505 3638 11654 14704 11402 2157 -8075 -15152
1880 -15152 -14608 -6839 4433 12859 14556 10453 1770 -8272 -14875 -14533 -6247 4438 13097 14654
1894 14654 9838 919 -8160 -14669 -13890 -6235 4849 13226 15375 9981 141 -9009 -14624 -12514 -5607
1909 -5607 4101 12379 14924 10637 618 -9581 -15276 -13092 -4771 5068 12563 14303 9779 569
1923 569 -9606 -15077 -12838 -4298 5574 12143 13987 9625 409 -9654 -15371 -13063 -4217 6140
1937 6140 12911 13894 8695 -622 -9695 -14516 -12049 -4073 5220 12450 14582 9162 -664 -10420 -14664
1952 -14664 -11568 -3544 5671 12898 14133 8705 -1384 -10721 -14585 -11014 -2854 5716 12395 13843
1966 13843 8899 -1297 -11105 -15281 -10976 -2220 6677 12292 13341 8060 -1570 -10619 -14148 -11204
1980 -11204 -2741 6361 12656 13600 7400 -2056 -11266 -14132 -10732 -2472 6582 12857 12985 7017 -2347
1995 -2347 -10860 -13815 -10552 -2682 6486 12695 13458 7221 -2795 -11329 -14119 -9790 -1699 6883 12760
2010 12760 12990 6600 -2768 -10854 -13961 -9888 -1822 7105 12946 12703 6207 -3412 -11059 -13306 -9764
2025 -9764 -1302 7400 13161 12424 6176 -3585 -11151 -13532 -9752 -1458 7513 13328 12550 5460 -4096
2040 -4096 -11578 -12990 -8927 -908 7592 12611 12001 5497 -3756 -11271 -13204 -9082 -660 7954 12945
2055 12945 11947 4944 -4523 -11735 -13074 -8465 -286 7794 12369 11537 4975 -4105 -11250 -12837 -8391
2070 -8391 -75 8055 12783 11471 4476 -4539 -11835 -12724 -7790 146 8107 12602 11270 4524 -4761
2085 -4761 -11607 -12624 -7605 398 8665 12783 10876 3769 -5271 -11670 -12467 -7109 1174 8727 12299
2100 12299 10490 3795 -5444 -11719 -12401 -7306 1076 8873 12665 10208 3256 -5573 -11595 -12523 -6850
2115 -6850 1787 8907 12169 9875 3123 -5742 -11835 -12284 -6567 2213 9423 12414 9611 2383 -5878
2130 -5878 -11878 -11713 -6629 1855 9143 12218 9911 2610 -6254 -11947 -11597 -5984 2094 9218 12551
2145 12551 9322 2227 -6387 -11601 -11348 -5541 2298 9159 11941 9075 2291 -6401 -12078 -11288 -5400
2160 -5400 2775 9867 11777 8960 1669 -6528 -11520 -11138 -5229 2880 9661 11950 8806 1335 -6584
2175 -6584 -11191 -10681 -5207 3054 9506 11717 8760 791 -7264 -11483 -10428 -4286 3106 9395 11859
2190 11859 8810 908 -7844 -12451 -10321 -3819 3660 9331 11648 8234 876 -7238 -11998 -10271 -3788
2205 -3788 3841 9580 11409 7765 620 -7405 -11374 -10106 -3825 4169 9693 11221 7523 49 -7465
2220 -7465 -11335 -9792 -3894 3484 9685 11704 7862 -777 -8289 -11286 -9045 -3207 3749 9437 11370
2235 11370 7135 -459 -8379 -11691 -8890 -3024 4337 9676 10906 6909 -489 -7950 -11250 -9153 -2684
2250 -2684 4394 10040 10923 6272 -1314 -8125 -11001 -9049 -2963 4968 10481 11109 5998 -1850 -8321
2265 -8321 -10857 -8624 -2921 4581 10469 11244 5750 -1937 -8319 -10538 -8090 -2587 4929 10486 11031
2280 11031 5607 -2563 -8462 -10496 -7808 -2135 5224 10158 10150 5187 -1742 -8227 -10828 -8427 -1633
2295 -1633 5838 10409 9970 4748 -2427 -8057 -10288 -8373 -2120 6063 10950 9880 4216 -2895 -8041
2310 -8041 -9955 -8047 -1860 6211 10671 9853 4014 -2969 -8287 -9962 -7785 -1446 5979 10743 9859
2325 9859 4107 -3147 -8478 -10231 -7239 -808 6505 10398 9152 4183 -2723 -8417 -10586 -7414 -517
2340 -517 6633 10410 8488 3461 -2908 -8394 -10380 -7267 -191 6804 9954 8400 2868 -3138 -8296
2355 -8296 -10231 -6894 -145 6923 10491 8707 3165 -3824 -8617 -9834 -6271 -97 6486 10040 8112
2370 8112 3107 -3786 -8826 -9697 -6180 242 6775 10327 8237 2861 -3735 -9168 -10147 -5551 1159
2385 1159 7068 9695 7648 2873 -3541 -9000 -10189 -5848 1113 7287 9763 7689 2271 -4044 -8870
2400 -8870 -9837 -5453 1274 7024 9312 7863 2313 -4226 -8944 -9484 -5378 1538 6940 9307 7378
2415 7378 1991 -4731 -9058 -9272 -4955 1596 6793 9224 7704 2226 -5072 -9402 -9254 -4703 1777
2430 1777 7293 9245 6976 1829 -4805 -8929 -8917 -4454 2011 7385 9256 7271 1723 -4827 -9276
2445 -9276 -8856 -4529 2364 7534 9136 6671 1096 -5175 -8781 -8652 -4021 2227 7654 9138 6668
2460 6668 824 -5302 -9056 -8711 -4115 2323 7900 9156 6414 617 -5430 -8789 -8037 -3984 2752
2475 2752 8048 9165 6421 542 -5431 -8965 -8091 -3368 2835 7710 8491 5838 402 -5459 -8930
2490 -8930 -8206 -3357 2997 8023 8741 5682 24 -5627 -8878 -7622 -3182 3211 7923 8548 5477 -179
2506 -179 -5899 -8718 -7703 -3065 3120 7776 8625 5433 -303 -5807 -8970 -7496 -2623 3719 7953
2521 7953 8232 5105 -40 -5797 -8882 -7505 -2155 3824 7793 8304 5177 -533 -6355 -8917 -7259
2536 -7259 -2408 3763 7658 8181 4926 -459 -6087 -8744 -7246 -1665 4187 7495 7825 5097 -781
2551 -781 -6345 -8666 -7009 -1521 4191 7614 7972 4546 -968 -6329 -8555 -6698 -1649 4399 7655
2566 7655 7734 4517 -1561 -6471 -8265 -6549 -1421 3861 7736 7827 4165 -1564 -6445 -8695 -6354 -1184
2582 -1184 4594 8036 7759 3925 -2047 -6657 -8310 -5787 -924 3959 7839 7450 3893 -1945 -6716
2597 -6716 -8507 -6223 -565 4791 7927 7231 3516 -2424 -6502 -7845 -5767 -1046 4984 7915 7295
2612 7295 3249 -2200 -6757 -8111 -5452 -455 4951 8135 7244 2848 -2474 -6765 -7824 -5170 -269
2627 -269 4455 7731 7427 3160 -2918 -7006 -7991 -5214 13 4862 8054 7025 2831 -2825 -6515 -7703
2643 -7703 -4940 291 5180 8012 6748 2498 -2537 -6692 -7946 -4927 317 5303 8009 6476 2121
2658 2121 -2878 -6574 -7350 -4754 269 5381 7702 6663 1910 -3140 -6773 -7387 -4406 472 5490
2673 5490 7557 6427 1910 -3352 -7118 -7405 -4378 777 5146 7736 6517 1671 -3059 -6850 -7453
2688 -7453 -4284 1080 5653 7802 5750 1031 -3470 -6888 -7326 -4117 952 5732 7882 5840 1249
2703 1249 -3565 -6760 -6852 -3957 1100 5467 7529 5483 1389 -3945 -7195 -6992 -3563 1403 5775 7491
2719 7491 5626 1062 -4155 -7216 -6733 -3382 1395 5648 6947 5538 1019 -3896 -7061 -6904 -3644
2734 -3644 1718 6055 7448 5179 565 -4146 -7139 -6678 -3152 1884 5703 7285 4947 205 -4210
2749 -4210 -6878 -6535 -3670 1789 6065 7316 5174 423 -4153 -7132 -6346 -2941 2104 6056 7236
2764 7236 4674 439 -4212 -7095 -6431 -2441 2588 6216 6708 4602 -110 -4191 -7073 -6074 -2227 2218
2780 2218 6028 6926 4342 54 -4427 -6873 -5868 -2347 2571 6202 7007 4137 -346 -4574 -6614
2795 -6614 -5741 -1888 2540 6030 6539 4343 -575 -4742 -7131 -5917 -1809 2874 6141 6528 4040 -424
2811 -424 -4771 -6662 -5779 -1895 3010 6240 6751 3609 -653 -4788 -6658 -5554 -1726 3188 6552 6673
2827 6673 3779 -783 -4763 -6420 -5502 -1818 2929 6281 6407 3631 -1034 -4861 -6733 -5195 -1245
2842 -1245 3217 6367 6237 3271 -841 -4956 -6683 -5193 -1035 3436 6353 6323 3359 -1343 -4735 -6706
2858 -6706 -5017 -1146 3405 6099 5870 3105 -1358 -5321 -6607 -4985 -816 3732 6387 5673 3034
2873 3034 -1452 -5297 -6453 -4952 -597 3940 6426 5790 2583 -1690 -5320 -6424 -4335 -612 3717
2888 3717 6273 5693 2526 -1805 -5288 -6103 -4486 -544 3945 6167 5304 2385 -1946 -5198 -6573 -4378
2904 -4378 -53 3855 6167 5703 2347 -2269 -5213 -6033 -4253 -372 4024 6171 5266 2178 -2043 -5387
2920 -5387 -6018 -4153 186 4194 6003 4946 2198 -2094 -5623 -5905 -3721 210 4028 5973 5278 2022
2936 2022 -2549 -5414 -5737 -3540 499 4041 6026 4943 1688 -2397 -5104 -5952 -3546 435 4153
2951 4153 6171 4984 1637 -2630 -5676 -5630 -3474 616 4121 5803 4899 1012 -2575 -5468 -5625 -3388
2967 -3388 761 4488 6247 4717 1096 -2514 -5323 -5826 -3245 916 4674 5977 4338 1050 -2765
2982 -2765 -5568 -5723 -2943 1240 4656 5884 4124 846 -2986 -5494 -5441 -2860 862 4345 5897 4343
2998 4343 834 -2809 -5621 -5514 -2773 1019 4739 5922 4294 576 -3067 -5665 -5156 -2716 1346
3013 1346 4844 5904 4248 544 -3230 -5328 -5187 -2315 1654 4708 5539 3697 367 -3531 -5286
3028 -5286 -5098 -2752 1864 4736 5395 3610 357 -3109 -5350 -4961 -2143 1826 4599 6121 3675 9
3044 9 -3347 -5241 -4988 -2180 1608 4595 5488 3653 77 -3516 -5548 -4666 -1758 2159 4789 5624 3678
3061 3678 -13 -3463 -5335 -4537 -1471 2040 4745 5165 3572 26 -3298 -5449 -5097 -1761 2132 4871
3077 4871 5380 2950 -310 -3443 -5317 -4633 -1410 2165 4862 5356 3064 -788 -3890 -5217 -4113 -1551
3093 -1551 2231 4914 5244 2898 -609 -4075 -5014 -4228 -1003 2156 4637 5012 3003 -549 -4112 -5518
3109 -5518 -3983 -764 2785 4641 4772 2679 -742 -3930 -5232 -4010 -837 2514 4793 4711 2350 -757
3125 -757 -3844 -5241 -4362 -972 2530 5107 4728 2328 -1099 -4221 -5232 -3672 -925 2546 4886 4809
3141 4809 2288 -1206 -4425 -5224 -3513 -479 2810 4442 4548 2226 -1113 -4311 -5140 -3511 -90 2902
3157 2902 4669 4536 2516 -1238 -4336 -4928 -3535 -411 2903 4468 4658 2339 -1218 -3925 -5124 -3148
3173 -3148 -104 3134 4908 4282 1865 -1760 -3793 -5054 -3135 -137 3012 4716 4222 1635 -1992
3188 -1992 -4120 -4595 -2849 145 3175 4503 4388 1911 -1819 -4462 -4975 -2823 510 3081 4365 4245
3204 4245 1425 -1438 -4346 -4859 -2831 360 3449 4521 3991 1493 -1546 -4616 -4898 -2742 37 3122
3220 3122 4690 3895 1310 -1766 -4068 -4414 -2739 96 3037 5149 4024 1022 -2358 -4635 -4392 -2225
3236 -2225 405 3481 4557 3689 1157 -2167 -4705 -4378 -2462 655 3420 4595 3514 734 -2286
3251 -2286 -4638 -4219 -2407 748 3701 4400 3370 829 -2412 -4093 -4230 -2110 763 3677 4659 3251
3267 3251 835 -2212 -4426 -4154 -1974 1198 3559 4610 3492 752 -2488 -4363 -4378 -1837 1096 3486
3283 3486 4670 3313 754 -2820 -4340 -3952 -1724 1271 3454 4194 2973 625 -2562 -4470 -3748 -1538
3299 -1538 1337 3761 4593 3028 410 -2507 -4285 -4013 -1626 1463 3847 4139 2788 211 -2639 -4405
3315 -4405 -3840 -1575 1488 3738 4440 2733 56 -2750 -4224 -3554 -1354 1355 3619 4387 2660 61
3331 61 -2882 -4479 -3708 -1162 1714 3635 3868 2775 -145 -3287 -4283 -3678 -1487 1777 3798 4161 2770
3348 2770 -369 -2781 -4320 -3469 -998 1943 3364 4212 2351 -342 -3032 -4341 -3543 -1125 1984 3933
3364 3933 4109 2446 -294 -2898 -4170 -3397 -888 2075 3500 4092 2237 -811 -3064 -4210 -3372 -969
3380 -969 1869 4334 4235 2196 -840 -3219 -3972 -3206 -827 1755 3788 3882 2168 -722 -3123 -3775 -3165
3397 -3165 -847 1848 4110 3839 2192 -876 -3349 -4218 -3129 -446 2248 3844 3719 1635 -1071 -3548
3413 -3548 -3964 -2845 -401 1952 3995 3684 1577 -948 -3434 -4108 -2701 -320 2326 3726 3454 1668
3429 1668 -1320 -3193 -3901 -2724 -587 2259 3941 3549 1576 -1053 -3250 -3736 -2609 -328 2221 3635
3445 3635 3378 1189 -1011 -3059 -3765 -2814 -110 2451 3843 3519 1558 -915 -3209 -3897 -2434 -316
3461 -316 2504 3794 3339 1054 -1401 -3058 -4012 -2576 -50 2454 3716 3054 969 -1287 -3312 -3597
3477 -3597 -2428 47 2472 3866 3145 1265 -1449 -3654 -3839 -2089 367 2666 3783 2962 1037 -1660
3493 -1660 -3180 -3647 -2179 229 2840 3832 3108 1020 -1602 -3341 -3492 -2018 833 2904 3735 2847
3509 2847 807 -1536 -3290 -3480 -1915 673 2879 3600 2704 536 -1869 -3379 -3696 -2057 766 2768
3525 2768 3575 2771 564 -2016 -3517 -3431 -1979 860 3096 3726 2775 724 -1943 -3351 -3445 -1860 745
3542 745 2760 3585 2570 561 -1612 -3644 -3449 -1783 637 3180 3704 2288 480 -1978 -3328 -3153
3558 -3153 -1470 958 3059 3521 2344 272 -1971 -3311 -2766 -1433 1101 3080 3916 2219 -89 -2155
3574 -2155 -3360 -2983 -1617 966 2722 3428 2235 -229 -2519 -3552 -3174 -1440 1004 3109 3455 2303
3590 2303 179 -2222 -3639 -3165 -1213 1172 2955 3263 2039 -149 -2045 -3313 -2722 -980 944 3113
3606 3113 3317 2172 -145 -2466 -3141 -2691 -952 1018 3212 3246 1932 -167 -2436 -3693 -2755 -949
3622 -949 1503 2962 3345 2169 -363 -2252 -3476 -2856 -901 1423 2991 3204 1640 -498 -2527 -3271
3638 -3271 -2583 -732 1716 3474 3168 1972 -449 -2410 -3464 -2596 -476 1491 3147 3432 1662 -584
3654 -584 -2513 -3066 -2451 -412 1502 3188 2963 1477 -543 -2428 -3438 -2576 -414 1616 2926 2756
3670 2756 1511 -743 -2321 -3193 -2320 -521 1712 3035 2878 1350 -567 -2584 -3163 -2365 -373 1726
3686 1726 2867 2842 819 -682 -2479 -3384 -2312 -138 1792 3354 2695 1341 -679 -2542 -3222 -2392
3702 -2392 -275 1912 3091 2675 1104 -925 -2690 -3150 -1964 30 1957 3012 2375 1143 -897 -2699
3718 -2699 -2914 -2107 64 1978 2822 2422 934 -770 -2572 -3041 -1853 -39 1921 3231 2750 1066
3734 1066 -1114 -2611 -2934 -2028 240 2070 3238 2219 730 -1237 -2825 -2894 -1753 260 2283 2918
3750 2918 2567 1091 -1274 -2779 -2833 -1874 106 2374 2851 2455 880 -1230 -2875 -2887 -1291 104 2350
3767 2350 3010 2339 666 -1016 -2698 -3090 -1788 650 2370 2944 2264 577 -1282 -2781 -2898 -1601
3783 -1601 585 2235 2816 2096 668 -1390 -2593 -2804 -1252 743 2272 2997 2502 690 -1149 -2670
3799 -2670 -2607 -1192 506 2511 2822 2180 569 -1531 -2785 -2471 -1427 756 2220 2760 1790 137 -1428
3816 -1428 -2968 -2401 -1457 733 2330 2512 1682 184 -1450 -2612 -2824 -1152 827 2116 2545 2035 51
3833 51 -2106 -2571 -2346 -926 1058 2269 2806 1810 -34 -1654 -2585 -2305 -1161 949 2478 2770 1795
3850 1795 220 -2032 -2937 -1987 -670 844 2474 2642 1796 13 -1741 -2885 -2388 -710 1015 2313
3866 2313 2905 1607 -100 -1739 -2676 -2179 -899 1198 2543 2622 1778 -153 -2258 -2494 -2194 -950 887
3883 887 2146 2758 1558 -432 -1762 -2785 -2106 -798 1152 2436 2722 1699 -525 -1919 -2627 -1771
3899 -1771 -718 1175 2376 2542 1276 -125 -1602 -2755 -2149 -536 1214 2623 2222 1302 -228 -1822
3915 -1822 -2626 -2138 -721 1272 2297 2288 1409 -316 -2152 -2462 -1798 -657 1199 2446 2483 1026 -342
3932 -342 -2353 -2572 -1790 -531 1339 2480 2555 1167 -706 -2050 -2681 -1858 -536 1260 2490 2199 988
3949 988 -690 -2074 -2556 -1855 -777 1243 2523 2196 1191 -712 -2207 -2650 -1757 -240 1322 2219 2171
3966 2171 815 -566 -2127 -2615 -1745 -211 1362 2461 2320 808 -780 -2261 -2558 -1821 -264 1731
3982 1731 2312 2136 979 -850 -2135 -2411 -1745 -112 1548 2416 2223 1043 -878 -1988 -2485 -1579 292
3999 292 1634 2779 1998 645 -1165 -2211 -2666 -1379 165 1690 2485 2175 594 -970 -2098 -2618
4015 -2618 -1398 343 1308 2316 1822 546 -1029 -2034 -2073 -1485 439 1643 2774 2111 488 -1269
4031 -1269 -2357 -2487 -1295 410 1863 2424 1864 672 -979 -2261 -2379 -1129 342 1793 2485 1980
4047 1980 664 -727 -2212 -1957 -1171 606 1583 2081 1893 84 -1170 -2397 -2066 -934 560 1793
4063 1793 2418 1653 393 -1069 -2157 -2106 -1221 661 1991 2482 1578 196 -1319 -2268 -2082 -1151 759
4080 759 1706 2287 1839 94 -1322 -2374 -1848 -899 554 2094 1917 1857 187 -1408 -2256 -2314 -1202 621
4098 621 1958 2571 1695 -139 -1433 -2141 -1914 -728 639 1722 2411 1302 184 -1144 -2201 -1930 -657
4115 -657 750 1795 2240 1452 -133 -1171 -2072 -1874 -433 635 1906 2327 1319 -66 -1483 -2011 -1945
4132 -1945 -857 526 1929 2501 1365 12 -1460 -2245 -1827 -608 851 1921 2035 1588 -279 -1417
4148 -1417 -2053 -2114 -704 726 2161 2111 1253 -6 -1202 -2180 -1607 -718 1160 1862 2199 1215 -239 -1637
4166 -1637 -2180 -1764 -536 1159 1858 2084 1088 -182 -1860 -2417 -1697 -244 1053 2014 2278 989 -274
4183 -274 -1521 -1946 -1626 -203 918 1889 1991 1161 -550 -1651 -2074 -1550 -386 1041 1926 1984 1195 -409
4201 -409 -1655 -2234 -1428 76 1131 1792 1762 757 -501 -1542 -2007 -1658 84 1299 1883 1834 826 -384
4219 -384 -1792 -1964 -1615 7 1094 2072 1785 770 -736 -1588 -2010 -1381 -222 1224 2252 1827 576
4236 576 -805 -1782 -1910 -1554 -309 1101 1816 1899 970 -862 -1677 -1959 -1271 -133 1414 2081 1900 886
4254 886 -590 -1612 -2171 -1357 5 1406 2023 1493 487 -1052 -1956 -1778 -1522 111 1100 2137 1791
4271 1791 815 -590 -1840 -2136 -1508 52 1274 2035 1611 569 -833 -1744 -1901 -1407 209 1059 1889
4288 1889 1797 590 -1037 -1714 -2016 -1352 -4 1490 2070 1687 546 -1012 -2012 -1808 -1074 679 1448
4305 1448 1796 1332 475 -928 -1675 -1737 -1043 23 1642 1929 1456 288 -1083 -1870 -1740 -564 291 1673
4323 1673 1858 1674 260 -1006 -1850 -1782 -794 464 1558 1950 1371 580 -1179 -1698 -1481 -895 382 1490
4341 1490 1831 1055 119 -914 -2069 -1617 -1055 130 1655 1897 1287 193 -1000 -1761 -1668 -1179 533 1667
4359 1667 1728 997 -144 -880 -1742 -1708 -821 502 1698 1562 1182 19 -1129 -1680 -1849 -719 397 1676
4377 1676 2154 1306 273 -889 -1887 -1422 -613 603 1781 1850 1283 226 -863 -1793 -1591 -429 623
4394 623 1679 1638 1048 -77 -919 -1840 -1597 -684 586 1395 1931 902 -103 -1195 -1804 -1587 -600 589
4412 589 1542 1751 1080 -245 -1092 -1734 -1556 -787 738 1555 1623 791 33 -1330 -1810 -1358 -348 626 1587
4431 1587 1566 1180 -147 -1333 -1659 -1508 -556 841 1516 1525 866 -292 -1290 -2030 -1410 -382 729 1824
4449 1824 1379 721 -51 -1242 -1531 -1345 -252 969 1433 1937 840 -395 -1329 -1867 -1235 -297 786 1548
4467 1548 1268 755 -270 -1431 -1769 -1204 47 733 1614 1578 935 -249 -1358 -1621 -1178 -141 976 1658
4485 1658 1362 790 -408 -1578 -1843 -1143 -99 1250 1710 1493 786 -236 -1536 -1576 -1078 72 1045 1559
4503 1559 1528 1035 -585 -1295 -1505 -990 -39 1141 1574 1644 722 -645 -1445 -1459 -1007 63 1230 1578 1391
4522 1391 609 -308 -1634 -1795 -1040 227 911 1523 1568 523 -701 -1665 -1922 -879 19 1093 1498 1434
4540 1434 612 -569 -1340 -1539 -988 209 866 1431 1670 481 -399 -1559 -1562 -1064 376 1244 1511 1618 322
4559 322 -553 -1286 -1376 -734 129 994 1687 1482 83 -834 -1628 -1457 -952 58 1112 1570 1464 299 -1196
4578 -1196 -1389 -1410 -861 66 1084 1631 1170 437 -1155 -1488 -1274 -785 293 1036 1686 1190 152 -889
4596 -889 -1536 -1262 -931 610 1038 1783 973 206 -965 -1406 -1486 -740 43 1237 1648 1050 178 -681 -1467
4615 -1467 -1214 -742 364 1130 1734 921 -185 -796 -1390 -1328 -652 492 1297 1191 832 307 -788 -1433 -1553
4634 -1553 -496 160 1586 1482 630 146 -545 -1456 -1279 -360 387 1352 1444 989 57 -919 -1259 -1023 -707
4653 -707 703 1207 1524 726 -69 -903 -1549 -1300 -634 542 1345 1388 1076 44 -797 -1385 -1171 -577 484
4672 484 1373 1650 628 -151 -1054 -1536 -1155 -544 664 1310 1314 836 -171 -1142 -1630 -936 -450 481 1411 1435
4692 1435 1046 -162 -904 -1519 -867 -116 858 1439 1521 780 -24 -1098 -1267 -1134 -189 881 1368 1441 971
4711 971 -220 -966 -1211 -972 -376 447 1243 1250 864 -168 -1207 -1367 -1402 91 593 1339 1142 690 -177 -1365
4731 -1365 -1592 -1306 -262 620 1628 1211 660 -529 -1220 -1366 -1105 121 800 1417 1186 603 -166 -787
4749 -787 -1421 -1370 -173 566 1127 1398 581 -301 -958 -1139 -1101 -189 684 1579 1365 544 -227 -1489 -1498 -950 -96
4770 -96 679 1115 1005 411 -341 -1127 -1263 -854 109 1163 1539 1541 362 -247 -1073 -1347 -721 -30 888 1325
4790 1325 1163 290 -564 -1233 -1155 -652 309 1220 1285 1194 264 -573 -1149 -1007 -696 223 883 1548 1128 588 -717
4811 -717 -1134 -1457 -844 -126 890 1013 898 254 -544 -897 -1187 -714 407 1036 1436 1256 344 -528 -1415
4830 -1415 -1387 -663 317 867 1290 1169 308 -995 -1203 -1488 -550 133 844 1316 987 606 -689 -954 -1510
4849 -1510 -457 225 629 1220 787 430 -659 -1091 -1281 -740 190 903 1356 973 213 -547 -1212 -1220 -559 188
4869 188 878 1314 1123 162 -770 -945 -1209 -418 372 1011 1616 1005 220 -594 -1048 -1075 -449 377 1095 1331
4889 1331 918 115 -455 -1264 -1169 -496 299 832 980 742 3 -657 -1047 -1097 -430 294 862 1157 657 29
4909 29 -513 -1145 -1169 -540 564 978 1412 835 -202 -907 -1079 -999 -445 288 969 1348 598 183 -683 -1607
4929 -1607 -779 -520 328 1141 1184 816 14 -908 -1221 -991 -306 434 1028 1158 554 -178 -620 -1303 -1050 -322
4949 -322 806 1010 1172 826 153 -642 -938 -1006 -87 593 987 1019 297 36 -809 -1053 -691 -267 454 873
4969 873 1269 644 -215 -513 -1062 -981 -270 480 877 1259 629 -3 -826 -1304 -1087 -102 698 1137 982 378
4989 378 -333 -586 -1137 -1087 -278 331 890 1104 484 -105 -787 -1147 -1256 66 592 1256 1226 435 -289 -1085
5009 -1085 -1027 -819 -209 487 1069 891 520 -341 -806 -777 -766 370 903 1120 993 374 -475 -929 -933 -586 -61
5030 -61 859 1256 1249 502 14 -764 -1187 -544 -248 505 907 821 351 -266 -659 -1172 -646 247 895 1070 981 570
5052 570 -656 -886 -1147 -573 79 888 964 831 360 -529 -1050 -851 -599 -55 711 741 983 -16 -654 -863
5072 -863 -731 -680 -8 802 1221 840 222 -724 -848 -1065 -564 155 580 915 1158 293 -386 -1019 -987 -385 568
5093 568 655 1212 675 474 -425 -1079 -1326 -381 -107 557 1179 946 336 -470 -1193 -1158 -711 253 926 961 872
5114 872 39 -409 -822 -1081 -500 131 1089 910 793 -146 -371 -886 -1230 -436 289 923 777 678 -95 -708
5134 -708 -730 -572 -523 430 676 953 762 -94 -645 -1145 -849 -506 286 1019 1094 666 -8 -796 -725 -779 -373 243
5156 243 959 989 757 -388 -689 -998 -943 -510 298 714 795 792 -39 -925 -1306 -622 -431 70 934 798 522
5177 522 5 -581 -786 -788 -301 293 718 1050 788 75 -699 -924 -866 -313 234 924 805 527 246 -798 -1074
5198 -1074 -909 -143 273 786 877 609 -58 -637 -1032 -928 -133 411 889 1251 413 -118 -790 -1079 -669 -211
5218 -211 312 777 1101 666 -108 -1027 -786 -728 -481 525 827 902 376 -214 -643 -760 -646 -208 665 908
5238 908 883 391 -130 -918 -1021 -509 -240 465 916 604 369 -453 -903 -904 -374 -201 527 879 906 379 -323
5259 -323 -803 -861 -476 -264 265 1048 578 652 -278 -760 -1232 -857 -121 456 1084 696 348 -343 -916 -913 -604
5280 -604 -73 765 980 680 496 122 -1003 -947 -400 -4 789 1024 732 232 -149 -860 -843 -459 162 681
5300 681 1016 641 -109 -217 -739 -836 -430 45 358 967 463 -19 -259 -832 -855 -732 82 602 1178 503 -82
5321 -82 -262 -876 -998 -507 63 861 813 567 382 90 -708 -882 -490 72 822 848 590 26 -138 -881 -490
5342 -490 -536 175 716 824 715 168 -429 -905 -616 -474 -21 622 1095 410 -161 -368 -958 -757 -195 170
5362 170 541 694 818 -97 -364 -793 -631 -598 226 673 976 452 79 -195 -914 -758 -268 22 460 855
5382 855 657 154 -521 -533 -617 -448 324 540 761 565 426 -68 -726 -648 -538 1 649 822 231 -89 -434
5403 -434 -746 -703 -348 370 809 667 341 -152 -365 -785 -626 -414 506 1006 695 590 -108 -623 -593 -750 -399
5424 -399 255 710 361 387 -233 -715 -796 -614 -59 390 630 744 564 -194 -496 -1003 -500 -208 30 705 796
5445 796 389 137 -741 -818 -453 -461 184 459 357 606 -290 -610 -804 -636 -289 560 671 987 330 -233 -446
5466 -446 -786 -505 -186 744 861 861 407 -315 -327 -718 -613 -191 476 650 774 269 -317 -361 -764 -587 31
5487 31 421 1079 823 431 226 -678 -930 -562 -210 392 370 724 -112 -209 -823 -884 -613 -11 443 833 682
5508 682 178 -14 -528 -917 -276 161 499 654 651 175 -369 -548 -546 -494 -170 414 815 933 178 -116 -778 -530
5530 -530 -430 -328 377 874 680 374 -232 -666 -786 -443 -105 543 545 591 185 -226 -503 -530 -391 -40 505
5551 505 680 494 -44 -213 -797 -693 -439 143 392 659 614 20 -221 -499 -472 -546 196 683 692 739 30 -48
5573 -48 -413 -911 -473 -3 473 804 463 188 -194 -875 -550 -647 104 448 737 872 34 -244 -780 -757 -166
5594 -166 -136 667 696 560 -6 -361 -268 -376 -370 199 240 516 579 165 -783 -864 -374 -380 393 609 451 543 -27 -408
5618 -408 -556 -567 -191 35 375 644 746 -15 -297 -469 -623 -345 305 554 460 628 56 -255 -449 -557 -328
5639 -328 212 444 612 614 248 -641 -622 -571 -303 128 509 400 329 -195 -226 -666 -851 -96 102 380 580 238
5661 238 180 -484 -625 -672 -426 314 503 624 663 -112 -402 -740 -669 -85 167 432 392 559 124 -594 -709 -726
5683 -726 -88 -76 789 493 283 165 -472 -446 -574 -77 171 533 600 447 -201 -389 -394 -689 -265 507 621 674
5705 674 454 -84 -591 -582 -547 41 355 794 808 255 -216 -452 -324 -777 -201 -19 548 548 348 -348 -558 -801
5727 -801 -656 49 263 446 363 569 -221 -237 -540 -342 -81 391 806 706 305 -232 -362 -728 -340 -158 344
5748 344 420 595 35 -110 -686 -584 -339 -40 88 289 320 32 -204 -474 -578 -520 -98 231 353 406 102
5769 102 -161 -575 -465 -390 -241 384 828 594 103 -185 -544 -552 -548 -20 159 1056 733 19 -266 -351 -829 -299
5791 -299 -22 371 629 773 115 -376 -387 -439 -262 -255 411 554 671 96 -203 -364 -615 -417 -193 75 538
5812 538 523 64 42 -483 -710 -500 -239 393 351 446 180 -473 -703 -832 -568 129 231 523 478 163 -213 -567
5834 -567 -534 -312 224 439 808 504 146 -308 -474 -547 -281 262 495 505 657 389 -377 -518 -575 -180 176
5855 176 662 412 588 241 -105 -579 -427 -300 101 159 438 594 297 -159 -600 -463 -549 -73 573 265 151
5876 151 -68 -333 -564 -504 -283 102 563 265 324 -41 -658 -736 -334 -351 -25 380 485 587 1 -558 -573 -450
5898 -450 48 148 449 643 563 19 -252 -459 -587 -181 56 298 437 583 293 -343 -336 -635 -75 332 470
5919 470 338 414 63 -477 -456 -241 -94 443 443 989 288 -71 -228 -692 -480 23 152 480 467 240 -166 -807
5941 -807 -680 -492 -246 27 471 445 29 -236 -279 -240 -254 -153 248 624 563 238 -158 -377 -492 -541 -89 240
5963 240 691 670 267 -152 -337 -414 -538 97 264 670 563 174 -130 -474 -148 -368 -184 232 489 227 355
5984 355 -240 -249 -729 -291 -141 214 478 531 412 236 -538 -562 -248 -22 461 544 471 -75 -157 -589 -413 -327 12
6007 12 437 679 350 138 -177 -323 -574 -179 184 159 586 425 218 -218 -349 -446 -440 -33 269 707 643 418
6029 418 -327 -613 -535 -330 60 457 709 289 135 -481 -628 -465 -19 103 395 455 372 153 -219 -262 -619
6050 -619 -405 -181 352 328 318 62 87 -473 -498 -417 -43 171 622 543 308 -294 -246 -472 -396 -140 351 283 143
6073 143 87 -199 -405 -415 38 111 -83 493 462 -96 -184 -419 -334 -451 207 405 523 522 145 -321 -634 -497 -166
6096 -166 46 265 481 335 -2 -83 -486 -214 -250 54 378 761 264 89 -346 -496 -99 -159 -147 280 333 397
6118 397 265 -314 -207 -494 -131 132 491 441 295 206 -369 -420 -22 38 284 87 469 215 -296 -207 -278 -484
6140 -484 -327 174 -17 334 231 5 -309 -325 -306 -12 259 227 495 69 108 -164 -402 -276 -272 19 358 278
6162 278 190 61 -296 -256 -264 -114 33 222 529 66 -122 -222 -552 -583 -128 15 478 407 105 -33 -256 -453
6184 -453 -228 -308 -128 384 426 -60 50 -240 -421 -169 -75 248 343 731 400 -56 -564 -499 -11 -257 -12 276
6206 276 348 234 91 -86 -247 -339 -85 121 371 259 288 -272 -534 -748 -362 -70 302 454 589 317 -112
6227 -112 -294 -324 -269 -54 132 381 143 139 -36 -265 -206 -50 54 209 265 396 -78 4 -291 -537 -207 97
6249 97 109 574 332 3 -373 -123 -388 -194 38 272 475 201 437 -311 -110 -362 -165 -92 307 594 300
6270 300 209 -48 -382 -398 -474 -73 129 340 513 21 -197 -373 -582 -383 26 449 350 229 55 -250 -435
6291 -435 -646 -350 80 188 373 300 13 -216 -437 -526 -283 168 237 531 259 88 22 9 -200 -28 -74 224
6313 224 344 366 -125 -303 33 -331 -316 -13 426 425 150 -169 -148 -422 -464 71 -28 235 611 266 -183 -160 -221
6336 -221 -194 87 -111 39 297 304 -54 -210 -402 -469 -142 -258 277 259 325 -122 -271 -437 -285 -231 -150 321 390
6359 390 422 216 -27 -438 -182 -254 -1 369 419 250 307 -104 -149 -540 -526 -149 327 349 304 -270 -222 -450 -299
6382 -299 -117 -88 109 148 13 90 -52 -547 -55 -165 -1 270 206 378 135 -341 -387 -194 -46 271 23 552
6404 552 310 -65 -329 -411 -326 -96 -13 206 191 495 -12 -32 -446 -551 -323 -22 219 352 265 22 -388 -581
6426 -581 -490 -417 71 200 566 85 -49 -296 -405 -8 -187 98 518 362 462 283 -13 -514 -174 -55 324
6447 324 411 495 71 -4 -383 -553 -231 -25 182 533 426 387 -292 14 -431 -489 -148 172 679 505 55 -72
6469 -72 -446 -377 -322 -120 8 116 524 92 173 -347 -525 -343 -82 510 509 304 531 -81 -293 -588 -348 -111
6491 -111 129 588 251 251 218 -167 -247 -455 -94 96 389 337 81 -196 -223 -271 -106 -150 132 392 354 255 47
6514 47 -161 -238 -376 -84 123 343 394 106 -283 -197 -516 -41 323 245 563 70 166 -33 -449 -182 -13 160
6536 160 160 379 206 218 159 -289 7 -64 42 269 294 353 143 -384 -292 -340 -357 -170 53 415 469 166 -135 -522
6560 -522 -400 -250 143 266 583 511 77 9 -107 -203 -173 -257 282 157 384 101 -7 -518 -290 -159 -240 593
6582 593 101 297 6 -177 -304 -250 46 -99 334 198 59 -44 -137 -428 -158 -12 28 229 203 -54 293
6603 293 -168 -290 -140 -304 198 142 367 107 134 -274 -86 -31 10 59 364 400 155 -19 -181 -131 -402 -434 65
6626 65 439 149 29 84 -270 -168 -306 -179 174 249 380 488 158 -273 -175 -485 -155 77 85 386 111 253
6648 253 -165 -289 -313 81 -2 400 271 317 249 -20 -231 -358 -122 26 365 401 189 -79 -11 -342 -215 -101
6670 -101 363 152 480 306 -17 47 -313 -476 -156 331 192 286 306 37 -269 -468 -204 -61 19 5 493 235
6692 235 29 -120 -589 -343 33 486 -22 410 45 -79 154 -304 -248 -242 -17 229 213 227 -191 -325 -292 -154
6714 -154 103 -1 389 211 190 21 -242 -454 -428 -37 216 219 388 275 -38 -108 -356 -294 -32 25 192 -48
6736 -48 122 8 -199 -321 -478 -139 176 15 200 259 -30 -378 -8 -193 -100 117 642 569 141 -102 -228
6757 -228 -204 -180 -72 107 850 575 87 168 -314 -512 -432 66 114 206 489 138 -171 -182 -246 -169 224 45 364
6780 364 320 99 -233 -236 -339 -69 108 311 521 164 146 -113 -163 -391 -431 28 52 332 267 123 -391 -380 -291
6803 -291 288 -426 326 290 326 42 -144 -279 -293 9 -105 115 92 118 63 -82 -102 -341 -83 152 -340 472
6825 472 176 360 -4 -639 -202 -265 -212 100 435 216 -40 -145 -137 -245 11 -95 22 449 222 49 -42 -249
6847 -249 39 -357 99 350 407 149 103 -17 -317 -1 -248 19 341 507 405 -159 -57 -43 -652 -231 -137
6868 -137 -128 315 243 -36 -345 -247 -306 -72 226 110 367 -102 292 -311 -163 -545 -58 109 29 120 -10 183
6890 183 -375 -246 -93 -299 56 259 463 236 107 -267 -405 -497 -156 22 172 289 280 233 -142 -428 -120
6911 -120 64 9 425 80 192 61 -146 -6 -159 -254 -129 241 582 203 33 -470 -359 -140 -243 190 413
6932 413 172 215 145 -435 -304 -237 -44 244 -93 192 366 -130 -163 -452 -700 -368 -143 271 151 38 151
6953 151 -319 -295 -240 -287 -135 565 244 255 41 -163 -317 -439 -238 192 175 98 98 -162 -167 -409 -415 -88 78 370
6977 370 189 112 140 196 14 -112 42 -26 287 82 165 168 1 -410 -426 -233 71 278 206 -214 175 58 -148
7000 -148 -94 29 244 -61 434 16 250 -219 -304 -399 -75 236 -11 490 19 -113 -212 -451 -175 145 54 376
7022 376 212 201 2 -249 -581 -288 29 -60 371 22 384 26 -178 -511 -465 -81 -40 259 565 233 -15
7043 -15 -404 -130 -76 -236 28 577 491 341 13 -512 -265 -317 -108 11 -154 214 52 -245 -37 30 52 57 -41
7066 -41 147 546 8 -54 -300 -305 -300 264 268 270 410 280 -199 -229 -313 -315 225 146 329 213 103 -85 -414 -231 -365
7091 -365 -200 187 182 482 -45 6 -253 -424 -237 -235 120 212 210 83 -61 -360 -522 -57 167 82 326 11 34
7114 34 -455 -207 -241 -350 10 360 344 111 43 -44 -616 -419 -233 60 56 551 451 -145 -269 -261 -182 -237 -247 145
7138 145 572 226 84 82 -123 -180 -169 -210 143 227 -168 39 -212 -155 -214 -151 -66 31 347 319 163 -88 -87 -274 241
7163 241 39 622 57 114 96 -56 -219 -243 -54 -121 169 195 -27 48 -206 -322 -281 25 161 63 460 167 14
7186 14 -51 -487 -380 101 134 406 291 161 -16 38 -261 -145 -370 26 224 326 101 66 -391 -423 -237 -37
7208 -37 265 171 344 380 -22 -319 -425 -47 24 13 263 155 111 111 -50 -336 -334 -356 246 199 192 60 21 -329 -259
7233 -259 -281 -143 38 242 440 304 -84 -460 -251 -165 411 -43 190 293 117 165 -30 -413 -50 127 -134
7254 -134 304 403 37 -350 -282 -341 -361 -144 -9 201 94 -32 -127 -224 -646 -176 -508 127 -61 21 9 -134 -436
7277 -436 -494 -160 -148 39 67 305 149 371 -253 -445 -146 -262 -64 46 -132 -62 298 -266 -342 -280 -114 367
7299 367 365 235 -47 -93 -225 -33 -30 -91 400 198 144 15 -233 -93 -422 -453 134 19 162 156 168 193 -189 -190 -351
7324 -351 -291 162 451 240 365 -227 -288 -2 112 -267 -57 402 207 3 -165 -292 -328 60 -107 409 364
7345 364 77 288 -102 -238 -232 -343 205 47 322 370 396 -236 -353 -38 -184 -247 285 217 207 -28 -103 -206 -280
7368 -280 -209 -114 237 62 296 -176 -306 -434 -320 -201 117 196 318 384 -98 -84 -418 -332 63 -131 469 235
7390 235 152 -309 -218 -331 -89 -192 179 306 339 146 15 130 -367 107 -283 -59 27 266 293 85 75 -18
7412 -18 -506 -76 176 68 169 162 10 -116 41 -388 -84 -158 126 540 7 313 -149 -111 -262 28 -37 19
7434 19 438 358 56 15 -254 -306 -325 -130 -13 203 19 96 -255 -69 -58 -92 -167 344 318 57 -227 -217 -211 -281 -182
7459 -182 176 259 300 79 -57 47 92 -23 -117 24 197 333 -70 139 -207 -148 -347 -240 138 74 150 500
7481 500 269 -171 -30 -70 -23 187 178 117 161 -41 -247 -305 -232 -280 43 225 76 93 -34 -239 -332 -243 -171 -126 359
7506 359 401 415 -394 53 -288 86 -92 156 564 491 -55 116 -173 -277 -191 143 291 166 205 -48 208 -149
7528 -149 -181 -141 -67 72 88 315 218 -25 -323 -233 -187 -32 284 144 224 237 -131 -231 -116 47 -224 -117 232
7551 232 157 68 -77 -118 -423 -236 -224 255 539 -119 142 -75 -179 -399 -516 -253 133 154 172 216 62 -481
7573 -481 -431 -57 -39 184 306 384 290 -155 -7 -421 -349 -162 111 360 188 329 -67 -287 -477 -322 89 132
7595 132 87 151 211 -43 -209 -415 -105 -102 301 318 141 13 -34 -162 -414 -444 -275 64 26 335 -18 -2 -255
7618 -255 -249 -316 165 352 470 407 12 -95 -394 -522 -12 265 -150 377 243 140 -162 -378 -156 -124 -2 50
7640 50 339 484 167 -74 -148 -260 -143 -158 251 -2 251 139 72 -231 -363 -271 112 -195 184 329 150 -156
7662 -156 -367 -270 -240 85 212 420 121 289 -90 -531 -317 -63 207 177 223 320 56 55 -236 -294 72 63 210
7685 210 468 217 120 272 -402 -188 -206 30 440 563 322 33 -72 -255 -215 176 325 2 469 132 -111
7706 -111 -12 -201 -26 17 -13 368 390 327 -79 -130 -253 -342 -120 218 239 399 405 133 6 -294 -286 -100 10 354
7730 354 329 283 32 -243 -6 -420 -187 -94 142 189 299 -3 -101 -346 -152 87 -134 271 328 188 -42 -221
7752 -221 -109 -170 90 171 211 94 329 147 19 -174 -296 -23 45 85 -42 289 28 -89 -289 -472 41 43
7774 43 20 -10 161 82 85 -121 -12 -66 -25 308 284 220 51 125 -243 -179 -166 116 98 189 268 -13 -278 -127 -248
7799 -248 -136 271 371 186 30 -96 -334 -345 -93 -108 195 419 173 -7 -197 -31 -316 -237 -133 45 83
7820 83 190 32 202 -218 -56 0 -157 -39 106 328 63 -26 -469 -328 127 69 217 175 405 -121 98 -30
7842 -30 -538 -436 -333 236 -15 271 -4 108 3 10 -388 -55 -76 253 557 342 126 -82 45 -498 -166
7863 -166 178 55 260 -3 -444 -209 -246 -49 -61 318 108 49 159 120 -316 -117 -245 276 27 -48 51 252
7885 252 -199 -327 -253 -238 -113 258 262 187 411 -103 -343 -210 -211 71 251 248 530 -179 16 -320 106 -128 -187
7908 -187 287 20 261 122 81 -222 -244 5 77 409 21 348 -181 -259 -89 -249 -147 29 52 246 108 259
7930 259 124 -121 -297 -167 124 62 153 173 335 -222 -87 -131 -107 388 18 387 184 154 175 -2 -320 -192
7952 -192 98 -286 190 -139 -203 -305 -340 -245 -82 112 265 325 391 251 -146 -332 -596 13 -192 126 76 102
7974 102 338 -162 -319 -370 -341 79 149 -112 83 86 -347 -237 -235 -482 -29 57 163 124 -154 114 -33 -211 -88
7997 -88 200 220 334 84 151 -193 -511 -48 -29 54 -49 365 198 151 -402 -369 -289 -14 -73 73 43 411 50
8020 50 -281 -260 -244 -2 -212 33 283 195 263 -193 9 -137 -36 219 327 220 185 -177 -143 -243 -329 192 68
8043 68 191 -53 143 89 86 -307 -263 -88 -84 98 142 88 1 -249 1 -132 -84 456 69 66 103 125 -217 -426 -268
8068 -268 -196 229 325 124 223 13 79 -345 -328 -88 101 241 64 178 57 -75 -7 -205 -225 168 188 232 122
8091 122 -90 -199 -567 -151 -167 -3 37 151 115 81 -306 -83 -131 -113 174 9 -122 173 -179 21 -190 -81
8113 -81 17 217 31 -193 132 -150 -279 -381 -103 130 111 -32 618 460 13 -38 -197 -254 219 167 1 365
8135 365 52 201 -67 -272 -299 -36 109 118 319 34 -52 -12 38 -64 -149 90 -31 230 151 -41 -364 -496 162
8158 162 -22 209 351 246 128 -69 65 -134 80 58 159 36 340 92 -31 -473 -54 -245 21 516
8178 516 312 -58 10 92 -529 -213 -270 2 366 301 139 -18 -257
8191b57
$$ Imaginary data points
##PAGE= N=2
##DATA TABLE= (X++(I..I)), XYDATA
0 0 0 0 0 0 0 0 6 -8 8 -8 8 -16 16 -19 24 -32 37 -41 49 -61 69 -81 96 -107 126 -144 164 -186 210 -239
30 -239 268 -300 336 -376 420 -466 520 -578 642 -711 788 -871 966 -1069 1184 -1313 1460
47 1460 -1628 1819 -2043 2308 -2624 3018 -3514 4166 -5063 6384 -8535 12641 -23350 111722
61 111722 240802 27229 -94751 -103072 -46749 -74609 -80037 4239 136527 152411 61118 -34656
73 -34656 -59706 -82783 -116891 -97528 29745 159329 168846 57217 -51219 -94866 -98388 -92209
85 -92209 -42381 51320 121122 105941 45518 -1924 -41123 -104802 -143907 -77904 71363 167466
97 167466 129566 23661 -44564 -64080 -84626 -101390 -55154 51134 131362 118072 42383 -25395
109 -25395 -67310 -98157 -104321 -49004 54187 130546 122337 46985 -34917 -87163 -102728 -80016
121 -80016 -20770 49706 96285 101082 66053 -2955 -85814 -133058 -99052 -2157 82347 103125
133 103125 76102 38622 -4178 -63403 -112508 -101252 -21700 70248 112614 94185 41917 -19585
145 -19585 -78914 -112332 -88468 -9680 74574 109035 82807 28116 -25102 -65649 -89828 -80828
157 -80828 -28690 48662 107995 110421 51957 -35619 -101058 -108667 -60812 8538 62952 86693
169 86693 78183 39604 -19284 -74881 -98125 -74129 -13178 55934 100096 97317 44443 -32982
181 -32982 -93598 -105148 -62264 8926 69347 91404 71055 25439 -25234 -65723 -85963 -72602
193 -72602 -19145 54813 106769 98617 33050 -46053 -92319 -89034 -49669 4618 57217 88364
205 88364 78488 29308 -33530 -76054 -84169 -58920 -7883 53597 96519 90232 32457 -42607 -90577
218 -90577 -89483 -47259 10851 60346 82646 70804 27123 -29718 -75498 -87421 -57897 1371
230 1371 61588 92919 77393 23117 -40873 -81942 -83166 -47697 8354 59950 84633 69987
242 69987 23007 -34223 -76496 -84333 -52844 6472 64012 89917 70337 17530 -41359 -78495
254 -78495 -78990 -43500 10450 59216 81258 67358 21973 -35703 -78566 -83344 -46585 13051 65674
267 65674 84660 63198 13112 -40894 -74866 -75111 -41595 11328 59662 81053 64877 17208
279 17208 -39024 -78342 -79783 -41892 16951 65903 82076 58573 9296 -42002 -73480 -71848
291 -71848 -37922 13489 60188 80232 61879 12923 -42525 -77636 -75188 -36871 19228 65278
303 65278 79326 54839 6225 -43064 -72111 -69273 -35409 15235 61104 78658 58538 8662
315 8662 -45170 -76406 -71118 -32073 21348 64443 76025 52072 4178 -43952 -71374 -67203 -31797
328 -31797 18592 61743 76923 54039 4864 -46529 -75105 -67395 -28197 23718 63814 73423
340 73423 48943 2447 -44832 -71596 -65019 -28283 22196 62525 73922 49622 2042 -47189
352 -47189 -73684 -64600 -24694 26274 63125 70401 45685 -68 -46186 -71020 -63172 -24766 25961
365 25961 63316 70954 45287 -2024 -47793 -71517 -61098 -21805 27505 63157 69161 43068
377 43068 -3234 -48175 -70388 -59267 -20051 28053 62842 68431 41976 -4833 -49197 -70368
389 -70368 -57703 -18070 28735 62292 67406 41029 -5747 -50028 -69955 -55990 -16016 30893
401 30893 62706 65378 37691 -7461 -49245 -68070 -54922 -15692 30664 62895 65488 37107
413 37107 -9144 -50983 -68190 -53450 -12904 32608 63169 63055 34076 -10877 -50282 -66330
425 -66330 -51623 -12907 32087 62485 63523 33797 -12115 -51806 -67107 -49998 -10077 34141
437 34141 62410 61222 31173 -13354 -51669 -65131 -48530 -9129 34181 62011 60807 30856
449 30856 -13817 -52129 -65569 -47124 -6634 35904 61718 58804 28979 -14951 -52538 -64610
461 -64610 -45538 -5067 36280 60279 56842 27652 -15172 -52052 -64394 -45523 -4318 37253
473 37253 60901 56394 25836 -17214 -52642 -63184 -43182 -2636 38226 60705 55065 23731
485 23731 -18888 -52536 -60982 -40892 -2825 36299 60130 56428 24765 -20742 -55467 -61709 -37804
498 -37804 1031 37861 58158 53746 23195 -20883 -54725 -60554 -36402 2172 37631 56795
510 56795 52068 23100 -19922 -54977 -61912 -37484 4058 41686 58909 49130 17117 -22776 -52017
523 -52017 -57051 -36008 1937 39467 59421 50630 16646 -24877 -53038 -55702 -34206 2042 39529
536 39529 60552 51518 14805 -29114 -55079 -52346 -28399 4810 36446 55608 50184 17479 -26066
549 -26066 -55658 -56008 -30021 7728 41028 56040 46276 13986 -26487 -54443 -55649 -29490 10082
562 10082 43181 54991 41690 11183 -24189 -50064 -54540 -32788 7108 45208 60011 43884
574 43884 6630 -30470 -51284 -49231 -27149 7833 41587 56611 43438 8219 -29538 -52352
586 -52352 -50061 -25980 9699 41305 55039 43916 9791 -30708 -56479 -51978 -21315 16235
598 16235 41919 48994 37924 10547 -25494 -53377 -54184 -25282 16637 46696 51940 35136 5265
611 5265 -27572 -50965 -51159 -24433 15706 46384 52301 34576 3745 -29004 -49991 -48379 -22965
624 -22965 14512 44605 53737 36904 2720 -33119 -52437 -45559 -17727 15578 41406 50116 37256
637 37256 5188 -32798 -54617 -47685 -16477 19901 44119 48068 32552 2677 -31030 -51705
649 -51705 -46458 -17612 19169 44704 48974 32169 844 -31772 -51318 -45667 -17317 19530 46745
662 46745 49914 29399 -3850 -33058 -46700 -40827 -17533 15461 43955 52625 33055 -3967 -37433
675 -37433 -50498 -40531 -12686 20121 44535 47844 28259 -4891 -34241 -47468 -39808 -14296 18628
688 18628 44386 49426 29894 -4504 -36292 -50532 -40309 -11119 22895 45676 45558 24271 -6237
701 -6237 -32493 -45357 -39689 -14319 20559 46566 48668 25969 -7543 -36205 -48729 -38896 -8687
714 -8687 25442 45519 42704 21779 -6201 -32024 -46439 -39657 -11337 24286 46491 44642 23009
727 23009 -8077 -35555 -48318 -37627 -6459 27394 44888 39545 19593 -6123 -31172 -46390
739 -46390 -40217 -9332 27281 47094 42162 19859 -8866 -36022 -48818 -36049 -2601 29046
751 29046 42420 36664 19566 -5337 -32979 -48960 -38066 -4287 30200 45401 38289 17856
763 17856 -8838 -35257 -47864 -34685 -1231 30279 42427 35069 17178 -6909 -33256 -47998
775 -47998 -36181 -2690 30458 45368 37862 16440 -12368 -37374 -45298 -29401 647 27091
787 27091 40040 37093 18979 -10657 -38260 -47681 -30167 1720 29549 41879 36434 16236 -13085
800 -13085 -38956 -44835 -26716 2842 27778 39044 35467 18456 -11257 -39162 -46963 -28527 3744
813 3744 31021 41924 35258 13285 -15968 -37699 -41330 -24800 1631 26183 40840 37759 15599
826 15599 -16794 -40757 -43029 -24192 4467 29106 40795 34784 12118 -17596 -39079 -39920 -21802
839 -21802 3777 26640 39255 36291 14840 -17252 -41294 -42682 -21836 6852 30252 39827 32616
852 32616 10068 -17760 -37366 -39098 -22604 3795 28828 40946 34218 10033 -19792 -39979
864 -39979 -39617 -20686 7415 30916 39626 30779 7698 -19080 -36999 -37604 -20584 5115 29459
877 29459 40382 32726 8235 -20770 -39550 -37840 -18366 8189 30461 38905 29332 6174 -19717
890 -19717 -36449 -36752 -19556 6645 30900 40554 30200 5541 -22645 -38931 -35981 -16142 9747
903 9747 30339 37742 28467 5612 -21102 -37788 -35750 -16904 9413 30661 38726 28862 4377
916 4377 -23032 -38632 -34787 -14648 11192 30654 36473 26535 3907 -21261 -37322 -35177 -16244
929 -16244 10748 32339 38671 26242 1412 -23802 -37444 -32426 -13285 10874 30348 36681 26716
942 26716 1805 -24167 -37652 -32238 -12614 11564 30889 37259 25703 795 -25586 -37774
954 -37774 -31260 -10577 12700 29889 34843 24556 1744 -23397 -38185 -32965 -10969 14490 32652
967 32652 35145 21921 -1021 -24268 -35954 -30836 -11444 13797 32684 35779 21968 -2402 -24773
980 -24773 -35467 -29944 -10507 13932 32339 35843 21152 -3329 -26126 -35053 -28181 -8537 14065
993 14065 31108 34565 22116 -2795 -26843 -36960 -28467 -6657 16186 31294 32507 19806 -2427
1006 -2427 -25091 -36224 -28995 -7218 16960 32543 32756 17969 -3952 -25085 -35211 -28009 -7104
1019 -7104 17619 33121 32226 16857 -5395 -25305 -34222 -26745 -6840 17006 32983 33323 17368
1032 17368 -6862 -27402 -34468 -24845 -4855 17083 31375 31762 17188 -6266 -27175 -34685 -25123
1045 -25123 -3893 18275 31598 30782 16164 -6967 -27480 -34373 -24395 -2743 19044 31378 29872
1058 29872 14549 -7490 -26758 -33637 -24375 -3486 19253 32822 30124 13438 -9243 -27088
1070 -27088 -32194 -22670 -2857 18606 31880 30510 13530 -9919 -28061 -32439 -21318 -1481 19205
1083 19205 31421 29393 12789 -10521 -28115 -31906 -20821 -988 19293 31110 29012 12477
1095 12477 -10605 -28736 -32204 -20168 241 20279 31045 27405 10983 -11091 -27669 -30856
1107 -30856 -19711 239 20099 31430 27910 10707 -12012 -28654 -31066 -18624 1934 21200
1119 21200 30782 26466 9640 -12068 -27887 -30246 -18795 1597 20759 30695 26576 9367 -13329
1132 -13329 -28843 -30295 -17232 2495 21535 30462 25329 8404 -12730 -28003 -29605 -17100 2825
1145 2825 21277 30954 25698 7670 -14057 -28556 -29106 -15864 3697 21539 30190 24298 6616
1158 6616 -14234 -27845 -28433 -15808 3200 21918 30537 24231 5959 -15284 -28221 -27437 -14985
1171 -14985 4357 22082 30043 23666 5413 -15459 -28029 -27007 -14607 4773 22575 30380 22879
1184 22879 3937 -16512 -27866 -25975 -13728 4816 22337 30346 22692 3691 -16715 -27233
1196 -27233 -25728 -13350 5221 23332 30547 21888 1912 -17528 -26767 -24470 -12632 5587 21880
1209 21880 29519 21958 2357 -17065 -27879 -24979 -11869 6876 23454 29406 20010 1090 -17614
1222 -17614 -26859 -24457 -11402 7406 23029 28366 19079 1480 -16425 -26687 -25759 -12151 8312
1235 8312 25388 28694 17594 -824 -17128 -25321 -23984 -11628 7686 24337 28643 17609 -766
1248 -766 -17272 -25654 -24102 -11399 8702 25448 28637 16790 -1647 -17686 -25620 -22568 -9644
1261 -9644 9253 24074 26859 16356 -729 -16951 -26764 -24260 -9269 11516 25213 25845 14772
1274 14772 -1479 -16766 -25916 -23568 -9280 11347 25430 26004 14190 -2252 -16845 -24929 -22981
1287 -22981 -8977 11144 25965 26776 13570 -3960 -18494 -24683 -20981 -7581 10347 24384 26130
1300 26130 14836 -3631 -19738 -26309 -20118 -5194 11214 23297 24643 14819 -2787 -19488 -26896
1313 -26896 -20490 -4430 12518 23674 23648 13540 -2991 -18995 -26382 -20798 -4764 13667 24698
1326 24698 23379 12036 -4632 -18738 -24637 -19401 -5334 12599 24798 24683 12188 -6046 -20287
1339 -20287 -24611 -17934 -3510 12038 23967 24301 12322 -6451 -20793 -24590 -17051 -2765 12379
1352 12379 22900 23301 12538 -5324 -21080 -26101 -17693 -1077 14523 23254 21321 10222 -5127
1365 -5127 -19529 -24699 -18463 -2315 14936 24486 22044 9244 -7186 -19131 -23235 -17252 -2545
1378 -2545 14611 24741 21848 8094 -8306 -19541 -22315 -16464 -2640 13996 24350 22384 8888
1391 8888 -8820 -21209 -23236 -14851 -322 14748 23201 20755 8696 -7876 -20566 -23569 -15579
1404 -15579 140 15401 23683 20303 7199 -8104 -20111 -23008 -15395 497 16188 23736 19212
1417 19212 6055 -8052 -19275 -22555 -15491 -64 16328 24371 20037 6071 -10171 -20852 -21411
1430 -21411 -13051 1155 15522 22885 19276 6298 -9836 -20668 -21867 -13235 1580 16251 22934
1443 22934 18692 5935 -10542 -21393 -21925 -12150 2945 16300 21925 17759 5609 -9350 -20614
1456 -20614 -22443 -12894 2537 17125 22696 17860 4318 -11111 -20890 -20857 -11270 3038 16305 21893
1470 21893 17684 4732 -11024 -20854 -20845 -11393 3333 17058 22415 17117 3421 -11469 -20939 -20213
1484 -20213 -10062 4299 16570 21635 16602 3846 -11242 -21301 -20377 -10275 4528 17182 21756
1497 21756 16043 2481 -11894 -20857 -19255 -10009 4670 16977 21801 15846 2476 -12255 -21258
1510 -21258 -19692 -9181 5718 17732 21190 15027 2004 -12102 -20481 -19233 -8590 5807 17314
1523 17314 20653 15017 1984 -12446 -20973 -19361 -8529 6648 17754 20579 13645 1076 -12274
1536 -12274 -20196 -18490 -8241 6161 17644 20678 13959 826 -13156 -20931 -18458 -6691 7185
1549 7185 17625 19643 13311 485 -12920 -20354 -17930 -6805 6991 17695 20055 13421 24
1562 24 -13900 -20881 -17774 -5661 8146 17960 19041 12339 -158 -13159 -20073 -17237 -6154 7819
1576 7819 17677 19632 12414 -962 -14255 -20522 -16777 -4846 8543 17607 19003 11849 -1077 -14196
1590 -14196 -20039 -16319 -4766 8691 17700 19042 11578 -1869 -14407 -20270 -15594 -3820 8552
1603 8552 17566 18807 11090 -2123 -14454 -19725 -15700 -3814 9157 17690 18687 10474 -3050 -14767
1617 -14767 -19715 -15035 -3036 8950 17611 18467 10423 -3194 -15328 -19681 -14578 -2892 9872
1630 9872 17884 18045 9508 -3791 -15250 -19118 -14322 -2841 9573 17842 17786 9326 -3582 -15402
1644 -15402 -19199 -13603 -2167 10019 18256 17610 8651 -4858 -15273 -18124 -13285 -2291 9876
1657 9876 17894 17817 8594 -4720 -15768 -18849 -12523 -1540 10316 17989 17036 7837 -5398 -15488
1671 -15488 -18722 -12229 -1255 10420 17791 16503 7545 -5300 -15518 -18621 -12485 -363 11208
1684 11208 17787 16086 6673 -5492 -15347 -17914 -12178 -403 11673 18119 16051 6469 -6255 -15391
1698 -15391 -17719 -11550 -128 11183 17654 16009 6107 -6411 -16074 -17523 -11057 532 11366
1711 11366 17727 15527 5926 -6695 -16383 -17629 -10534 1266 11603 17059 14916 5666 -6525 -16204
1725 -16204 -17642 -10536 1433 12576 17211 14370 4759 -7222 -16039 -17042 -9948 1573 12125
1738 12125 17197 14056 4439 -7270 -15723 -17047 -10043 1866 12687 17595 13846 3782 -8186
1751 -8186 -16042 -16428 -8946 2075 12110 16981 14031 4146 -8185 -16428 -16599 -9051 2747 12670
1765 12670 16804 13601 3508 -8286 -16039 -16061 -8176 3216 12383 16542 13136 3372 -8060 -16490
1779 -16490 -16366 -8134 3905 13013 16448 12291 2684 -8688 -15866 -15531 -7813 3700 13228 16540
1793 16540 12485 2481 -8877 -16140 -15553 -7285 3876 13299 16467 11964 1932 -9679 -15859 -14710
1807 -14710 -6937 3607 12595 16565 12313 1797 -9833 -16534 -14428 -6126 4591 12702 15694 11488
1821 11488 1793 -9495 -16033 -14761 -6191 4612 13034 15598 11160 1220 -9580 -15997 -14539 -6090
1835 -6090 5431 13979 15572 10331 127 -9483 -14928 -13848 -6875 4617 13976 16486 10278 -324
1849 -324 -10941 -15041 -13080 -5285 5081 13384 15841 10229 -710 -10797 -15489 -13085 -5124 5206
1863 5206 13468 15864 10008 -579 -10961 -15811 -12708 -3918 5939 13382 14453 8975 -464 -9930
1877 -9930 -15322 -13551 -4695 6329 14731 14791 8403 -2013 -10682 -14874 -12397 -4331 6316 14687 15017
1892 15017 8243 -2059 -10671 -14358 -12155 -4244 6366 14354 15267 8275 -2758 -11384 -14999 -11431
1906 -11431 -2715 7082 13316 13977 8293 -1851 -11026 -15602 -11918 -2586 7867 14008 13632 7166 -1983
1921 -1983 -11009 -15036 -11777 -2169 8292 14113 13138 6887 -2389 -10839 -14960 -11961 -2502 8425 14702
1936 14702 13156 6500 -3322 -11394 -14296 -10804 -1979 7696 13522 12993 6713 -2796 -11979 -15198 -10322
1951 -10322 -1049 8246 13515 12820 6286 -2965 -11878 -14930 -10082 -695 8779 13199 12102 6365 -2704
1966 -2704 -11744 -15152 -10765 -263 9214 14141 12151 5217 -3750 -11576 -14222 -9925 -247 8995 13742
1981 13742 12349 5500 -4030 -11972 -14482 -9075 114 8737 13508 12078 4916 -4743 -12271 -13993 -8914
1996 -8914 299 8626 13160 11762 5127 -4452 -12570 -14243 -8657 802 9419 13115 11605 4355 -4716
2011 -4716 -12072 -13465 -8476 765 9318 13476 11652 4159 -5346 -12591 -13588 -7896 949 9443 13457
2026 13457 11012 3721 -5368 -12246 -13310 -8100 719 9233 13370 11172 3606 -5467 -12607 -12986 -7239
2041 -7239 2275 9602 13027 10527 3543 -5727 -12287 -12930 -7577 1695 9480 13661 10758 2896 -6272
2056 -6272 -12615 -12539 -6918 2251 9817 12866 9874 2983 -6189 -12244 -12414 -6597 2166 10044 12968 9895
2072 9895 2716 -6541 -12712 -12361 -6144 2896 10253 12636 9612 2418 -6525 -12209 -12066 -6292 2795
2087 2795 10279 12885 9462 1600 -6969 -12280 -12248 -5408 3230 10117 12411 8997 1580 -6697 -12375
2102 -12375 -11943 -5536 3470 10746 12775 8756 926 -6961 -12245 -11624 -5332 3501 10729 12746 8459
2117 8459 817 -7235 -12176 -11578 -5204 3868 10575 12399 8091 422 -7937 -11998 -11034 -4173 3876
2132 3876 10548 12079 8054 749 -7778 -12650 -10862 -4319 4512 10512 11943 8038 -73 -8095 -12342
2147 -12342 -10640 -3969 4461 10701 11896 7176 31 -7562 -12151 -10919 -3792 5237 11294 11780 6800
2162 6800 -767 -8169 -11716 -10256 -3712 4778 10731 11571 7145 -558 -7930 -12057 -9967 -3072 5160
2177 5160 10995 11663 6916 -990 -8672 -12144 -9755 -2735 5288 10308 10818 6743 -704 -8515 -12568
2192 -12568 -10077 -2199 6175 10780 10534 6365 -971 -8328 -11864 -9639 -2146 5995 11044 11092 6130
2207 6130 -1305 -8636 -12004 -8888 -1995 5870 11129 10524 5666 -1893 -8592 -11386 -8487 -1726 5714
2222 5714 10512 10741 6002 -1949 -9604 -12208 -8246 -877 6082 10052 9824 5521 -2065 -9087 -11678
2237 -11678 -8208 -893 6234 10456 9762 5135 -2349 -9237 -11569 -8101 -723 6601 10698 9729 4470
2252 4470 -2696 -8977 -11149 -7880 -1135 6162 10959 10512 4691 -3387 -9760 -10951 -7004 -430 6058
2267 6058 10381 10020 4655 -3885 -10050 -11236 -6695 61 6243 10324 9670 4311 -3612 -10003 -10783 -6641
2283 -6641 477 7000 10287 9508 4020 -3913 -9092 -10515 -6964 -25 6920 10696 9648 3220 -4453
2298 -4453 -9417 -10039 -6356 -21 6543 11063 9693 3215 -4778 -9711 -10182 -5932 461 7001 10768
2313 10768 9687 3112 -4819 -9512 -9443 -5782 695 6798 10319 9199 2964 -5000 -10060 -10034 -5850 861
2329 861 7451 10495 8639 2249 -4683 -9482 -9852 -5809 900 7671 10872 8277 1657 -5111 -9070
2344 -9070 -9394 -5782 1066 7856 10804 8018 1523 -5435 -9207 -9214 -5354 1394 7781 10845 8019 1453
2360 1453 -5564 -9717 -9084 -4642 1807 7805 10384 7236 1141 -5479 -9395 -9259 -4691 2101 7977
2375 7977 10348 7652 1247 -5167 -9722 -9291 -4910 2474 8296 9682 6715 649 -5096 -9646 -9273
2390 -9273 -4601 2431 8640 9888 6576 440 -5697 -9232 -9056 -4425 2881 8515 9988 6667 494
2405 494 -5601 -9400 -8879 -3969 2791 8501 9334 6494 327 -5964 -9107 -8614 -3780 3322 8436 9359
2421 9359 6052 529 -6075 -9640 -8555 -3140 3265 8383 9271 5982 86 -6062 -9514 -8377 -3274
2436 -3274 3434 8491 9229 5731 -420 -6211 -9289 -8340 -3083 3466 8684 9435 5279 -674 -6261 -9586
2452 -9586 -7599 -2645 3615 8507 9148 5388 -735 -6313 -9442 -7892 -2545 3835 8574 9026 5553
2467 5553 -1111 -6757 -9177 -7543 -2201 3502 8476 8919 5196 -1307 -6648 -9118 -7614 -2085 4348
2482 4348 8608 8579 4811 -1336 -6813 -8904 -7182 -2049 4188 8734 8699 4565 -1571 -6995 -8995 -6860
2498 -6860 -1597 4452 8567 8443 4120 -1736 -6666 -8825 -7086 -1737 4404 8739 8295 4116 -1742
2513 -1742 -7021 -8679 -6714 -1336 4941 8526 8161 3704 -1849 -6737 -8460 -6545 -1154 5120 8680
2528 8680 8311 3777 -2107 -7036 -8720 -6044 -524 4985 8255 8107 3270 -2337 -6914 -8902 -6248
2543 -6248 -821 5227 8352 7613 3073 -2751 -7041 -8635 -5979 -293 5201 8483 7424 3015 -2510
2558 -2510 -7338 -8034 -5651 -478 5763 8643 7271 2622 -2731 -7406 -8293 -5427 -14 5518 8269
2573 8269 7157 2918 -2944 -7257 -8684 -5486 305 5402 8310 6866 2620 -2954 -7368 -8282 -5068
2588 -5068 560 5866 7823 7070 2548 -3088 -7143 -8377 -5195 501 5924 8237 6437 2049 -3673
2603 -3673 -7511 -8059 -4700 821 5914 8113 6557 2205 -3369 -7487 -7709 -4451 1123 6052 8185
2618 8185 6553 1870 -3931 -7772 -7627 -4155 1344 5855 7486 6245 1705 -3551 -7516 -7471 -3824 1586
2634 1586 6192 7962 6368 1423 -3847 -7511 -7525 -3967 1510 5931 7869 6105 1347 -4178 -7798
2649 -7798 -7437 -3910 1421 6032 8097 5954 1084 -4309 -7565 -7144 -3497 1666 5818 7573 6194
2664 6194 1149 -4395 -7703 -7079 -3367 2057 6043 7513 5474 774 -4639 -7528 -6919 -3147 2177
2679 2177 6573 7597 5301 615 -4304 -7402 -7153 -3255 2373 6814 7657 5297 104 -4552 -7222
2694 -7222 -6585 -3168 2290 6239 7617 5043 102 -5112 -7364 -6461 -2726 2439 6157 7503 4640
2709 4640 109 -4873 -7513 -6520 -2392 2277 6282 7269 4694 -203 -4929 -7459 -6372 -2212 2655
2724 2655 6618 7155 4457 -139 -5104 -7500 -6201 -2292 2723 7037 7367 4708 -342 -4981 -7438
2739 -7438 -5949 -2050 2658 6587 7313 3807 -465 -5150 -7232 -6162 -1743 2935 6590 6991 4284
2754 4284 -1004 -5469 -7168 -5548 -1401 3521 6814 6614 3532 -742 -4933 -6973 -5610 -1491 3480
2769 3480 6665 7258 3377 -1159 -5237 -7102 -5209 -1112 3367 6860 6684 3556 -1498 -5434 -6987
2784 -6987 -5577 -927 3651 6538 6311 3675 -1505 -5606 -6894 -5005 -1210 3423 6444 6357 3072 -1488
2800 -1488 -5374 -7053 -4863 -1100 3853 6248 6681 2987 -1796 -5326 -6892 -4833 -653 3855 6414
2815 6414 6367 2810 -2032 -5588 -6689 -4682 -615 3925 6846 6026 2458 -2175 -5464 -6682 -4615 -435
2831 -435 4442 6639 5867 2618 -1973 -5271 -6569 -4375 -12 4246 6756 5613 2153 -2111 -5584
2846 -5584 -6384 -4192 13 4189 6657 5693 2291 -2284 -5853 -6438 -4303 5 4493 6739 5799 1997
2862 1997 -2551 -5649 -6304 -4011 -13 4452 6581 5613 2083 -2711 -5690 -6535 -3793 329 4620 6489
2878 6489 5249 1650 -2444 -5808 -6463 -3683 336 4456 6541 5473 1946 -2847 -5390 -6168 -3537
2893 -3537 510 4766 6094 4957 1354 -2774 -5905 -6035 -3378 907 4589 6271 5266 1392 -2875
2908 -2875 -5904 -5698 -3401 666 4716 6249 4982 1191 -2920 -6043 -5986 -3139 824 4751 6064 4847
2924 4847 1052 -3476 -5844 -5867 -3044 1328 4674 6030 4686 1122 -3298 -6058 -5824 -2563 1265 4601
2940 4601 6012 4556 763 -3405 -5738 -5578 -2609 1336 4909 6108 4516 564 -3316 -5644 -5393
2955 -5393 -2403 1818 4766 6086 4339 411 -3595 -5846 -5293 -2211 1674 4871 5704 3993 228
2970 228 -3916 -5873 -5320 -2333 1517 4746 5888 4082 -21 -3749 -5708 -4901 -2073 1929 5088 5773
2986 5773 3808 83 -3741 -5776 -4805 -1811 2032 5167 5585 3565 -418 -4003 -5815 -4811 -1691
3001 -1691 1768 5038 5729 3794 -126 -4035 -5622 -4738 -1736 2154 5183 5778 3262 -319 -4027 -5668
3017 -5668 -4608 -1571 2316 5412 5652 3263 -646 -4027 -5481 -4633 -1466 2508 5322 5708 3020 -561
3033 -561 -4162 -5465 -4217 -1281 2392 5005 5451 2953 -1138 -4023 -5595 -4278 -1327 2317 5127
3048 5127 5323 2575 -886 -3974 -5671 -3965 -1021 2596 5091 5161 2374 -998 -4477 -5294 -4198 -875
3064 -875 2961 5388 5279 2424 -984 -3885 -5640 -4067 -743 2949 5281 5092 2245 -1360 -4216 -5359
3080 -5359 -3939 -698 3154 5307 4841 2184 -1524 -4384 -5249 -3763 -372 3047 5162 4923 2174 -1737
3096 -1737 -4677 -5195 -3734 -206 3213 4736 4632 2201 -1376 -4142 -5194 -3441 -86 3373 5113
3111 5113 4536 1693 -1522 -4255 -4812 -3493 -168 3560 4995 4371 1592 -1604 -4546 -4888 -3671 -2
3127 -2 3126 5627 4720 1635 -1859 -4726 -5050 -3191 211 3206 4843 4152 1543 -2042 -4601 -4782 -2928
3144 -2928 259 3655 4710 3947 1396 -1889 -4513 -4965 -2850 552 3753 4786 4121 1373 -1897 -4571
3160 -4571 -4984 -3199 504 3841 5042 4249 742 -2241 -4257 -4894 -3050 793 3648 4757 3775 1091
3176 1091 -2580 -4540 -4553 -2456 629 3737 4658 3865 1024 -2250 -4427 -4600 -2436 1122 3604 4750
3192 4750 3719 843 -2144 -4602 -4721 -2641 1322 4047 4848 3555 663 -2189 -4658 -4586 -2601 851
3208 851 4089 4885 3465 536 -2657 -4427 -4124 -2370 1345 3881 4638 3268 609 -2857 -4578 -4434
3224 -4434 -2279 1236 3721 4837 3573 627 -3079 -4623 -4060 -1863 1685 3795 4579 3179 291
3239 291 -2608 -4604 -4441 -1796 1508 4147 4619 3107 204 -2807 -4604 -4075 -1571 1623 3984 4806
3255 4806 3026 37 -3037 -4427 -4003 -1480 1110 3739 4557 2926 -161 -2925 -4325 -3780 -1321 1840
3271 1840 3936 4214 2548 -362 -3156 -4832 -3857 -1002 1647 3825 4301 2869 -201 -3253 -4472 -3996
3287 -3996 -1211 1908 4286 4427 2663 -406 -3132 -4252 -3832 -1379 1964 4091 4132 2498 -620 -3170
3303 -3170 -4284 -3329 -882 1969 4087 4331 2418 -669 -3237 -4358 -3663 -803 1897 3951 4358 2307
3319 2307 -713 -3296 -4570 -3381 -442 2030 4141 3714 2138 -967 -3294 -4036 -3350 -381 2113 4214
3335 4214 4098 2017 -758 -3206 -4147 -3019 -292 2403 3993 3808 2071 -1052 -3387 -4120 -2846 -331
3351 -331 2385 3912 3784 1863 -814 -3345 -4176 -3115 -429 2605 4051 4009 1735 -1105 -3377 -4197
3367 -4197 -2861 -114 2566 3921 3874 1903 -1205 -3209 -4172 -2720 -237 2279 4074 3621 1627 -1219
3383 -1219 -3712 -4031 -2590 94 2668 3829 3651 1436 -1118 -3515 -3766 -2621 -36 2796 3771 3657
3399 3657 1274 -1432 -3388 -4053 -2561 190 2757 4115 3419 1331 -1436 -3648 -3956 -2532 256 2912
3415 2912 4136 3155 1104 -1714 -3882 -3834 -2428 286 2523 4176 3509 1137 -1316 -3897 -3756 -2198
3431 -2198 283 2887 3869 3513 814 -1934 -3491 -4039 -1985 585 2822 4063 2942 861 -1815 -3532
3447 -3532 -3748 -1884 908 3013 3905 3060 576 -1908 -3612 -3630 -2116 943 2570 3867 3125 647
3463 647 -1928 -3766 -3398 -1999 625 2711 3892 2937 250 -1810 -3659 -3491 -1467 692 3107 3877
3479 3877 2855 436 -2147 -3564 -3593 -1797 697 3452 4066 2666 367 -2053 -3883 -3881 -1489 1156
3495 1156 3152 3781 2688 328 -2241 -3756 -3226 -1561 1160 2927 3615 2711 321 -2368 -3795 -3378
3511 -3378 -1546 1124 3339 3532 2407 57 -2295 -3455 -3220 -932 1405 3378 3564 2169 -177 -2276
3527 -2276 -3532 -3163 -1327 1150 3147 3439 2128 -306 -2277 -3042 -3072 -1033 1545 3211 3278 2051 -307
3544 -307 -2195 -3445 -2787 -997 1216 3194 3355 2394 -230 -2366 -3746 -2952 -1066 1602 3013 3212
3560 3212 2123 -242 -2353 -3219 -2818 -520 1492 3548 3550 1846 -249 -2390 -3479 -2638 -742 1753
3576 1753 3502 3499 1896 -407 -2967 -3692 -2669 -716 1971 3361 3593 1591 -432 -2668 -3330 -2684 -513
3593 -513 1728 3185 3274 1670 -503 -2773 -3369 -2536 -622 1785 3078 3287 1552 -912 -2786 -3406 -2557
3610 -2557 -264 1809 3063 3231 1708 -596 -2660 -3576 -2594 -463 1974 3222 3145 1385 -826 -2759
3626 -2759 -3227 -2395 -172 1875 3134 3151 1231 -779 -3095 -3656 -2044 -108 1945 3266 3266 1397 -991
3643 -991 -2790 -3271 -1984 -173 1761 3176 3136 1351 -973 -3006 -3094 -2122 113 2252 3229 3041 870
3660 870 -1314 -2791 -2863 -1996 -18 2052 3177 2917 974 -975 -2884 -3301 -1858 177 2266 3439
3676 3439 2924 924 -1467 -2751 -3083 -2108 -9 1834 3193 2718 916 -1525 -2933 -3172 -1553 142
3692 142 2154 3473 2561 623 -1343 -2841 -2853 -1572 360 2029 3235 2557 602 -1415 -2837 -3016
3708 -3016 -1712 436 2209 3094 2515 838 -1307 -2781 -2727 -1667 474 2444 2962 2579 576 -1604
3724 -1604 -2876 -2995 -1506 696 2279 3135 2313 662 -1441 -3221 -2867 -1029 862 2237 3367 2358
3740 2358 127 -1948 -2919 -2913 -1554 395 2261 2922 2108 371 -1737 -2764 -3115 -1286 880 2259 2920
3757 2920 1971 349 -1726 -2598 -2818 -1368 808 2364 3277 2141 60 -2083 -2584 -2705 -1325 907
3773 907 2340 2980 2213 106 -1845 -2495 -2275 -1029 1145 2346 2887 1900 269 -2120 -2961 -2595 -1087
3790 -1087 817 2500 2853 1894 -90 -1984 -2723 -2374 -913 1211 2586 2674 1627 35 -2013 -2764 -2026
3807 -2026 -985 891 2483 2812 1662 -418 -1870 -2678 -2509 -840 1295 2262 2534 1562 -407 -1949
3823 -1949 -2971 -2184 -594 1210 2644 2625 1450 -273 -2287 -2887 -2124 -546 1439 2713 2892 1050
3839 1050 -374 -1788 -2782 -2135 -564 1457 2999 2627 1289 -695 -2096 -2577 -2149 -366 1002 2507
3855 2507 2566 1652 -301 -1831 -2615 -1774 -417 1526 2647 2678 1463 -470 -2273 -2662 -2083 -318 1691
3872 1691 2483 2656 1170 -458 -2242 -2737 -2051 -287 1655 2566 2686 1054 -713 -2084 -2570 -1955 -168
3889 -168 1771 2740 2713 1213 -931 -2425 -2734 -1730 -334 1471 2728 2462 945 -884 -2351 -2577 -1650
3906 -1650 13 1541 2357 2325 983 -900 -2425 -2745 -1722 208 1479 2509 2023 789 -877 -2270
3922 -2270 -2406 -1616 -80 1944 2510 2037 862 -1130 -2711 -2492 -1628 119 1888 2586 2404 898 -835
3939 -835 -2513 -2485 -1271 -17 1437 2498 1982 826 -762 -2157 -2594 -1572 331 1828 2286 2356 663
3956 663 -998 -2306 -2430 -1344 -17 1943 2781 2064 655 -1086 -2136 -2287 -1516 367 1806 2534 2266
3973 2266 513 -1230 -2233 -2386 -1503 10 1803 2434 1643 503 -1265 -2422 -2336 -1224 296 1699
3989 1699 2476 1886 313 -1254 -2645 -2265 -1356 453 1742 2524 2141 391 -1357 -2144 -1956 -1386 331
4006 331 1997 2348 1699 282 -1392 -2286 -2242 -1123 611 1897 2349 1759 -88 -1393 -2355 -1761 -957 907
4024 907 1954 2383 1751 236 -1400 -2653 -2138 -1057 934 1873 2249 1483 78 -1412 -2208 -2288 -824
4041 -824 568 1900 2291 1513 335 -1571 -2508 -1830 -796 621 1857 2205 1573 -38 -1603 -2196 -2122
4058 -2122 -665 774 1927 2505 1833 114 -1647 -2102 -1923 -780 983 1786 2419 1326 -513 -1682
4074 -1682 -2195 -1656 -504 906 2102 2333 1368 -366 -1533 -2204 -1751 -749 854 2216 2212 1180 -329
4091 -329 -1714 -2593 -1788 -301 1129 2051 2166 1322 -36 -2052 -2303 -1749 -402 1458 2075 2501 1520 -445
4109 -445 -1592 -2184 -1615 -368 936 1901 2254 1257 -409 -1645 -2475 -2038 -561 819 2022 2317 1069
4126 1069 -307 -1478 -2381 -1633 -447 1356 1873 2042 1170 -398 -1856 -2001 -1567 -202 1095 2018 1939
4143 1939 766 -444 -1798 -2195 -1751 -161 1277 2184 2018 1017 -864 -1445 -2346 -1706 -150 890 1719
4160 1719 2208 897 -665 -1443 -1910 -1670 -10 961 2323 2047 687 -863 -1762 -2038 -1652 -139 1529
4177 1529 2080 1743 1088 -508 -1695 -2161 -1511 -107 1411 1703 1947 874 -731 -1823 -2128 -1505 56
4194 56 1083 2119 1890 683 -903 -1854 -2066 -1567 6 981 2100 1593 579 -907 -1972 -2125 -1182
4211 -1182 143 1465 1729 1740 364 -994 -1681 -2109 -1049 154 1320 2175 1702 432 -865 -1830 -2232
4228 -2232 -1324 120 1380 2088 1865 291 -1024 -1899 -1634 -823 498 1658 2204 1617 512 -666 -2004
4245 -2004 -1975 -1108 228 1691 2122 1574 298 -909 -1994 -1855 -953 547 1488 2025 1478 461 -1074
4262 -1074 -1761 -1778 -965 451 1583 1986 1162 333 -968 -1982 -2069 -874 409 1872 1892 1273 251 -1126
4280 -1126 -2016 -1756 -506 749 1505 2041 1558 -4 -976 -1832 -1742 -866 476 1220 2117 1242 114 -1007
4298 -1007 -1950 -1901 -885 488 1417 1647 1162 184 -995 -1696 -1855 -773 391 1531 2054 1263 -13 -1117
4316 -1117 -1895 -1750 -537 784 1679 2127 1155 -241 -1136 -2092 -1283 -626 704 1751 1967 1289 17 -1446
4334 -1446 -1761 -1649 -530 586 1505 1736 1201 -50 -1180 -1896 -1633 -792 881 1544 1866 1320 -462 -1163
4352 -1163 -1802 -1607 -541 1272 1685 1756 961 -126 -1458 -1769 -1548 -251 687 1684 2095 967 -149 -1042
4370 -1042 -1804 -1290 -447 871 1678 1693 1096 -407 -1640 -1920 -1389 -188 866 1547 1447 1053 -145 -1353
4388 -1353 -1732 -1323 -398 834 1613 1906 955 -170 -1055 -1856 -1573 128 806 1799 1727 1009 -140 -1696
4406 -1696 -1728 -1470 65 665 1860 1638 580 -718 -1385 -1739 -1178 -263 1130 1595 1517 884 -323 -1285
4424 -1285 -1446 -1353 -157 813 1833 1335 760 -381 -1563 -1621 -1162 54 884 1781 1540 533 -574 -1403
4442 -1403 -1763 -1223 5 1156 1697 1331 682 -635 -1603 -1411 -993 26 1226 1576 1370 527 -632 -1786
4460 -1786 -1702 -1130 40 1067 1716 1746 660 -521 -1611 -1521 -1128 0 1272 1585 1366 508 -374 -1461
4478 -1461 -1800 -852 141 1096 1709 1285 281 -573 -1457 -1679 -787 353 1178 1626 1236 447 -760 -1552 -1639
4497 -1639 -996 136 1082 1503 1153 337 -758 -1462 -1749 -1034 383 1468 1781 1493 443 -711 -1538 -1496
4515 -1496 -958 -41 1066 1677 1225 138 -728 -1491 -1578 -944 508 1479 1443 1288 252 -905 -1323 -1332 -708
4534 -708 296 947 1580 1147 274 -859 -1567 -1380 -829 555 1101 1554 1127 171 -751 -1538 -1531 -830 470
4553 470 1319 1470 1193 216 -1033 -1523 -1843 -408 265 999 1556 1242 300 -721 -1801 -1300 -963 690
4571 690 1174 1514 1299 45 -661 -1745 -1408 -817 618 948 1325 828 186 -964 -1648 -1275 -330 611 1384
4590 1384 1696 790 -187 -997 -1423 -1169 -571 526 1242 1308 1050 -168 -920 -1839 -1121 -395 636 1393 1400 900
4610 900 -100 -802 -1447 -1216 -448 347 1165 1358 789 -92 -951 -1667 -1357 -387 645 1097 1561 942 -336
4629 -336 -1111 -1572 -983 -559 367 1243 1346 1043 -20 -1149 -1547 -1087 -449 741 1444 1311 724 -188 -874
4648 -874 -1579 -1115 -472 868 1032 1538 617 -360 -1104 -1323 -1096 -619 619 1137 1181 745 -303 -1052 -1461
4667 -1461 -1185 -248 1002 1334 1203 694 -439 -1320 -1305 -1193 -463 633 1297 1368 668 -304 -1077 -1244 -951
4686 -951 -97 474 1530 1445 321 -391 -1415 -1392 -866 -43 793 1386 1301 861 -501 -1377 -1313 -1100 -336 803
4706 803 1117 1244 609 -272 -1396 -1599 -868 78 1019 1305 1130 265 -423 -1199 -1400 -746 111 750 1645 1143
4726 1143 719 -664 -1474 -1593 -681 48 831 1256 1088 560 -648 -1325 -1324 -756 462 803 1245 1015 383
4745 383 -565 -1190 -1384 -566 178 917 1538 1219 235 -652 -1100 -1303 -854 205 716 1299 957 529 -424 -1214
4765 -1214 -1281 -738 -51 978 1643 1059 388 -638 -1101 -1249 -749 713 564 1330 1070 140 -596 -1420 -1130
4784 -1130 -727 255 727 1363 1116 154 -685 -1212 -1179 -380 -98 961 1417 868 -104 -966 -1053 -933 -541 315
4804 315 1070 1093 1059 89 -886 -1476 -1285 -582 332 969 1444 918 97 -868 -1196 -1117 -459 244 1252 1569 866
4825 866 -141 -866 -1383 -1037 -476 349 989 1179 819 -8 -721 -1232 -1146 -244 397 806 1140 825 17 -803
4845 -803 -1133 -979 -383 542 1163 1268 854 -106 -774 -1144 -1215 -421 437 1028 1227 704 -16 -757 -1295 -1291 -222
4866 -222 444 804 1048 670 -47 -703 -1413 -1064 -184 445 1415 1349 773 82 -936 -1433 -1180 -142 390 1022
4886 1022 1257 478 -93 -986 -1277 -1117 -356 315 1321 1121 597 -299 -870 -1360 -748 -282 487 966 964 474
4906 474 -155 -849 -1099 -808 -381 662 1289 1204 741 -263 -1057 -1440 -1047 -224 690 927 1154 625 24 -869
4926 -869 -1044 -1057 -111 621 1005 1234 595 -457 -1047 -1397 -597 47 347 1009 1272 420 -358 -791 -1270 -985
4946 -985 78 589 977 1044 636 -143 -674 -1133 -835 -98 887 1020 907 702 -121 -1152 -1115 -1023 -126 830
4966 830 1157 883 486 -335 -1263 -1227 -901 -103 864 994 967 228 -361 -927 -1215 -907 26 678 1166 794 323
4987 323 -354 -1084 -1222 -670 -113 624 1301 852 301 -609 -1130 -1056 -597 158 510 1089 1000 576 -339 -930 -1056
5008 -1056 -624 365 954 1178 800 197 -734 -1000 -1258 -582 326 720 1033 821 107 -466 -1030 -1275 -463 116
5028 116 967 1234 845 -4 -621 -959 -1089 -610 -110 956 954 1055 248 -567 -870 -1133 -463 95 787 1001
5048 1001 868 247 -418 -1395 -984 -568 -78 681 1265 759 245 -227 -1049 -1002 -615 80 856 1050 903 -114
5068 -114 -303 -851 -1147 -569 225 1121 884 847 171 -552 -975 -992 -353 310 1059 899 320 117 -429 -1205 -1008
5089 -1008 -295 347 1047 765 589 -42 -382 -1123 -675 -454 573 832 962 547 154 -857 -791 -1185 -431
5108 -431 340 881 1197 607 -47 -593 -1099 -1109 -501 146 826 720 436 -124 -557 -947 -1222 -463 250 961
5128 961 1024 451 -1 -704 -1416 -750 -44 596 789 933 584 -297 -525 -944 -925 -403 489 1252 1083 356 -27
5149 -27 -675 -1019 -1152 -336 453 1171 996 600 -311 -711 -1074 -692 -289 581 872 987 843 5 -733 -1204
5169 -1204 -665 -355 558 777 900 657 -246 -790 -1063 -840 -148 551 931 775 439 -58 -705 -897 -750 -313
5189 -313 633 1204 1031 246 -74 -462 -1031 -563 -164 383 1063 1016 510 -316 -864 -755 -884 59 506 893
5209 893 761 243 -309 -633 -1234 -890 67 548 824 595 393 -8 -752 -1139 -723 211 375 759 664 313
5229 313 -314 -857 -909 -486 -37 807 792 634 290 -308 -601 -745 -632 -79 738 921 476 518 -199 -586 -819
5250 -819 -545 17 581 1172 786 626 -270 -648 -880 -583 61 827 873 848 602 -335 -546 -1162 -549 64 458
5271 458 825 590 208 -318 -1229 -986 -415 20 359 902 599 512 -290 -1119 -1031 -558 -83 573 1064 848 321
5292 321 -402 -755 -836 -395 -116 1133 779 802 86 -535 -885 -966 -251 -41 583 935 635 158 -354 -832 -714
5313 -714 -378 181 873 579 366 301 -624 -849 -937 -278 -26 804 813 676 81 -329 -629 -906 -139 54 603
5334 603 773 350 114 -523 -818 -743 -385 268 511 753 255 40 -277 -618 -754 -253 451 716 864 760
5354 760 -94 -701 -979 -929 -287 75 724 773 486 92 -656 -964 -701 -100 -110 457 923 816 163 -583 -772
5375 -772 -792 -612 274 406 727 590 -17 -776 -889 -729 -278 329 817 603 431 10 -695 -743 -554 -339 407
5396 407 786 604 163 -33 -464 -874 -669 -122 430 734 783 222 -201 -578 -756 -811 -255 139 704 618 456
5417 456 -91 -405 -723 -552 -41 397 600 719 211 -52 -636 -855 -547 -246 287 871 954 252 -61 -776
5437 -776 -510 -479 122 491 945 762 487 -192 -685 -1072 -541 -81 225 837 649 216 -346 -648 -652 -358 -34
5458 -34 728 783 769 306 -420 -587 -538 -420 -96 280 652 616 396 37 -674 -828 -114 -56 603 660 563 190 -433
5481 -433 -795 -921 -310 104 708 929 664 185 -258 -621 -770 -581 106 565 440 419 22 -176 -501 -714
5501 -714 -380 -45 702 543 486 44 -57 -878 -613 -560 38 459 571 642 262 -430 -796 -1050 -371 -10 547
5522 547 867 714 485 -256 -652 -1092 -300 64 627 436 774 193 -139 -591 -432 -395 -98 606 668 548 220
5543 220 -539 -789 -606 -453 475 583 693 696 306 -506 -335 -662 -352 40 475 703 466 -8 -288 -651 -1016
5564 -1016 -265 156 446 897 500 -92 -304 -501 -654 -179 -166 405 524 425 213 -211 -613 -649 -328 267 340
5585 340 722 600 15 -613 -883 -687 -192 122 427 539 415 -36 -344 -699 -517 -101 103 438 572 488
5605 488 59 -530 -509 -577 -148 434 481 743 506 154 -637 -859 -525 -191 189 770 770 154 -167 -795 -879 -633
5627 -633 -144 70 635 755 522 138 -627 -675 -341 -66 196 568 480 484 182 -570 -599 -424 235 448 737 791
5649 791 111 -12 -370 -652 -673 141 493 413 557 452 -224 -658 -735 -476 -183 362 453 394 -6 -12 -412 -400 -481
5672 -481 -476 568 647 380 443 -157 -585 -588 -307 69 250 724 777 438 119 -607 -678 -420 -177 402 658 535
5694 535 78 -195 -599 -511 -175 -78 307 428 499 63 -167 -596 -798 -509 -22 224 814 331 375 -290 -668
5715 -668 -771 -537 256 517 703 424 339 -332 -381 -654 -416 75 379 377 664 350 -99 -603 -813 -410 -4
5736 -4 280 695 691 143 -162 -595 -619 -199 152 472 747 422 37 -109 -438 -665 -513 126 432 638 407 -123
5758 -123 -297 -354 -557 -138 76 223 471 358 280 -215 -347 -550 -349 84 517 932 251 181 -81 -207 -450
5779 -450 -198 -17 556 478 520 284 -93 -763 -568 -277 -84 463 459 526 101 -299 -606 -765 -177 -30 432 812
5801 812 568 -46 -507 -429 -556 -265 184 688 480 687 -33 -156 -369 -442 -267 156 498 757 605 95 -266
5822 -266 -839 -604 -294 330 335 422 476 215 -304 -660 -226 -333 239 595 464 273 49 -296 -449 -825 -285
5843 -285 0 308 586 239 -184 -606 -491 -341 -216 299 360 725 445 216 -447 -718 -517 -99 240 322 636
5864 636 -55 -196 -229 -711 -670 -264 3 357 666 177 -60 -349 -466 -277 -71 350 496 199 403 -203 -239
5885 -239 -318 -258 -134 316 465 589 238 -52 -317 -680 -353 -260 532 330 484 67 -142 -264 -484 -193 -82
5906 -82 520 683 386 233 -80 -427 -430 -386 -131 300 387 240 252 114 -319 -726 -377 -92 281 388 653 221
5928 221 -151 -473 -821 -633 215 189 379 486 297 -175 -395 -549 -447 108 284 190 343 102 116 -292 -535
5949 -535 -284 21 732 334 483 155 -35 -350 -465 -383 5 368 562 529 -19 -62 -302 -404 -247 126 469
5970 469 578 275 251 7 -406 -705 -502 -83 316 392 470 227 -74 -697 -767 -266 -60 491 87 251 659
5991 659 -375 -524 -484 -515 48 293 686 317 133 -36 -468 -213 -418 114 142 377 350 26 -138 -452 -369
6012 -369 -127 -150 443 554 442 95 -147 -735 -314 -79 151 458 779 493 -99 -358 -509 -559 -105 279 390
6033 390 633 521 172 -278 -720 -144 -448 -79 419 280 436 21 -364 -340 -171 -369 88 425 304 255 -85
6054 -85 -519 -611 -754 -455 198 420 902 223 -197 -482 -725 -513 -299 237 552 284 227 125 -415 -279 -83
6075 -83 -175 265 294 711 458 -136 -122 -532 -411 -289 -66 354 667 66 -35 -571 -480 -470 -429 101 286 318 262
6098 262 22 -344 -578 -399 -151 101 683 409 252 99 -228 -314 -328 -98 -64 182 465 327 391 -22 -475
6119 -475 -397 -243 231 324 494 180 26 -97 -471 -404 -15 250 303 483 451 -145 -438 -715 -203 -297 248 311
6141 311 481 32 -429 -418 -337 -143 -161 504 356 240 95 -194 -329 -617 -361 -130 217 522 423 359 -104 -50
6163 -50 -231 -523 -244 221 372 507 188 50 -535 -457 -234 174 65 399 261 157 -48 -481 -505 -248 -306
6184 -306 182 507 412 -7 -368 -96 -610 -501 -92 308 322 414 133 -319 -164 -381 -155 -190 222 483 188
6205 188 389 -372 -174 -328 -139 -211 307 267 812 218 -245 -205 -257 -259 -12 201 409 400 76 -27 -264 -260 -459
6228 -459 -50 78 398 99 3 -141 -550 -345 -253 146 180 513 434 173 -227 -429 -418 -304 -273 313 309 397 67
6251 67 -252 -238 -427 -119 -14 613 465 505 274 -127 -466 -245 -244 -10 379 611 461 167 -177 -326 -630 -420
6273 -420 55 343 550 348 -21 -50 -272 -468 -281 -118 137 542 457 104 -450 -59 -407 -243 -23 284 462
6294 462 263 170 -316 -355 -598 -317 243 199 386 460 249 -146 -295 -389 -59 55 -239 388 -79 43 -194 -481
6316 -481 -557 50 308 473 427 333 74 -237 -100 -439 87 -103 392 197 79 60 -269 -331 -458 -101 293 237
6338 237 497 232 12 -333 -290 -227 236 69 429 421 328 -41 -217 -374 -444 -39 329 486 303 149 85 -229
6360 -229 -436 -148 -47 166 89 411 293 73 -45 -291 -652 -354 -93 491 265 449 -255 -376 -546 -273
6380 -273 90 230 562 327 438 -11 -336 -328 -416 182 213 304 273 330 93 -199 -667 -417 -17 386 427 299 110
6403 110 182 -217 -222 -426 -32 217 172 206 440 -12 -114 -402 -615 -11 293 207 403 -196 -276 -462 -167 -240 -16
6426 -16 209 418 507 267 -190 -156 -484 -422 -102 41 315 234 267 -128 -91 -568 -69 -138 351 409 375 2 159
6449 159 -163 -106 -94 38 73 418 349 269 -212 -50 -717 175 320 -41 282 271 -147 -42 -325 -531 -273 175
6471 175 30 524 133 -104 -227 -329 -460 -472 10 -188 243 228 187 -157 -12 -207 -142 -1 123 156 118 203
6493 203 12 -491 -451 -65 -30 135 505 272 320 -187 -691 -350 -153 12 505 124 193 -6 -54 -306 -409 -19
6515 -19 125 102 119 279 -94 -515 -300 -247 -262 -181 -54 579 317 56 -157 -445 -415 -164 424 422 231 162 4
6538 4 -204 -104 -278 -310 -41 502 573 234 118 122 -85 -268 -116 208 -11 434 229 266 -177 -367 -501 -457 -136
6561 -136 -132 506 534 59 -294 -251 -461 -87 258 503 262 215 -175 42 -263 -61 -125 -90 389 402 159 47 185
6584 185 32 63 -172 110 108 216 248 -76 -121 -620 -403 -23 119 314 482 386 -343 -406 -272 2 -116 446
6606 446 118 425 294 -17 -114 -182 -210 125 4 357 440 -15 203 -181 -140 -267 23 79 171 33 278 26
6628 26 -309 -623 -562 -73 37 265 396 494 -161 -108 -535 -359 -230 -38 181 166 -137 290 -549 -337 -342 42
6650 42 238 96 347 23 106 -88 -441 -252 36 224 348 546 -11 79 -284 -426 -387 107 -223 375 389 301
6672 301 -248 -223 -10 -130 44 316 403 305 149 -132 -267 -350 -601 -204 7 214 285 53 -5 -529 -261 -379
6694 -379 -101 -88 138 293 92 -9 -423 -317 -184 -48 81 256 366 101 -84 -31 -258 -299 -16 125 196
6715 196 550 -52 -155 -265 -63 -222 -96 81 29 86 47 253 -147 -240 -234 33 77 557 614 186 -415 -30 -226
6738 -226 -114 21 284 495 278 12 -304 -162 -143 -206 -82 301 378 418 28 -82 -167 -432 -132 -331 248 66
6760 66 149 -176 -84 -206 -313 -108 -95 118 505 538 292 -1 -262 -328 -494 16 479 409 554 -129 -107 -414 -161
6783 -161 -62 -33 301 280 589 -114 245 -371 -26 -167 -54 200 290 34 58 225 -159 -141 -536 196 -107 373
6805 373 430 -124 -244 -286 -248 -266 119 257 163 546 -63 91 -276 -275 205 2 243 217 571 38 91 -580 -119
6828 -119 -213 -53 333 303 114 60 59 -331 -339 -164 55 423 367 -234 153 -178 -537 -341 -92 208 214 320 77
6851 77 -176 -394 -251 -340 -125 105 311 710 202 118 -271 -207 -514 89 45 71 201 107 168 -31 -247 -293 -160
6874 -160 246 448 409 -44 -161 -125 -481 -221 -425 38 355 195 172 -35 32 -363 -367 47 309 461 230 335
6896 335 372 -17 -288 -135 95 389 363 430 -34 203 33 -157 -201 53 -87 430 160 40 12 -180 -363 -99
6918 -99 110 20 229 271 -47 -436 -264 -440 -385 99 -59 327 278 201 157 -294 -180 -110 -316 79 207 415 345
6941 345 73 -270 -277 -230 -131 158 515 326 -64 -251 -390 -332 27 -154 48 120 134 225 -392 -372 -150 -349 122
6964 122 352 232 252 63 36 -210 -157 104 19 118 144 368 89 -120 -78 -334 -444 -45 258 686 244 -14
6986 -14 -71 -263 -265 -138 -50 279 281 -116 16 137 -526 -318 -563 -144 0 180 241 -49 -204 -262 -335 -404 16 56
7010 56 394 374 -10 75 82 -189 -138 -289 187 303 360 202 361 -309 -292 -398 175 294 531 153 -86 -61 -320
7033 -320 -170 -452 -66 182 235 301 174 -178 -534 -530 -56 -223 195 337 304 29 64 -284 -277 -288 39 165 142
7056 142 108 335 -34 -288 -42 -381 -112 288 280 485 219 -172 -421 -225 -52 -51 258 339 239 302 -432 -428 -324
7079 -324 -135 -12 225 217 162 134 -330 -204 -175 -228 212 337 37 97 254 -23 -248 -227 -242 -88 228 365 140
7102 140 117 13 -167 -190 -228 59 247 585 -116 46 -138 -491 -283 -314 -66 94 403 60 82 -94 -240 -429
7124 -429 -141 -85 99 303 129 14 23 2 -191 -144 162 116 331 551 174 380 -381 -377 104 64 159 126 121 167 45
7149 45 -422 -431 -125 186 255 263 -67 135 -107 -246 -108 -277 211 184 214 249 35 -119 61 -221 -202 -20 214
7172 214 206 113 -15 174 -326 -450 -75 280 324 -46 94 -294 -43 -164 -402 54 -202 184 240 148 -65 -220
7194 -220 -113 -11 -312 390 146 577 299 -62 -397 -82 -66 -119 162 176 252 215 -43 -232 -432 -207 -281 157
7216 157 207 387 253 -129 -386 -250 -367 -70 -264 81 90 270 -201 -34 -612 -263 102 200 219 475 392 -109
7238 -109 -352 -244 -84 324 135 295 331 141 -563 -560 -135 -134 -40 -54 517 106 10 -235 -333 -253 -157 -83 249 276
7262 276 132 43 -9 -355 -557 -373 54 113 330 51 -43 -218 -481 -451 -108 -250 262 363 333 43 -2 -78 24
7285 24 -353 -280 234 373 133 145 -352 -147 -281 34 211 -127 31 60 197 -118 -283 -268 -271 -157 272 355 126
7308 126 344 2 -54 -325 -23 51 278 56 144 79 -175 50 -75 -541 -382 236 309 246 -30 -281 -254 -207 -32
7331 -32 150 343 249 233 26 -513 -23 -185 -50 45 80 325 142 147 -469 -460 -206 -381 165 304 146 349 118
7354 118 -108 -368 -108 -195 -52 19 427 337 32 -247 -365 -112 -20 343 88 124 366 138 -195 -252 -348 -71
7376 -71 84 280 352 123 -78 -204 -205 175 119 220 39 337 457 -57 -60 -160 -299 -79 -61 270 245 40 172
7399 172 -146 -182 -239 25 -217 152 347 264 -142 -28 -175 -393 161 -1 194 522 212 221 -198 -320 -334 -31
7421 -31 -200 -76 163 110 24 -24 49 -197 132 68 62 339 73 168 -313 -275 -336 201 130 125 221 120 -120 28 -366
7446 -366 -116 -118 -94 232 105 143 -269 -308 -364 -154 -286 401 219 213 201 -104 -113 -207 -129 -53 85 265 643 185 -120
7471 -120 -96 -228 -200 -58 122 132 424 -34 -312 40 -351 -115 211 385 181 101 162 83 -234 64 -104 -102 171
7494 171 237 333 -5 115 -398 -247 69 216 36 346 235 66 250 -4 -445 -359 -6 -29 365 423 -39 -18
7516 -18 -286 -60 -180 -51 518 221 203 329 -216 -293 -231 -130 -322 265 284 206 121 202 -330 -240 -222 74 173 190
7540 190 306 308 -77 16 -215 -391 208 -34 59 258 146 236 -205 -146 -322 -142 388 404 161 286 -195 -137 -182
7563 -182 -315 -89 -38 238 315 -95 -311 -324 -559 -140 80 270 4 327 40 254 -267 -290 -119 136 317
7584 317 111 302 46 -122 -325 -348 -86 -53 513 340 227 -115 -117 -244 -190 -29 31 191 175 268 219 -184 -300
7607 -300 63 -155 68 80 277 105 -100 -297 -33 -156 -55 -180 144 607 76 315 7 -479 -363 -239
7627 -239 66 319 398 177 -71 29 -290 -133 -208 332 386 286 252 335 -295 -170 -17 57 -83 76 144 247
7649 247 -13 -215 -573 -412 101 -184 95 192 81 258 -112 -66 -82 -87 258 335 148 270 -7 53 -256 -530
7671 -530 16 86 382 300 -56 12 168 -334 -265 -140 262 188 482 379 227 -133 -468 -300 -338 11 249 333
7693 333 290 -183 -102 31 -336 -227 -40 85 206 -116 -1 51 -67 -302 -144 256 261 -17 179 103 112 -212 -507
7716 -507 -194 145 50 340 26 199 -193 -30 -185 -118 274 65 290 11 -14 76 -257 -246 77 218 357 405
7738 405 76 -25 -45 -41 -576 81 164 -187 317 171 51 -66 -83 -162 -127 167 42 78 133 -250 -38 6 166
7761 166 39 225 520 95 111 -238 -210 29 -183 -109 -125 329 -12 189 232 165 -108 -371 -101 152 423 357
7783 357 -92 -41 -216 -509 -28 -8 258 269 522 -103 -98 -292 -252 -183 -72 83 167 271 165 -35 -363 -270 -61
7806 -61 -86 147 195 -66 107 232 -448 -46 -350 6 187 226 385 94 290 -30 -185 22 256 9 272
7827 272 -111 54 -145 11 -198 -279 80 43 -15 -67 275 -57 -473 -230 121 17 -8 250 204 113 160 22 -184
7850 -184 -77 49 49 352 95 -147 203 55 -56 -71 140 204 204 225 68 -127 -239 -148 -274 21 54 271 220
7873 220 177 14 -141 -366 -77 -368 -14 486 148 118 114 -228 -253 16 -101 278 226 -212 115 -91 -95 -166 36
7896 36 279 56 134 284 41 229 -241 -338 -40 69 61 194 164 -21 -108 -193 -362 -219 -5 156 -9 366 229
7919 229 20 -256 20 -136 -82 457 197 160 -98 -233 -297 -219 -74 -191 281 -25 -82 -80 165 -182 -186 -100 8
7942 8 247 355 443 146 -262 -177 -344 -295 200 262 160 198 -63 -276 -277 -292 94 -248 336 151 321 -60 -153 -51
7966 -51 -48 -234 218 166 214 278 -81 -170 -121 -237 -57 -125 127 285 127 -39 -80 -180 -509 -211 214 200 12 -7
7990 -7 40 -345 -429 -168 17 195 -177 55 341 -186 -96 -185 -107 -181 -44 342 88 61 125 -144 49 -357 172
8013 172 10 81 -34 56 135 -163 -318 -114 215 32 482 300 -25 264 -144 -188 -276 81 42 295 221 313 302
8036 302 -232 -300 -142 165 433 254 185 29 -67 -184 -242 -188 -28 339 5 211 93 203 -198 -124 -180 -306
8058 -306 -163 23 441 294 -34 -50 -99 -99 255 -73 89 192 163 192 -134 -233 140 84 -23 328 526 -105 -244
8081 -244 -13 -354 -106 -160 171 227 125 113 -83 -122 -322 31 88 107 203 18 -49 -13 -181 -37 -247 79 254
8104 254 280 155 -167 -33 -181 -239 25 -29 202 241 -49 -93 -47 -360 -79 -366 100 455 233 43 4 -91 5
8127 5 -166 -86 224 293 107 230 2 -81 -145 -192 23 -238 -44 -73 225 -2 -216 -147 -185 -418 77 217 272 209
8151 209 183 79 -255 -281 2 115 316 268 92 302 -36 -43 -71 -175 -28 2 62 -5 -33 -162 -259 -190 -326 60
8175 60 39 117 354 142 -5 -158 -249 -183 -140 72 193 86 -169 -171 -297 -210
8191b10
##END NTUPLES=NMR FID
##END=
