##TITLE=1H_LR-685-M
 CDcl3, 8 sc, 
 26.7.2019
##JCAMPDX= 6.0         $$ Bruker NMR JCAMP-DX V2.0
##DATA TYPE= NMR FID
##DATA CLASS= NTUPLES
##ORIGIN= UXNMR, Bruker Analytische Messtechnik GmbH
##OWNER= root
$$ XWIN-NMR		Version 3.5
$$ Fri Jul 26 15:20:58 2019 Russian Standard Time (UT+4h)  she@DPX200
##.OBSERVE FREQUENCY= 200.13155
##.OBSERVE NUCLEUS= ^1H
##.DELAY= (6, 6)
##.ACQUISITION MODE= SIMULTANEOUS
##.ACQUISITION SCHEME= undefined
##.AVERAGES= 8
##.DIGITISER RES= 18
##SPECTROMETER/DATA SYSTEM= spect
##.PULSE SEQUENCE= zg30
##.SOLVENT NAME= CDCl3
##.SHIFT REFERENCE= (INTERNAL, CDCl3, 0, 15.7039)
##AUDIT TRAIL= $$ (NUMBER, WHEN, WHO, WHERE, WHAT)
$$ ##TITLE= Audit trail, XWIN-NMR		Version 3.5
$$ ##JCAMPDX= 5.01
$$ ##ORIGIN= Bruker BioSpin GmbH
$$ ##OWNER= she
$$ F:/spectra/data/she/nmr/H-F/1/audita.txt
$$ ##AUDIT TRAIL=  $$ (NUMBER, WHEN, WHO, WHERE, WHAT)
(   1,<2019-07-26 15:20:01.71 +0400>,<she>,<DPX200>,
      <created by zg, POWCHK disabled, PULCHK disabled
       configuration hash MD5:
       00 E9 B6 7A A2 85 ED C7 34 08 36 98 17 FE 4E 26
       data hash MD5: 16K
       4A B1 19 96 6E E9 C9 E1 61 9F DC D8 CA 8A 50 C7>)
$$ ##END=
$$ 
$$ hash MD5
$$ F4 AE 4D 01 17 EF 68 A2 13 2E 35 ED 92 39 C8 E2
##$RELAX= 
##$RELAX= 
##$RELAX= 
##$RELAX= 
##$RELAX= 
##$RELAX= 
$$ Bruker specific parameters
$$ --------------------------
##$DU= <F:/spectra>
##$EXPNO= 1
##$NAME= <H-F>
##$PROCNO= 1
##$TYPE= <nmr>
##$USER= <she>
##$AMP= (0..31)
100 100 100 100 100 100 100 100 100 100 100 100 100 100 100 100 100 100 
100 100 100 100 100 100 100 100 100 100 100 100 100 100 
##$AQSEQ= 0
##$AQ_mod= 1
##$AUNM= <au_zg>
##$AUTOPOS= <>
##$BF1= 200.13
##$BF2= 200.13
##$BF3= 200.13
##$BF4= 200.13
##$BF5= 200.13
##$BF6= 200.13
##$BF7= 200.13
##$BF8= 200.13
##$BYTORDA= 1
##$CFDGTYP= 0
##$CFRGTYP= 5
##$CHEMSTR= <none>
##$CNST= (0..31)
1 1 145 1 1 1 1 1 1 1 1 1 1 1 1 1 1 1 1 1 1 1 1 1 1 1 1 1 1 1 1 1 
##$CPDPRG= <>
##$CPDPRG1= <>
##$CPDPRG2= <>
##$CPDPRG3= <>
##$CPDPRG4= <mlev>
##$CPDPRG5= <mlev>
##$CPDPRG6= <mlev>
##$CPDPRG7= <mlev>
##$CPDPRG8= <mlev>
##$CPDPRGB= <>
##$CPDPRGT= <>
##$D= (0..31)
0 1.2 0 0 0 0 0 0 0 0 0 0.03 0 0 0 0 0 0 0 0 0 0 0 0 0 0 0 0 0 0 0 0 
##$DATE= 1564140001
##$DBL= (0..7)
120 120 120 120 120 120 120 120 
##$DBP= (0..7)
150 150 150 150 150 150 150 150 
##$DBP07= 0
##$DBPNAM0= <>
##$DBPNAM1= <>
##$DBPNAM2= <>
##$DBPNAM3= <>
##$DBPNAM4= <>
##$DBPNAM5= <>
##$DBPNAM6= <>
##$DBPNAM7= <>
##$DBPOAL= (0..7)
0.5 0.5 0.5 0.5 0.5 0.5 0.5 0.5 
##$DBPOFFS= (0..7)
0 0 0 0 0 0 0 0 
##$DE= 6
##$DECBNUC= <off>
##$DECIM= 24
##$DECNUC= <off>
##$DECSTAT= 4
##$DIGMOD= 1
##$DIGTYP= 9
##$DL= (0..7)
0 120 120 120 120 120 120 120 
##$DP= (0..7)
150 150 150 150 150 150 150 150 
##$DP07= 0
##$DPNAME0= <>
##$DPNAME1= <>
##$DPNAME2= <>
##$DPNAME3= <>
##$DPNAME4= <>
##$DPNAME5= <>
##$DPNAME6= <>
##$DPNAME7= <>
##$DPOAL= (0..7)
0.5 0.5 0.5 0.5 0.5 0.5 0.5 0.5 
##$DPOFFS= (0..7)
0 0 0 0 0 0 0 0 
##$DQDMODE= 0
##$DR= 18
##$DS= 0
##$DSLIST= <SSSSSSSSSSSSSSS>
##$DSPFIRM= 0
$$ [...]
##$SUBNAM2= <"">
##$SUBNAM3= <"">
##$SUBNAM4= <"">
##$SUBNAM5= <"">
##$SUBNAM6= <"">
##$SUBNAM7= <"">
##$SUBNAM8= <"">
##$SUBNAM9= <"">
##$SW= 24.9336996594482
##$SWIBOX= (0..15)
0 0 2 0 0 0 0 0 0 0 0 0 0 0 0 0 
##$SW_h= 4990.01996007984
##$TD= 16384
##$TD0= 1
##$TE= 0
##$TE2= 300
##$TE3= 300
##$TEG= 300
##$TL= (0..7)
0 120 120 120 120 120 120 120 
##$TP= (0..7)
150 150 150 150 150 150 150 150 
##$TP07= 0
##$TPNAME0= <>
##$TPNAME1= <>
##$TPNAME2= <>
##$TPNAME3= <>
##$TPNAME4= <>
##$TPNAME5= <>
##$TPNAME6= <>
##$TPNAME7= <>
##$TPOAL= (0..7)
0.5 0.5 0.5 0.5 0.5 0.5 0.5 0.5 
##$TPOFFS= (0..7)
0 0 0 0 0 0 0 0 
##$TUNHIN= 0
##$TUNHOUT= 0
##$TUNXOUT= 0
##$USERA1= <user>
##$USERA2= <user>
##$USERA3= <user>
##$USERA4= <user>
##$USERA5= <user>
##$V9= 5
##$VALIST= <valist>
##$VCLIST= <CCCCCCCCCCCCCCC>
##$VD= 0
##$VDLIST= <DDDDDDDDDDDDDDD>
##$VPLIST= <PPPPPPPPPPPPPPP>
##$VTLIST= <TTTTTTTTTTTTTTT>
##$WBST= 1024
##$WBSW= 4
##$XGAIN= (0..3)
0 0 0 0 
##$XL= 0
##$YL= 0
##$YMAX_a= 31347
##$YMIN_a= -14184
##$ZGOPTNS= <>
##$ZL1= 120
##$ZL2= 120
##$ZL3= 120
##$ZL4= 120
##$ABSF1= 10
##$ABSF2= 0
##$ABSG= 5
##$ABSL= 3
##$ALPHA= 0
##$AQORDER= 0
##$ASSFAC= 0
##$ASSFACI= 0
##$ASSFACX= 0
##$ASSWID= 0
##$AUNMP= <proc_1d>
##$AZFE= 0.1
##$AZFW= 0.1
##$BCFW= 1
##$BC_mod= 2
##$BYTORDP= 1
##$COROFFS= 0
##$CY= 11.3945322036743
##$DATMOD= 1
##$DC= 2
##$DFILT= <>
##$DTYPP= 0
##$F1P= 20.1537800932815
##$F2P= 0.134698688090026
##$FCOR= 0.5
##$FTSIZE= 0
##$FT_mod= 4
##$GAMMA= 1
##$GB= 0.15
##$INTBC= 1
##$INTSCL= 1
##$ISEN= 128
##$LB= 0.24
##$LEV0= 0
##$LPBIN= 0
##$MAXI= 10000
##$MC2= 0
##$MEAN= 0
##$ME_mod= 0
##$MI= 1.114404
##$NCOEF= 0
##$NC_proc= 0
##$NLEV= 6
##$NOISF1= 3.799351
##$NOISF2= 2.8
##$NSP= 1
##$NTH_PI= 0
##$NZP= 0
##$OFFSET= 15.70392
##$PC= 1
##$PHC0= -9127.524
##$PHC1= 6.20097
##$PH_mod= 1
##$PKNL= yes
##$PPARMOD= 0
##$PSCAL= 0
##$PSIGN= 0
##$REVERSE= no
##$SF= 200.130013532006
##$SI= 16384
##$SIGF1= 3
##$SIGF2= 2
##$SINO= 400
##$SIOLD= 16384
##$SREGLST= <1H.CDCl3>
##$SSB= 0
##$STSI= 0
##$STSR= 0
##$SW_p= 3612.71676300578
##$SYMM= 0
##$S_DEV= 0
##$TDeff= 0
##$TDoff= 0
##$TI= <>
##$TILT= no
##$TM1= 0
##$TM2= 0
##$TOPLEV= 0
##$USERP1= <user>
##$USERP2= <user>
##$USERP3= <user>
##$USERP4= <user>
##$USERP5= <user>
##$WDW= 1
##$XDIM= 8192
##$YMAX_p= 0
##$YMIN_p= 0
$$ End of Bruker specific parameters
$$ ---------------------------------
##NTUPLES= NMR FID
##VAR_NAME=  TIME,          FID/REAL,        FID/IMAG
##SYMBOL=    X,             R,               I
##VAR_TYPE=  INDEPENDENT,   DEPENDENT,       DEPENDENT
##VAR_FORM=  AFFN,          ASDF,            ASDF
##VAR_DIM=   8192,          8192,            8192
##UNITS=     SECONDS,       ARBITRARY UNITS, ARBITRARY UNITS
##FACTOR=    0.0002004,     1,               1
##FIRST=     0,             0,               0
##LAST=      1.6414764,     0,               0
##MIN=       0,             -14184,          0
##MAX=       1.6414764,     31347,           0
$$ Real data points
##PAGE= N=1
##DATA TABLE= (X++(R..R)), XYDATA
0 0 0 0 0 0 0 0 0 0 0 0 0 0 0 0 0 0 0 0 8 -8 8 -8 8 -8 8 -14 16 -16 16 -22 24 -24 30 -32 37 -40 46 -49 55 -62 68
41 68 -75 83 -92 103 -112 127 -141 157 -177 199 -226 261 -305 362 -444 563 -761 1149 -2186 10884
61 10884 31347 10096 -8192 -4833 10509 9989 1410 2478 14503 17956 11228 7752 14565 17818
75 17818 9240 -2534 -3069 4914 9806 6533 3076 4386 6931 5011 1450 635 1236 -763 -2818 -1031
91 -1031 1409 -2257 -10046 -13169 -8811 -4107 -4458 -6689 -5523 -2426 -2055 -5259 -8961 -10949 -11650 -12072
107 -12072 -11768 -9313 -4701 -1024 -1379 -4348 -5388 -3516 -2535 -4001 -4596 -2159 681 718 -938 -1505 -508
124 -508 954 2660 4400 5548 6242 7184 7862 6804 4457 2387 1279 1479 3575 6823 8967 9002 8423
141 8423 8155 6670 3810 2159 2907 3595 2463 1814 3290 4196 2149 -762 -739 1337 1864 422 -415
158 -415 256 339 -1746 -4410 -5915 -6172 -6103 -5274 -3109 -783 -345 -2192 -3991 -4483 -4804 -6224 -7385 -6422
176 -6422 -4416 -3643 -3677 -2810 -1452 -1957 -3817 -4034 -2032 -394 -568 -925 -261 91 -1040 -2178 -1652 21
194 21 1453 2649 4086 5064 4557 3125 2032 1884 1758 1284 1306 2626 4502 5396 4992 4443 4213 3402 1971
213 1971 1507 2803 3980 3223 1527 1106 1781 1486 26 -522 791 2129 1840 768 473 369 -881
230 -881 -2956 -3974 -3282 -2269 -1966 -1825 -950 -20 -686 -2672 -4082 -3854 -3054 -3008 -3406 -2973 -2057 -1859 -2588
249 -2588 -3091 -2613 -1984 -1954 -1855 -985 17 38 -994 -1929 -1945 -1400 -1064 -822 183 1744 2671 2483 1806 1349
269 1349 917 355 234 1020 2089 2625 2650 2701 2958 2812 2169 1751 1911 2315 2606 2746 2870 2487 1458 467
289 467 373 1026 1425 1410 1453 1953 2009 1027 -382 -1035 -1167 -1443 -1877 -1385 -203 187 -670 -1633 -1611 -1391 -2185
310 -2185 -3311 -3164 -1933 -1198 -1784 -2533 -2451 -2178 -2616 -3216 -2657 -1275 -563 -1000 -1478 -1014 -607 -1436 -2519
329 -2519 -2290 -658 537 648 634 1305 1750 1062 140 197 909 1264 1203 1680 2687 3074 2314 1453 1429 1990
349 1990 2149 2047 2184 2626 2674 2172 1484 1231 1007 539 342 881 1818 1969 1212 388 17 -309 -1034 -1578
369 -1578 -1276 -616 -478 -754 -764 -652 -1165 -2211 -2757 -2237 -1523 -1507 -1871 -1609 -1147 -1373 -2257 -2658 -2088 -1412
389 -1412 -1351 -1292 -575 127 -201 -1187 -1480 -918 -477 -686 -548 558 1699 1606 732 341 670 747 366 432 1278
410 1278 2134 2077 1489 1353 1664 1497 719 379 1189 2137 2121 1358 959 1131 934 183 -276 169 885 888 533
431 533 583 809 273 -901 -1490 -1013 -312 -330 -638 -447 -13 -197 -935 -1444 -1388 -1288 -1381 -1201 -488 36 -410
452 -410 -1243 -1444 -1128 -977 -1112 -870 -231 121 -152 -340 -274 -340 -922 -1226 -608 322 693 463 441 592 531 -50
474 -50 -498 -222 352 613 560 749 1201 1102 342 -214 96 697 726 359 571 1233 1311 493 -219 -80 376 343
496 343 156 523 1283 1218 422 -197 -106 117 -145 -538 -187 676 961 347 -223 -174 -34 -395 -917 -696 10
517 10 214 -203 -434 -205 -260 -897 -1306 -934 -175 -38 -336 -436 -286 -470 -968 -1281 -1065 -658 -524 -382 16
538 16 327 12 -616 -893 -596 -293 -386 -348 128 639 517 99 58 274 180 -107 141 922 1346 927 369 498
560 498 862 666 153 215 969 1474 1229 834 919 1106 522 -213 -190 584 964 539 216 592 1010 464 -615
581 -615 -790 -192 152 -228 -535 -159 127 -408 -1244 -1219 -643 -493 -977 -1093 -510 23 -412 -1299 -1556 -1152 -888
602 -888 -1110 -1088 -475 51 -130 -651 -637 -303 -365 -825 -749 -54 541 441 100 213 505 383 48 187 733 1051
624 1051 962 935 1076 1045 610 294 497 986 1061 975 1063 1325 1292 765 315 262 393 221 139 509 903 692 -47
647 -47 -357 -64 34 -432 -851 -556 8 -97 -649 -920 -755 -876 -1332 -1422 -772 -201 -450 -1027 -1024 -560 -559 -1257 -1654
670 -1654 -1098 -345 -178 -411 -352 79 46 -480 -723 -186 381 296 -25 226 917 1030 401 -37 263 819 930
691 930 759 946 1301 1160 677 442 612 728 463 313 750 1240 1158 579 252 227 141 -133 -274 61 289
712 289 77 -174 -153 -57 -374 -900 -916 -451 -189 -346 -558 -501 -419 -689 -1018 -989 -686 -498 -525 -333 41 64 -419
735 -419 -822 -709 -297 -235 -410 -200 281 493 236 -57 51 225 36 -238 112 707 855 336 -49 161 499
756 499 272 -173 -13 549 874 523 155 253 363 -8 -439 -249 289 451 175 53 365 467 26 -501 -416
777 -416 9 181 23 14 253 264 -77 -310 -135 74 -22 -175 48 427 430 13 -367 -324 -96 -201 -243 0 304
800 304 268 -6 -110 -58 -225 -537 -664 -306 104 62 -184 -232 -127 -253 -522 -559 -265 -127 -233 -306 -59 167
822 167 -193 -716 -681 -162 200 -53 -208 148 526 293 -242 -298 135 278 -52 -29 557 987 651 63 133 560
844 560 635 191 28 477 962 751 250 186 484 421 -15 -55 431 780 457 -60 -4 311 98 -470 -639 -170
866 -170 159 -18 -306 -247 -73 -311 -745 -838 -529 -344 -550 -655 -397 -184 -381 -782 -875 -563 -351 -407 -422 -175
888 -175 -17 -184 -430 -341 -102 -166 -309 -96 462 574 277 89 280 435 235 22 265 683 717 506 509 767
910 767 757 355 65 377 844 819 379 249 579 720 255 -170 -17 345 262 -47 63 386 283 -294 -642
931 -642 -388 -66 -267 -621 -544 -155 -57 -423 -779 -683 -480 -569 -811 -581 -221 -240 -580 -773 -467 -232 -430 -668
953 -668 -428 8 125 -78 -198 33 64 -122 -153 103 372 421 270 367 623 567 280 122 343 574 554 459 537
976 537 677 573 303 224 418 451 238 144 419 607 342 -80 -129 94 88 -149 -259 -2 142 -101 -323 -296 -148
999 -148 -305 -660 -652 -237 -36 -299 -567 -435 -146 -257 -598 -660 -228 -44 -266 -397 -109 136 -136 -520 -373
1020 -373 139 302 -22 -195 181 492 259 -164 -146 227 346 106 117 427 591 281 -31 101 419 387 -27
1041 -27 -91 351 543 324 -36 -33 161 75 -121 -89 190 204 -43 -163 23 134 -94 -395 -330 -11 128 -33 -127
1064 -127 -26 7 -177 -282 -176 -14 -76 -211 -95 177 162 -136 -332 -100 97 40 -130 -28 223 173 -111 -159
1086 -159 54 158 -127 -347 -20 357 234 -182 -261 22 155 -150 -365 -135 203 92 -246 -189 114 134 -306
1107 -306 -466 -86 269 68 -274 -207 175 197 -170 -326 -74 237 181 -35 81 306 263 -67 -104 159 397 186
1129 186 -59 105 488 457 132 28 130 263 162 80 208 372 205 -23 41 177 107 -155 -254 -6 192 40
1151 40 -209 -197 -102 -161 -396 -342 -155 -147 -340 -431 -200 -32 -278 -644 -503 -165 -77 -311 -360 -162 -2 -161 -359
1174 -359 -196 97 31 -246 -129 270 418 95 -157 39 388 346 56 103 445 620 352 159 306 500 360
1195 360 55 205 581 607 227 2 240 458 239 -100 -99 218 213 -38 -160 23 58 -182 -446 -309 -13 -127
1217 -127 -427 -462 -183 -93 -352 -617 -484 -254 -311 -451 -361 -156 -168 -380 -437 -190 -94 -232 -346 -194 102 129 -53
1240 -53 -100 81 133 84 18 225 377 308 153 244 477 460 150 100 354 575 428 201 249 460 362 133 93 256
1264 256 321 60 -4 187 374 136 -247 -259 21 108 -148 -340 -214 -5 -112 -360 -390 -180 -192 -427 -510 -202
1286 -202 21 -217 -563 -397 -90 -83 -365 -432 -168 69 -35 -239 -111 72 44 -162 -126 147 315 130 -66 119
1308 119 395 361 68 -44 210 371 219 169 294 394 186 50 127 318 266 25 22 254 305 69 -96 -21 69
1331 69 -10 -151 -74 71 17 -197 -241 -52 58 -214 -472 -276 44 50 -243 -312 -63 49 -186 -375 -98 122 -23
1354 -23 -286 -135 234 248 -137 -296 -11 270 144 -80 -35 232 270 37 -167 67 249 72 -120 -2 314
1375 314 276 -90 -215 35 248 45 -248 -135 94 124 -71 -166 -70 -16 -160 -279 -113 75 6 -185 -177 0 93
1398 93 -112 -237 -114 78 118 -8 16 155 123 -83 -92 140 238 91 -14 174 370 253 -36 -39 158 204 85
1421 85 84 177 254 105 -52 25 185 74 -169 -210 24 226 -14 -250 -222 -26 -95 -338 -366 -106 -51 -253 -360 -153
1445 -153 -31 -220 -510 -416 -76 50 -176 -307 -127 58 -3 -222 -179 65 105 -20 -30 232 377 155 -105 31
1467 31 362 363 133 73 333 492 331 123 215 293 223 69 138 375 379 173 1 96 226 84 -144 -131 46 153
1491 153 -38 -177 -110 -86 -208 -369 -256 -88 -167 -345 -348 -130 -132 -358 -434 -352 -196 -238 -300 -210 -90 -124 -255 -257 -89
1516 -89 9 -122 -192 -26 254 249 5 -73 146 287 103 23 179 422 362 140 209 381 331 65 16 270 541 357
1540 357 85 58 272 294 64 -82 26 212 105 -67 -8 155 70 -252 -352 -106 38 -151 -349 -259 -41 -60
1562 -60 -312 -404 -260 -194 -298 -319 -159 -15 -120 -322 -259 -107 -53 -193 -253 -97 103 100 -21 -30 48 70 -55 7 202
1587 202 271 90 35 199 323 179 -34 14 222 256 153 130 212 253 98 -30 30 158 103 -83 -52 185 261 31
1611 31 -233 -162 29 -28 -170 -173 72 118 -128 -254 -120 10 -163 -360 -191 108 132 -61 -246 -93 53 -43 -230
1634 -230 -178 47 123 -6 -61 84 165 -25 -192 -17 199 190 -31 -2 148 254 43 -104 -59 131 83 -17 57
1657 57 221 142 -57 -156 -10 101 -4 -159 -62 102 116 -56 -161 -128 -67 -131 -182 -45 87 11 -174 -132 77 79
1681 79 -171 -248 -44 197 88 -9 33 135 107 -79 -72 136 189 38 -29 153 338 225 -35 -78 115 211 113 -23
1705 -23 112 257 102 -87 -70 96 99 -99 -180 46 243 41 -250 -224 -49 -13 -225 -285 -125 21 -84 -243 -180
1728 -180 -34 -115 -324 -305 -71 45 -114 -198 -106 28 16 -178 -198 -9 134 60 24 127 211 110 -66 59 231
1751 231 233 123 92 280 357 243 103 108 224 228 138 144 288 277 90 -13 90 189 37 -121 -50 111 132 -35 -151
1776 -151 -91 -70 -187 -298 -181 -28 -140 -286 -276 -92 -54 -346 -449 -288 -40 -33 -216 -216 -45 -13 -167 -233 -83
1799 -83 72 -17 -162 0 267 214 -16 -112 100 295 166 50 147 314 329 140 99 264 281 119 45 184 369
1822 369 257 56 -3 156 184 31 -77 10 141 81 -43 -44 9 -23 -236 -289 -75 -20 -113 -263 -205 -50 -109 -274
1846 -274 -300 -144 -112 -189 -195 -104 7 -120 -259 -170 -7 42 -140 -146 44 207 75 -53 -19 97 130 8 58 226
1870 226 262 128 17 146 286 181 -44 5 268 288 142 29 83 198 107 -61 -13 142 113 -57 -121 35 146
1893 146 -80 -260 -181 5 34 -165 -192 -67 21 -115 -223 -166 -26 -91 -226 -177 20 63 -94 -228 -116 27 17
1916 17 -107 -42 68 145 62 -23 102 114 30 -34 66 257 193 45 30 165 204 75 -9 12 131 133 74 34 134 98
1942 98 -106 -119 38 105 -8 -168 -92 77 25 -152 -195 -102 -26 -108 -192 -69 42 -40 -210 -192 -1 16 -169 -213 -26
1967 -26 132 52 -96 -66 51 88 -12 -52 140 252 95 -28 55 228 184 -7 -25 157 269 144 17 43 181
1990 181 156 -3 -50 92 122 14 -62 45 152 8 -165 -210 -17 25 -102 -182 -85 -24 -96 -197 -176 -96 -135 -205 -157
2015 -157 -12 37 -118 -245 -148 -8 -25 -128 -137 13 81 22 -63 57 130 40 -59 71 209 231 68 52 206 240 141
2040 141 44 49 223 247 117 114 209 192 25 -55 78 161 102 -70 -57 113 112 -63 -211 -108 7 -106 -200 -138 -56 -60
2066 -60 -219 -280 -104 -56 -208 -294 -192 4 13 -171 -221 -82 -26 -86 -143 -43 89 27 -23 -31 89 136 -24 -68 69
2091 69 235 205 96 84 214 202 86 71 151 193 127 90 170 234 166 -16 -10 87 149 53 -24 -20 60 39 -110 -143 -41 -87
2119 -87 -199 -211 -47 30 -127 -248 -178 -32 -106 -253 -201 -79 -16 -77 -120 -74 -37 -96 -155 -83 66 93 -50 -97 60
2144 60 187 96 -48 -23 153 217 104 82 171 235 98 2 88 201 176 34 15 166 197 73 -42 -32 99 51 -39
2169 -39 -51 17 62 -20 -106 -54 17 -116 -222 -157 9 37 -125 -203 -123 -43 -106 -187 -111 -14 -85 -139 -86 53 4 -108 -118
2196 -118 -18 86 67 -24 -10 89 127 25 -18 56 116 54 8 137 258 138 13 -35 91 171 30 -35 34 157 133
2221 133 1 -39 67 32 -51 -104 28 116 17 -143 -136 1 10 -86 -221 -104 24 -31 -135 -101 -35 -45 -158 -147 -29
2246 -29 25 -63 -124 -29 123 69 -64 -68 22 91 32 13 90 156 140 4 32 139 133 22 -4 157 222 124 2 -23 110
2273 110 104 -2 -35 67 86 2 -55 46 63 -68 -139 -97 -4 22 -83 -154 -78 11 -80 -155 -153 -71 -80 -121 -120 -6 20 -80
2301 -80 -184 -88 41 24 -65 -123 64 103 19 -57 35 70 45 -6 90 210 189 24 -38 100 207 146 -19 32 192 186
2327 186 89 58 87 98 36 -43 4 125 102 -79 -69 56 62 -99 -180 -106 -16 -17 -113 -127 -21 -61 -131 -175 -101 -40 -115 -195
2355 -195 -117 -8 -7 -114 -166 -58 26 -10 -66 2 81 77 -31 20 109 115 -6 -44 91 223 121 46 71 166 190 77 48
2382 48 107 177 107 12 95 132 69 -60 -33 88 131 -12 -90 -21 73 -30 -131 -152 -64 -44 -114 -167 -37 10 -87 -249 -175
2409 -175 -30 -56 -153 -188 -78 45 -9 -138 -128 -11 24 -97 -34 73 103 26 -56 41 156 111 23 -9 137 203 96
2434 96 54 94 154 91 40 77 134 133 11 6 99 169 26 -80 -41 90 63 -50 -94 18 19 -87 -119 -53 -28 -110 -194 -128
2462 -128 15 -6 -136 -206 -87 -29 -64 -164 -116 -24 -1 -83 -44 22 57 -61 -104 3 129 91 -16 -17 110 129 56 14
2488 14 56 134 107 47 96 187 164 64 -27 100 154 59 -61 12 119 78 -16 -62 -14 40 -45 -74 -20 34 -15 -150 -126 -8
2516 -8 -30 -122 -203 -75 -20 -31 -118 -137 -21 -24 -125 -120 -18 50 -32 -108 -23 93 45 -51 -30 58 147 54 2 56 138 110 25
2545 25 50 128 123 55 40 126 156 76 -38 4 99 120 34 12 23 78 18 -61 -13 45 -32 -125 -109 26 38 -77 -173 -75 -13
2574 -13 -37 -128 -138 -28 -60 -113 -144 -88 5 -75 -145 -62 35 36 -93 -115 16 105 30 -34 4 137 133 14 48 110 145 75 -8
2603 -8 102 179 101 2 40 140 156 80 -8 48 99 34 -20 42 73 33 -28 -78 18 23 -93 -99 -88 10 -33 -82 -150 -67 -72 -120 -137
2634 -137 -60 -31 -108 -132 -87 -7 9 -112 -136 -20 37 10 -36 -32 73 60 8 23 98 107 13 33 107 206 115 19 38 164 161
2663 161 95 30 84 146 110 -19 23 105 68 -43 -16 28 89 -14 -109 -65 -11 -21 -137 -123 -84 -50 -101 -127 -101 -18 -80 -141
2691 -141 -157 -23 3 -129 -139 -72 -26 -35 -112 -71 16 23 -4 -32 64 86 5 -3 84 141 101 37 43 138 160 75 15 89 133 115 44
2722 44 77 132 89 11 -25 66 103 10 -73 -26 50 38 -38 -117 -30 7 -77 -120 -75 -49 -89 -144 -97 -48 -27 -133 -206 -102 3
2751 3 -35 -109 -113 -21 2 -69 -82 20 50 -19 -50 13 152 89 1 4 112 144 99 2 56 115 155 58 59 107 106 42 26 92 171
2782 171 92 8 -8 84 31 -26 -56 -9 35 -45 -37 -40 12 -34 -128 -98 -38 -26 -111 -189 -85 -18 -57 -148 -141 -49 -32 -74 -106 -40 7
2813 7 -54 -80 1 57 23 -43 -39 94 117 96 4 35 126 119 61 61 103 143 67 42 84 168 87 -9 27 153 136 11 -56 27 78
2844 78 9 -60 -32 43 0 -94 -96 -15 5 -109 -154 -96 -6 -10 -99 -164 -67 -3 -90 -102 -100 -34 -53 -110 -52 48 36 -53 -107 -13 68
2875 68 17 -29 26 109 128 38 23 121 104 58 8 70 142 88 24 44 122 117 39 -10 34 129 70 -21 1 77 22 -79 -51 1
2905 1 9 -66 -106 -52 38 -22 -132 -111 -38 -27 -64 -130 -66 -4 -51 -112 -106 1 5 -86 -101 2 83 21 -44 -21 76 72 6 0 58 100
2937 100 72 38 69 127 91 0 31 132 158 82 8 52 112 104 11 9 72 64 10 -41 49 36 -9 -69 -37 6 -19 -73 -104 -38 7
2968 7 -59 -99 -104 -52 -55 -127 -87 -7 -22 -98 -123 -37 9 -7 -81 -36 31 47 7 -35 59 59 17 -14 35 122 107 26 38 121 140 59
3000 59 17 48 129 93 -1 36 91 98 22 -41 38 73 22 -77 -58 67 41 -32 -135 -30 58 -47 -113 -73 -21 -83 -86 -104 -21
3029 -21 -23 -106 -101 -70 22 -18 -77 -78 3 42 -30 -54 -9 68 5 -28 44 72 35 -6 -18 96 169 63 7 34 104 106 28 24 79 97
3061 97 43 24 72 98 39 -45 -12 45 52 -48 -49 -14 34 17 -91 -50 -11 -24 -108 -103 -44 -6 -108 -125 -67 14 -46 -126 -101 -23
3091 -23 12 -34 -64 -12 31 -1 -19 -16 38 64 -5 -13 67 102 67 -28 30 89 102 19 12 79 85 36 19 59 103 56 -25 -14 64 58 -17
3124 -17 -26 -5 49 25 -60 -50 10 -25 -84 -97 -12 2 -76 -143 -56 11 -21 -92 -111 -40 -17 -49 -64 -43 9 -13 -39 -39 48 26 -56
3155 -56 -16 79 87 40 2 21 52 96 45 47 56 105 44 48 70 94 70 -24 -21 102 105 37 -33 -11 68 31 -32 -25 -14 14 -70 -59 -12
3188 -12 -34 -43 -112 -77 -17 -6 -109 -114 -23 -11 -70 -92 -70 -11 -24 -46 -16 19 20 -66 -99 -6 33 52 -24 13 39 91 51 -21 93
3219 93 58 23 29 77 92 95 11 -6 82 112 35 5 59 73 43 -1 -22 16 36 -35 -40 -5 3 -67 -79 -36 28 -13 -84 -105 -34 0
3251 0 -58 -91 -81 -6 -52 -88 -67 -24 -30 -54 -73 2 27 18 -76 -18 51 80 2 -10 24 79 71 17 49 92 81 30 17 79 132 76
3283 76 -9 20 112 56 -14 7 44 39 5 -8 36 38 -13 -69 -51 20 30 -79 -80 -29 3 -46 -119 -97 -39 -39 -90 -89 -53 -10 -50 -96
3315 -96 -69 15 -1 -83 -58 2 30 7 -35 16 41 48 -11 6 66 101 3 -12 81 117 42 -7 10 111 107 42 37 46 61 23 8 53
3347 53 30 25 -20 -1 49 45 -35 -78 -35 5 -32 -88 -74 -12 -21 -68 -63 -68 -24 -88 -93 -49 8 -36 -90 -89 -19 9 -14 -31 -14 29 40 -12
3381 -12 19 41 49 -8 9 41 99 58 6 41 124 119 38 52 57 71 16 2 11 63 53 -12 -14 54 79 -40 -94 -40 30 18 -76 -65
3413 -65 -47 11 -93 -82 -42 -21 -53 -84 -62 -31 -38 -115 -112 -25 4 -24 -83 -62 14 -21 -42 -42 44 38 16 -24 35 64 34 0 13 94
3445 94 124 67 15 47 83 58 49 39 106 74 24 3 76 91 7 -30 9 68 41 -86 -74 20 7 -34 -74 -13 -28 -60 -106 -85
3475 -85 -48 -75 -97 -97 -68 10 -47 -96 -66 -15 -20 -73 -50 -18 21 -23 -70 48 49 37 -49 -1 61 100 36 -13 67 101 82 32 58
3506 58 133 77 52 53 73 101 30 16 31 81 62 -14 2 33 34 8 -51 -46 9 -41 -104 -70 -21 -24 -86 -126 -58 15 -53 -86 -94 -74 -11
3539 -11 -60 -72 -24 -32 -73 -40 -26 36 17 -69 -29 44 43 7 -11 21 105 68 12 45 86 93 42 18 68 105 25 18 52 111 100 17
3571 17 -1 37 61 41 -1 5 33 17 -36 -20 12 1 -55 -81 -19 14 -44 -85 -83 -29 -4 -75 -86 -38 -25 -59 -75 -30 25 -12 -84
3602 -84 -52 19 33 -2 -36 -17 34 53 4 32 69 44 3 36 122 89 56 19 36 96 93 45 10 59 68 64 34 61 32 5 -6 -31
3634 -31 44 13 4 -50 -16 8 -32 -88 -70 -22 -24 -69 -92 -85 -23 -24 -80 -32 -22 -40 -94 -49 17 2 -36 -65 -13 31 10 4 11 25 66
3667 66 29 15 77 64 48 1 38 67 61 22 -12 30 95 51 7 30 59 51 -9 -11 38 36 0 -49 -22 44 7 -46 -91 -24 30 -64
3699 -64 -65 -34 -33 -42 -87 -46 -15 -31 -81 -112 -1 -3 -21 -71 -57 22 18 -10 -2 29 51 12 3 29 85 57 -9 15 84 80 33 -4 66 90
3733 90 80 9 2 33 54 5 23 17 61 1 -24 8 21 20 -29 -37 -4 3 -14 -39 -48 -38 -28 -62 -68 -27 -41 -63 -64 -41 -37 -10 -98 -66 -11
3768 -11 6 -47 -58 8 34 -42 -30 -21 20 36 -20 4 80 66 29 -3 26 56 46 49 27 64 48 23 9 48 88 2 -24 37 80
3799 80 60 -17 -29 9 22 -14 -31 -45 -8 -37 -38 -46 -18 -28 -75 -82 -26 39 -60 -69 -77 -25 -36 -71 -39 -3 -3 -37 -29 -16 6 -25 -6 -26
3833 -26 29 61 -2 -14 26 75 64 23 32 39 66 31 22 60 91 45 0 24 75 79 2 -5 6 68 5 -4 -44 56 21 -47 -34 5 33
3866 33 -57 -77 -43 -1 -31 -73 -56 -31 -13 -50 -59 -30 -8 1 -67 -46 -14 -11 -51 -45 4 24 2 -18 -7 68 44 -18 19 30 46 14
3898 14 -10 42 48 64 9 30 57 44 -1 24 38 27 14 -11 -20 47 15 12 -14 22 -9 -14 -42 -29 11 -24 -11 -34 -20 10 -25 -60
3930 -60 -20 -37 -39 -38 -24 -22 -13 -22 -67 -6 24 14 -25 -15 25 35 -2 -17 32 50 10 19 27 65 30 5 19 69 48 19 -11 26 78 23
3964 23 -27 5 43 14 6 -24 33 -4 -27 -42 13 -5 -4 -42 -38 -1 -23 -38 -45 -42 -7 -23 -65 -36 -3 -6 -49 -65 0 38 -9 -43 -43 11
3998 11 17 -35 -16 12 33 58 6 22 61 23 -19 38 48 79 31 -2 31 47 55 -8 10 36 16 0 8 26 26 -5 -28 10 46 -32
4030 -32 -47 -71 -2 20 -37 -49 -69 -6 -22 -37 -56 21 -8 -50 -69 -26 18 -41 -39 -51 9 36 -24 -22 1 46 33 11 29 50 40
4061 40 16 54 44 63 14 30 49 70 47 14 13 62 21 31 33 21 41 20 -38 -29 21 -14 -34 -49 0 19 -30 -29 -16 -4 -9 -45 -46
4094 -46 -28 -19 -89 -55 -58 38 -18 -63 -48 -27 7 -12 -49 -15 19 -2 -3 12 47 41 -8 6 49 64 19 12 37 64 65 42 15 38 63
4127 63 30 42 48 67 45 -7 25 38 33 -9 -5 9 38 -8 -44 7 -11 -8 -34 -31 -38 -32 -21 -64 -42 -19 -48 -66 -54 -1 18 -48 -49 -39
4161 -39 8 -47 -36 -8 4 -32 -15 -2 8 47 33 -22 37 50 54 22 -9 7 72 40 6 57 41 19 15 1 70 57 4 -6 8
4192 8 45 25 -28 -1 0 26 -27 -24 -6 -22 -51 -56 -32 -36 -13 -28 -63 6 12 -16 -101 -44 -20 -7 -28 -5 0 1 -34 -28 8 39 -12 -35 27
4227 27 67 66 0 21 29 54 31 13 38 56 27 6 57 51 51 7 -8 35 36 43 -9 -9 36 12 -9 29 -9 -8 -11 -12 -47 -16 -40 -41 -54 -36
4263 -36 12 -46 -74 -42 -12 -6 -27 -44 -28 -20 -44 -21 31 13 -39 -26 -8 50 42 -4 9 34 61 32 17 14 42 51 24 16 78 68 28
4296 28 -12 49 94 53 -18 8 44 38 -1 -1 21 4 3 -27 -19 -14 2 -56 -49 3 -7 -42 -61 -57 -1 -53 -65 -63 -18 -38 -17 -40 -29 28
4330 28 -21 -31 -39 31 -20 12 -4 9 15 27 -23 1 45 11 38 26 39 41 30 1 44 66 59 41 13 24 47 37 8 28 31 5 1
4363 1 17 22 35 -34 -18 4 -5 -35 -50 -27 -12 -49 -58 -49 -32 -22 -25 -46 -37 -17 -15 -72 -44 -50 -36 -28 -23 0 11 40 -14 -6 38 12 -3 25
4399 25 34 37 38 20 14 39 47 35 29 81 83 46 24 19 28 57 6 30 32 22 0 0 3 6 -27 -15 -34 5 5 -21 -21 -24 13 -39 -52 -15 -9 -40 -58
4438 -58 -54 -34 -3 -44 -58 -38 -19 -17 -6 -34 -8 7 -14 -1 -3 44 8 -7 37 77 32 28 8 49 66 45 34 31 23 63 16 28 67
4471 67 27 13 -5 18 34 23 3 -11 10 17 -41 -13 -4 -26 -2 -76 -52 -20 -18 -27 -51 -54 5 -39 -49 -25 -25 -9 -10 -51 -16 -46 -31 -4
4505 -4 28 38 -23 -12 -13 3 23 5 -11 18 57 23 20 61 44 8 7 19 76 44 43 -16 47 49 60 -20 -19 -4 1 16 -23 -11 10 -36
4539 -36 -36 -25 -19 -16 -24 -40 -32 9 -14 -62 -38 5 -16 -32 -12 -35 8 -2 -20 -37 -4 9 -50 -20 36 24 8 8 20 35 28 32 29 29 19
4574 19 31 4 28 68 24 26 42 74 12 13 -5 23 26 8 -12 -3 21 17 -19 -1 33 -6 -36 -7 2 5 -13 -23 -18 6 9 -50 -28 -42 -48
4609 -48 -51 -60 -55 -17 -15 -19 -42 -2 17 -16 -20 -1 19 8 -29 -21 18 34 7 25 23 14 24 30 15 53 58 6 -9 49 38 22 -9 16 33 11
4645 11 14 -14 -12 -7 -17 -11 -18 1 -10 -55 -40 -3 -4 -24 -19 -16 22 -21 -59 9 -16 -34 -35 -6 -7 11 -23 -44 4 45 19 -9 -3 36 20 8
4681 8 13 56 34 -5 22 7 36 38 9 18 14 29 32 12 18 17 -8 -1 16 16 44 29 -22 5 8 -19 -33 -17 -22 4 -40 -46 -27 -26 -32 -40 -20 -20 -22
4720 -22 -54 2 -23 -3 -14 -32 17 -1 18 -28 -17 8 25 -2 10 30 20 2 -27 -12 60 21 5 -7 40 48 55 0 -2 31 -4 4
4752 4 14 26 11 22 -25 -19 24 11 -47 -32 -7 -10 -5 -32 -19 -19 -25 -37 -25 31 -10 -13 -32 17 14 -33 -57 -32 -23 16 -19 -7 6 43 10
4787 10 9 33 29 27 -8 2 45 30 14 -36 9 51 36 9 0 38 40 34 -7 18 40 -1 -23 -1 32 23 -36 -3 17 15 16 -2 -8 -13 -28 -4
4823 -4 -31 -5 22 -66 -28 -25 10 -50 -27 -3 24 7 -48 -19 9 7 13 -22 9 6 -2 1 9 56 41 -22 -3 32 16 33 40 9 24 25 18 5
4859 5 45 25 -18 -25 15 28 0 -17 -7 6 45 3 -27 -27 -2 -19 -4 -8 -20 -16 -58 -17 -24 0 -21 -42 -38 13 17 -15 -45 -53 -6 27 -37
4894 -37 6 15 4 -11 -32 -7 8 -9 0 17 40 12 -17 -14 36 15 36 17 2 46 46 27 23 42 30 -7 23 42 24 8 -18 28 21
4927 21 8 -11 -2 -5 8 -49 -6 -20 -3 -43 -41 -35 13 -26 -35 -33 -14 -11 -17 -7 -9 5 3 -33 8 -8 -6 14 -24 -12 42 44 2 26 29 42 4
4964 4 -10 54 35 7 20 15 45 30 3 4 34 30 28 2 7 18 -1 -45 -5 -12 -16 -6 -34 -3 24 -24 -25 -28 -3 -16 -44 -20 -24 -30 -41 -35 4
5001 4 -34 1 -46 -24 17 4 -13 -32 23 8 13 -42 21 31 16 11 17 14 12 29 13 12 51 38 5 1 59 43 38 26 42 44 21 16 -19 1
5037 1 -11 -6 -4 1 6 22 -11 -46 -13 3 -33 -55 -50 -19 -27 -43 -12 -41 -3 -30 -55 -17 -25 -21 -23 -12 -3 29 -19 -18 4 4 17 2 5 18 19 23
5075 23 28 49 18 32 37 15 63 27 6 28 14 64 43 27 46 19 -22 7 15 7 -22 4 -26 -5 0 -21 -19 -23 -10 -20 -16 -33 -28 2 -51
5110 -51 -43 -8 -22 -7 -14 -21 10 0 -38 -54 -18 10 7 -41 -16 23 -4 -20 32 48 8 -18 24 10 73 17 29 18 45 26 9 35
5142 35 16 28 23 44 28 39 18 -2 11 37 -7 -29 -11 -13 7 9 -2 -25 -30 -30 -28 13 -20 -40 -42 -50 -55 0 -9 -8 6 -12 20 -29 -6 -7
5178 -7 -12 23 25 -6 15 30 12 -19 33 35 30 7 -1 55 48 7 21 21 42 -1 16 45 23 14 22 -1 12 16 -14 4 -13 22 -4 -39 -28 -17
5214 -17 3 23 -22 -16 -26 -33 -45 -45 -9 3 -48 -45 -44 5 -5 -30 -28 -18 23 -17 2 -5 23 -17 -13 2 21 2 20 8 25 22 21 8 -5
5249 -5 38 20 13 44 45 30 32 10 42 29 10 -10 19 36 30 -7 1 14 0 2 -8 16 5 -27 -11 -26 -22 15 -34 -50 -37 -20 -25 -9 -43
5284 -43 -39 -36 -52 -1 -46 17 -42 -19 -21 0 15 -12 3 22 39 1 11 22 3 22 -8 18 21 20 36 -7 29 46 40 28 1 27 17
5317 17 7 22 28 -18 -1 -21 -3 26 -38 -29 11 -8 13 -14 -11 -37 -6 -32 -21 -36 -28 -21 22 -7 -17 -10 -1 4 -48 5 -6 -31 -27 -13 14
5352 14 -12 -15 8 -3 14 -13 8 -2 28 12 -14 7 49 -19 9 13 19 48 48 16 -8 16 21 24 -7 29 16 -3 -24 6 10 29 -16 -28
5386 -28 5 -8 17 -29 -12 -1 -12 -12 -18 17 -12 -31 6 -32 40 -37 -24 -15 10 11 -5 -10 12 2 -4 1 -30 2 -6 -13 22 9 19 -2 2
5421 2 13 17 30 20 55 21 53 31 13 31 57 15 -14 32 16 -2 -1 -8 5 -9 11 -15 -31 35 -23 18 7 -8 -14 -20 -17 -18 -24 -12 -11
5456 -11 5 4 22 -41 4 -15 -18 -30 -33 8 17 -22 5 12 31 -3 6 -4 14 35 20 40 -28 24 4 -17 -7 8 -2 -20 42 10 33
5489 33 6 -15 -11 12 -2 -11 -24 -2 12 -23 25 -17 -3 1 -23 -24 -33 -13 -25 -5 -9 -17 -29 -14 -15 -3 -5 5 -27 -9 -2 -13 -12 8 3 15
5525 15 5 9 -2 24 19 -29 12 -2 28 23 34 17 33 -5 4 33 32 -24 4 16 10 44 -4 -1 4 20 13 -19 -13 0 4 12 -26 32 -22 -26 -21
5562 -21 -9 5 -15 13 -15 1 5 -27 -15 11 14 -9 -33 0 35 4 -23 -13 19 10 -20 -23 14 -5 12 -26 -9 14 26 12 18 19 40
5595 40 9 8 25 18 -3 10 8 -13 10 -5 -15 14 1 0 -2 3 25 6 10 -2 -29 2 -20 -17 -9 -21 23 4 17 26 -3 -13 8 16 18 8
5631 8 -2 -14 7 6 9 5 -6 12 12 5 6 33 0 14 11 -3 39 10 -16 -11 30 -1 1 4 5 27 16 3 -33 -1 1 4 1 40 6 -14 -35 -16
5669 -16 17 -30 -33 -35 -15 -7 -20 -7 -6 -23 5 3 -10 5 7 3 10 5 28 3 -2 -1 17 41 48 1 -18 34 12 -5 20 47 -6 3 17 27 19
5706 19 40 2 -11 9 6 -6 14 -18 19 -9 1 4 -17 -20 -36 -9 1 9 -18 5 -34 -9 0 -29 -30 -13 -11 -9 -3 -14 -4 -22 -2 2 34
5741 34 28 16 10 26 -6 -2 12 25 16 24 14 6 25 -4 20 7 21 18 9 24 17 9 -24 6 -2 -38 10 22 -21 -22 2 -39 12 -19 -7 -24
5777 -24 -2 -14 -26 18 -40 -8 10 -31 11 -4 -22 7 -8 -6 -19 8 -2 -23 7 8 12 32 33 23 36 9 3 -4 15 23 38 14 6 17
5811 17 1 22 3 16 6 14 -34 29 8 8 6 1 -3 -4 22 16 27 -4 -4 -16 -28 -39 -20 -3 -6 3 -15 1 -39 -12 -15 -26 -12 -14 -14 3 -11
5848 -11 -22 -23 -18 -8 0 2 19 25 14 39 -24 1 16 -4 30 29 19 27 43 33 52 14 -2 32 7 11 19 -2 9 45 33 5 12 -6 11
5883 11 -30 -33 -54 4 20 -45 17 -14 -6 -20 2 -15 -15 0 -5 -3 -32 -29 -31 -34 22 -28 -28 -33 3 3 -8 -2 11 10 3 -14 -13 28 30 15 0 18
5921 18 44 44 43 28 -1 26 20 26 33 1 6 30 10 21 27 -5 -5 22 1 6 -8 -17 15 9 -26 -18 12 -4 6 11 -29 -4 -28 -30 -47 -6 -32
5958 -32 -4 -16 -31 -13 6 -22 3 -7 -11 -29 -19 19 -15 7 -13 -11 26 -8 29 27 42 34 -3 -11 2 34 48 3 19 21 33 26 -13 17
5992 17 18 22 0 -34 21 2 -11 -17 -10 7 14 -35 20 -2 -27 -1 -27 8 1 -15 -1 -22 -6 8 -5 -17 6 7 -12 -5 -5 -3 -14 0 -13
6027 -13 15 22 10 -18 21 8 18 -19 -30 41 -18 8 15 24 26 11 12 13 21 13 47 40 9 47 0 -10 -15 29 1 6 -24 3 9 9 -42 -44 -10
6064 -10 -32 15 -27 -11 -29 -16 -5 -15 -9 -3 13 -19 18 -22 -11 -17 9 3 3 -6 28 33 10 15 -1 15 22 9 -12 14 13 -5 8 5 25 35
6100 35 35 2 41 15 11 0 14 50 -7 12 -32 -7 15 -7 1 9 11 -5 -6 -9 -11 -25 -21 -5 -15 -17 -7 -6 -1 13 2 -37 -4 -11 29 1 -20
6137 -20 -16 -17 1 -31 -14 34 -19 32 13 -2 12 17 -2 8 15 30 -13 5 -1 35 43 37 23 40 -4 3 15 13 40 41 26 30 7 5 -16 -6
6173 -6 13 20 12 15 25 13 -24 -30 -9 1 -22 -42 -37 0 -21 -15 -2 -15 13 -14 -34 6 -5 10 -12 -24 -22 -14 14 2 28 1 17 1 9
6208 9 8 -15 -4 7 17 4 7 17 -9 39 15 7 -6 4 13 9 31 30 8 15 1 -23 16 7 -16 -18 -9 -21 -2 -16 -29 -27 -16 -4 -14 1
6244 1 -3 0 7 0 -12 6 10 12 -11 -1 -17 -23 -11 13 -9 -27 -26 37 12 29 6 6 22 36 10 17 -23 25 -11 3 9 4 21 10 1 1 2 11 -13
6283 -13 7 -3 -14 -2 11 4 -14 -11 -21 -2 27 -6 -11 6 8 -11 9 -1 4 36 -24 4 4 -6 1 -14 -12 -7 2 -4 -3 15 13 4 4 10 2 20 15
6322 15 -27 2 20 -21 -25 35 35 14 7 15 19 16 5 -17 -5 -8 4 4 -28 7 18 -11 -4 21 10 -5 -14 3 -12 15 20 27 17 15 16 -33 -1
6359 -1 17 -4 -41 -35 43 0 -3 -17 12 6 -8 -25 -1 25 -4 17 3 16 22 -4 -1 9 31 13 -8 -11 20 30 29 -7 -8 24 -17 -19 2
6394 2 1 -1 -8 5 6 21 -2 -14 16 6 4 22 -17 -8 14 -1 -18 -16 10 -18 -27 -1 -9 21 17 -10 20 1 18 10 16 6 13 -2 3 -18 34 -4
6432 -4 6 10 16 1 8 -26 -18 20 3 25 20 21 25 -19 16 8 21 5 11 -21 -13 9 23 9 -13 -1 -20 -27 -1 -13 -26 -17 4 7 24 -18 3
6469 3 24 12 7 -11 13 0 14 -6 -1 8 -7 18 31 31 15 -7 -10 8 18 16 17 7 14 9 8 7 -22 -16 25 20 23 -9 4 -10 6 1 0 24 -14
6508 -14 3 -3 17 -46 -24 -8 -27 -9 9 -7 -5 27 9 9 9 12 -1 -29 12 -31 -39 -13 2 -36 7 -10 -4 -4 -2 0 -17 -3 23 12 -1
6543 -1 30 46 -3 40 19 10 13 0 6 -14 20 22 11 12 -14 3 19 -5 -6 8 -9 4 -28 3 -2 -1 -43 -11 -7 0 -10 -3 15 -24 31 -9
6579 -9 10 10 14 5 24 13 -7 11 9 24 4 35 -18 17 26 1 10 29 -18 8 18 25 33 21 6 -22 17 13 10 29 2 16 16 6 1 -6 -16
6616 -16 -7 7 23 44 -1 14 -26 -14 1 -12 -2 -13 -18 12 -4 -47 -3 -3 1 -14 -11 3 8 7 -18 -2 -6 2 -1 -9 16 16 15 22 19 35 12 3
6654 3 25 -18 5 27 13 19 11 -6 -6 3 11 -10 25 15 -20 -6 -8 -14 -27 14 -25 -4 5 -12 -7 15 -18 8 14 11 10 -9 -13 -4 27 10 -10 -17
6692 -17 -19 11 -12 -18 -1 -14 32 11 4 4 15 26 27 -3 47 26 5 11 21 5 5 15 11 -18 -13 6 35 17 9 2 20 3 1 -8 30 55 9
6729 9 -3 -26 -2 5 -37 -36 4 -13 -26 -31 -36 -18 3 -35 1 -15 -13 -9 -24 -22 -24 13 4 16 -2 -7 -11 -21 2 13 16 -12 18 33 14 28 10
6766 10 -4 17 19 37 13 46 14 6 -6 14 26 37 18 28 -4 -21 6 2 3 5 -20 21 -9 -16 -22 -16 -37 -15 1 10 6 -20 -1 -46 -13
6801 -13 -32 4 -8 -24 23 -19 4 15 18 7 24 -23 5 43 9 5 0 -10 14 18 -7 22 23 55 9 12 31 42 45 -2 -5 15 27 31 3
6836 3 23 41 -8 19 10 18 35 7 -1 -1 -3 -27 -43 4 -3 -35 -16 -26 -16 -23 -6 -3 17 -6 13 -43 -31 24 -2 -12 -12 -21 -36 -12 -18 -5
6872 -5 11 15 -29 3 -16 12 5 -9 4 -12 27 34 21 6 27 -16 -2 18 21 16 54 21 3 1 29 3 18 18 19 7 29 37 -4 -13 -18 -8
6908 -8 -2 -21 -35 1 -1 -7 -14 -28 10 -5 -1 11 -9 3 3 1 -17 -7 -53 35 5 10 30 -14 -19 9 10 -12 8 -18 -17 -1 9 17 42 30 12
6945 12 4 10 33 -6 21 19 -2 5 -9 4 6 33 14 -13 27 -1 -12 -22 11 -14 -16 -6 9 -7 7 18 -21 -35 -10 14 -29 -6 -12 -25
6979 -25 -7 11 9 -3 5 -15 -22 18 3 8 -20 8 4 6 39 18 22 38 4 -4 8 13 42 20 13 -16 13 15 -7 14 6 5 26 -16 -12 36 -15
7016 -15 26 24 26 17 16 0 9 -1 -3 -14 5 -17 -28 18 -21 -26 0 -29 -16 13 10 -2 -8 25 -18 16 18 -14 -3 17 -11 8 13 10 11 6 23
7053 23 -15 30 11 19 2 12 39 8 11 19 3 40 -13 -13 14 -13 8 0 -10 5 3 -14 19 -2 2 -11 -1 -1 16 -9 -35 0 -9 -22 -15
7088 -15 -10 2 33 -4 -4 12 11 29 -12 -7 -17 -32 5 -30 -2 -14 16 28 30 -9 -17 -5 -9 9 0 4 2 -14 4 -8 -16 12 19 4 -20 13
7124 13 17 12 -2 -6 24 11 -29 9 2 25 -10 15 -3 -4 -10 -24 8 32 -11 23 -32 -28 12 -16 -17 -3 -8 2 20 4 -10 -14 0 -1 10 -21
7160 -21 -1 -39 -10 25 -11 33 15 -14 4 -16 10 -2 16 3 -1 -26 -25 11 -17 0 -31 -26 -1 17 14 3 -30 -21 18 -25 -27 20 -5
7193 -5 15 -3 9 3 4 -2 4 -18 3 -4 -20 -22 5 4 -1 12 12 -13 -3 23 6 -6 -19 -3 7 -28 -3 -14 -1 -23 -8 -3 13 10 -5 -4 12
7230 12 3 -2 -16 9 5 2 11 -4 -3 20 -5 -15 13 -10 22 8 -2 7 -14 7 3 -38 5 19 16 12 12 2 9 10 -12 4 15 14 -31 -6 11
7267 11 -7 -4 -4 -28 -6 9 10 15 3 7 15 -14 15 -35 19 -21 3 -7 0 22 -1 -5 -31 -2 -8 6 2 -2 13 18 9 1 17 26 -2 8 3 -10
7305 -10 9 8 9 0 -16 7 -6 16 40 -14 24 40 9 -7 36 20 15 -12 0 9 19 16 31 20 -10 21 -4 11 -13 22 -3 15 -3
7338 -3 16 10 -4 -16 10 6 1 -1 -5 -21 4 12 13 -2 -1 -9 -6 -9 -18 1 -3 -12 18 21 -23 -10 -14 1 5 -18 -7 -7 4 14 -6 6 18 13 17 -17 22
7379 22 -12 -11 7 -17 -18 20 9 11 -16 4 16 -3 -16 6 2 14 9 -3 -11 17 -5 -13 -3 -3 8 23 -18 -19 0 -26 12 -9 0 2 -5 7
7415 7 17 3 47 -22 -1 0 10 2 -9 -8 -14 7 -29 -30 16 11 -3 1 26 -4 32 22 -11 -9 27 25 -23 -14 -1 4 3 -5 14 19 20 29 -6 -8 18
7454 18 27 19 -7 -20 15 -22 13 34 18 1 -9 24 -18 14 -11 -4 0 -4 -6 1 -12 -20 0 12 14 -6 12 18 18 11 32 1 5 -21 -3 1 0 36
7492 36 -4 5 -14 8 28 17 -9 10 -9 30 37 13 14 11 -2 13 20 25 24 16 9 13 12 5 -17 22 23 24 -16 10 -5 -2 12 -25 -17 -14 1 6 -1 -16
7532 -16 -27 0 4 -33 8 -3 20 19 21 -15 11 42 19 -10 -10 25 16 6 1 7 -15 36 2 26 20 17 18 39 6 33 21 21 22 20 6 22 10
7569 10 11 25 4 0 2 12 2 23 0 -5 -18 21 4 28 12 -33 19 -4 -1 -13 12 -32 -20 -17 0 11 -10 -15 -12 -24 26 -1 -17 -4
7603 -4 6 15 16 41 5 3 11 16 -7 -1 -2 -5 46 7 24 4 22 8 34 21 4 31 -1 0 -3 7 10 24 9 9 10 2 -5 3 10 16 -8 -8 -7 -23 35
7644 35 12 10 6 22 -1 -2 15 -22 -43 -16 17 13 5 42 -16 6 -21 -10 -26 -5 12 -10 18 -4 13 -5 -4 0 -1 -1 32 8 17 20 32 27
7680 27 -5 13 4 38 10 -2 -20 12 -3 7 -40 -6 10 -28 -8 6 -2 -10 -13 6 9 -5 -7 -22 -16 30 -16 -2 -1 1 5 -27 0 -37 -8
7715 -8 9 -27 -8 -3 30 -3 2 21 12 29 9 -13 -8 10 41 5 -10 6 9 38 18 27 41 15 13 5 5 -8 6 -25 12 4 -7 11 2 -28
7751 -28 -6 15 -11 -20 -38 -13 6 -9 -2 -57 -25 28 6 23 -7 16 -22 -32 -17 12 -26 -19 -31 -27 18 6 1 28 4 48 -8 16 4
7784 4 18 9 -3 28 22 5 26 -13 13 14 7 27 3 39 5 7 3 19 -13 -24 25 -18 6 -4 -9 -11 7 -1 6 -19 -2 5 -20 0 -15 -14 19
7821 19 11 -4 27 -13 -17 -20 -15 -2 1 -6 4 -13 -31 26 16 -9 11 6 10 8 6 0 8 1 22 14 -3 11 4 13 20 12 13 8 19 9 23 38 19 29
7861 29 9 -13 -28 -3 6 17 0 5 -7 -22 5 -8 13 2 1 -9 -1 -9 -26 12 7 -16 6 3 0 29 -22 -14 10 0 47 -10 18 -3 2
7896 2 -17 -4 1 -18 13 28 26 14 7 8 20 21 18 -12 50 7 11 43 -13 17 9 -5 22 -31 19 10 -12 -13 -36 19 -3 12 6 1 2 15 6 2
7934 2 5 -9 7 -25 6 10 -29 4 8 17 -10 -32 -15 45 -5 -2 -21 -5 -18 -26 10 7 -11 -45 14 6 15 -8 -33 -8 20 4 5 -2 1 -5 10
7971 10 12 10 -8 19 -2 13 -25 -18 25 -12 -8 -3 -13 12 -16 3 23 18 -11 16 -12 -17 -6 -21 -2 -2 -10 -7 0 17 10 -11 15 -6 -1 45 9
8008 9 -11 -2 22 6 -30 3 14 -6 -12 -1 11 26 -1 7 -17 26 9 20 -14 32 15 12 -1 -7 5 -17 32 3 12 27 18 10 25 21 2
8043 2 3 18 18 -1 -30 -23 -16 29 32 7 0 -14 5 28 -21 11 -12 2 -10 16 5 1 -2 -7 29 0 2 -7 15 -24 15 13 29 -1 -7 8 -4
8080 -4 -5 -7 29 -1 -1 10 -9 -3 15 -7 4 -8 7 9 39 34 28 29 7 -24 15 0 10 23 17 14 -10 -4 25 27 0 -13 -2 -1 9 6 14 37
8118 37 11 0 -1 10 -5 -12 -17 9 8 -15 0 14 6 -16 3 -8 -37 -14 -5 20 5 5 -11 4 -27 -25 -18 6 -7 10 5 25 -10 3 22
8153 22 2 25 22 12 20 5 6 -4 10 6 -13 13 -9 27 -33 12 -3 -44 -11 21 -12 -18 -1 -18 -10 18 -4 -6 -6 -9 -2 -12 -2 -12 -1
8188 -1 -12 -9 2
8191B
$$ Imaginary data points
##PAGE= N=2
##DATA TABLE= (X++(I..I)), XYDATA
0 0 0 0 0 0 0 0 0 0 0 0 0 0 0 0 0 -8 8 -8 8 -8 8 -8 16 -16 16 -24 24 -24 32 -32 40 -40 48 -56 59 -65 72 -81
38 -81 91 -104 112 -125 137 -152 169 -187 209 -233 259 -291 330 -372 427 -495 584 -706 884 -1166
58 -1166 1687 -2979 13524 11942 -11725 467 13696 11614 -3481 -3537 4514 5990 -3776 -5947 1046
73 1046 5285 -2760 -10102 -6791 2692 3581 -4311 -11699 -11633 -10123 -11610 -13804 -11279 -7006 -5125 -4858
89 -4858 -2438 -1213 -5764 -13021 -14184 -8705 -4458 -6031 -8146 -5610 -833 719 -952 -2037 -794
104 -794 1006 1821 2181 3260 4845 4855 2024 -1054 -115 4324 7621 8083 8724 11187 12329 9610 5316
121 5316 3080 3087 3592 4215 5141 5962 6598 7321 7609 6194 3697 1872 1125 1095 1642 2237 1284 -1154 -2961
140 -2961 -3152 -3165 -3703 -2983 -598 564 -1072 -3032 -3438 -4384 -7607 -10250 -9007 -5599 -3942 -4268 -3826
157 -3826 -2070 -1511 -3290 -5486 -6030 -5413 -4796 -4028 -2619 -1348 -1622 -3060 -3254 -1578 240 614 736
174 736 2104 3464 2875 1174 615 1032 516 -313 1121 4536 6760 6436 5581 5554 5063 3124 1511 1788
192 1788 3014 3605 3752 4117 4342 3552 2436 2153 2684 2806 2164 1586 1757 1921 882 -944 -2065 -2077 -1841
211 -1841 -1861 -1058 767 1577 36 -2403 -3353 -3087 -3688 -5091 -5110 -3272 -1699 -1908 -2675 -2425 -1914 -2568 -3820
230 -3820 -3930 -2690 -1735 -1964 -2442 -2073 -1546 -2066 -3010 -2715 -769 1114 1450 923 901 1159 526 -682 -1089
249 -1089 -198 931 1539 2100 3120 3920 3587 2340 1491 1615 2108 2100 1956 2368 3130 3201 2407 1642 1574 1793
269 1793 1886 2092 2608 2894 2223 1054 221 -117 -427 -870 -756 32 758 985 691 156 -770 -1984 -2855 -2717
289 -2717 -2028 -1677 -1862 -1888 -1471 -1429 -2190 -2988 -2914 -2269 -2069 -2259 -1942 -1276 -1406 -2566 -3200 -2509 -1574 -1489 -1650
310 -1650 -717 773 1189 101 -923 -837 -427 -500 -536 450 1991 2550 1922 1446 1938 2226 1501 762 1303 2758
330 2758 3309 2579 1931 2164 2296 1643 1037 1529 2411 2593 2083 1908 2041 1482 126 -811 -527 251 545 322
350 322 317 480 158 -729 -1528 -1825 -1875 -2055 -1992 -1396 -788 -1014 -1910 -2566 -2416 -2197 -2259 -2254 -1654 -1010 -1079 -1640 -1837
373 -1837 -1637 -1806 -2205 -1850 -621 407 365 -31 49 356 0 -725 -680 347 1218 1312 1309 1812 2186 1615 670
394 670 599 1469 1873 1562 1475 2220 2640 1894 721 481 1039 1360 1132 1118 1702 1940 1166 97 -220 37 -135
415 -135 -692 -604 293 1010 476 -610 -1095 -917 -1041 -1595 -1774 -1052 -386 -585 -1089 -1126 -943 -1334 -2035 -2023 -1058
436 -1058 -276 -441 -917 -856 -558 -767 -1339 -1416 -827 -252 -39 207 664 774 3 -802 -700 -42 324 318 580
457 580 1164 1280 803 494 528 481 156 142 830 1541 1445 799 503 626 603 165 55 554 1160 1132 763 567
479 567 636 239 -459 -720 -89 666 653 245 261 649 345 -581 -1125 -737 -105 -110 -339 -18 401 139 -779 -1174
501 -1174 -777 -342 -485 -751 -414 227 102 -772 -1315 -994 -554 -626 -814 -368 258 259 -386 -736 -592 -589 -958 -1029
523 -1029 -288 484 510 95 -71 87 -9 -378 -422 29 479 575 517 681 736 378 -94 -5 632 985 885 810 1062
546 1062 1203 737 137 127 458 534 403 688 1353 1386 629 -35 11 359 136 -343 -197 449 672 165 -404
567 -404 -298 -154 -559 -1048 -826 -43 141 -579 -1075 -774 -479 -1038 -1747 -1480 -494 -40 -490 -883 -575 -387
587 -387 -925 -1524 -1222 -412 -194 -546 -482 192 568 14 -693 -594 129 448 256 245 763 1015 628 137 304
608 304 803 885 608 778 1386 1653 1155 541 517 709 599 349 562 1098 1269 927 614 562 398 -72 -347
629 -347 -78 311 256 -64 -226 -81 -240 -711 -1015 -759 -502 -580 -703 -532 -398 -797 -1457 -1576 -1051 -735 -972
650 -972 -1097 -567 -62 -275 -915 -1084 -764 -646 -880 -700 59 539 211 -331 -171 423 496 -68 -174 544 1272
671 1272 1116 559 493 818 786 361 371 1042 1582 1245 741 846 1198 997 179 -201 298 860 808 441 462 591
693 591 354 -206 -428 -200 -94 -359 -545 -221 65 -295 -862 -1079 -819 -647 -744 -726 -391 -271 -586 -913 -884
714 -884 -724 -863 -1101 -792 -150 157 -78 -309 -218 -137 -341 -516 -270 126 309 258 346 583 507 97 -148 247
736 247 689 704 437 489 795 762 274 -71 124 435 345 227 532 936 760 82 -359 -49 248 -22 -391 -123
758 -123 461 560 47 -381 -198 -21 -265 -513 -233 242 263 -190 -355 -128 -29 -384 -657 -334 244 332 21 -60
780 -60 39 -72 -438 -545 -269 13 -10 -107 75 386 236 -309 -579 -358 -56 -104 -181 -34 139 0 -294 -365 -193
803 -193 -173 -363 -289 143 384 149 -223 -319 -179 -176 -286 -145 229 389 264 134 322 428 91 -355 -128 476
825 476 713 403 154 467 724 463 -52 49 517 625 265 203 615 766 197 -373 -194 339 379 -58 -163
846 -163 271 520 117 -523 -533 -228 -228 -594 -537 -73 159 -306 -782 -627 -264 -401 -910 -835 -306 -40 -339 -639
868 -639 -520 -294 -438 -679 -506 -44 137 -58 -161 56 198 -23 -350 -243 204 501 390 342 550 662 402
889 402 197 370 585 474 362 577 876 873 395 208 435 561 378 203 472 697 536 135 38 172 92 -240
911 -240 -433 -22 328 150 -366 -471 -168 -123 -615 -921 -622 -223 -331 -653 -557 -288 -411 -883 -1011 -526 -157
932 -157 -361 -629 -483 -108 -71 -503 -660 -382 -5 -34 -128 102 440 343 -33 -136 254 484 288 111 362 826
954 826 783 447 346 495 560 384 330 584 745 591 351 365 484 386 77 34 251 450 297 80 27 86 -81
977 -81 -362 -387 -168 -146 -297 -373 -145 -24 -377 -763 -661 -331 -309 -534 -538 -280 -178 -421 -599 -448 -232 -303 -484
1000 -484 -323 55 228 -149 -409 -178 171 69 -231 -89 358 511 251 85 328 485 182 -85 152 614
1020 614 628 207 91 410 599 286 -99 3 383 446 161 80 278 383 -10 -307 -99 216 132 -200 -230 127
1042 127 271 -95 -440 -358 -119 -132 -323 -237 8 35 -248 -317 -146 -7 -202 -428 -226 82 172 -54 -191 -95
1064 -95 -20 -117 -136 14 200 115 -61 30 244 139 -208 -268 47 252 143 -48 5 218 114 -152 -203 65 102
1087 102 -134 -225 96 340 119 -298 -338 68 186 -132 -268 12 302 129 -213 -136 173 118 -238 -235 200 464
1109 464 192 -163 -41 312 284 -108 -163 149 428 272 37 74 265 187 -119 -87 232 327 77 -127 18 308
1131 308 160 -227 -312 -96 39 -76 -179 -62 38 -169 -380 -280 -133 -205 -402 -398 -144 33 -214 -409 -342 -154
1153 -154 -203 -360 -242 -4 18 -176 -206 34 177 -59 -281 -50 345 345 94 34 250 425 180 -4 245 527
1175 527 395 166 257 576 565 220 -38 241 520 381 85 103 363 402 74 -154 23 201 -47 -275 -98
1196 -98 214 85 -357 -503 -226 -32 -281 -576 -444 -129 -164 -430 -514 -295 -265 -470 -578 -334 -51 -144 -398 -377
1218 -377 -32 24 -207 -399 -155 160 113 -14 80 281 239 39 70 333 404 236 125 347 573 483 247 179 351
1241 351 433 302 270 390 481 304 77 158 325 237 -28 -104 148 285 33 -214 -150 46 -122 -321 -324 -121 -139
1264 -139 -332 -388 -209 -105 -342 -578 -487 -149 -91 -341 -507 -244 -64 -161 -395 -319 -75 -42 -232 -223 113 273 5
1287 5 -276 -31 276 314 31 -26 306 472 277 76 211 398 294 102 130 394 467 210 36 202 396 268
1309 268 -25 -59 206 255 96 -27 69 127 -97 -228 -95 61 -74 -263 -251 -11 -28 -269 -401 -256 -119 -167
1331 -167 -266 -200 -38 -85 -252 -265 -20 17 -180 -336 -67 254 162 -171 -160 151 214 -34 -157 139 302 98 -73
1354 -73 88 349 229 -107 -198 152 389 161 -65 -9 229 211 -104 -207 48 195 12 -178 -26 199 89
1375 89 -253 -316 -14 149 -64 -292 -152 130 80 -147 -182 -8 32 -96 -123 36 221 80 -63 -37 142 207 -21
1398 -21 -90 68 268 241 62 82 159 107 -38 15 207 224 30 -76 97 239 87 -207 -184 34 61 -61 -156 -49
1422 -49 -13 -155 -287 -195 -43 -126 -356 -335 -25 55 -191 -414 -273 -46 -73 -283 -219 46 99 -81 -179 51 196
1445 196 -41 -219 -4 315 366 113 11 186 392 240 50 96 326 388 202 171 346 424 137 -100 99 423
1467 423 319 12 -67 170 277 23 -185 -134 48 -72 -199 -127 38 -15 -287 -408 -274 -109 -247 -419 -372 -144
1489 -144 -113 -266 -381 -291 -222 -333 -352 -162 -6 -122 -231 -169 40 39 -161 -165 26 171 172 50 152 268 241 97
1513 97 129 281 361 248 180 357 518 383 100 68 264 357 197 86 231 386 204 -3 18 134 70 -160 -181
1536 -181 87 222 -35 -310 -282 -111 -88 -326 -401 -227 -44 -141 -367 -239 -85 -227 -463 -464 -156 14 -140 -335
1558 -335 -183 51 13 -240 -256 -26 74 -10 -46 145 248 100 -72 27 207 231 119 79 271 378 326 104 83
1581 83 217 194 98 146 316 313 112 -4 156 207 33 -144 -55 184 174 10 -85 7 -3 -133 -258 -134 5 -56
1605 -56 -244 -213 6 32 -240 -419 -248 9 -4 -194 -153 47 46 -166 -238 -86 60 -38 -187 -29 237 190 -56
1628 -56 -147 28 215 99 -79 21 245 258 65 -7 150 169 3 -123 36 254 187 -69 -74 117 155 -39 -216
1651 -216 -89 101 38 -54 -29 82 0 -192 -225 -49 58 -47 -156 -72 124 83 -118 -216 -55 24 -14 -33 88 179
1675 179 49 -102 -9 139 99 -67 -83 150 300 196 5 54 166 104 -49 -34 154 214 56 -41 104 188 9
1698 9 -227 -181 50 146 -41 -143 -72 76 -59 -271 -217 -27 -35 -220 -246 -9 103 -102 -362 -266 6 25 -186 -225
1722 -225 -32 88 -9 -185 -104 71 32 -119 -20 222 302 102 -37 94 273 192 -2 67 243 312 227 144 224 257
1746 257 86 -12 78 285 230 68 28 115 187 53 -164 -77 16 -15 -91 -88 1 -86 -223 -277 -117 -92 -224 -336 -219
1771 -219 -22 -69 -261 -345 -215 -152 -242 -252 -134 48 -43 -208 -148 57 64 -133 -184 33 242 229 39 39 197 237 58
1796 58 18 204 339 219 102 193 389 331 63 -21 212 350 223 32 106 251 171 -29 -75 67 79 -77 -196
1819 -196 1 106 -29 -291 -277 -86 -60 -236 -303 -147 -27 -111 -246 -284 -127 -159 -330 -276 -69 21 -127 -263 -124
1842 -124 22 -22 -173 -143 82 120 65 16 127 134 75 1 51 261 224 68 97 259 352 192 22 69 231 203 73
1867 73 103 222 219 42 -89 66 167 36 -157 -97 140 154 -84 -216 -125 -20 -104 -215 -155 7 -23 -244 -232 -74
1891 -74 -10 -185 -318 -173 32 40 -152 -176 -16 65 -51 -170 -16 74 101 -2 24 171 168 -32 -114 53 227 133
1915 133 21 76 231 211 83 7 104 143 50 3 108 217 138 -75 -76 50 94 -30 -146 -57 57 2 -81 -99 -6
1940 -6 -72 -194 -180 -17 60 -107 -199 -94 54 2 -182 -176 -23 63 -71 -103 19 96 14 -142 -53 134 157 8 -47
1965 -47 138 260 146 -86 -26 171 183 62 22 146 209 75 -60 57 158 76 -105 -76 96 173 9 -147 -114
1988 -114 23 -18 -159 -159 -27 1 -146 -164 -103 -3 -143 -293 -208 -4 34 -85 -193 -72 21 -57 -162 -82 27 -1
2012 -1 -63 5 158 150 5 -61 64 210 174 52 72 225 226 150 23 86 197 84 48 128 249 200 11 -25 92 153
2038 153 18 -100 -57 81 39 -86 -120 -42 -22 -200 -204 -89 17 -95 -246 -192 -36 -55 -228 -287 -117 -16 -74 -194
2062 -194 -117 15 -18 -174 -129 44 73 -29 -109 57 173 172 -5 -15 118 179 127 71 157 262 211 95 105 199 203 66
2088 66 2 155 292 171 18 31 98 81 -34 -52 27 60 -6 -65 -26 25 -98 -231 -192 -72 -13 -129 -208 -137 -42 -103
2114 -103 -192 -175 -123 -99 -174 -148 7 53 -81 -205 -67 63 21 -73 -69 123 162 89 -9 122 155 69 -21 124 263 231
2140 231 63 7 153 232 117 -41 24 170 188 65 16 92 134 -42 -112 -12 107 21 -110 -115 6 73 -125 -217
2164 -217 -166 -29 -53 -142 -124 -51 -44 -144 -176 -121 -41 -101 -157 -119 80 76 -48 -107 -27 73 11 -60 18 115 131 39 47 131 100
2193 100 1 11 138 194 132 50 53 146 152 28 -16 67 113 59 -16 56 154 22 -136 -128 1 80 -65 -166 -65 53 -26
2220 -26 -124 -159 -62 -72 -166 -105 -57 79 -64 -201 -106 1 4 -110 -147 -44 88 30 -83 -23 93 47 -23 -38 126 165
2246 165 54 -12 106 199 130 -25 -16 125 186 124 57 73 141 79 -17 -21 68 54 -18 -14 67 108 -45 -187 -141 25 -22 -132
2274 -132 -145 -50 -5 -91 -149 -85 -30 -103 -221 -96 28 25 -103 -141 -40 51 -12 -109 -67 40 80 26 -24 115 135 -4
2300 -4 -69 80 197 158 19 67 182 200 69 -11 93 129 106 21 115 161 84 -4 -82 86 120 -45 -106 -50 98 52
2326 52 -100 -175 -54 -8 -117 -182 -95 20 -52 -177 -129 -15 -46 -173 -236 -111 12 -7 -120 -90 2 10 -49 -55 24 105
2352 105 42 -23 52 164 115 -30 -8 132 189 124 46 94 181 162 30 95 165 148 30 19 131 195 51 -56 -22 71
2378 71 65 -51 -86 5 26 -31 -128 -74 -21 -107 -177 -136 -7 -27 -145 -256 -116 5 -57 -218 -171 -49 -32 -121 -89 24
2404 24 29 -44 -106 -51 96 96 -14 -16 138 182 73 3 35 139 128 65 71 194 185 69 -8 98 198 132 -3 -6 87 173
2432 173 52 -38 11 67 21 -99 -45 0 -50 -123 -131 -21 -18 -100 -231 -138 -22 -30 -157 -141 -69 -45 -124 -159 -98 -28 -92 -140
2460 -140 -30 73 23 -126 -65 4 110 62 -21 43 138 102 28 49 150 138 81 2 128 222 154 -5 9 158 127 31
2486 31 -59 47 103 67 -21 11 56 -1 -108 -93 20 38 -84 -161 -118 28 -22 -144 -182 -88 -34 -102 -149 -73 4 -57 -145
2513 -145 -113 -22 31 -119 -149 -4 117 25 -60 -16 63 94 3 -17 92 137 64 27 128 185 112 -5 1 131 181 82 5
2540 5 42 117 53 -22 -7 76 72 -40 -44 31 67 -38 -126 -86 29 10 -93 -136 -82 -39 -97 -106 -92 -44 -97 -178 -107 24 -13 -113
2570 -113 -147 -49 62 -31 -104 -52 35 105 -3 -24 75 121 16 -6 73 198 152 14 51 116 195 85 -16 53 129 110
2596 110 46 36 125 107 -13 -22 46 72 10 -95 -48 17 26 -68 -140 -71 -24 -69 -102 -93 -38 -83 -163 -162 -36 -38 -149 -173 -84 -9
2626 -9 -34 -109 -98 0 16 -49 -48 39 63 7 -22 55 143 101 17 15 114 175 93 16 89 174 120 44 74 123 137 48 6 126 117 66
2658 66 -53 -2 63 64 -31 -113 -30 25 -28 -131 -46 -21 -71 -148 -152 -21 -28 -124 -185 -117 -5 -58 -109 -137 -53 18 -53 -123 -28 14
2688 14 5 -52 0 79 78 -26 -44 65 150 110 8 57 128 128 49 48 135 149 58 20 97 155 81 -9 32 76 127 -12 -80 -4
2718 -4 70 53 -80 -71 -11 -47 -108 -81 -10 -4 -99 -191 -61 -7 -50 -149 -167 -56 -18 -96 -94 -57 -2 -52 -101 -52 19 37 -51 -77 35
2749 35 145 65 -42 23 104 131 28 45 109 136 101 34 117 151 94 -6 35 119 154 59 -39 1 54 66 -35 -22 18 20
2777 20 -58 -99 -3 7 -94 -133 -93 -18 -35 -151 -148 -85 -45 -78 -118 -81 -28 -80 -117 -70 11 8 -45 -73 -3 76 29 -49 -23 77
2807 77 86 35 8 84 137 22 42 114 119 126 12 46 146 137 49 3 38 70 83 19 -15 55 77 -30 -71 23 48 -66 -98 -62
2837 -62 21 -11 -115 -140 -79 -17 -97 -167 -112 -30 -63 -123 -72 -19 -19 -87 -154 -21 65 -12 -62 -38 32 90 29 -11 54 108 44 13
2867 13 65 142 118 30 36 122 167 73 19 52 111 105 46 -7 82 75 41 -32 29 85 -32 -85 -37 33 -12 -66 -157 -54 18 -57 -98
2898 -98 -91 -39 -56 -136 -121 -56 17 -101 -128 -67 14 -19 -116 -71 1 46 -38 -34 7 81 36 -17 6 112 80 23 7 96 136 105
2928 105 -22 39 128 97 36 28 91 80 33 24 73 72 19 -61 -25 61 74 -6 -59 -38 0 -16 -115 -74 -11 -22 -96 -93 -67 -27 -91
2959 -91 -137 -45 25 9 -116 -112 -19 15 -5 -50 -10 18 22 -9 31 71 80 -11 -29 77 125 48 16 52 124 114 54 18 88 95 34
2990 34 20 59 122 67 -25 14 100 112 2 -74 -20 42 -15 -70 -83 -7 -17 -78 -96 -27 -44 -81 -94 -81 15 -37 -120 -114 -24 -3
3020 -3 -4 -85 -58 31 0 -87 -9 52 70 -44 -16 43 86 63 -36 19 88 148 54 7 87 123 73 26 18 93 59 8 16 76 118 48
3052 48 -25 -29 49 8 -72 -50 -7 -6 -50 -66 -30 2 -73 -109 -76 -4 -23 -92 -129 -64 -7 -71 -99 -73 -6 14 -44 -46 30 28 -29 -50
3084 -50 19 80 50 -45 -5 87 100 13 -27 60 103 73 40 47 101 86 19 21 72 145 26 -30 6 75 67 -10 -37 4 2 -43 -65 -48
3116 -48 3 -15 -91 -45 -3 -2 -87 -118 -42 -11 -47 -103 -75 -30 -36 -82 -47 0 5 -43 -96 -10 30 51 -22 -28 73 89 54 5 43 86
3148 86 87 36 65 105 92 12 18 110 106 65 -22 -2 80 62 28 -44 24 50 -18 -70 -6 16 -41 -73 -64 11 -11 -84 -133 -65 -6 -51
3180 -51 -99 -103 -32 -30 -78 -127 -19 -21 -67 -106 -25 44 -7 -77 -39 43 51 -1 -30 7 65 77 35 34 94 90 11 22 80 120 64 14 18
3213 18 95 85 33 14 46 68 31 -17 5 48 -14 -23 -28 18 34 -70 -95 -58 24 -32 -102 -130 -36 -65 -93 -97 -58 -37 -94 -117 -34
3244 -34 -26 -43 -92 -83 -8 67 -28 -73 -7 31 31 -8 -4 71 85 26 0 52 97 85 3 35 114 97 59 35 82 79 60 31 42 113 20
3277 20 -16 -16 45 73 -46 -64 -49 14 -18 -68 -114 -6 -35 -34 -87 -55 -47 -79 -125 -78 5 -22 -98 -103 -22 -11 -15 -93 -38 -10 7 -22
3309 -22 -20 36 19 -3 28 48 94 68 0 37 118 113 32 14 53 70 70 57 62 86 99 29 43 91 51 18 -46 -19 57 31 -47 -77
3341 -77 -48 21 -40 -117 -32 -27 -68 -91 -62 -5 -35 -118 -105 -34 -10 -30 -75 -57 1 -3 -27 -62 3 12 -31 -11 26 71 74 -34 -17 69
3373 69 56 51 -5 59 130 63 17 60 60 49 32 19 72 131 26 -22 13 74 34 -30 -42 -4 25 -23 -54 -46 -12 -47 -104 -60 -22
3404 -22 -42 -61 -126 -38 -20 -41 -106 -70 -33 -20 -60 -64 -38 5 -17 -48 -11 41 0 -2 -7 72 86 49 10 30 60 48 33 21 86 68
3436 68 60 39 85 104 43 -3 11 60 92 3 5 13 25 -25 -43 -1 29 -20 -50 -39 6 -17 -60 -88 -85 -23 -32 -107 -99 -51 -30 -96 -77
3469 -77 -28 -36 -35 -92 -23 9 24 -54 -32 47 69 10 -19 5 88 91 41 29 58 100 56 17 85 106 69 27 63 119 106 35 -20 67
3501 67 82 32 -16 46 23 -4 -79 -46 26 12 -54 -64 -54 -13 -18 -122 -99 -42 -12 -63 -94 -60 -45 -41 -68 -61 -20 -8 -47 -83 -31
3532 -31 14 -8 -41 -29 41 43 24 36 45 64 29 34 85 109 99 29 57 126 110 43 40 61 102 89 42 39 59 59 -4 -15 34 58 -27
3565 -27 -73 -14 33 -29 -66 -99 -30 -18 -59 -57 -31 -37 -57 -119 -61 -39 -16 -65 -101 -34 33 -33 -67 -51 35 20 -24 -32 30 54 22 10
3597 10 48 85 63 -6 31 112 116 76 11 86 70 71 19 20 77 69 19 11 85 45 7 -44 -10 63 45 -28 -74 5 9 -52 -65 -60 -16 -42
3631 -42 -74 -62 -7 -25 -90 -72 -41 25 -24 -50 -65 -5 6 -29 -34 -6 1 11 -25 23 59 8 -2 -3 74 97 26 9 41 77 72 37
3663 37 54 46 67 35 3 29 72 12 6 17 84 54 -22 -40 47 45 -1 -38 -70 -7 -32 -48 -49 34 1 -57 -63 -42 0 -30 -107 -73 -1
3696 -1 8 -66 -33 3 8 19 -6 7 8 15 -24 16 58 61 35 -25 -11 74 41 11 27 50 85 29 39 56 78 48 -2 11 65 46 6
3729 6 -7 4 13 14 -20 -17 26 -12 -83 -45 -10 -19 -63 -79 -34 -25 -8 -90 -51 -9 14 -31 -55 -18 -21 -10 -35 -32 -1 14 -16 -42 22 51
3763 51 18 -27 4 46 23 22 17 60 46 45 14 37 95 47 15 49 80 67 29 -19 39 41 24 -20 -46 16 -8 -51 -43 11 4 -60 -60 -72
3797 -72 -48 -38 -109 -101 -31 -7 -75 -83 -16 -32 4 -79 -43 -13 7 -18 -50 13 47 13 -39 -32 42 40 -1 4 42 92 56 6 57 69 59
3830 59 33 -8 73 83 13 -8 52 75 30 7 -2 30 66 -9 -10 10 20 -46 -45 -38 20 -10 -47 -41 -31 17 -40 -65 -57 2 -39 -61 -44
3863 -44 -15 -2 -33 -28 -3 29 -21 -39 -44 47 43 -5 7 9 43 45 6 30 75 31 -26 18 73 69 1 -4 48 83 44 33 13 44 14 7
3897 7 3 -23 31 -43 -17 -16 -5 9 -23 -54 -32 -15 -36 -55 -22 -6 -27 -88 -86 -18 -26 -29 -69 -3 29 -5 -60 -2 1 16 11 -22 4 34
3931 34 -3 -5 7 42 47 35 15 48 66 40 -20 57 78 47 4 32 69 28 16 0 19 18 18 -41 -9 27 11 -41 -90 -1 39 -10
3963 -10 -39 -24 -39 -10 -48 -59 -15 -33 -44 -52 -23 3 -33 -54 -22 5 38 -30 -35 7 0 -30 -14 2 19 65 1 2 57 37 45 8 26
3996 26 61 73 29 17 32 103 26 -16 30 46 49 -18 10 48 48 -26 -10 30 11 -27 -36 -77 -9 10 -12 -47 -10 -8 -57 -43 -23 -23 -19
4029 -19 -66 -71 -17 16 -52 -31 -26 2 7 -24 9 21 43 -14 -7 48 62 36 -22 33 71 53 26 16 39 78 29 10 31 40 5 6 43
4062 43 64 55 -11 -50 11 64 24 -50 -46 24 21 -39 -39 -23 -26 -60 -71 -70 -50 -25 -70 -104 -35 5 -41 -50 -53 -18 -21 -36 -26 3 9 -16 -36
4097 -36 31 43 12 10 3 51 71 46 18 84 63 29 9 46 63 41 30 40 73 76 27 5 5 42 42 -29 -16 42 50 -28 -29 -10 9 -15
4131 -15 -50 -49 6 -21 -71 -75 -16 -16 -86 -99 -80 -41 -38 -54 -20 -15 -41 -18 -36 -2 52 0 -21 -48 57 58 14 -34 7 58 54 56 32 61
4165 61 49 14 17 41 53 39 -1 57 74 40 2 4 25 23 -21 -28 5 0 16 -19 -21 -7 8 -59 -103 -7 10 -14 -81 -82 -32 -43 -62 -74
4199 -74 -61 -27 -53 -53 -39 7 -3 -56 -24 -3 34 -8 -49 16 58 36 -4 2 29 76 26 25 51 74 43 20 61 72 42 23 6 37
4231 37 15 21 -8 13 28 -8 -28 -33 26 23 -48 -37 -52 14 -3 -86 -56 -41 -13 -69 -40 -28 -29 -57 -63 2 -26 -41 -35 -40 -4 35 -53 -38
4265 -38 -7 46 25 5 12 44 22 19 9 48 61 30 14 50 60 72 48 8 36 60 30 -4 51 34 -25 -14 1 20 18 -24 -31 6
4297 6 -5 -28 -65 -29 -22 -45 -47 -44 -32 -38 -52 -77 -42 -28 -21 -83 -70 -19 7 -42 -31 24 3 1 -41 1 -5 35 19 20 21 44 18 -2 16
4332 16 58 68 43 -3 35 85 66 13 62 28 60 27 35 49 55 -28 -21 5 41 -5 -29 -38 0 18 -49 -36 -22 -2 -18 -48 -65 -28
4364 -28 -6 -67 -82 -27 -28 -43 -55 -31 -27 11 -61 -38 -14 -10 11 -10 7 13 11 -25 28 34 26 1 19 53 43 32 -11 31 63 65 42 1
4398 1 33 31 16 16 -1 62 29 -19 9 24 -8 -11 -24 -12 -16 -16 -29 -39 12 -22 -51 -61 -42 -3 -39 -79 -57 -41 -11 -48 -56 -15 0 -31
4432 -31 -26 -3 -18 -21 -22 -9 36 43 -8 -27 15 73 45 -5 34 15 21 -4 36 39 77 28 -19 13 40 23 -22 -8 40 25 40 5 24
4465 24 33 5 -1 22 13 -29 -33 -30 -8 -26 -39 -49 -34 10 -21 -41 -20 -30 -4 -35 -36 -42 0 -8 -61 -8 19 34 -25 -47 -2 35 41 -14 14
4500 14 21 12 -3 26 41 25 15 -2 -8 47 24 22 43 15 42 6 -2 5 31 1 3 -34 25 -1 -34 -37 -30 -28 -36 -17 -34 -37 -1 -59 -45 -29
4536 -29 -16 -11 -37 -15 -3 11 -33 -34 10 9 -11 -8 1 36 -3 -9 -12 11 12 11 2 53 9 1 12 10 25 28 15 -42 34 10 27 -9 25 53 23
4573 23 -9 22 10 -1 -19 -20 11 4 -13 -33 -64 0 -21 -26 -28 -30 6 -5 -39 -32 21 -7 -43 -26 9 19 -21 -37 -11 -2 -7 0 -31 0 -13
4608 -13 -8 -13 13 26 22 -12 -4 53 49 2 -20 25 32 -3 16 0 41 53 -7 5 8 24 1 2 18 41 -6 -13 -21 13 23 -20 -20 6 -21 -14
4644 -14 -47 16 4 -3 -80 -54 15 -2 -13 -42 -23 23 14 -14 -26 18 18 12 19 17 25 -16 -9 -23 26 23 -1 6 32 51 34 -15 12 47 27
4679 27 16 10 17 10 6 -19 -10 21 -1 14 -30 -7 47 -17 -42 -23 -26 -15 -42 -25 12 -4 -47 -23 4 -16 -23 -37 -8 13 16 -44 -31 -6
4713 -6 -4 -8 22 -4 12 -3 -1 -15 21 47 8 -17 38 31 29 -13 -20 22 12 19 33 17 4 17 -8 36 50 22 13 -11 -1 51 18 -37 -29
4748 -29 9 31 -31 -22 -10 -5 -10 -43 -16 -17 -48 -55 -30 6 -25 -24 -16 -31 28 -28 -27 -10 -16 15 5 13 21 22 -23 -12 22 39 31 -28 -20 55 44
4785 44 8 21 72 39 -3 25 21 41 22 -22 -3 26 13 20 -15 -9 24 2 -33 -19 -18 -24 -33 -34 -39 14 -38 -43 -69 -29 15 -31 -29 -35 -2 -16
4821 -16 -23 -22 -6 -22 -20 15 15 37 -27 -13 14 15 32 -1 -21 17 33 33 27 22 55 65 37 29 58 40 -9 -10 38 42 26 -8 -3 10 35 -7
4857 -7 -6 8 -10 -36 -22 -6 10 -8 -54 -45 -17 1 -19 -23 -61 3 18 -71 -15 -11 -3 -47 -26 -3 28 0 -13 -28 34 8 6 -7 17 25
4891 25 -7 25 52 9 26 5 20 43 50 35 1 31 30 14 22 -11 39 23 -22 -22 -21 -10 -9 -58 0 28 -17 -30 -38 1 4 -47 -38 -60 -41
4926 -41 -15 -16 -5 8 -26 -29 -19 -2 20 -20 -45 -21 9 -20 -14 -13 -2 5 -7 15 33 34 35 20 37 52 62 5 -14 28 37 29 11 37 33
4961 33 44 15 -11 1 60 2 9 -1 -1 16 -15 -44 -1 10 -38 -26 -9 -6 -10 -55 -70 -20 -24 -20 -24 8 -7 -9 -48 -36 -33 -32 -4 -30 -6
4996 -6 16 11 -3 -16 16 16 -9 20 48 28 -27 11 37 28 52 53 5 25 47 23 13 3 12 22 -13 -2 33 29 4 -22 -13 24 -22 -23 -14
5031 -14 -55 14 -34 -18 -36 -33 -38 -46 -54 -12 -46 -50 -25 -26 -26 -18 -49 4 0 17 -28 -17 -14 32 -1 -15 8 16 30 -16 37 6 22 25 8 6 56
5068 56 43 16 35 22 56 21 18 46 39 1 -1 9 44 27 -8 -19 5 30 -28 -17 -47 -12 -47 1 -25 -22 -26 -67 -45 -21 -31 -21 -48
5101 -48 -24 -13 3 -17 -26 -2 -24 3 -10 -23 1 -18 1 -10 13 38 39 -5 44 35 13 32 11 54 50 32 13 21 19 15 28 11 29 18
5135 18 -16 -17 24 11 -12 -9 20 15 12 -12 -14 -18 -38 -14 -46 -25 18 -37 -38 -3 -16 -25 -34 -33 -36 -12 -26 -13 -4 32 24 -27 4 4 -28 -6 -10 22
5173 22 11 11 -14 18 30 12 2 5 23 26 9 9 19 40 20 11 6 25 45 -11 -3 7 12 29 -4 -8 -26 -15 -48 -37 -52 9 -17 -34 5
5208 5 -15 -35 -38 -16 -10 -14 -19 -35 -63 -15 -29 -39 -43 2 3 -12 -3 15 -19 -1 7 -6 20 3 7 13 8 20 31 -8 -11 36 53 -8 -1 40 50
5245 50 7 34 -8 28 -2 8 26 14 18 -1 -17 21 -4 24 -39 -16 -2 -24 2 -30 -6 -25 -25 -41 -13 15 -7 -21 -14 15 1 -32
5277 -32 -6 -5 -3 -13 -3 11 -4 18 8 -3 -5 33 -1 -4 13 16 31 16 42 51 34 27 6 18 38 14 8 28 2 35 -1 0 2 -18 13
5312 13 -2 -15 -15 1 -43 -21 -26 -16 0 -23 -33 -2 -19 -22 -20 -1 -2 -44 -55 -27 -5 -8 11 -12 -21 13 -10 -5 -18 16 12 18 5 9 4 3 13
5349 13 19 40 22 21 30 9 12 14 22 52 -1 -11 41 13 2 -25 11 -2 2 -9 -11 -23 -5 -1 -44 -38 -36 12 -43 -22 -11 -10 -11 -52 6 6 -15
5386 -15 11 -3 -36 -11 10 -21 4 16 1 -7 12 -18 22 -13 -3 13 16 -6 1 15 3 8 22 -4 0 24 4 4 11 0 14 17 -7 34
5420 34 10 18 28 -40 8 -20 2 -26 -12 40 -1 8 -15 7 10 -29 -16 10 -9 7 -35 -22 -19 1 -12 -17 24 11 19 -31 20 15 3 -13
5454 -13 11 9 -5 21 -22 5 9 -15 -1 -8 0 22 0 -6 -16 14 20 13 15 25 39 32 -2 30 32 -18 -28 -14 -12 -41 -2 -1 -38 -13 9 -17
5490 -17 -25 7 -27 3 -29 -28 -5 33 0 -3 -8 -13 -30 20 -5 19 18 15 30 42 17 -24 6 46 4 22 -4 -11 31 13 -9 -3 22 22 -6
5525 -6 -9 12 -14 22 -7 -1 -26 22 -26 6 13 18 -33 -43 -21 -14 15 -19 -30 7 9 -41 -44 -9 -10 7 -9 -27 -2 -31 18 -56 -4 9 9
5560 9 -20 -16 18 36 -27 -2 26 52 -9 6 21 -13 18 0 0 26 33 8 17 7 2 -37 7 -6 -5 1 2 2 11 -12 13 -28 -16 -7 -8 0 -25
5597 -25 19 -5 -30 -38 7 -1 2 -6 -1 -16 -7 -2 -32 9 14 -13 -12 -14 21 6 -12 5 7 3 -4 2 20 9 34 -14 15 33 4 10 -28 7 28 29
5635 29 0 5 13 -2 -12 12 21 -11 -12 5 -12 -1 -11 -25 -14 -22 -3 -20 -29 -13 0 -40 -6 13 -4 15 -33 -7 7 -11 -19 -25 10 -6
5669 -6 21 17 -37 -3 15 5 -3 18 28 8 -6 24 27 21 27 -3 4 10 6 -15 34 30 22 24 24 18 -11 7 -3 -23 23 -4 -5 -3 -2 9 -1 -24 -20
5708 -20 -17 -9 -14 -31 -14 -1 2 -22 10 -9 -2 -22 2 -7 -14 -34 -7 21 -4 0 -8 4 13 24 -1 -9 -9 43 7 -15 16 24 17 2 27 16 35
5745 35 14 6 25 27 16 21 30 1 -3 -7 -14 -33 12 25 4 -36 7 -36 -25 9 23 4 -42 -45 -5 7 -25 -30 -47 0 -40 -33 -24 -21 1 -23
5781 -23 -12 -20 -2 -5 9 22 -1 -6 25 11 -1 21 11 23 28 -3 28 34 -3 37 49 27 -11 -6 39 28 15 13 -7 -13 11 -18 -38 17
5815 17 -23 -14 -37 -16 -30 -30 -23 -22 -6 9 -20 7 7 6 -12 -43 35 -25 -38 -2 -31 -12 -32 -34 -10 -2 -8 0 -13 16 3 19 14 24 16 16 11
5852 11 23 9 10 50 12 20 22 32 28 -5 49 21 3 -5 26 5 8 4 -1 -5 -18 -9 -14 8 -1 10 -3 -39 0 -10 -7 -6 -28 -13 -14 -29 -2 25
5890 25 -42 -34 -32 -48 -18 -22 -10 -1 -1 -26 29 -8 0 34 10 -8 36 6 30 21 40 16 14 25 10 25 25 23 6 24 9 -2 6 8 34 30 19
5927 19 22 16 24 8 -23 19 -25 -14 -29 -4 13 -18 6 -36 12 -34 -33 -71 -47 -8 -22 -20 -15 -23 19 -21 3 -23 -32 12 3 4 28 37 -3 -29
5963 -29 31 38 -1 -7 9 22 32 26 59 24 27 53 -5 12 28 1 38 1 21 8 -9 0 -17 15 13 -8 -15 -46 -5 -24 22 -6 -9 -21
5997 -21 -23 -28 -2 -1 -30 -13 -23 13 1 11 -5 8 15 -19 -31 -22 -28 -22 -5 -14 36 21 -26 11 19 46 24 31 -11 29 15 13 -13 16 23 0
6033 0 33 13 10 0 26 7 12 28 20 -9 13 8 -17 16 -17 -6 -20 -8 -29 -7 -4 4 -38 -30 8 2 -31 -3 17 -27 7 -41 -3 15 -5
6068 -5 -23 5 -13 14 -20 14 3 39 22 -13 -10 -13 9 -8 2 11 11 52 16 13 11 20 10 37 -4 39 -10 -6 8 15 1 -14 6 13 -7 -10
6104 -10 11 -17 9 -12 -46 16 -10 -30 -5 -13 -1 -16 -40 10 -26 -25 -20 -25 -9 -5 4 -5 -13 7 -7 15 26 7 -9 20 -13 -4 5 3 -3 25
6140 25 16 6 -3 -1 5 35 47 -7 32 24 25 20 11 18 16 22 -6 -1 0 32 0 15 13 -1 1 -18 -23 -10 2 9 -5 -7 9 -5 -1 -6 -23 -38 -33 -16 -29
6181 -29 -15 -25 13 -24 -9 -6 -5 -5 19 -12 -2 4 13 -2 -8 -6 -38 16 -8 2 -21 -10 34 -1 10 5 -4 34 -21 -5 -1 3 3 -7 -5 -6 -23
6218 -23 -13 -34 -1 12 -1 10 -12 -1 -8 22 -8 8 -13 -31 -7 -6 22 -9 -1 -22 6 15 24 -4 -21 33 -13 22 4 1 -29 7 -23
6251 -23 22 47 -30 -13 -20 30 8 7 -5 -22 18 -7 -29 -21 24 3 17 20 -10 20 -16 -22 -5 -6 18 1 -5 4 4 -29 -31 8 -20 -8 -5 -16
6287 -16 -16 -2 28 8 -5 25 25 3 4 30 0 -11 25 -3 14 -2 9 14 22 15 -17 -11 2 -5 30 -7 8 -14 20 -28 5 7 -5 26 3
6322 3 17 1 -7 9 -32 -7 6 -9 -9 5 20 -10 -11 10 19 13 4 -18 10 -6 7 13 -14 -1 -9 -12 -13 -7 34 17 -11 32 39 16 3 -8 19
6359 19 12 -2 3 -2 20 10 16 12 7 9 -21 -17 18 -16 -9 8 8 -14 -9 -17 3 -16 -30 6 -19 1 9 -37 -11 -16 37 -4 -26 -15 -1 -8 -15 -5
6397 -5 -21 -7 -27 8 15 35 14 -11 11 19 6 2 26 5 -15 2 -10 -4 3 -18 21 0 20 16 1 -22 8 21 29 0 3 0 9 -5 1 -1 14
6434 14 0 -22 -29 5 -23 6 22 -23 15 4 -16 21 11 -16 0 -14 14 21 -2 -10 -23 23 29 0 0 11 4 26 30 24 8 -1 -3 23 11
6469 11 29 21 -18 32 0 6 14 -4 -8 7 -6 -9 44 15 14 9 0 1 1 8 -2 5 -13 -14 22 -2 4 -5 11 -17 -17 -16 0 -1 -9 -7 22 13 -20 21 3
6510 3 22 -26 -14 8 11 -25 2 29 23 4 37 13 31 -2 -12 24 21 21 2 -5 31 34 8 -10 23 16 14 0 24 25 23 6 -12 -10 28 32 -7
6547 -7 12 -11 12 -9 -27 3 3 -24 -27 0 15 17 -4 -25 -21 -14 13 -11 3 1 -22 -16 -7 -14 0 -4 18 6 21 -5 22 18 24 7 28 14 20
6584 20 23 20 29 6 27 -1 34 11 61 15 11 -18 -4 10 23 -5 -15 -12 4 -4 20 -15 -11 -15 -10 -23 29 -15 9 3 -9 24 -21 -10 -9 -2
6620 -2 -7 -16 9 23 1 39 -50 13 29 2 -18 17 31 -19 48 24 3 11 43 31 23 30 29 33 30 -13 77 -3 42 47 21 10 22 7 8 21
6656 21 8 1 4 26 -5 -19 6 -7 -10 -12 8 0 -23 -9 -19 -1 7 -24 -14 -24 22 -22 -16 -12 -8 15 -7 15 -5 5 -10 -13 4 46 8
6691 8 -9 4 4 18 12 -14 -6 26 -20 -7 12 11 34 27 -3 0 -9 5 3 22 -2 24 -4 -15 16 19 3 -27 -27 -8 2 35 6 5 -3 2 -19
6728 -19 -10 -17 -7 9 -35 -4 25 -6 -5 -11 3 -20 10 15 -4 -44 11 6 12 0 29 38 26 20 19 18 22 14 18 61 23 42 -20 10 1 12 24 17
6766 17 7 3 10 3 -4 4 -11 7 -4 14 5 -7 44 10 -5 -13 -6 -1 1 -9 17 -17 -14 -23 -28 -33 -2 3 -5 4 -11 22 -19 -4 -19 -24 -4 -27 23
6805 23 8 -1 25 14 11 27 4 -1 -15 14 -15 48 -6 31 13 17 14 23 5 0 -11 11 28 -5 7 15 6 -8 23 6 -25 -2 -2 -4 5 6 2
6842 2 6 13 7 -1 -6 -8 9 -10 -1 -10 -2 -11 3 -25 -20 15 1 -11 4 -2 -32 9 12 -23 -1 -7 10 5 6 15 -3 25 27 3 2 -2 -20 -6 30 19 1
6883 1 -15 22 0 22 42 4 25 -5 -8 8 15 -8 1 6 -14 -2 26 -21 -24 6 14 14 -9 -12 -23 -5 -16 -23 13 -37 16 2 11 19 -1 -11
6919 -11 0 12 -2 27 8 6 12 8 25 12 14 9 3 11 29 8 9 25 6 37 11 -4 23 17 38 21 13 6 16 26 1 24 -4 11 33 -22
6955 -22 36 -34 21 -23 -4 1 11 15 1 10 14 2 -1 -26 9 2 8 -4 -2 17 -1 20 26 9 20 -2 32 9 -13 13 12 -5 38 10 2 40
6991 40 9 31 19 -12 1 20 9 17 8 9 7 -8 32 10 -16 -8 18 4 7 25 19 15 22 -9 6 19 -8 -23 -2 -25 9 -8 -19 6 -38
7026 -38 -14 -12 16 -17 13 -2 -1 9 3 -10 4 -12 7 -3 13 -14 -13 16 12 16 17 8 33 8 31 7 6 6 -12 4 33 22 26 10 10 -14
7062 -14 -2 43 3 0 -10 1 -14 2 -14 -16 22 -22 -15 -24 -17 -14 18 22 -2 3 8 -3 -36 12 3 -1 36 -28 -21 8 15 -6 -17 -6 -37 -8 13
7099 13 -8 6 4 -17 8 11 11 -4 26 -5 -13 34 35 19 -21 -7 -7 27 -12 -4 7 8 -11 3 33 0 8 7 11 -10 2 -1 27 -4 -19 5
7135 5 -1 13 32 33 6 15 21 -15 -6 -5 -6 8 24 5 8 24 11 -11 -8 40 2 11 19 15 -21 10 4 27 17 3 47 -2 -1 1 29 13 -16 3
7173 3 21 -5 17 -25 13 -9 0 8 14 2 -6 -5 12 25 8 36 -1 18 15 11 -19 -8 25 -20 -9 -3 10 10 -19 19 19 2 8 -23 -15 -3 -10
7210 -10 8 4 -2 -6 17 10 -8 8 -11 3 -8 -2 10 11 0 8 30 16 0 14 -10 6 -21 -33 -22 -9 11 -8 20 6 1 -7 7 15 46
7245 46 -17 -3 22 22 21 15 32 7 -17 -21 5 16 -33 7 16 7 1 10 -6 7 1 21 -18 -4 32 10 -4 8 -26 -13 -15 -10 -2 -11 -17 2 -13
7282 -13 9 -13 -21 -35 6 -37 -1 2 2 -1 1 19 -1 -15 -53 15 37 -17 7 41 -15 0 -5 25 5 -18 10 17 35 -6 31 2 20 -18
7316 -18 30 0 -25 7 5 13 21 12 -4 10 -20 2 0 -3 -10 1 -3 -16 8 23 3 -16 -11 -3 13 -23 9 -13 14 14 13 9 -1 16 -6 3 -4 12
7354 12 -1 -12 -12 -2 22 -16 -3 14 -4 11 9 6 17 16 -16 14 6 0 -8 -6 -12 -3 -14 5 -3 29 21 6 9 -12 23 -21 12 0 -10 32 -29
7391 -29 -18 -9 4 -4 -15 17 -23 -12 -10 -9 -30 -10 0 -6 19 -13 6 -14 -5 21 9 -26 0 10 2 28 21 20 -10 1 -12 9 0 7 -2 27
7427 27 29 48 21 -3 -4 23 20 9 18 -9 3 -3 15 -11 6 23 18 -16 11 18 7 16 -1 13 23 -19 0 2 -17 35 14 19 19 -19 -10 -25
7463 -25 21 20 11 13 -11 1 2 14 -15 8 23 3 30 -3 9 29 21 -6 20 8 24 0 17 22 13 7 12 29 39 -15 19 2 18 17 9 -7
7499 -7 21 31 21 14 19 23 16 -11 6 -18 -11 -44 -22 -5 -13 -12 13 -20 -21 -9 9 7 -12 12 -4 -28 -18 3 0 -16 15 -7 -1 38 6 42
7535 42 21 -12 -11 16 -13 -14 7 20 19 25 27 14 20 26 2 20 8 14 13 8 6 18 28 20 24 -7 24 -12 12 23 18 -9 6 24 -24 -1 36
7572 36 15 -3 11 2 7 -10 -17 -20 -14 -36 -19 -16 9 -2 11 -12 13 -11 -12 13 15 16 2 18 -1 -1 26 10 -17 1 5 22 59 3 14 24
7608 24 16 10 12 -6 -18 -15 37 26 -18 27 -6 -16 14 -4 11 6 16 1 -18 -11 -20 -12 -18 -29 -22 4 -37 11 -4 -17 -23 -20 16 3 20 5
7644 5 0 -5 -14 -7 -5 -8 27 7 5 6 3 -3 4 32 27 20 -22 7 21 -2 6 -12 -7 12 34 22 35 16 7 -11 13 41 -7 16 -19 8 8 -3 23
7683 23 -30 17 -3 -4 -18 -8 3 -14 -22 -24 0 -8 -27 -22 -10 -19 -32 28 -11 4 1 17 5 -7 -12 19 -4 -8 -5 -4 29 3 2 -26 14 4
7719 4 4 10 -11 35 19 -3 26 10 -4 16 16 3 22 20 -7 27 0 8 17 0 8 30 27 12 19 9 10 14 18 -17 -21 -1 8 -13 8 6 -4 12
7757 12 35 -13 -34 -10 -34 -7 18 -5 -16 -4 1 -7 -14 -11 14 37 -7 -19 -9 11 6 8 25 14 -4 3 14 -33 1 13 24 32 -6 -5 29
7792 29 -3 13 -9 -15 2 22 -4 15 24 -4 23 -20 -1 4 6 -24 -12 11 6 8 -1 18 -16 -7 -13 30 -16 10 4 -12 14 -9 17 14 -4 12
7828 12 2 10 -14 8 -18 11 29 -13 29 2 8 -3 5 6 -10 12 32 55 23 21 21 8 10 -22 5 29 17 -20 27 21 11 7 19 12 3 50
7864 50 1 14 35 -31 9 -19 18 -6 2 20 16 -15 -9 -6 25 -26 -40 -2 -31 8 20 -17 5 43 1 -9 1 7 8 25 -1 23 0
7897 0 10 5 7 24 -12 -8 51 11 1 8 26 -4 11 -6 19 39 -24 -13 -6 -31 -21 20 0 -8 3 -5 -16 8 3 12 -2 -21 -17 2 -3 -23
7933 -23 7 -5 -22 6 -16 3 -3 -18 2 -18 21 -7 29 -16 -19 2 -20 -5 23 -5 59 5 13 9 24 3 -16 39 -14 -8 24 12 12
7966 12 17 -9 -4 12 9 2 -3 30 21 -8 -1 34 26 -5 8 1 19 -9 -12 -18 12 -20 -18 -16 -12 -8 12 1 18 -11 -12 25 -12 -1 12 -2 29 -12
8004 -12 4 6 -11 15 3 8 12 -38 7 -45 7 3 17 -49 0 1 -4 -3 -11 13 3 26 -11 19 28 6 34 12 10 15 6 19 -27 18 15 4 14
8041 14 -23 24 -3 -40 15 -8 25 -23 -9 -9 16 -11 0 7 -27 28 31 -17 0 -40 2 -14 -12 -23 -18 19 14 8 -2 -5 -19 14 -10 5
8075 5 13 10 7 4 -3 -5 1 5 17 5 -8 -2 6 3 0 1 -2 1 4 5 2 -13 4 20 -5 0 20 1 13 21 11 18 14 -22 20 13 1 -14 -5 10 8 -6 -25
8118 -25 -17 -47 -10 -10 8 11 8 2 -9 -9 -15 -6 -15 28 -12 -17 -1 -13 -7 11 4 8 10 8 -8 24 -22 -3 26 -10 14 -1 9 23 12 25 27 3
8156 3 1 18 26 24 13 3 23 -2 18 23 -6 -12 -11 -7 11 -11 -23 -3 -23 2 12 -16 10 -30 -20 -1 2 2 -17 -27 -4 13 -35 -11 3
8191C
##END NTUPLES=NMR FID
##END=
