##TITLE=1H_LR-684B-FK
 DMSO, 8 sc, 
 26.7.2019
##JCAMPDX= 6.0         $$ Bruker NMR JCAMP-DX V2.0
##DATA TYPE= NMR FID
##DATA CLASS= NTUPLES
##ORIGIN= UXNMR, Bruker Analytische Messtechnik GmbH
##OWNER= root
$$ XWIN-NMR		Version 3.5
$$ Fri Jul 26 15:01:13 2019 Russian Standard Time (UT+4h)  she@DPX200
##.OBSERVE FREQUENCY= 200.13155
##.OBSERVE NUCLEUS= ^1H
##.DELAY= (6, 6)
##.ACQUISITION MODE= SIMULTANEOUS
##.ACQUISITION SCHEME= undefined
##.AVERAGES= 8
##.DIGITISER RES= 18
##SPECTROMETER/DATA SYSTEM= spect
##.PULSE SEQUENCE= zg30
##.SOLVENT NAME= DMSO
##.SHIFT REFERENCE= (INTERNAL, DMSO, 0, 15.7039)
##AUDIT TRAIL= $$ (NUMBER, WHEN, WHO, WHERE, WHAT)
$$ ##TITLE= Audit trail, XWIN-NMR		Version 3.5
$$ ##JCAMPDX= 5.01
$$ ##ORIGIN= Bruker BioSpin GmbH
$$ ##OWNER= she
$$ F:/spectra/data/she/nmr/H-F/1/audita.txt
$$ ##AUDIT TRAIL=  $$ (NUMBER, WHEN, WHO, WHERE, WHAT)
(   1,<2019-07-26 15:00:17.64 +0400>,<she>,<DPX200>,
      <created by zg, POWCHK disabled, PULCHK disabled
       configuration hash MD5:
       00 E9 B6 7A A2 85 ED C7 34 08 36 98 17 FE 4E 26
       data hash MD5: 16K
       C7 C1 EC 80 B7 0C F5 B0 5C 57 97 79 2D 09 35 E1>)
$$ ##END=
$$ 
$$ hash MD5
$$ 19 73 87 7B B6 5B 26 63 5B E7 B3 15 04 97 DB 32
##$RELAX= 
##$RELAX= 
##$RELAX= 
##$RELAX= 
##$RELAX= 
##$RELAX= 
$$ Bruker specific parameters
$$ --------------------------
##$DU= <F:/spectra>
##$EXPNO= 1
##$NAME= <H-F>
##$PROCNO= 1
##$TYPE= <nmr>
##$USER= <she>
##$AMP= (0..31)
100 100 100 100 100 100 100 100 100 100 100 100 100 100 100 100 100 100 
100 100 100 100 100 100 100 100 100 100 100 100 100 100 
##$AQSEQ= 0
##$AQ_mod= 1
##$AUNM= <au_zg>
##$AUTOPOS= <>
##$BF1= 200.13
##$BF2= 200.13
##$BF3= 200.13
##$BF4= 200.13
##$BF5= 200.13
##$BF6= 200.13
##$BF7= 200.13
##$BF8= 200.13
##$BYTORDA= 1
##$CFDGTYP= 0
##$CFRGTYP= 5
##$CHEMSTR= <none>
##$CNST= (0..31)
1 1 145 1 1 1 1 1 1 1 1 1 1 1 1 1 1 1 1 1 1 1 1 1 1 1 1 1 1 1 1 1 
##$CPDPRG= <>
##$CPDPRG1= <>
##$CPDPRG2= <>
##$CPDPRG3= <>
##$CPDPRG4= <mlev>
##$CPDPRG5= <mlev>
##$CPDPRG6= <mlev>
##$CPDPRG7= <mlev>
##$CPDPRG8= <mlev>
##$CPDPRGB= <>
##$CPDPRGT= <>
##$D= (0..31)
0 1.2 0 0 0 0 0 0 0 0 0 0.03 0 0 0 0 0 0 0 0 0 0 0 0 0 0 0 0 0 0 0 0 
##$DATE= 1564138816
##$DBL= (0..7)
120 120 120 120 120 120 120 120 
##$DBP= (0..7)
150 150 150 150 150 150 150 150 
##$DBP07= 0
##$DBPNAM0= <>
##$DBPNAM1= <>
##$DBPNAM2= <>
##$DBPNAM3= <>
##$DBPNAM4= <>
##$DBPNAM5= <>
##$DBPNAM6= <>
##$DBPNAM7= <>
##$DBPOAL= (0..7)
0.5 0.5 0.5 0.5 0.5 0.5 0.5 0.5 
##$DBPOFFS= (0..7)
0 0 0 0 0 0 0 0 
##$DE= 6
##$DECBNUC= <off>
##$DECIM= 24
##$DECNUC= <off>
##$DECSTAT= 4
##$DIGMOD= 1
##$DIGTYP= 9
##$DL= (0..7)
0 120 120 120 120 120 120 120 
##$DP= (0..7)
150 150 150 150 150 150 150 150 
##$DP07= 0
##$DPNAME0= <>
##$DPNAME1= <>
##$DPNAME2= <>
##$DPNAME3= <>
##$DPNAME4= <>
##$DPNAME5= <>
##$DPNAME6= <>
##$DPNAME7= <>
##$DPOAL= (0..7)
0.5 0.5 0.5 0.5 0.5 0.5 0.5 0.5 
##$DPOFFS= (0..7)
0 0 0 0 0 0 0 0 
##$DQDMODE= 0
##$DR= 18
##$DS= 0
##$DSLIST= <SSSSSSSSSSSSSSS>
##$DSPFIRM= 0
$$ [...]
##$SUBNAM2= <"">
##$SUBNAM3= <"">
##$SUBNAM4= <"">
##$SUBNAM5= <"">
##$SUBNAM6= <"">
##$SUBNAM7= <"">
##$SUBNAM8= <"">
##$SUBNAM9= <"">
##$SW= 24.9336996594482
##$SWIBOX= (0..15)
0 0 2 0 0 0 0 0 0 0 0 0 0 0 0 0 
##$SW_h= 4990.01996007984
##$TD= 16384
##$TD0= 1
##$TE= 0
##$TE2= 300
##$TE3= 300
##$TEG= 300
##$TL= (0..7)
0 120 120 120 120 120 120 120 
##$TP= (0..7)
150 150 150 150 150 150 150 150 
##$TP07= 0
##$TPNAME0= <>
##$TPNAME1= <>
##$TPNAME2= <>
##$TPNAME3= <>
##$TPNAME4= <>
##$TPNAME5= <>
##$TPNAME6= <>
##$TPNAME7= <>
##$TPOAL= (0..7)
0.5 0.5 0.5 0.5 0.5 0.5 0.5 0.5 
##$TPOFFS= (0..7)
0 0 0 0 0 0 0 0 
##$TUNHIN= 0
##$TUNHOUT= 0
##$TUNXOUT= 0
##$USERA1= <user>
##$USERA2= <user>
##$USERA3= <user>
##$USERA4= <user>
##$USERA5= <user>
##$V9= 5
##$VALIST= <valist>
##$VCLIST= <CCCCCCCCCCCCCCC>
##$VD= 0
##$VDLIST= <DDDDDDDDDDDDDDD>
##$VPLIST= <PPPPPPPPPPPPPPP>
##$VTLIST= <TTTTTTTTTTTTTTT>
##$WBST= 1024
##$WBSW= 4
##$XGAIN= (0..3)
0 0 0 0 
##$XL= 0
##$YL= 0
##$YMAX_a= 227052
##$YMIN_a= -360047
##$ZGOPTNS= <>
##$ZL1= 120
##$ZL2= 120
##$ZL3= 120
##$ZL4= 120
##$ABSF1= 10
##$ABSF2= 0
##$ABSG= 5
##$ABSL= 3
##$ALPHA= 0
##$AQORDER= 0
##$ASSFAC= 0
##$ASSFACI= 0
##$ASSFACX= 0
##$ASSWID= 0
##$AUNMP= <proc_1d>
##$AZFE= 0.1
##$AZFW= 0.1
##$BCFW= 1
##$BC_mod= 2
##$BYTORDP= 1
##$COROFFS= 0
##$CY= 11.3945322036743
##$DATMOD= 1
##$DC= 2
##$DFILT= <>
##$DTYPP= 0
##$F1P= 20.1537800932815
##$F2P= 0.134698688090026
##$FCOR= 0.5
##$FTSIZE= 0
##$FT_mod= 4
##$GAMMA= 1
##$GB= 0.15
##$INTBC= 1
##$INTSCL= 1
##$ISEN= 128
##$LB= 0.24
##$LEV0= 0
##$LPBIN= 0
##$MAXI= 10000
##$MC2= 0
##$MEAN= 0
##$ME_mod= 0
##$MI= 1.114404
##$NCOEF= 0
##$NC_proc= 0
##$NLEV= 6
##$NOISF1= 3.799351
##$NOISF2= 2.8
##$NSP= 1
##$NTH_PI= 0
##$NZP= 0
##$OFFSET= 15.70392
##$PC= 1
##$PHC0= -9224.299
##$PHC1= 13.80097
##$PH_mod= 1
##$PKNL= yes
##$PPARMOD= 0
##$PSCAL= 0
##$PSIGN= 0
##$REVERSE= no
##$SF= 200.130013532006
##$SI= 16384
##$SIGF1= 3
##$SIGF2= 2
##$SINO= 400
##$SIOLD= 16384
##$SREGLST= <1H.CDCl3>
##$SSB= 0
##$STSI= 0
##$STSR= 0
##$SW_p= 3612.71676300578
##$SYMM= 0
##$S_DEV= 0
##$TDeff= 0
##$TDoff= 0
##$TI= <>
##$TILT= no
##$TM1= 0
##$TM2= 0
##$TOPLEV= 0
##$USERP1= <user>
##$USERP2= <user>
##$USERP3= <user>
##$USERP4= <user>
##$USERP5= <user>
##$WDW= 1
##$XDIM= 8192
##$YMAX_p= 0
##$YMIN_p= 0
$$ End of Bruker specific parameters
$$ ---------------------------------
##NTUPLES= NMR FID
##VAR_NAME=  TIME,          FID/REAL,        FID/IMAG
##SYMBOL=    X,             R,               I
##VAR_TYPE=  INDEPENDENT,   DEPENDENT,       DEPENDENT
##VAR_FORM=  AFFN,          ASDF,            ASDF
##VAR_DIM=   8192,          8192,            8192
##UNITS=     SECONDS,       ARBITRARY UNITS, ARBITRARY UNITS
##FACTOR=    0.0002004,     1,               1
##FIRST=     0,             0,               0
##LAST=      1.6414764,     0,               0
##MIN=       0,             -360047,         0
##MAX=       1.6414764,     227052,          0
$$ Real data points
##PAGE= N=1
##DATA TABLE= (X++(R..R)), XYDATA
0 0 0 0 0 0 0 0 8 -8 8 -14 16 -16 24 -32 40 -44 56 -64 74 -89 104 -121 144 -165 188 -217 247 -280 318
29 318 -359 406 -455 511 -572 638 -712 790 -881 977 -1082 1199 -1327 1466 -1626 1802 -1997
46 -1997 2218 -2472 2759 -3096 3490 -3962 4543 -5270 6215 -7501 9364 -12320 17753 -31099
60 -31099 134617 102901 -138918 -3443 89608 107978 101643 93961 -32222 -51001 85470 151275
72 151275 -5325 -141085 -150330 -97922 -7305 120530 79450 -137001 -243453 -120881 -22680
83 -22680 -52739 -90691 -120012 -182821 -126135 54913 70967 -156710 -291276 -181594 -46937
94 -46937 -7798 18223 -15486 -144352 -170895 -11971 78816 -26074 -119218 -83163 -23663 44150
106 44150 145014 129337 -51444 -144240 -14389 126743 127526 80965 36245 -16859 29072 180627
118 180627 199707 18913 -88740 9635 124510 149879 154939 105280 -27550 -62914 74929
129 74929 155873 57778 -32637 -15571 6230 34229 115278 100168 -85391 -196184 -70931
140 -70931 77468 59563 -27271 -81374 -117184 -89740 11149 24995 -107525 -190596 -117521
151 -117521 -25042 4880 11674 -45897 -177193 -201363 -52152 46219 -30136 -109557 -87263 -59252
163 -59252 -36589 33242 36549 -100515 -177281 -46760 108018 104279 22224 -31985 -61345 -29485
175 -29485 78023 120280 24883 -45820 19694 105591 121227 107443 58557 -35223 -46265 84643
187 84643 183333 127828 37745 16810 20595 46395 116575 116942 -9810 -76485 39335 157886
199 157886 116331 13690 -37399 -59622 -39984 50340 99065 14989 -78110 -55318 6791 17842
211 17842 2702 -35355 -107931 -117262 -6379 79861 20059 -85310 -117285 -96827 -50963 17390
223 17390 21420 -76671 -130581 -42608 49457 20855 -51413 -82807 -91267 -57275 41658 94176
235 94176 11289 -82978 -58274 15864 39082 34068 18852 -25730 -35935 47963 125911 82968
247 82968 -15172 -50480 -17067 49253 114391 105369 9813 -41919 26931 99952 73664 13155
259 13155 -9149 -12931 11804 84397 117369 35713 -60827 -53879 10048 41626 42539 18889 -38454
272 -38454 -61349 6804 70533 20237 -77757 -102225 -53513 6090 44422 25396 -55855 -107600
284 -107600 -63334 2306 1738 -37252 -62266 -69644 -42472 23707 45536 -31279 -109873 -88769
296 -88769 -15876 24070 29892 9519 -42720 -66532 -6058 60325 31115 -45311 -59337 -6098
308 -6098 52934 82428 58528 -14707 -58393 -13248 58433 70766 36796 9150 464 18457
320 18457 63520 79493 22234 -41845 -30295 33934 79687 80389 37573 -28288 -49096 11146
332 11146 69164 39439 -28964 -40863 719 36701 44659 18823 -40746 -80749 -47317 21560
344 21560 43697 7564 -38065 -57979 -40129 2561 17984 -26457 -77581 -65362 -6120 33991
356 33991 25606 -21453 -74789 -80564 -20751 37145 23477 -30033 -48509 -20471 15314 30985
368 30985 11862 -35755 -60084 -18005 48870 66939 28563 -15740 -31234 -11295 31521 55904
380 55904 29155 -15726 -16538 31098 71282 60195 6560 -39816 -29948 31227 76961 57462 5001
393 5001 -20122 -5214 21773 36796 23647 -13703 -36589 -9009 41939 55408 14934 -38769
405 -38769 -58325 -30635 17830 38218 6870 -40962 -47853 -10340 21549 8747 -35224 -65398
417 -65398 -50111 -998 34885 21636 -26438 -60664 -50820 -10693 18961 9134 -25759 -42809
429 -42809 -17952 22779 33199 1611 -39724 -49052 -15289 34110 54897 26659 -20087 -33818
441 -33818 159 40056 38699 1686 -23379 -5119 37284 61583 44620 1846 -28633 -17628
453 -17628 24262 54990 45840 11131 -12386 -3673 26094 42432 19838 -23178 -35977 785
465 785 47276 52736 13003 -32270 -43849 -14710 21639 23838 -6812 -31904 -24302 2220 18656
478 18656 7990 -27198 -58175 -47735 370 33332 16410 -25060 -47130 -36742 -8651 10684
490 10684 -1505 -34383 -43956 -10460 27763 28552 -4911 -40135 -47784 -17238 26849 38401 6801
503 6801 -23490 -15946 10866 24653 17205 -5281 -24731 -13381 29011 57341 38725 -2262 -24308
516 -24308 -15012 14665 41647 35530 -1200 -18127 10944 43622 35154 41 -25043 -24929 970
529 970 37128 45271 11699 -24307 -25101 -4190 10834 11291 -4817 -28605 -26582 10815 35165 9034
543 9034 -35378 -49708 -31504 -2687 19905 13574 -21461 -42410 -21202 7750 4795 -18270 -33592
556 -33592 -33211 -11872 22681 31140 -5379 -41522 -34379 -3943 14256 15971 4977 -15702 -18310
569 -18310 12057 35931 16719 -18075 -25122 -5203 22037 43169 36176 -1808 -25313 -1451
581 -1451 32225 30563 8736 -2730 -1517 10707 34424 41209 9798 -23293 -17710 10676 28231
594 28231 29726 14775 -13569 -22821 7180 32570 11507 -23555 -26470 -5918 11882 22663 14821
607 14821 -18986 -42698 -22177 10795 12084 -6641 -18846 -23209 -16891 6371 16665 -12448 -43750
620 -43750 -32915 202 15421 11618 -2288 -25481 -33624 -6461 21554 9390 -18379 -20310 -3752
633 -3752 11178 22898 17864 -13391 -34202 -7910 29727 30523 9026 -1518 -4559 -2801 15804
646 15804 30743 11466 -16511 -8703 20916 33297 25595 8759 -14411 -21281 8045 37226 23770
659 23770 -6696 -11413 1329 8664 13678 11430 -11977 -29576 -8042 23937 21530 -2390 -17042
672 -17042 -23782 -22011 689 19244 -577 -30882 -24337 3149 8834 -3444 -14986 -28011 -31096
685 -31096 -5634 22055 11381 -19242 -27765 -16252 -5232 5739 8628 -11165 -27365 -7015
697 -7015 22814 18102 -5620 -15161 -14278 -9202 12628 31905 15281 -15503 -12963 11856 20089 12405
711 12405 5122 -5745 -9506 14225 39512 25330 -7999 -14785 1016 11220 18369 21899 5989
724 5989 -12936 -2398 22149 20578 -720 -11894 -12506 -6077 14511 29449 7651 -24662 -22074
737 -22074 1906 7759 -310 -4360 -12076 -19080 -3067 19002 7493 -24173 -31423 -14662 -1626
750 -1626 6386 9413 -6883 -27049 -17542 7744 8115 -11091 -18068 -13001 -6002 10071 22232 4495
764 4495 -24195 -22023 2425 13044 9968 7147 -2044 -10398 5149 26932 15563 -13690 -15232
777 -15232 5448 16690 20112 22337 8195 -13489 -8820 16418 22501 6358 -2814 -442 4837
790 4837 16792 24621 6432 -20520 -17291 7866 17598 11187 5590 -4354 -15516 -6045 13723 7602
804 7602 -16470 -20324 -3952 5561 8001 6867 -9503 -30406 -22421 5253 11068 -6220 -14267 -10825
818 -10825 -8766 -2326 6684 -3325 -25160 -23471 871 13796 7887 -1578 -12281 -19190 -6169
831 -6169 14288 10676 -9577 -11518 3225 10107 10744 11305 -488 -17548 -9441 18126 25561 8678
845 8678 -2134 -902 846 8428 18783 10398 -9948 -8049 14255 23266 12723 2522 -5257 -10902
859 -10902 -1086 17913 17264 -2194 -10199 -1240 5414 6726 5761 -6707 -20877 -11311 13036 15648
873 15648 -3033 -13899 -12383 -11578 -4993 7018 2745 -16921 -19644 -313 9353 -70 -10361 -16160
887 -16160 -17855 -6368 11707 10706 -8731 -16708 -7392 572 2648 4055 -2484 -13509 -7258 13356
901 13356 18161 2404 -9287 -8083 -2917 7307 19130 13093 -6023 -8209 9461 16680 7759
914 7759 1010 -726 -2978 3995 19989 20746 869 -11530 -3596 7745 11418 10265 2631 -7827
928 -7827 -4175 11412 13920 -619 -10888 -9114 -4376 3568 12895 6972 -12423 -18174 -3754 5574
942 5574 329 -6468 -9876 -11813 -5201 8366 6767 -12058 -21761 -11628 -151 2865 3006 -2061
956 -2061 -12756 -12896 1319 8258 -1523 -11945 -10354 -2276 7120 13266 5698 -10417 -13323 934
970 934 10634 7742 3519 989 -2480 1593 13816 14617 -1397 -10520 -1040 11541 14900 12839 5331
985 5331 -5368 -5230 7887 14535 5521 -3624 -2318 3228 8345 11954 6025 -8664 -13534 -1536
999 -1536 9904 8723 1010 -5874 -9545 -4505 5275 4469 -9176 -15292 -6542 2650 4012 2041 -4598
1014 -4598 -15530 -16099 -2046 7578 230 -10331 -10161 -4125 1322 3848 -1338 -12109 -13913 -2181
1028 -2181 8690 7713 631 -5617 -8159 -3502 6809 9427 -214 -7088 -1279 8161 11299 8381 606
1043 606 -7249 -4801 8522 16061 8908 -369 -1273 2348 6031 9567 7170 -2246 -6575 2627 13813
1058 13813 12087 1810 -5898 -6635 -620 7461 8189 -181 -6962 -4179 1858 4340 1998 -4621 -11679
1073 -11679 -9819 1648 8693 1651 -9093 -11730 -7525 -1705 2162 -775 -9082 -11687 -3692 4614
1087 4614 2644 -5216 -10207 -10061 -4586 4111 6955 -445 -8952 -7556 831 5972 3841 -2371 -6584
1102 -6584 -2625 6763 11048 5486 -2586 -4839 -883 5698 11083 8915 347 -4105 2363 10476 9711
1117 9711 2349 -2981 -1688 4309 10731 10775 2685 -5024 -4196 2661 7645 6213 483 -4487 -3439 3143
1133 3143 7067 2482 -6303 -9872 -4527 3440 6295 922 -7550 -10102 -5223 1012 1063 -3212 -7520
1148 -7520 -7958 -3324 2536 3050 -4512 -12222 -10489 -1280 5124 2969 -3574 -7530 -5702 -261 3690
1163 3690 1234 -4283 -6369 -1860 5797 8452 3840 -4010 -6422 -1236 6623 9279 4778 -1027 -1651
1178 -1651 3831 8486 7395 1054 -3201 -1140 5638 10620 9169 2392 -3241 -2830 2904 7877 6156
1193 6156 -634 -4141 -45 6798 7209 261 -5806 -6719 -2641 3123 5573 1869 -5159 -7668 -3621
1208 -3621 1430 856 -4141 -8675 -6934 -603 4472 1706 -6159 -10904 -8481 -2097 1860 1190 -3575
1223 -3575 -6752 -4414 1033 2746 -1709 -6872 -7284 -2407 4611 7777 2648 -5076 -6159 -8 4800
1238 4800 4081 1082 -625 -263 3425 8021 7205 3 -5042 -1931 5096 9594 8057 2127 -2361 -238
1254 -238 5645 6646 1954 -1806 -1140 2386 6107 7839 3228 -4412 -6243 -1037 4368 4264 751 -2920
1270 -2920 -4119 -948 3548 1692 -5567 -9240 -4613 1174 3033 889 -3380 -8039 -7694 -1625 1782
1285 1782 -1171 -5800 -6023 -2831 1304 2732 -1722 -7898 -8132 -1500 3892 3128 112 -2644 -3836 -1654
1301 -1654 3770 4548 -1206 -4815 -649 5034 6922 4749 332 -3612 -1861 5109 8186 4138 -53
1316 -53 455 2606 4624 6024 3893 -1716 -3194 2246 7535 6587 2041 -1937 -3378 -18 5053 4881
1332 4881 -1686 -4848 -933 2963 2401 861 -2195 -6418 -5688 770 4451 67 -5521 -5814 -3282 -981
1348 -981 918 -1213 -6093 -6997 -1240 2992 653 -3146 -5192 -5622 -3225 2079 3748 -1895 -5856 -2860
1364 -2860 1626 2636 1276 -1425 -4167 -2280 4304 6934 2132 -2454 -1309 786 2513 4932 4893
1379 4893 -60 -2674 2092 7031 5390 815 -1160 -947 2010 6692 6763 746 -3374 -414 3133 3322
1395 3322 2371 818 -2429 -2524 2629 5420 919 -4501 -4240 -1765 714 2718 1590 -3892 -6413 -1716
1411 -1716 2196 -96 -3362 -3950 -3784 -2750 1289 2684 -2832 -7606 -5060 -48 1547 378 -1518
1426 -1518 -4195 -3769 1246 3367 -537 -4107 -2675 -134 1638 3894 3720 -1582 -4592 -271 5048
1441 5048 4117 384 -498 238 1555 4780 5501 435 -3552 -382 4081 4329 3695 2411 -481 -1953
1457 -1953 1760 5386 2197 -2417 -1940 934 2912 3472 2195 -2830 -5211 -1082 3274 1832 -1178
1472 -1178 -1799 -2282 -2431 636 2349 -2382 -6635 -3819 1109 1879 106 -1990 -4266 -4964 -851 2313
1488 2313 -418 -3962 -3023 -515 -145 1251 992 -2928 -5512 -1387 3843 3273 -131 -1467 -1439 -471 2435
1505 2435 3730 121 -3130 126 3868 3764 2278 1360 -978 -2318 1653 5949 3699 -938 -842 1575
1521 1575 2651 2918 2085 -1163 -2955 534 4437 3438 225 -1219 -1722 -1574 1090 3244 -83 -4045
1537 -4045 -2315 1745 1789 -396 -1855 -3745 -3988 -443 2902 409 -3466 -3545 -1553 -842 8 348 -2330
1554 -2330 -4739 -1799 2809 2098 -1768 -3356 -2607 -1335 1393 2944 197 -2982 -1309 1955 1984 742
1570 742 544 -961 -1787 1679 5455 3213 -1724 -1927 670 2270 2751 2764 562 -1783 693 4068 3065
1587 3065 -242 -1073 -607 -191 2228 4016 1286 -3077 -2217 1313 2242 494 -635 -1778 -2143 513
1603 513 2670 555 -3236 -3632 -1367 -154 532 1042 -1349 -4427 -2808 1385 1225 -2349 -3091 -1913
1619 -1913 -760 847 1656 -726 -3966 -2879 425 1301 744 163 -1022 -2083 266 3107 1687 -1962
1635 -1962 -2247 800 2236 2674 2435 241 -1946 -117 2933 3008 957 122 788 849 2352 3626 1200
1652 1200 -2345 -1446 2232 3359 2196 480 -671 -1394 49 2448 1182 -1636 -1881 -215 970 1133
1668 1133 824 -1688 -4194 -2638 1142 1678 -1001 -2364 -1703 -1194 -303 273 -1195 -3746 -2952 290 1481
1685 1481 281 -912 -2176 -3001 -1401 1691 1336 -1581 -2000 297 1728 1600 593 -1128 -2323 -428
1701 -428 2802 3232 1080 44 -90 188 1550 2986 1246 -1090 -386 2688 3823 1865 205 -675
1717 -675 -760 860 3024 2478 110 -735 285 1309 1409 887 -905 -2528 -970 2246 2643 -425 -2317
1734 -2317 -1912 -1101 -154 501 -487 -2597 -2007 -54 683 -582 -1659 -2682 -2905 -1110 1147 961 -1989
1751 -1989 -2911 -1491 -28 -56 -196 -1433 -2173 -921 1537 1707 -115 -1621 -1393 -576 1012 2301 1435
1768 1435 -979 -506 1745 2692 1440 183 -143 254 1544 3226 3006 558 -566 505 1652 2272
1784 2272 1785 640 -567 229 2377 2254 270 -1425 -952 191 959 1290 104 -1347 -1517 -367 712
1801 712 118 -903 -2216 -2085 -463 893 365 -2111 -3123 -1827 -294 -170 -821 -1681 -2350 -1689 -21
1818 -21 352 -901 -2207 -1887 -955 501 1120 30 -1937 -1783 184 1650 839 -262 -579 -378 881
1835 881 1754 1727 153 -574 238 1902 2507 1886 697 -539 321 2253 2835 1194 -494 160 1414 1839
1853 1839 1797 914 -483 -534 517 1785 1623 177 -973 -1160 26 1189 648 -1029 -2000 -997 418
1870 418 387 -366 -1639 -2148 -1523 -388 358 -512 -1825 -2026 -1242 -447 -39 -1166 -2263 -2023 -455 736
1888 736 346 -1001 -1938 -1481 -144 794 678 -100 -926 -546 733 1514 902 -442 -1026 192 1796 2367
1906 2367 1159 41 -80 896 1678 1759 1158 595 265 1116 2133 2152 692 -611 -531 1132 1916 1461 410
1925 410 -691 -207 647 1084 429 -845 -1056 -237 532 798 -4 -1157 -2055 -1376 20 336 -543 -1603
1943 -1603 -1676 -781 233 -287 -1512 -2311 -1654 -548 347 142 -706 -1592 -1819 -563 494 149 -1081 -1326
1961 -1326 -287 950 1132 316 -993 -1083 -288 1145 1375 644 77 3 403 1250 1417 735 -265 -271 1329
1980 1329 2260 1673 333 -444 42 981 1508 1255 20 -155 552 890 910 747 -342 -1236 -444 846 1207
1999 1207 214 -1154 -1056 -493 232 244 -799 -1458 -1269 -179 353 15 -957 -1585 -1718 -603 578 151 -1306
2018 -1306 -1510 -774 46 148 -358 -1050 -1512 -548 701 761 -86 -758 -611 -445 351 985 419 -734 -464
2037 -464 897 1813 711 -106 -565 -26 896 1730 1214 54 97 479 899 1198 1054 343 -629 112 1512
2056 1512 1416 423 -601 -448 335 607 1124 235 -885 -674 326 664 144 -478 -939 -813 -307 598 193
2075 193 -920 -1528 -899 72 5 -338 -926 -1371 -1100 219 225 -815 -1081 -963 -655 -6 703 -9 -1351 -1177
2095 -1177 104 942 305 -314 -364 -204 471 940 806 -148 -330 232 749 1095 1156 416 -658 -144 980
2114 980 1353 153 -177 187 678 1260 1120 439 -618 -307 414 1016 545 283 -218 -348 -200 709 607
2133 607 -667 -1297 -228 550 224 -29 -543 -1129 -1018 71 201 -332 -1051 -647 -620 -281 263 -343 -1617
2152 -1617 -1269 -65 727 181 -254 -628 -698 -287 276 435 -474 -652 134 497 451 508 87 -805 -612 937
2172 937 1384 374 -282 -8 555 666 684 390 -226 -210 719 1103 891 484 -28 -449 -150 897 995 -227
2192 -227 -476 142 848 519 -3 -255 -895 -754 543 865 -187 -681 -585 -459 -359 105 -225 -1114 -1105 41
2212 41 629 -162 -801 -829 -955 -553 155 333 -629 -867 -365 51 16 -28 -209 -1008 -852 633 1070 93 -608
2233 -608 -207 333 406 359 355 71 -214 628 963 651 193 -72 -321 158 1014 1271 242 -582 268 799 676
2254 676 302 133 -351 10 669 776 93 -364 -475 -69 79 372 264 -601 -741 15 494 12 -772 -737
2274 -737 -763 -346 145 256 -499 -1182 -729 -152 13 -354 -358 -641 -635 165 642 -389 -913 -537 85 22 311 262
2296 262 -423 -483 -216 448 502 102 -416 -36 191 564 1012 -34 -702 147 936 804 218 -66 32 111 461
2317 461 1064 469 -136 156 96 480 647 390 -383 -818 6 870 283 -263 -443 -412 -84 136 153 -322 -1005
2338 -1005 -328 338 106 -43 -479 -875 -731 -59 387 -154 -736 -410 0 -104 -160 9 -524 -656 -351 691
2358 691 440 -198 -316 -292 69 403 493 111 -646 192 987 420 164 106 125 -5 499 957 636 186 -142
2379 -142 239 153 510 324 -131 -498 322 902 363 -298 -401 -84 -88 230 390 -115 -422 -44 -136 147 -243
2400 -243 -382 -522 -596 3 598 -22 -795 -677 -391 -180 -216 2 -364 -811 -252 211 130 -264 -713 -305 -216
2421 -216 313 427 -41 -420 53 387 78 132 96 -75 -43 104 856 705 -115 -229 17 563 734 619 -26
2442 -26 -93 516 1027 303 -86 -76 245 398 450 547 365 -332 -279 -51 190 400 26 -311 -389 87 387 74
2464 74 -857 -974 -267 -71 150 -282 -596 -701 -507 49 -93 -395 -592 -553 -106 156 173 -205 -576 -428 -119
2485 -119 -84 -11 -188 -172 -399 173 432 437 -334 -556 -45 606 830 365 -111 -243 245 742 558 124 -8 450
2507 450 361 560 525 695 56 -153 197 614 520 184 -185 -454 366 622 41 -452 -354 56 253 -170 79
2528 79 -257 -307 -219 135 66 -384 -399 -372 -303 -20 -11 -240 -691 -547 -266 86 -99 -377 -486 -635 -157 264 136
2551 136 -278 -622 -91 369 338 44 -110 -336 189 589 364 35 13 138 139 371 649 400 -183 -311 255
2572 255 666 524 24 -274 -14 415 697 294 35 -217 396 351 217 13 157 -92 -185 -13 198 -114 -238
2593 -238 -544 -333 162 -102 -113 -473 -693 -115 133 -64 -538 -677 -377 -33 225 -91 -352 -555 -151 -185 57
2614 57 -230 -301 -219 -60 42 23 -197 -244 -212 -25 337 542 392 -204 -146 52 491 532 -56 -200 222 611 636
2637 636 245 117 -10 256 229 344 402 363 130 59 232 488 387 -54 -376 -119 219 320 62 -346 -289 123
2659 123 92 30 -282 -221 -196 86 134 -235 -276 -572 -410 -327 -40 104 -267 -312 -150 35 -54 -141 -295 -595 -132
2682 -132 393 386 102 -373 -248 -8 349 318 -142 -74 -12 317 412 168 168 107 124 342 361 356 288 147 32 75 408
2707 408 368 151 -291 167 568 379 60 -121 98 215 82 240 -6 -59 -130 258 178 -86 -231 -417 -154
2728 -154 -228 235 -75 -127 -473 -425 -485 -91 -144 -223 -437 -224 117 11 -497 -615 -316 -18 203 -10 -285 -427
2750 -427 -63 138 29 -49 29 50 -217 271 456 427 116 -116 0 336 493 162 5 -54 113 414 344 -143
2772 -143 45 309 509 216 105 2 -86 194 206 115 104 235 -112 -181 36 293 294 -91 -132 -2 308 174 -56
2795 -56 -380 -405 -20 265 85 -107 -440 -177 -236 -22 -105 -170 -356 -249 15 -41 91 -26 -234 -334 -113 232
2817 232 15 -328 -451 0 164 189 -77 -233 -132 6 337 285 308 71 394 41 151 163 329 146 124 141
2839 141 337 402 300 -80 13 180 622 306 -103 -159 302 379 250 16 6 57 -59 230 226 -15 -212 -200 -237
2862 -237 -149 101 -191 -325 -205 106 76 -116 -129 -309 -300 -260 101 189 -64 -316 -206 -91 -58 -107 -182 -327 -58
2885 -58 276 171 -34 -33 -28 69 -24 279 229 10 -18 155 212 188 -147 -102 -98 306 640 280 34 -71 50 150 40
2910 40 103 304 202 82 117 181 23 243 1 23 133 378 144 -257 -96 140 317 -195 -290 -119 -267 -255
2932 -255 -16 126 -362 -312 -204 -4 -187 -191 -71 -208 -150 -82 22 -162 -302 -329 -144 -155 -1 -74 -422 -198 -13
2955 -13 253 -64 -141 47 -215 211 348 99 32 -115 127 63 103 183 55 77 59 101 333 164 -76 53 55 349
2979 349 424 113 -292 -147 356 191 27 142 144 -157 170 15 352 -142 -170 -284 -19 205 -16 -64 -246 -43
3001 -43 -33 -62 -161 -352 -156 -244 -175 2 -24 -170 -400 -67 82 -75 -299 -360 -44 -97 19 168 -101 -131 80
3024 80 169 1 32 171 -219 -231 80 244 217 14 -14 -56 103 263 -17 -76 34 349 491 87 128 281 29
3047 29 3 253 274 171 -142 -64 188 -32 -30 130 -239 -103 146 108 -109 -320 106 34 -178 -112 -135 -216 -230 -61
3071 -61 -3 -231 23 -177 -189 45 64 -19 -149 -152 -65 53 -155 -59 14 -170 -279 -62 158 -13 -255 -168 75 -62
3095 -62 210 2 161 47 58 66 115 -99 144 38 120 170 88 75 -192 -20 204 305 125 189 -12 56 310 108
3119 108 -77 -149 -78 181 61 130 334 -28 -50 123 9 118 -93 -211 32 39 -22 46 -38 -271 -82 4 -167
3142 -167 78 -73 -497 -170 -10 177 -77 -153 -194 20 156 -114 -8 74 -229 -12 36 9 -251 14 -22 -13 286
3165 286 10 156 28 73 -123 141 155 -84 -125 -15 145 259 94 -101 47 46 127 136 133 24 2 -52 144 -142
3189 -142 13 -201 145 -34 90 -7 118 -86 -179 228 115 99 -83 5 -136 -75 26 -136 -54 -371 -133 170
3211 170 22 29 -144 -208 -84 28 60 -76 -20 16 -48 -26 136 -152 -236 -27 -73 145 30 -149 -50 -29 93 115
3235 115 -89 110 84 -7 50 384 101 129 -105 -54 46 82 128 -19 201 -30 139 229 -114 -200 -133 60 57 36
3259 36 105 -168 -215 -166 178 -82 -165 -290 -111 -46 -40 168 46 -118 -48 -55 -164 -152 -155 -66 -96 19 -31 112 -136 -133
3285 -133 68 74 139 -127 -82 75 -18 85 -88 -181 -88 114 -114 38 167 127 14 -105 18 -25 13 152 -143
3308 -143 -100 102 221 81 -91 -15 200 26 -9 -13 73 -37 -54 56 278 -41 39 -69 117 291 -151 -49 -11
3331 -11 29 -48 -149 50 -18 -93 8 86 -91 -18 21 -32 -18 151 -17 -81 -180 -139 -119 -34 3 -96 -59 -10 -28 8 17 -130
3359 -130 -110 44 237 113 23 -17 -70 95 222 218 -147 -111 -70 31 35 142 171 -100 -29 -151 25 39 52 25 104
3384 104 326 199 264 139 -76 -255 29 175 39 -39 -45 9 0 86 36 -100 -66 -56 90 -90 -56 -15 -19 21 -91
3409 -91 9 -53 147 53 -25 -88 38 -241 -128 -205 -24 104 121 -72 -203 136 118 -69 101 -1 -138 74 129
3432 129 59 158 30 27 -14 -25 196 -32 -65 -109 68 112 -228 137 -31 46 219 14 -63 -2 -58 -159 100 -1
3456 -1 -9 11 -48 -142 201 93 59 21 -128 -17 16 52 7 -25 47 -118 237 -220 -146 13 -65 157 32 -27 -62 16
3482 16 -158 41 -173 -128 -36 116 -1 28 -158 182 11 56 -137 -17 48 -102 -173 156 127 -96 -23 -1 7 21
3506 21 29 55 -35 57 -159 39 32 297 27 89 124 60 -21 107 232 -171 5 -65 68 35 -25 -65 -36 51 38 -29 -49
3533 -49 -249 -194 47 -27 -52 0 -4 16 -162 -53 -161 -119 34 -221 -15 -56 -164 -40 -100 -62 97 -27 -37 -101 -227
3558 -227 -13 173 -19 128 -6 151 84 -65 -38 -96 16 -238 -29 56 50 -37 39 -14 59 23 145 13 58 -43
3582 -43 1 22 145 150 40 103 15 194 -192 103 -234 127 95 111 -123 -29 -88 -117 -104 -44 159 -63 10 -86 169
3607 169 -54 -11 -167 -332 24 -41 79 -67 -23 86 3 124 31 58 59 -56 -139 -39 -10 -282 -30 2 83 -41
3631 -41 75 -169 49 -91 -109 -53 -22 -52 62 -25 9 -16 5 120 46 160 -133 -75 -52 96 38 -52 128 56 85
3656 85 192 115 187 55 -183 180 -7 -62 43 -76 1 -73 -144 -68 38 56 -79 -155 -209 -63 45 -39 -19 -133
3680 -133 -198 4 -4 11 -10 110 -163 65 -98 -68 64 103 -45 -20 146 -37 21 29 -58 112 89 22 86 2 251
3705 251 83 82 -78 22 235 14 -65 -67 -2 -227 43 -87 18 179 24 155 -58 128 2 -79 14 -30 148
3728 148 -106 115 -156 -48 75 -39 54 14 -112 -47 -173 -82 107 -10 -59 -108 20 -4 -144 -124 73 210 -59
3751 -59 -73 143 -21 38 -263 17 3 -49 107 -31 -100 -78 16 -86 -19 219 57 -122 94 39 0 6 178 76
3775 76 -36 -62 100 173 82 18 177 -66 -60 -39 53 -12 60 16 -58 155 2 -15 186 -49 32 -70 -44 12 -158 -64
3801 -64 -98 120 79 -66 -42 -59 56 63 3 -34 -105 -121 24 167 -21 119 -4 -120 -102 -264 119 -99 -84 50
3825 50 21 54 140 3 -38 -56 150 -31 -37 8 -188 -64 36 177 -81 115 -40 17 133 -21 138 -9 89 60
3849 60 -56 36 -34 -149 -135 206 88 -59 -24 -82 -120 -3 212 -84 -133 -10 36 -65 -9 22 -33 -58 -3 -23 -77
3874 -77 160 -46 -102 -45 -51 100 -121 73 -85 61 161 242 -148 2 -24 87 -50 94 52 39 -26 91 -97
3897 -97 -70 -123 97 181 -10 -26 -114 -97 -31 53 105 195 -43 -105 169 -19 -34 -56 -132 2 239 -36 4 -23 -349 121
3923 121 -60 -198 -43 -82 -59 -74 69 31 -259 -32 5 -112 126 112 63 49 29 -18 -10 94 -62 -120 69 177
3947 177 -36 80 45 -169 85 -142 -12 112 104 -140 26 185 -50 38 8 -37 120 -69 -35 75 97 -168 -40
3970 -40 88 91 247 126 -3 111 128 60 118 91 130 28 158 -55 15 14 -168 -41 82 127 -2 25 -52 -4 133
3995 133 155 -172 -168 71 -95 174 -125 -141 -198 90 -126 -223 43 -79 75 -36 -20 -9 39 -9 74 -286 -68 -16
4019 -16 50 -118 -25 122 -75 -58 -49 -41 19 -135 -23 -105 -99 -104 -99 234 117 165 -61 26 117 99 42 74 -57 133 -54
4046 -54 7 -77 36 -119 33 87 121 -14 92 -45 65 -10 77 41 89 122 -39 -48 36 -110 63 67 32 3 80 32
4072 32 -126 -11 -97 12 44 -17 -138 322 90 -23 22 -78 -67 26 112 -161 99 27 -19 -52 -127 63 -57 96
4096 96 -160 134 27 102 -64 -59 -50 20 41 -19 122 -14 88 223 231 -19 -2 112 106 38 -23 -14 -66 -32 -217 -79 10
4123 10 159 -78 -89 -89 17 233 -216 78 97 87 -19 -60 -53 95 60 -175 68 89 -57 58 -30 -86 -77 -34 -119 -143
4149 -143 -149 -145 -21 56 53 46 -54 -24 -80 -91 -41 69 -52 -17 -72 -21 38 -33 -190 -163 -50 -108 -5 -61 -163 -1 144
4176 144 163 90 -51 95 42 124 -89 70 -203 64 25 264 12 -60 38 -49 59 -2 133 107 -44 -43 128 -43
4200 -43 206 81 85 58 146 73 -46 -141 12 35 60 -174 167 -10 146 -145 -5 82 227 7 86 113 104 72 -99
4225 -99 121 -173 161 -5 40 87 -88 45 1 47 386 -174 -15 51 93 3 -15 1 184 -9 -58 -138 -200 88
4249 88 -20 23 -174 -41 -87 7 172 48 141 -36 -4 -69 -178 93 -15 118 -29 105 85 53 111 -55 -10 -35
4273 -35 9 108 18 -87 -128 -109 -76 195 2 -158 -42 -45 -107 50 42 85 -84 -130 -106 130 69 -134 -52 217 105 -24
4299 -24 -91 -8 86 43 -23 136 28 76 -52 107 -38 -68 -29 -118 250 -97 169 123 10 64 -17 105 -101 -245
4323 -245 -198 281 40 34 -84 17 154 -122 -43 -95 9 9 -51 -91 69 -135 -143 -11 2 -104 -86 -4 -94 53 63
4348 63 -34 49 30 158 5 135 87 44 229 29 30 -54 70 -53 92 135 138 89 26 36 84 -62 55 78 5 81
4374 81 -81 84 -27 29 -26 42 107 125 64 197 152 34 -9 23 119 -106 256 -11 12 -23 103 -4 39 31 26 -21
4400 -21 90 1 103 111 -41 67 16 -72 30 -38 -92 22 -162 288 -6 146 16 115 -213 56 122 -147 -153 101
4424 101 19 81 90 31 -97 188 196 13 55 -13 4 159 -85 88 -87 104 185 -61 -3 121 -36 -103 -167 -22 210
4449 210 46 106 9 69 -21 97 220 -127 118 -58 135 60 -1 -231 120 105 -192 197 115 -281 100 71 -175
4472 -175 -163 48 348 44 53 -63 0 -9 119 -49 12 -198 -37 99 -54 -134 -108 69 54 35 -73 161 -74 197
4496 197 -66 -295 -90 84 287 15 6 -10 -16 -101 -11 -16 -98 -72 -93 -100 -74 9 55 67 39 53 184 -86 -44 20 -88
4523 -88 -41 8 -81 73 -18 14 68 38 75 -47 33 -116 -28 -85 17 -80 -228 16 -82 -68 4 -52 1 -9 11 108 -35
4550 -35 286 -22 123 132 91 -45 41 -57 -76 33 -44 -53 -65 93 -65 18 -38 -40 -125 162 -64 165 137 -106 -92 107
4576 107 33 46 -163 -203 310 -194 43 11 -153 -16 -54 35 -220 -246 103 -65 -69 -36 -3 -265 244 -2 -57 12
4600 12 137 99 97 10 66 169 118 45 -141 59 -56 63 27 87 98 -161 -19 195 137 -157 180 95 59 40 66
4625 66 -188 89 119 -38 24 24 73 -69 24 92 -60 8 45 -50 -218 -213 -13 105 -10 -77 66 -62 -188 -222 -17
4650 -17 -44 -9 -69 -54 -40 -169 -67 30 -188 -109 180 111 -55 221 55 -41 30 -36 -19 -122 42 67 302 -165 213
4675 213 -17 -46 -95 -46 4 103 -96 105 -113 37 -20 250 129 -30 -54 -163 19 72 150 -80 99 18 -68 147
4699 147 -99 118 205 18 -62 -11 -115 -41 -3 77 42 -87 -3 121 7 -82 22 -132 172 5 23 93 -271 -57
4723 -57 -98 -69 -85 158 52 -61 67 -53 37 -25 137 85 14 -11 -25 186 -217 -145 -94 80 -53 -53 101 65 -72
4748 -72 -52 29 85 -70 -40 -106 -41 -200 118 -1 -73 -67 61 24 58 -48 92 -64 69 37 -74 91 -20 90
4772 90 -57 -110 -55 35 -125 -193 258 -12 -44 19 9 48 32 -32 105 -9 43 -27 25 -33 18 -103 -14 12 129 -39
4798 -39 143 0 -72 -211 107 189 69 49 42 14 -21 75 -54 -126 -100 92 -143 122 -178 58 -20 -17 84 -153 189
4823 189 145 -57 83 36 -111 -16 90 161 -2 -9 -47 4 -75 139 83 -69 -73 -270 -30 8 -40 16 42 85 130 52
4849 52 147 -19 -90 -7 -247 -37 -27 82 130 -104 -154 112 39 -136 10 67 -142 17 80 -178 221 -43 50 -45
4873 -45 122 -41 17 124 0 93 29 225 25 97 142 173 59 -21 -140 -33 -223 -98 -198 -72 60 31 118
4896 118 115 17 -136 95 159 43 137 -94 155 36 115 178 -142 -78 42 122 104 -13 -38 121 -61 72 -169 39
4920 39 -83 -9 202 55 55 -161 -41 45 71 121 97 53 160 81 -21 52 23 97 74 44 -94 17 59 -22 -97 149
4946 149 -5 75 -73 10 -34 -52 -55 -25 38 -110 -28 -34 -231 60 -24 207 146 68 -136 -48 -81 7 -32 -106 -16 41 76
4973 76 211 134 -62 -93 80 49 97 -31 9 -23 -10 -15 206 -61 55 -11 77 -38 103 76 72 90 -130 -10 -51 21
4999 21 143 -78 -10 38 11 43 112 -49 -23 -114 153 -25 -161 -136 -141 -12 45 -98 226 133 -108 92 -145 -113 28
5024 28 90 -15 -29 91 -44 199 163 -33 -130 11 24 -99 83 13 -88 36 -49 -102 137 -101 -97 -62 57 70
5048 70 -118 60 -64 135 -189 -30 123 83 133 -83 -27 -67 -47 -63 -4 -72 43 215 9 40 81 114 95 -66
5072 -66 -164 -226 -9 -94 20 72 11 -75 54 -3 -53 27 -95 -69 -16 85 -74 -46 -18 112 110 -79 18 221 0 89
5098 89 214 -64 -68 121 -20 -54 -8 123 -44 -166 -165 2 -8 109 124 83 2 -43 149 -127 -27 52 -172 113
5122 113 65 -83 84 -58 212 42 41 -98 41 -47 -150 -42 -36 107 -213 116 46 30 58 97 137 19 145 193
5146 193 70 -70 18 12 15 72 8 -223 23 228 -70 180 -36 180 30 97 39 60 48 -15 -59 -11 88 -68 50
5171 50 146 53 140 -158 168 163 -17 -13 -18 -32 -86 62 -22 -57 -59 -52 26 -99 17 43 101 -16 -262 -55 -62 4 91 72 -39
5200 -39 65 64 48 -44 -46 -7 -102 68 -15 -210 -74 -18 -84 34 204 -250 -108 27 162 264 -149 1 -187 -8
5224 -8 44 57 -12 98 -2 -40 -105 -57 52 -21 -45 22 -114 -110 -44 -118 11 19 -131 257 -37 -49 112 -105 -48 -83 49
5251 49 155 -117 31 48 -24 -18 57 37 115 -53 -61 -97 -112 -79 -35 34 91 -64 -181 37 -66 -55 -18 -226 -132 -5
5277 -5 47 -105 -31 54 118 174 -223 39 143 -37 -44 -76 23 -25 -220 192 -53 30 -149 44 41 -127 45 -105 -67
5302 -67 92 42 -179 -50 -202 22 172 35 160 111 168 149 3 -109 37 -70 109 -15 20 58 83 107 32
5325 32 71 144 54 185 107 -10 -103 -105 59 92 -202 -59 -184 -6 -87 -117 -144 48 -58 -55 -74 27 -57 -46 -143 2
5351 2 0 -56 62 29 139 -106 -25 -43 -18 231 51 71 -122 -239 -61 -110 23 -82 -128 -14 56 -48 76 82 -159
5376 -159 19 125 -181 206 -33 -93 -108 54 100 79 70 22 31 -1 115 78 -136 -125 29 193 -93 100 -52 -200
5400 -200 172 37 111 78 -25 47 21 -87 -84 -120 -9 -115 97 -153 40 -84 -155 -50 -24 7 23 -154 78 -2
5424 -2 25 96 -130 -51 -77 -51 144 101 -63 48 9 61 -119 230 37 22 62 -52 -97 -43 117 -4 40 36 -117 -37
5450 -37 -72 -100 15 -170 -39 -157 -214 33 8 -179 61 261 148 31 91 -159 102 -14 -65 -59 71 -108 100
5473 100 61 14 -28 -129 87 14 32 71 -69 45 -96 22 -52 -21 -68 -11 -74 97 -126 68 147 -112 63 33
5497 33 -18 -54 -177 -72 36 -140 -39 30 -29 -50 -27 -130 -30 -105 70 -4 -8 58 2 -41 33 116 -91 138 -11
5522 -11 101 -61 -85 175 100 25 -220 63 -61 27 -163 -103 206 50 -51 11 -82 -59 -5 -92 45 -148 -122 -30
5546 -30 -106 100 115 7 213 -150 149 121 5 44 91 -145 175 -8 47 128 12 -61 -9 162 6 88 -218 -5
5570 -5 -49 128 39 81 -55 168 221 78 -29 -19 -86 40 80 50 78 57 -93 1 98 -79 -63 -156 51 -69 150
5595 150 -35 -16 -141 -43 -19 27 42 -52 61 -8 -58 -76 19 61 87 -183 -128 117 90 62 5 -53 -52 42 123 -54 -55 25
5623 25 41 75 56 -27 27 -67 -103 44 -184 6 126 79 121 28 5 -42 -50 -78 136 -126 -47 100 102 28 145 -105 -51
5650 -51 66 37 57 5 127 -23 139 66 17 -82 5 -30 45 100 -223 -13 -60 -25 81 -98 -7 37 -14 -1 -116 -97
5676 -97 -10 -1 27 -44 64 53 76 49 149 -43 2 -30 145 13 74 61 43 71 -68 210 89 -24 59 -2 -46 -44 19
5703 19 147 40 37 7 -72 76 119 156 -50 -13 12 -146 100 -10 96 150 110 280 20 154 94 -103 17 55
5727 55 -172 -5 -131 109 -93 -106 0 -5 94 -122 28 91 45 173 -13 -51 6 88 -1 20 76 107 -5 -22 87
5752 87 142 -8 -82 148 -96 -49 -32 286 215 -54 148 179 50 297 62 141 -7 -140 3 27 251 60 79
5775 79 167 -23 154 -3 -87 -111 35 -166 49 -31 166 -39 -15 -67 167 -26 -57 72 -226 89 -217 -24 12
5798 12 -125 -40 11 62 13 0 -127 221 33 104 81 -3 103 104 165 -121 129 111 -306 -82 9 30 -123 17 -37
5823 -37 -169 20 -24 -49 -71 -22 50 -6 215 -95 -52 32 5 172 57 -213 -60 42 -2 96 -13 78 29 72 -82
5848 -82 98 46 57 118 20 -134 71 70 -119 -38 7 -126 108 74 4 137 -116 -52 -53 -72 38 -19 -52 -65 166 143
5874 143 -46 -54 19 94 72 -196 -39 13 -75 -16 -107 225 76 15 -78 70 -59 113 105 27 91 -139 -138 -15 -26 105
5900 105 170 113 120 -67 -96 -111 77 41 32 -89 183 -22 -133 75 -90 68 8 -109 -55 24 1 160 102 157 30
5925 30 91 -91 73 80 -21 131 73 -95 101 38 38 40 15 55 -139 -161 -94 -163 52 72 -50 -7 -138 -21 -116 216
5951 216 -54 113 -51 2 21 186 86 -43 100 -29 145 152 -55 -108 49 -129 -75 -100 -43 34 -20 106 77 -33
5975 -33 -136 13 -230 129 -60 -99 -121 -89 83 36 -142 -227 11 105 31 -46 93 -208 -94 0 138 -189 -150 -19
5999 -19 -92 165 -143 -4 165 67 -58 69 211 60 -209 59 -18 23 6 139 -112 126 -125 42 -27 15 -65
6022 -65 -171 24 47 -56 -151 5 59 -62 -86 62 -139 -3 -166 -25 49 126 232 137 -96 -35 -70 119 -129
6045 -129 -105 -212 -46 -3 28 -17 148 -110 12 2 248 -114 -25 212 -135 -90 -2 60 3 121 -70 59 17 -13
6069 -13 159 160 5 33 -1 11 22 -44 -31 45 -120 -111 -52 -40 157 -184 -60 -26 56 76 31 32 -97 -122 -127 -29 109 22
6097 22 41 -118 -117 -46 -23 -13 -16 7 -48 -64 50 -123 -65 102 -30 -62 -45 85 5 114 29 -58 -32 82 153 23 115
6124 115 -97 9 -21 92 -116 32 17 33 -84 223 94 7 -39 58 189 -29 42 -87 -107 19 62 164 4
6147 4 -3 -147 -49 115 14 -39 34 -15 36 -134 115 34 -272 124 2 2 -3 -93 -72 -7 49 2 112 -39 -20 176 90
6174 90 -91 -214 -42 -93 64 35 -169 -77 96 -54 3 109 -31 110 15 -40 29 11 30 100 -4 -29 -45 52 -24
6199 -24 -16 27 -85 -66 -40 99 -150 37 14 -50 -140 -177 -68 141 44 97 -127 -29 -36 19 -25 17 43 28 59 -106 100
6226 100 -106 -96 -15 21 -13 68 -75 -169 132 -71 -35 98 136 82 -30 -91 -95 51 -174 -5 -99 37 -191 -87
6250 -87 -20 -78 353 14 -120 89 -207 41 -186 -22 -80 -76 -89 58 79 11 15 -12 87 -80 -77 46 13 -200 -8
6275 -8 -126 37 164 152 -34 19 103 71 -205 -150 -5 -80 21 -71 18 -120 39 93 -122 -163 108 42 152 -167
6299 -167 20 -31 54 39 11 219 223 -75 14 47 -116 13 -57 40 25 -65 173 37 41 17 110 31 -141 -15 -27 -95
6325 -95 -136 -142 153 114 48 -168 -41 55 -89 71 -6 -70 106 -84 -15 -55 -95 1 24 -88 -54 41 50 -4 -68 -27 -8
6352 -8 -65 -59 142 46 112 0 100 -88 -177 -68 30 -123 -29 39 -27 -63 51 127 37 199 113 51 -6 -64 -220 8
6378 8 -13 -77 66 -2 -58 -58 -58 -159 -59 28 59 -60 14 -110 42 -56 72 52 -59 -89 117 37 49 -6 -57 -94 13
6405 13 73 9 -34 90 -13 -15 65 157 77 168 -47 -122 31 -28 -98 93 106 117 16 -97 -155 118 -90 -269 -18
6430 -18 251 -69 -104 -238 -154 109 -144 -94 -27 -99 44 14 228 39 130 31 80 96 -21 65 -195 40 -163 24
6454 24 -7 -219 86 -125 108 -154 -131 -89 5 37 110 -35 -7 58 -67 73 -20 -194 -21 33 47 119 124 -66 -94
6479 -94 -28 61 111 57 39 -25 48 45 -102 104 47 -83 -54 -6 -48 -10 -52 -82 145 35 175 39 -3 159 -90 -42
6505 -42 244 37 -40 49 53 169 -69 162 64 -19 91 8 140 107 10 -13 27 244 -82 -76 33 -119 -135 -82 140
6530 140 -179 110 -92 37 63 -31 12 -5 17 -127 88 112 97 -66 38 -74 -96 -86 96 133 -32 30 -47 39
6554 39 62 46 60 -29 45 -89 -307 -32 -88 -158 -88 152 182 26 -102 -265 32 -30 -35 -6 48 -150 -41 97 63
6579 63 -159 -39 -74 -241 197 66 124 -13 27 -46 45 -10 -41 69 -134 -140 166 -106 -72 131 -249 134 -64 102
6603 102 62 -43 -21 81 -122 -5 113 38 -15 124 42 67 -144 -143 7 -9 91 -12 -88 22 2 -201 -149 -130
6627 -130 -175 -112 -110 22 80 -107 -86 -164 -115 -49 118 131 46 9 12 135 -85 2 -95 38 8 149 107 -152 -149 95 165
6654 165 -39 -11 -105 -65 -84 -62 -13 93 28 -53 139 73 173 53 -22 149 -146 103 63 -65 130 -36 -107 112
6678 112 -48 -44 8 22 4 -119 50 -27 -24 -167 -55 241 197 78 94 33 121 108 20 -11 -139 -50 141 -68 99
6703 99 -20 -31 -31 -229 92 118 47 -81 -185 -130 64 14 -35 -21 -10 59 29 1 -89 225 -52 -52 137 -8 -27 -26 -20
6730 -20 -18 -196 56 114 -117 169 192 127 -1 -43 141 51 45 12 38 211 5 64 -119 -18 -54 -57 172 88 -184 -79
6756 -79 -164 88 38 -69 -130 -206 -176 157 -37 -179 -30 39 77 46 270 66 -29 199 177 -62 -149 -213 -4 -116
6780 -116 109 -94 -6 39 78 -29 -49 -26 97 131 -22 -36 42 -138 46 9 -61 28 -16 36 28 73 -20 41 55 91 199
6807 199 11 26 100 50 68 -37 45 8 66 25 -75 69 55 -80 65 -10 -27 -167 156 34 85 -86 -128 -167 -159
6832 -159 -52 -16 89 -15 87 -73 77 78 -98 -70 -105 -111 -215 5 69 4 -91 -90 42 141 -68 -68 -95 -155 28 10
6858 10 66 -88 4 28 82 7 -13 105 25 -97 66 -96 136 41 -22 78 -160 82 31 -121 7 205 37 -47
6882 -47 -119 62 132 -103 -160 136 -48 -320 -84 24 -20 -112 -36 9 -33 -48 32 28 104 58 -139 -8 -130 -51 1 -38
6908 -38 99 21 -2 -95 39 -19 -25 104 53 -103 -103 72 134 170 -106 63 -15 64 -187 42 57 -60 -152 183 6
6933 6 108 -286 -110 -16 -31 -43 -9 -255 142 25 73 -104 -300 15 -126 156 32 29 16 -38 -13 25 -75 -30 -7
6958 -7 68 109 -84 -96 -117 -132 120 -74 31 30 55 -63 21 -149 71 -10 -113 159 -72 -8 124 -35 74 -106
6982 -106 -77 -33 -56 103 -2 209 113 119 43 -88 -3 134 46 56 39 -101 122 151 -61 30 48 15 -42 240 -4
7007 -4 -82 -68 53 84 35 10 -36 -62 -5 -187 82 30 -113 -23 -24 65 -49 -61 101 -94 -39 42 -10 -44 -4 164 -290
7034 -290 30 -87 69 92 -22 5 -84 106 25 -7 15 116 156 26 39 -10 24 40 294 63 30 89 28 -279 133
7059 133 -57 170 28 185 46 -38 76 93 -42 -92 -154 -65 -83 98 -57 -116 -15 -68 41 -19 37 148 47
7082 47 -39 -146 69 -20 -241 72 -66 60 263 -53 -153 84 -159 -37 -91 -136 92 1 10 41 160 -83 126
7105 126 38 6 -81 133 177 21 106 -128 14 -46 99 25 -4 70 133 -33 7 60 134 51 -123 161 -46 29 3
7130 3 -69 -93 -59 187 -54 -52 -20 166 -69 -63 -41 225 -23 96 -57 62 -25 -43 -106 37 -125 40 -179 -47 104
7155 104 -91 70 -183 17 7 -116 -67 14 -76 -157 -31 -154 -3 150 -41 -117 108 7 53 34 96 -34 -178
7178 -178 -78 -64 78 17 59 9 17 20 98 43 72 -217 -81 -7 43 10 -197 -227 -93 62 -1 85 27 -271 -7 -178
7204 -178 35 110 -29 -22 88 -126 168 83 84 -161 -108 41 126 -216 87 -39 -115 130 13 227 115 31 -63 -12
7228 -12 104 11 28 -93 -171 -13 100 170 61 -44 29 68 -66 -49 -7 -148 60 61 119 41 -348 85 61 165 20
7253 20 -27 -63 167 70 3 63 93 -107 21 139 -231 -51 -46 31 -2 -46 -62 127 -52 22 24 188 29 -142 -43 0
7279 0 -16 216 152 109 174 58 31 30 11 -146 -94 25 -57 37 -65 -9 74 109 31 -128 -14 55 298 -204 -148 81
7305 81 -14 -81 95 10 -93 -85 79 98 -88 29 39 90 61 112 141 158 -91 62 15 -77 -116 -112 67 -226 -160 118
7331 118 84 207 -3 104 -34 10 -63 -115 16 10 129 60 99 -69 -27 -114 -80 153 -73 -88 179 139 63 26 -71
7356 -71 35 144 -70 41 88 7 70 -95 85 179 -89 112 9 -31 -67 -171 41 110 131 -12 82 -31 136
7379 136 47 43 62 74 43 41 136 -22 37 141 105 2 95 92 27 -22 139 -90 -46 121 179 106 -15 13 -101 132 112
7406 112 -122 75 -93 -141 -41 -13 166 -49 -10 -66 -28 -128 1 3 66 92 -90 -26 -38 164 20 -142 116 14
7430 14 -226 69 30 76 -57 -147 -74 131 152 66 126 126 -32 -99 33 178 -153 51 -73 -124 -44 -20 165 -39 72
7455 72 18 -45 168 168 56 35 -112 30 -41 65 37 165 20 -68 68 31 -192 15 -109 -22 -4 -60 17 -14 36
7480 36 151 -65 -82 138 -15 -36 160 116 -66 -149 -97 -91 88 30 84 30 -24 98 103 5 -158 -104 73 34 164 13
7506 13 152 42 -50 -2 19 122 -193 -62 120 -95 -28 -135 -2 7 -61 149 44 68 149 -69 -16 159 100 -35
7530 -35 -70 45 238 -21 -49 1 174 -137 67 113 -77 -168 -82 -39 -161 31 28 37 185 -21 -146 112 -21 -131
7554 -131 104 -105 16 -327 115 -144 98 -50 -50 -150 -104 -164 -28 48 -156 -99 84 -62 -150 40 -17 -98 -79
7577 -79 146 87 -25 39 -16 -97 -73 -72 186 24 -7 -62 75 78 57 -10 22 1 -84 -33 35 -118 18 17 -58 61 17 -47
7605 -47 48 35 48 21 -71 25 -30 -116 -80 9 101 -21 -76 -153 16 66 93 -125 114 -2 50 -66 -44 200 14 -157
7631 -157 93 -99 162 -13 19 39 -6 -241 41 -147 141 106 87 -98 73 112 26 93 -188 51 82 41 77 240
7655 240 164 10 -15 -29 -130 -36 -120 139 -64 -77 -52 24 -100 -24 21 54 -91 -186 -36 -55 -26 -30 -54 -91 -28 27 146
7682 146 -91 -57 104 97 30 -15 -13 36 60 -206 81 59 4 -71 4 23 -45 -6 28 -72 -3 176 95 -34 -67 225 7
7709 7 -115 22 -107 -1 14 31 0 34 -73 -42 -127 36 49 45 -63 136 14 30 13 -16 -130 -27 95 -140 -149
7734 -149 -39 80 42 264 217 20 14 -178 96 -136 -171 -105 163 -107 -78 59 119 40 143 32 126 -37 -112 -9
7758 -9 -71 88 -53 112 -33 -79 -51 -133 252 -123 -131 -31 -39 -35 -136 6 -8 -92 26 71 -107 116 -76 -74 -60 83
7784 83 -23 102 70 94 -35 142 -4 41 195 57 -68 -51 -5 -98 69 -90 55 -77 -72 81 3 13 -3 -29
7808 -29 30 8 14 31 -23 8 -25 -127 31 147 -51 128 53 -105 28 -76 -238 -123 35 -116 -23 -157 -27 -46
7832 -46 24 55 -23 -8 -36 168 29 -93 -138 -297 -31 -95 48 111 26 -93 -41 39 -10 -43 20 -18 -54 133 90 51
7858 51 240 -28 95 -48 -24 -20 -2 -6 -29 8 165 208 -20 18 11 47 40 -152 -120 -23 -32 -2 109 159 2 156 46
7885 46 139 -61 164 170 58 22 -31 -45 34 -110 -6 -38 42 -94 -83 26 15 11 -28 -34 40 -172 -41 36 -45 -9 -54
7912 -54 53 -94 -57 -59 77 60 68 20 21 66 63 30 63 -52 17 119 67 -115 74 -65 -4 71 -83 -100 30 -210 -20
7939 -20 -58 116 55 29 -42 2 -130 -4 59 -8 -33 -12 179 186 62 -44 62 -219 122 70 -29 20 -194 -5 21
7964 21 45 -103 -69 70 4 167 -124 170 -130 240 25 101 -59 -6 -14 -202 75 -51 -164 0 -18 53 -54
7987 -54 -201 35 46 70 -107 -100 124 -138 -10 -18 -72 43 154 -2 207 -109 99 -73 -51 -128 55 52 23 -59 -49
8012 -49 -108 29 176 16 222 -53 -127 71 124 125 78 32 -62 -99 79 14 -24 -41 95 -41 24 186 -102 -139 10
8037 10 -64 72 68 66 -81 36 -58 24 -162 -98 110 11 176 73 -10 111 92 74 -31 110 -39 -129 -141 -76 -9 -6
8063 -6 70 -52 213 290 103 183 79 -51 -118 4 26 14 76 -1 255 92 0 28 132 50 107 90 -43 -98 16
8088 16 13 147 -295 -61 8 167 93 -198 -34 158 150 -16 161 19 4 118 -70 -52 100 -24 -112 54 39 -80
8112 -80 135 -245 -53 -65 -238 -66 -91 122 219 -91 43 77 90 46 95 7 79 -111 33 -75 17 66 -119 83
8136 83 72 81 55 -50 -33 202 123 -122 -97 -150 -105 -175 -194 -114 27 11 109 -1 -51 -89 -93 42 -94 216 -116 28
8162 28 -112 6 -91 -57 6 -46 112 71 -36 -25 -144 -269 27 122 75 -68 -156 10 24 21 -40 -174 -130 106 133
8187 133 73 73 -56 25
8191B5
$$ Imaginary data points
##PAGE= N=2
##DATA TABLE= (X++(I..I)), XYDATA
0 0 0 0 0 0 0 0 -8 8 -8 8 -8 16 -16 23 -24 32 -38 40 -49 58 -69 80 -94 106 -124 141 -159 181 -205 232
30 232 -262 295 -329 367 -412 455 -507 564 -624 693 -766 849 -938 1041 -1154 1279 -1423
47 -1423 1585 -1775 1997 -2255 2573 -2966 3462 -4118 5040 -6405 8668 -13083 24947 -123820
61 -123820 -360047 -133231 20059 -6909 -74713 -91226 -171745 -171693 -44690 -2973 -167979 -271668
73 -271668 -189805 -67941 -792 41948 -42351 -231592 -268089 -77650 46702 -14399 -78836
84 -78836 -71693 -72294 -12036 117691 92153 -124452 -196345 -3509 162772 145840 91121 42641
96 42641 -42014 -33290 124607 191067 57254 -36558 42085 132859 157464 171489 109840 -50377
108 -50377 -91609 77961 209845 145249 37617 178 -9766 35153 134109 106328 -78958
119 -78958 -150960 -4275 117639 79564 6988 -54671 -140371 -134949 8750 69915 -55692
130 -55692 -150915 -95057 -33436 -24695 -1823 -39463 -186155 -231094 -57163 89594 20507 -106916
142 -106916 -133906 -107364 -56480 22369 17873 -101256 -144452 -24257 81882 67554 18507
153 18507 -35708 -106165 -75619 86712 163281 52142 -40251 10626 72303 80073 101785 85849
165 85849 -21678 -53593 98432 227052 156142 22031 -16860 7377 59303 136947 142131
176 142131 32203 -30394 51515 131767 100428 35143 -13180 -59649 -34995 88211 144312
187 144312 37410 -77229 -71900 -26907 -741 31047 10566 -95604 -129218 -1719 92585
198 92585 3162 -124524 -140065 -96654 -48505 18884 33867 -62791 -141777 -87432 -3444 -5787
210 -5787 -46437 -73765 -98623 -71905 33908 86395 -7101 -113285 -99129 -24085 30919 64675
222 64675 44381 -41599 -68736 32731 112568 52545 -36143 -38369 2819 49916 113523 120413
234 120413 18375 -63601 -8327 83802 89072 48640 24756 2429 8086 76900 117398 41307
246 41307 -59716 -58868 14556 74403 90559 43027 -50475 -79522 3378 67411 15260 -59687
258 -59687 -62173 -30842 -1332 37851 33658 -57875 -132340 -85663 3956 23357 -9015 -42688
270 -42688 -76262 -74591 -7300 36038 -29019 -114744 -97469 -11902 41787 39199 -7082 -75211
282 -75211 -92544 -21181 47937 30569 -22158 -33470 -12284 21349 61997 55566 -22924 -74705
294 -74705 -17276 72146 90510 55619 18076 -16093 -16666 45038 93075 45663 -29365 -19327
306 -19327 52464 93817 78172 25471 -36595 -48725 16977 82082 66425 7039 -20149 -11001
318 -11001 11723 37335 30532 -28399 -71823 -33213 38408 57449 18055 -38276 -80160 -68855
330 -68855 41 43578 -3456 -71530 -63133 -4629 21761 1767 -36787 -75746 -79949 -23364
342 -23364 40819 37040 -20594 -60605 -53149 -16536 20321 20984 -23982 -55579 -20504 42953 59990
355 59990 21368 -29455 -54044 -26778 40742 79467 42196 -17682 -21857 21592 52213 45583
367 45583 14298 -20093 -19132 33403 84704 70113 8453 -30732 -21435 15028 49261 51370 12237
380 12237 -26645 -13528 34563 53577 17071 -37752 -58046 -22127 38833 58549 12167 -46212
392 -46212 -54826 -20586 8425 8944 -14012 -42735 -46604 -9653 29592 18940 -34482 -73357 -60932
405 -60932 -12275 29079 26736 -17240 -55248 -42159 4094 26130 -22 -39736 -46311 -9740
417 -9740 37509 49977 14446 -33918 -46207 -12219 32887 47466 22310 -11985 -15296 18093
429 18093 49372 40440 -117 -28352 -13572 31615 66295 58176 12115 -28214 -21921 21868 51631
442 51631 33016 -8979 -22330 7563 43501 44267 7414 -33386 -42469 -11425 30632 41649 12009
455 12009 -27477 -38833 -17176 10864 13322 -16406 -48368 -40861 3705 35220 15914 -34702
467 -34702 -65927 -50686 -7327 21569 9138 -26591 -42132 -21563 6599 11330 -9813 -37911
479 -37911 -46113 -16547 30337 44098 8056 -34533 -39139 -9624 20977 28690 8500 -17778 -14012
492 -14012 23196 49272 30049 -11437 -31356 -14816 24892 56321 46368 3805 -21288 -2420
504 -2420 27772 31514 12403 -7416 -12847 7251 41469 48470 10880 -30955 -35501 -7310 23424
517 23424 34130 13456 -22504 -29743 3340 27794 5832 -32342 -42590 -22106 8380 29237
529 29237 17175 -24301 -51385 -35186 -3074 7709 -1916 -18336 -30362 -18813 14146 24425
541 24425 -11565 -49340 -41968 -4587 23457 28578 8423 -24089 -32399 -1878 26259 14892 -11508
554 -11508 -16876 -1296 21528 40624 31797 -8842 -33522 -9416 29709 39347 25231 7767 -5135
567 -5135 -273 26524 39462 11709 -20353 -13621 17895 38301 37835 15677 -19600 -30053 2600
580 2600 33659 20971 -9602 -16446 -4665 8179 19110 12639 -19795 -42284 -21907 13063 20781
593 20781 5304 -15504 -33718 -30460 623 18282 -8749 -40371 -30487 653 13602 8073 -8387
606 -8387 -34118 -41706 -10398 22554 14510 -12654 -20770 -12812 -1191 14054 15595 -12374 -33130
619 -33130 -9508 28039 32125 11730 -6043 -17344 -12737 16094 36803 16562 -12826 -7368 17036
632 17036 27042 23101 10068 -13801 -21058 11335 43681 30071 -3456 -12430 -4287 2875 14972
645 14972 20739 -634 -23484 -8551 21654 23326 1158 -17918 -27779 -20996 8420 27980 4622
658 4622 -28972 -26533 -4351 2878 -1505 -8136 -23527 -30176 -4694 21993 8960 -22588 -31342
671 -31342 -22078 -10362 7804 17432 -5185 -30913 -16837 14422 15031 -5839 -15697 -15064 -7464 15656
685 15656 32671 12559 -19514 -19212 4107 17058 18906 14520 -1605 -10997 11021 35454 21555
698 21555 -8419 -12053 1948 12524 25245 31689 9333 -18936 -9600 19646 22896 5587 -3838
711 -3838 -6057 -3298 15317 28862 6410 -27155 -24400 2069 12978 9307 4048 -9906 -22943
724 -22943 -9102 13166 5733 -19257 -25002 -13206 -1839 10286 13054 -11471 -37372 -24915 6192
737 6192 10141 -5966 -11552 -11482 -11834 1872 16643 1118 -27579 -24490 3247 16941 13818 7839
751 7839 -6393 -18784 -4413 20516 16611 -6131 -9379 4393 13673 20346 21327 1240 -20681
764 -20681 -9546 20521 26913 12801 4125 -553 -3344 9579 24257 9067 -17994 -12737 14156
777 14156 22380 13146 5392 -6780 -20566 -10180 15046 16166 -6007 -14941 -5911 1680 5965 5292
791 5292 -12556 -31228 -18891 10253 14741 -1996 -12744 -16218 -19047 -8040 8307 295 -22215
804 -22215 -20310 2134 10301 2988 -4635 -15796 -25113 -10065 17481 17766 -5419 -13684 -3294 3072
818 3072 5630 9080 162 -15088 -6879 19163 26051 9665 -3992 -7630 -5700 8477 24002 15683
832 15683 -5949 -5192 13002 18006 9761 4820 -3019 -11536 276 24679 23782 -933 -12710 -4382
846 -4382 2403 6244 10031 770 -15332 -10069 12607 15972 -2635 -15238 -15076 -11990 -1184 12210
860 12210 6037 -15049 -19866 -5149 2833 -1149 -5853 -13589 -19403 -6654 14430 10739 -12900 -21237
874 -21237 -10608 -2750 1498 8060 2147 -14262 -12418 8578 15325 363 -10994 -8679 -2469 8817
888 8817 20072 13222 -7479 -11926 3489 13268 10731 6797 1784 -3931 3670 20322 18928 -1364
902 -1364 -10936 -2110 7700 14039 17095 7164 -10056 -8688 9881 14976 804 -7645 -4448 -1473
916 -1473 3919 12751 7732 -12868 -20501 -5755 7482 5709 -1166 -8260 -13927 -7627 5857 4590
930 4590 -11850 -19269 -9918 -577 3711 5656 -3076 -18848 -18439 15 8801 -680 -8907 -7889 -4564
945 -4564 1650 9798 4990 -12451 -16207 590 13278 10808 4553 -793 -6723 -3369 10323 14423
959 14423 1956 -6718 -188 10253 14888 13458 3147 -9436 -6591 9927 17660 9132 915 -76
973 -76 -82 3757 11364 8727 -6946 -11971 1769 13666 10469 1391 -6363 -11839 -7647 5280 9020
988 9020 -3247 -11936 -6904 858 2952 890 -6159 -16269 -14976 -1 9466 2482 -8467 -12229
1002 -12229 -10520 -3641 3910 823 -11124 -13329 -905 7979 4497 -2080 -7105 -11680 -7070 7243
1016 7243 13551 2568 -8115 -4229 4721 8199 6306 570 -6086 -3474 9528 17022 9716 -599
1030 -599 -4032 -1706 4873 12312 10939 244 -4594 3327 11861 10242 2713 -4099 -6889 -788 11034
1045 11034 13689 1911 -8199 -5810 671 3381 2963 -888 -8141 -8966 1179 8916 2549 -9840
1059 -9840 -13902 -8962 -864 4628 1786 -7668 -12216 -5982 1059 1030 -3857 -8903 -11129 -5349 5451
1074 5451 8190 -2197 -12009 -9632 -1165 4314 5076 322 -5879 -5281 3953 10054 4526 -3761 -5708
1089 -5708 -647 6111 11533 9644 890 -5662 -852 8748 10921 5130 -880 -2108 3786 11282 11108
1104 11108 2269 -4801 -3297 3248 8684 9253 3628 -4435 -5825 1968 8247 4123 -4807 -7413 -2849
1119 -2849 3410 5930 2024 -6685 -11448 -6896 1572 3949 -680 -6724 -9256 -5269 951 2252 -4284
1134 -4284 -11264 -9846 -1902 4783 3637 -4036 -10338 -9093 -1211 4239 2400 -3106 -5473 -3094 2111
1149 2111 5808 3553 -3854 -7967 -2104 7724 10881 4873 -2416 -3675 1102 6699 7887 3699 -1112
1164 -1112 -852 4963 10173 8809 1670 -4563 -3215 3985 10352 8828 1699 -3422 -1694 4062 6416
1179 6416 2681 -3582 -5523 -918 5384 6872 1248 -5964 -8954 -5175 1468 4095 -211 -6881 -8108
1194 -8108 -2057 3076 588 -7216 -10764 -7268 -588 3205 1959 -3484 -8953 -8306 -2249 2327 292
1209 292 -5034 -6601 -2526 3758 5549 381 -6529 -7712 -1306 5457 6927 3434 -1587 -2813 972
1224 972 5975 5801 417 -2908 -331 5853 9950 8588 1544 -4636 -2583 5281 8904 5367 1225
1239 1225 173 1964 4887 6474 3325 -3495 -5605 100 6674 7659 2471 -3998 -6250 -2253 3046
1254 3046 2514 -3038 -6034 -3187 954 2767 733 -4486 -9938 -8483 -941 3718 971 -4150 -6531
1269 -6531 -5523 -1565 1331 -1372 -7509 -8012 -1146 4557 3335 -1105 -4956 -6390 -3268 3074 5125
1284 5125 653 -3341 -1781 2793 5338 4158 -677 -4702 -1870 5678 9380 5206 502 -904 -155
1299 -155 2849 6516 5611 -335 -2196 3065 7983 6539 1849 -2274 -3495 -9 6290 6846 722 -3716
1315 -3716 -1698 1305 2150 1475 -1253 -5053 -4600 1164 5031 1086 -4688 -6836 -5277 -1171 2587 617
1331 617 -5848 -7406 -2175 1732 -346 -3567 -5246 -6318 -3586 2130 4082 -1709 -6735 -4874 -325
1346 -325 1725 1547 -502 -4132 -3112 2953 5971 1924 -2681 -2766 -553 2728 6136 5543 -342 -3115
1362 -3115 1203 5996 5131 1997 -282 -755 1914 6924 7398 689 -3404 -538 3243 4053 3916 2351
1378 2351 -1750 -3069 1825 5513 1989 -3395 -3896 -1651 1596 3778 1776 -4310 -6757 -2266 1823
1393 1823 653 -1873 -3124 -4450 -3579 841 2288 -3171 -7406 -4815 -176 1220 907 -1068 -5254
1408 -5254 -5872 -172 3429 67 -3751 -2734 -879 780 3151 2643 -2122 -5360 -569 4868 4789 1527
1424 1527 -391 -1190 138 4375 5125 627 -2543 446 4218 4555 4218 2860 -1414 -2945 2101 6668
1440 6668 3708 -891 -1226 609 2037 3485 2492 -2348 -4736 -414 4178 2708 -506 -1910 -3144
1455 -3144 -3363 463 2879 -771 -5096 -3485 521 1337 59 -2113 -5302 -5775 -548 3444 312 -3560
1471 -3560 -3366 -2146 -1689 355 1142 -2715 -5612 -1366 3915 3110 -722 -2275 -2833 -1775 2179 4324
1487 4324 1144 -2513 -497 2615 2851 2069 1217 -1446 -2246 2490 6733 4232 -613 -1200 413 1650
1503 1650 3500 3525 -322 -2372 1239 4823 3108 -317 -1104 -1658 -1730 2009 4649 1324 -3722 -2918 722
1520 722 1332 72 -1139 -3260 -3665 150 3310 549 -3691 -4019 -2531 -1704 325 1356 -1863 -5005
1536 -5005 -2159 2107 1226 -2075 -3039 -2804 -1771 1291 3644 215 -3814 -2508 801 1385 1045 859
1552 859 -811 -2195 1238 4811 2852 -1830 -2280 389 2249 3551 3739 581 -2110 164 3464 2739
1568 2739 558 290 -44 -234 2663 4766 1497 -3049 -2391 1322 2445 1415 552 -1191 -2486 -32
1584 -32 2779 1086 -2834 -3143 -1182 -13 1158 1286 -1664 -4949 -3150 1202 1326 -1455 -2553 -2485 -1976
1601 -1976 265 1457 -849 -4362 -3030 449 1321 855 350 -1674 -3405 -779 2922 1967 -1700 -2197
1617 -2197 430 1939 2124 1965 -309 -2459 -529 3188 3520 1521 507 265 -258 1578 3774 1619
1633 1619 -1791 -1066 2638 3621 2199 703 -1049 -1983 110 3085 2241 -851 -1396 -102 575 903 1032
1650 1032 -1293 -3753 -2311 1963 2342 -789 -2586 -2575 -2182 -601 774 -457 -3228 -2572 137 748
1666 748 -253 -1145 -2759 -3634 -1255 2467 1854 -1616 -2599 -842 248 705 609 -762 -2040 -464 2844
1683 2844 2899 626 -984 -992 -601 1214 3544 2329 -516 -583 2142 3055 1612 363 -621 -419 1446 3744
1701 3744 2965 -82 -1065 -72 734 1372 1833 151 -1753 -589 2349 2366 -599 -2432 -2043 -1181 243
1718 243 1608 271 -2184 -2666 -817 -115 -575 -1309 -2543 -2853 -1162 1757 944 -2418 -3630 -2156 -506
1735 -506 102 193 -878 -2039 -1444 772 1009 -584 -1875 -1488 -649 1152 2789 1750 -1272 -1841 755
1752 755 2222 1409 623 182 210 1585 3122 2642 216 -937 80 1456 2559 2595 884 -720 -21
1769 -21 1972 2563 574 -901 -481 354 1536 2139 835 -1300 -2074 -352 941 710 -331 -1525 -1699
1786 -1699 -595 1056 297 -2265 -3133 -1659 -220 172 -123 -1636 -2629 -2209 -550 370 -723 -1892 -1848
1803 -1848 -1410 -65 1175 14 -2281 -2438 -118 1556 841 -243 -904 -867 464 1753 1683 76 -675
1820 -675 75 1701 2385 1958 633 -601 57 2094 2791 1677 452 136 875 1794 2067 1278 -191 -483
1838 -483 732 1928 1800 577 -663 -1182 4 1807 1320 -551 -2013 -902 371 558 -186 -1387
1854 -1387 -2065 -1501 -456 396 -389 -1715 -2347 -1804 -502 301 -619 -2113 -2280 -915 213 -39 -1153
1871 -1153 -1997 -1671 -420 619 711 -726 -1356 -978 73 1045 1001 -100 -839 -230 1527 2227 997 -397
1889 -397 -581 447 2017 2107 1637 406 206 970 1856 1961 961 -57 -240 1073 2460 2233 114 -673
1907 -673 -377 754 1444 783 35 -460 -507 278 811 296 -1078 -1858 -1080 479 812 -162 -1764 -1992 -1237
1926 -1237 -38 -180 -1237 -1947 -1669 -576 258 -284 -1301 -2108 -1956 -923 511 378 -731 -1281 -917
1943 -917 204 675 100 -1116 -1117 -1 1257 1361 539 -159 -603 17 1220 1688 871 -95 148 1165 2194
1962 2194 1465 394 -455 2 1088 1946 1736 574 -167 231 617 1116 940 -118 -586 -243 1196 1431
1980 1431 101 -1033 -1132 -503 681 666 -183 -1342 -1153 -275 -37 -269 -800 -1398 -1972 -717 639 475
1998 475 -1252 -2106 -1584 -526 -24 -387 -705 -1456 -587 411 427 -345 -1042 -1214 -595 514 1151 480 -852
2017 -852 -719 361 1137 873 163 -257 -143 742 1848 1368 102 -317 243 869 1327 1351 642 -150 27
2036 27 1483 1624 601 -689 -512 591 1119 1201 212 -761 -751 130 472 398 17 -445 -923 -326 823 422
2056 422 -1049 -1816 -1024 -94 148 -235 -822 -1397 -1000 1 218 -671 -1095 -869 -657 115 622 -16 -1252
2075 -1252 -1538 -56 879 437 -196 -551 -607 -63 885 689 -265 -431 52 664 967 939 387 -532 -325 1226
2095 1226 1618 468 -278 123 352 887 971 866 -144 -265 538 1061 838 234 -40 -698 -68 886 825 -527
2115 -527 -764 -303 324 320 4 -617 -1187 -817 312 788 -584 -697 -634 -734 -471 238 -192 -1113 -1456 -63
2135 -63 614 126 -724 -950 -913 -416 357 526 -336 -762 -202 219 371 397 -148 -799 -299 1048 1357 477 -329
2156 -329 -129 298 366 1056 790 88 -120 884 1199 618 596 -191 -266 35 1282 1472 -54 -451 -94 418
2176 418 367 201 -245 -617 -436 656 765 33 -441 -837 -740 -404 569 330 -821 -1344 -290 329 -135 -778
2196 -778 -994 -843 -367 403 395 -493 -1114 -673 -172 104 173 -396 -828 -748 480 945 -34 -819 -486 -133 295
2217 295 681 749 29 -326 445 756 554 316 91 -164 225 1306 1235 101 -437 -51 659 662 334 442 86
2238 86 -36 535 955 172 -382 -497 -123 240 762 394 -561 -1036 -90 519 99 -398 -380 -487 -288 293 179
2259 179 -615 -1011 -788 60 -7 -41 -127 -870 -999 29 506 -321 -918 -622 -185 62 269 234 -259 -869 -5
2280 -5 613 276 -67 -18 -188 263 806 751 -275 -733 268 773 650 497 334 -16 -216 472 1105 534 -6
2301 -6 -111 278 347 715 636 -188 -729 187 897 263 -425 -373 -281 -142 131 338 -142 -708 -417 -14 83 -153
2323 -153 -278 -950 -996 51 752 -100 -769 -538 -343 -54 52 -239 -534 -771 -109 491 166 -221 -373 -283
2343 -283 -224 589 717 -62 -323 -58 572 309 284 153 7 -3 525 984 546 -78 -107 183 556 835 640
2364 640 36 -497 283 799 357 -420 -132 -116 37 427 745 187 -436 -429 -95 155 201 -48 -335 -660 194
2385 194 603 -48 -1095 -848 -36 -41 42 -37 -575 -805 -412 140 -236 -337 -351 -476 -223 309 469 15 -869
2406 -869 -409 50 304 138 82 -182 -210 226 778 362 -219 -305 114 599 745 775 179 -114 327 804 348
2427 348 249 203 293 118 385 700 295 -284 -496 222 577 517 142 -421 -586 15 490 -96 -640 -473 -15
2448 -15 130 82 -20 -238 -722 -468 26 -130 -295 -245 -505 -499 28 350 -112 -765 -684 -31 266 -5 -212 -322
2470 -322 -485 -56 235 0 -265 -311 224 470 570 297 -177 -135 49 451 514 318 201 167 101 485 679 325
2492 325 -180 -203 439 805 582 238 -224 -121 359 594 241 -107 -147 -33 188 65 -22 -27 -392 -256 72 192
2514 192 15 -413 -866 -513 -44 266 -395 -882 -636 -27 218 -102 -220 -522 -531 -276 13 -22 -243 -297 -300 216
2536 216 183 181 -206 -240 -95 162 449 177 -10 -150 93 400 595 359 -112 -69 285 796 312 227 37 285
2558 285 508 502 340 81 -112 265 248 227 535 94 -204 -193 8 475 313 -172 -376 -189 348 347 -335 -708
2580 -708 -340 -126 38 -136 -408 -474 -272 -193 -57 -336 -241 -539 -427 -240 -66 -82 -327 -522 -416 129 253
2601 253 -171 -231 -246 -83 378 215 -21 -258 -280 88 279 383 183 -179 120 332 259 338 200 74 -93 206
2623 206 468 449 279 -58 -369 264 463 238 -234 -172 149 476 311 -172 -353 -76 -50 104 128 -36 -140
2644 -140 -332 -170 -254 -15 -71 -368 -608 -111 171 -35 -417 -640 -122 45 121 -302 -357 -335 -105 -19 -53 -320
2666 -320 -270 -248 -57 42 219 -143 -199 -264 117 304 235 -4 -14 -145 186 623 332 175 -132 -120 406 533 286
2689 286 102 65 114 499 349 35 -8 169 219 257 119 258 -100 -249 -108 111 451 36 -319 -431 -4 408
2711 408 35 -502 -421 -288 89 97 -122 -437 -321 -281 -124 -25 -175 -509 -389 -108 21 20 -217 -219 -272 -217 135 30
2735 30 -226 -313 -263 -68 194 80 -242 -250 39 237 380 166 -86 -86 340 475 297 92 -57 232 38 282
2757 282 466 250 43 -185 65 546 707 -21 -148 92 328 561 -117 -232 -260 -170 176 2 -141 -184 -494
2778 -494 -97 -84 25 -86 0 -403 -475 64 12 -283 -471 -387 -25 5 -146 -273 -249 -314 -139 115 108 -252 -140
2801 -140 -186 -159 90 -72 24 -60 -8 32 290 -152 89 64 185 287 438 243 -15 -5 147 563 281 13 -54
2824 -54 -15 369 580 367 -77 -130 136 250 31 83 306 -94 -16 139 163 -49 -64 -112 -123 124 384 32 -377
2847 -377 -369 111 29 -273 -352 -141 -217 -246 -66 87 -130 -251 -291 -61 -84 46 -187 -254 -154 6 152 -171 -293
2870 -293 -156 -187 -6 366 17 -189 4 163 135 205 -97 -158 -116 256 427 270 -3 34 120 263 215 361 369
2893 369 192 -221 -2 363 374 95 -78 25 443 161 40 -220 -104 263 249 -165 -188 -58 -307 -1 41
2914 41 157 -259 -295 -266 -75 11 167 -5 -440 -299 -45 85 -166 -299 -341 -283 -2 100 -108 -95 -166 -66 51
2937 51 -84 136 -58 -197 79 295 204 -168 35 215 59 -9 111 125 -71 -203 273 378 100 -210 35
2958 35 131 370 387 141 -136 -146 95 167 70 9 194 -110 76 147 165 -83 -203 -189 -7 56 157 -290 -342 -232
2982 -232 181 98 -169 -489 -62 -168 99 -70 -116 -187 -261 -64 -160 -112 -55 -71 -158 -257 135 -65 -71 -94 -17 73 76 92
3008 92 10 -339 -122 9 216 -62 48 1 45 119 259 302 -180 74 203 452 370 207 173 58 -103 345 504
3031 504 79 -187 -62 191 189 -53 -24 -97 -194 138 32 -103 -219 -64 -105 32 77 32 -71 -258 -35 -36 -16 -36
3055 -36 -165 -265 -277 27 262 -181 -161 -264 -108 28 -23 -40 -90 -258 97 -34 -171 -205 -191 -36 65 223 48
3078 48 -336 -36 86 208 201 -34 199 -122 -49 84 272 261 -174 -122 273 231 189 220 -121 21 165 238 38
3101 38 11 216 14 28 81 209 100 -63 -276 85 297 -99 -343 -193 -150 119 78 -105 -241 98 -123 19
3123 19 -26 -100 -98 -9 -153 -33 -89 -172 -136 -128 -124 8 30 -235 -302 -236 110 -97 -57 5 -34 -363 77 162 -68 -16 32
3150 32 -15 221 -39 146 66 90 47 312 -159 -144 -40 85 17 101 148 52 -13 -30 186 224 129 76 51 -159 176
3175 176 84 25 -270 56 144 3 -18 25 -98 -129 -135 49 177 -15 -171 -24 227 25 29 -231 -218 12 13 74 -225
3200 -225 -236 -101 -20 -102 11 -112 -49 -209 -15 166 -32 -122 -8 -62 -77 99 13 66 50 200 -75 195 241 -28
3224 -28 -260 26 40 150 -201 -218 -47 158 81 38 16 -16 156 244 188 -105 192 -151 8 -158 43 96 -54
3247 -54 -32 -110 -35 -7 201 -106 -196 -90 -34 6 -140 33 -58 -91 -151 18 -76 -136 -145 -92 255 -104 -17 -94 -69 88
3273 88 -96 -75 -42 -130 18 -49 163 -42 -155 -88 -139 164 48 -61 29 60 54 171 196 43 -108 144 29 110
3297 110 237 99 -45 -62 156 148 195 24 -327 35 -69 192 -96 -44 -33 -101 55 -92 -38 53 -89 -65 -9 -40
3321 -40 34 8 -99 -151 17 39 -223 -127 -303 13 -21 -89 -50 -68 -91 70 -63 -222 -184 11 -15 86 39 -51 -79
3346 -79 -222 324 -21 -28 -26 69 -19 112 30 76 120 -45 -113 -7 130 -60 -8 -54 -142 199 193 82 -36 102 6 80
3372 80 82 100 -136 38 81 -59 158 -19 -153 2 144 78 31 -165 -87 -93 -230 48 22 -154 12 -44 -159 -223
3396 -223 -114 -177 -100 -91 -51 98 136 93 -85 -71 -51 87 -148 -105 -4 98 14 113 105 -215 72 -58 20 105 61 -23
3422 -23 24 37 123 29 102 30 145 217 -11 143 49 -77 -149 140 324 206 32 190 265 75 -110 56 -71 -17
3446 -17 146 18 123 46 -148 -44 -31 76 114 -41 -59 -55 43 -54 -26 73 -68 53 -21 60 -300 -84 90 64 76
3471 76 -88 -44 10 -76 -51 1 3 81 -102 55 145 -67 13 -159 -64 208 9 111 225 153 3 32 71 136 3
3496 3 200 -9 -117 14 243 -123 -93 -61 202 -3 63 42 20 -101 179 302 -21 -200 -197 75 -79 -21 -68 80
3520 80 -5 -61 67 32 -2 -92 84 -281 -50 36 41 -82 39 5 155 207 -108 -158 25 64 164 100 -119 -16 5
3545 5 14 50 145 99 -114 -87 49 102 186 61 -83 -28 179 -23 120 -204 -95 122 -97 80 -88 103 29 -144
3569 -144 23 -21 -113 -161 3 152 -18 -136 -4 -199 13 -34 -27 -59 -157 111 -227 -29 -52 92 -49 -51 125 14
3593 14 -10 -34 -94 23 -34 80 -65 -38 -15 -238 -92 113 -2 -20 -122 -72 9 29 62 38 40 -39 0 -171 124 -132
3619 -132 -19 55 0 -7 -27 13 35 -99 176 114 -112 -72 -278 53 121 167 24 -57 -117 24 -141 137 -98 -16 79
3644 79 87 7 -156 12 13 -24 126 -77 140 -104 -90 3 89 123 -174 17 117 -123 73 -27 -83 -155 -187 -126 112
3669 112 -188 -10 90 -105 118 195 12 -4 -60 11 -61 105 -53 -75 -108 4 115 -18 4 -124 -62 -71 -109 7
3693 7 95 -140 97 34 137 -21 78 -100 27 161 -103 -183 32 -118 24 88 120 -76 -18 -80 -23 115 -14 -37
3717 -37 -9 101 -1 -22 -85 134 -155 -146 -55 -30 70 70 -85 25 83 -108 53 -64 -68 68 147 -95 -74 -33 120
3742 120 -8 30 -13 -46 -74 -74 47 -96 167 163 -114 -105 -173 82 -49 100 -141 47 -16 148 -11 84 -17 -219
3766 -219 178 60 -131 -146 6 119 -46 6 -76 44 218 -22 -194 -139 80 6 -48 -128 -10 -111 -8 -32 -77
3789 -77 -22 10 -152 32 -25 182 -133 -90 -165 -84 -82 22 -44 55 167 -13 -124 42 -35 85 153 -130 175 -32
3813 -32 -60 22 -41 3 -124 55 -66 -17 63 -92 24 291 -246 -160 -89 89 -178 -86 -11 83 -77 124 -120 65
3837 65 218 73 213 -207 82 -16 29 39 14 -231 29 121 -116 -203 5 120 102 -77 179 170 -18 -92 104 132
3861 132 -66 -70 -55 66 -83 -100 -22 -36 -139 133 -8 -21 44 83 19 55 1 137 -26 -277 -11 69 59 -68 -110
3886 -110 -21 -27 32 198 115 31 -125 105 -26 -150 112 119 -83 53 -40 -43 58 67 143 76 64 41 -118 -184 57 -3
3912 -3 188 -131 -132 91 -70 -5 39 -120 65 11 -62 -49 -186 -117 -118 15 19 -29 -93 -81 107 -142 -24 39 -15 -141
3938 -141 -72 -12 -54 -161 -94 -83 -40 219 13 41 -101 -38 -106 161 -45 -16 221 120 105 99 -76 77 24 68 -52
3963 -52 20 -29 25 5 141 76 -1 -102 20 -58 4 -80 59 -10 -23 -34 112 69 -20 94 39 -148 -27 -113 84 -94
3989 -94 89 -68 210 9 -58 -53 -138 -71 -21 144 -27 -16 35 11 33 156 -67 -187 -76 21 63 132 62 -70 109
4014 109 13 57 80 49 5 22 -49 10 12 -28 106 -73 70 266 183 -67 -105 -35 -126 -16 87 40 -46 -92 146 74
4040 74 -203 57 -27 -118 53 -92 -81 90 -4 35 4 -15 -59 -214 5 -249 95 37 -223 -289 89 60 -7 48 -53
4065 -53 35 -51 58 -137 62 -125 -100 17 -10 158 61 207 28 84 2 -18 32 22 151 -131 30 18 -15 -20 -21 25
4091 25 115 57 103 -21 16 -74 40 170 134 58 58 -21 76 107 -16 47 134 -36 137 203 -47 119 73 90 -112 -12
4117 -12 129 -125 -15 176 0 -48 -64 -30 165 24 12 26 112 56 24 130 162 31 -121 31 275 -31 -31 71
4141 71 109 -59 -47 111 88 -89 22 -87 91 86 95 3 11 58 -100 -67 -33 81 5 -68 76 -222 235 4 -26 -233
4167 -233 67 -7 -99 148 63 -59 -15 -122 -10 -38 -87 59 104 75 -9 -37 70 -53 -110 -53 -49 117 86 89 37 15
4193 15 19 -143 32 -71 75 143 -155 59 -32 113 24 78 146 49 21 -6 -79 -70 54 -64 -44 41 -34 -153 -91 14
4219 14 -81 107 -13 -171 -77 -177 -164 122 85 -83 64 -26 31 105 154 -154 57 -47 90 -149 -4 80 64 -77
4243 -77 31 43 -169 158 -179 127 31 -163 80 22 65 -44 92 94 -101 -41 45 -48 -75 11 19 -147 14 -69 -33
4268 -33 102 42 -201 104 -14 88 53 25 -102 109 1 -17 -8 -160 81 -67 101 32 32 100 173 32 119 -3
4292 -3 -8 80 -17 70 -172 -38 75 34 -37 -35 8 -22 -84 -57 -1 10 -165 -45 16 187 9 -45 6 -105 18 102 95 196
4320 196 -285 -4 -22 80 44 -71 164 -9 -49 -19 259 28 282 19 10 51 81 143 -64 -19 -92 22 130 19
4344 19 -13 -134 100 -58 88 -3 52 192 -161 -40 -53 75 -238 107 189 -27 -132 -159 48 -160 3 -73 -97
4367 -97 84 47 -313 48 192 -43 71 -6 -84 -33 -43 5 -14 12 -96 -7 -48 66 -30 75 -20 66 87 4 -66 56
4393 56 20 48 -124 -94 129 261 -21 -137 -52 15 26 -45 -98 29 -26 108 26 33 31 -146 -69 -133 9 -107 -161 -1
4419 -1 109 -9 -57 165 -59 -74 -105 -31 -22 -148 60 3 -43 -38 124 -60 -7 -97 30 -23 -106 73 10 -59 9 -69 -54
4446 -54 -62 -219 -43 -200 58 -70 30 136 -31 154 -112 -171 155 105 -10 -61 66 -33 -6 136 -98 -88 7
4469 7 -137 -181 -176 -165 -131 -56 -165 33 -41 142 31 -64 -34 67 -17 -20 71 -158 112 -130 222 8 -67 -27 108 33
4495 33 110 -98 -92 -71 -90 -35 44 34 -27 263 -15 53 174 144 132 -113 12 33 -5 -199 215 17 20 -60 -94 10
4521 10 -52 8 -44 134 78 -133 -48 87 -23 59 69 -22 -129 30 49 4 -5 -68 -48 4 -153 114 -65 -133 75 -105
4547 -105 -35 70 -38 122 -24 -46 130 -49 27 102 -71 -71 18 -42 8 61 -50 -168 295 -147 -126 -136 -334 -100
4571 -100 195 38 59 -84 -89 122 -129 104 136 -34 -25 -61 72 214 -8 2 68 23 -235 -54 65 129 -18 9
4595 9 28 -71 119 -164 154 -95 -5 10 86 -82 -36 146 42 -35 79 -2 13 -18 -96 27 146 31 -53 -87 25
4620 25 -80 -63 15 -193 69 -28 -41 -31 70 76 207 -150 59 19 39 -56 -106 13 16 16 45 53 61 126 -272 145 -48
4647 -48 -35 84 92 -12 -2 17 104 -33 57 40 -2 35 20 82 -84 -90 18 6 4 31 60 -57 65 136 65 132 12 53
4675 53 15 19 82 49 -71 72 26 43 37 -91 101 54 95 56 -59 15 -65 -65 -53 19 86 -80 -24 198 62 -34 26 -76
4703 -76 -32 -21 83 79 38 6 -89 30 54 -45 -63 -46 5 90 -156 23 -42 -121 -80 3 -128 -230 -28 -24 0 -70 99
4730 99 -52 141 -216 -55 -46 -53 89 -5 -118 -81 82 27 -11 -52 12 -1 95 -80 30 -28 -83 -123 -48 -148 -17 -67
4756 -67 -66 -103 54 -62 38 -13 -114 -43 122 -3 11 -10 20 -98 70 3 29 125 -49 16 11 -4 -20 45 123 -160
4782 -160 -190 64 -65 -32 -88 6 -59 -26 -198 -56 -99 -53 113 -142 -277 67 -86 65 -236 -13 -214 -36 81
4805 81 -211 126 93 -217 -47 -3 67 149 -67 -17 -158 -76 -47 117 -144 61 -187 -73 -183 97 70 -21 -86 -56
4829 -56 8 22 -66 -82 -98 -69 -37 42 13 -24 133 -127 -4 -25 29 -130 -53 6 -114 -152 93 98 94 90 -115 -141 -75 -56
4857 -56 -91 -209 -83 99 124 -276 -9 23 -90 -131 100 -82 62 68 117 114 -126 -64 103 -22 -24 -105 88 -39 36
4882 36 81 83 181 -153 90 -60 -40 57 100 29 112 -51 -107 -129 145 148 268 52 -20 -73 81 -25 48 80 -9 -29 33
4909 33 8 -141 15 83 -3 -109 -56 -17 -97 -26 -81 -26 219 -35 -160 -48 -166 87 96 97 21 -214 -9 -11 22 -135
4935 -135 1 -39 14 8 8 -53 -8 -14 61 -12 -97 6 120 98 103 -28 -43 27 15 103 107 81 -88 -146 -136 -7 -84 174 -138
4964 -138 179 117 -28 75 2 13 -179 105 -29 104 -113 -8 -23 -76 -105 -28 61 -154 -36 -79 9 76 99 -4
4988 -4 106 21 -163 102 43 -59 103 -59 -9 100 -96 -187 -98 39 92 181 2 -100 -39 -109 244 114 -275 -67
5012 -67 -67 -52 5 14 -27 11 26 123 -189 26 70 -200 27 66 -114 190 92 95 49 -42 65 47 -158 -43 -51 -37 64
5039 64 -48 29 3 53 -81 -138 31 120 16 80 176 88 89 -11 -15 -93 12 35 -41 -104 -4 57 -8 68 -125 -1 -95
5066 -95 -70 -137 17 -1 -110 -101 -13 191 183 -92 -135 -71 101 -32 -74 56 -76 -154 -41 -202 -18 -37 -79 97 102 28
5092 28 32 -92 22 59 -44 41 -203 39 61 -26 131 -33 -181 -55 -114 -16 44 63 86 -103 -127 -60 73 95 215
5117 215 154 -59 47 -50 -73 28 -35 -14 92 -18 -92 -86 87 -91 22 -1 4 29 6 24 -42 -41 73 98 -68 -38
5143 -38 10 -141 167 -95 -156 -188 -82 38 157 18 -113 -123 -80 -105 17 -15 -129 -99 -82 22 95 -69 -171 56
5167 56 0 -92 -67 -35 98 19 -37 -167 56 -37 -88 134 -75 1 -11 -114 -91 47 6 -41 13 -134 146 -248 -185
5192 -185 180 -7 27 -116 -30 -47 -78 -140 104 -6 -137 -96 -5 -91 16 -15 -4 -129 -74 74 -42 -77 -166 -21
5216 -21 -42 152 10 88 97 18 11 83 107 -205 -158 48 51 62 24 -27 65 12 50 -50 -83 -152 -75 -28 -164 50 102 0
5244 0 107 -130 -181 -2 -31 68 17 23 -188 140 -123 -49 98 22 -50 -92 -9 -61 -110 -115 195 -71 -197 -54 -10 21
5270 21 -39 1 189 64 24 -169 55 38 146 112 -2 -29 10 -22 161 -183 -65 45 109 126 -37 18 -18 76 -59
5295 -59 28 -4 90 89 7 -9 -201 41 -59 22 57 135 78 109 -10 106 15 -20 212 -5 121 174 -13 -153 273
5320 273 -65 13 -258 -82 -112 7 -45 26 -52 -113 16 -225 -81 78 -113 69 -86 131 -31 -204 101 -62
5342 -62 -114 51 239 -57 -3 -40 21 6 153 -43 142 37 135 -62 -75 5 18 100 -15 9 -7 93 144 -175 39
5367 39 -69 47 -141 -34 23 11 -41 -102 31 -3 -98 10 30 183 7 76 -171 45 -117 8 -96 -100 -28 -78
5391 -78 25 -119 -110 -36 8 -179 -76 104 4 185 -89 243 87 -4 -70 100 90 161 17 -112 -44 -90 75 13
5415 13 -120 -103 -80 -192 44 -62 85 239 29 22 107 188 108 -35 99 -206 -73 -136 -29 72 -27 -5 119 -38
5439 -38 -165 50 16 -9 126 -50 -84 -36 169 -34 -11 4 51 123 -6 -24 185 22 166 15 -118 -6 -139
5462 -139 -99 -190 12 2 174 -43 126 -26 -22 29 -6 -94 -85 -85 105 140 61 -88 24 -38 -43 11 -1 30 144 -24 -124
5489 -124 -116 -100 43 -69 60 -62 63 75 60 -32 -29 -18 101 -32 -110 -74 45 119 90 -71 -68 -35 -51 76 15 -143
5515 -143 -1 -67 37 111 18 32 30 10 89 -21 10 34 -48 -8 34 -63 77 153 146 -59 -10 34 30 -60 200 -3 -173
5542 -173 -66 -156 145 14 199 176 103 7 67 -50 96 137 -74 88 50 55 99 71 -61 -233 103 -3 110 -64
5566 -64 90 -76 -200 -24 90 -44 50 -156 -98 60 -60 -34 108 -44 -97 228 -187 4 -51 38 -195 -26
5588 -26 40 -60 135 -5 19 42 -65 21 103 -14 -32 4 -60 44 255 45 70 -25 37 53 -47 39 -139 -45 180
5613 180 -49 -42 -108 218 -52 -40 22 -74 -31 42 172 260 -50 28 -90 -123 -25 -134 227 8 -4 20 158 -12 79
5638 79 35 -16 -192 41 -14 10 97 -75 -73 68 57 -145 34 -145 207 229 52 33 -183 188 -54 -206 -153 49
5662 49 69 56 163 -112 58 -102 -51 -26 -140 -75 -42 181 51 -180 -382 36 -28 86 -60 69 -76 35 -75
5685 -75 -53 99 -36 -46 76 -90 -16 -53 -20 161 49 -10 9 101 51 62 -81 46 66 78 93 -12 -41 -67 -102 113
5711 113 -33 166 -147 124 -21 -73 216 36 -40 51 188 47 70 119 43 -22 82 -1 -89 -115 134 -19 -102 -47
5735 -47 137 -82 -76 -9 -25 -79 58 1 104 64 -41 -153 -70 -212 -30 -71 152 -46 -73 83 81 27 -48 -158 28
5760 28 157 -2 -37 78 -59 -7 178 -70 -66 62 88 67 -18 -95 95 -58 -145 -181 142 -31 -111 -90 -3 -71 -80 140
5786 140 12 18 -67 -166 -29 -67 -74 -129 -3 82 -35 -74 125 -252 -87 141 -211 -1 -75 -157 -112 223 163 49 -122
5811 -122 91 70 49 -14 -129 -62 12 171 -119 15 -70 93 102 26 30 -27 51 -5 53 -143 31 116 -85 42 22 41
5837 41 -137 97 213 -113 5 87 70 -97 6 -58 -100 -5 -34 -114 -23 -131 36 -80 -110 -50 -155 154 -53 19
5861 19 37 -9 55 -103 -18 -22 -51 -100 147 64 -194 -41 31 -146 -240 -180 -53 -27 22 -12 -1 -92 101 41 -59 36 110
5888 110 -62 -74 -19 111 118 65 -123 -11 -5 -41 -22 145 -37 -67 -73 -102 -172 -193 -105 31 -65 35 -110 -111 -80 39 58
5915 58 -222 74 -146 -51 8 41 -39 -91 -21 50 73 112 131 60 57 -58 -127 -6 -3 51 -70 -11 99 4 81 -61 -18
5942 -18 155 7 104 72 26 97 -215 -33 278 -72 -147 99 -206 88 196 9 78 -74 -97 40 -70 -73 -25 -33
5966 -33 144 1 -102 0 -6 217 52 120 -27 -147 59 20 126 43 -136 -118 -156 68 82 68 210 47 -1 -19
5990 -19 -95 -104 -30 -14 -21 72 -210 24 52 -135 27 25 -115 91 -70 -207 -56 -6 -3 -33 28 60 -48 21 -105 -56 -4
6017 -4 19 9 23 -42 16 -80 72 -147 -2 -35 -10 60 -131 -6 -83 151 10 66 -141 31 31 59 -207 133 104 76
6043 76 60 -113 -60 -15 -7 -84 -42 66 -63 121 -88 -42 85 -11 44 -42 124 -113 178 -2 58 36 136 -51 44
6068 44 -111 -133 15 31 -275 -123 103 -10 46 -5 55 185 5 82 -140 -115 -72 46 89 2 -109 25 121 133
6092 133 2 45 78 10 -145 107 -131 -161 -221 -7 -176 73 -46 -36 53 18 -58 37 -27 -52 55 -187 -48 -26
6116 -26 59 4 -119 102 26 187 -85 46 46 -66 14 -26 -52 -28 50 -144 -130 -66 -148 -106 13 -58 11 149 -92 -120
6142 -120 116 86 141 -13 -161 0 -42 -1 -132 13 116 -33 16 -54 -55 230 97 22 -94 -3 6 57 -114 6
6166 6 -186 -53 -59 -44 -28 63 -37 11 -112 -77 -78 11 90 15 41 -169 -1 74 102 -105 -86 261 48 -158 13 55
6192 55 120 -69 90 77 -92 -30 33 182 -59 -107 159 -12 3 -2 37 5 22 58 31 70 -32 -58 -11 -1 -170 -46
6218 -46 41 201 228 72 -96 8 156 1 8 -49 -109 -86 -149 77 -31 -33 -123 -29 84 -90 12 -108 -4 68 80
6243 80 93 -51 10 87 -95 -38 -36 -109 5 5 -105 -147 211 23 -14 -54 -176 -133 -156 -50 18 -11 -17 -27 -89 13 -39
6270 -39 83 -270 -104 88 -75 -11 -18 -54 98 78 27 -43 -66 133 36 7 -30 50 -248 -105 29 -113 21 21 170
6295 170 -43 -25 -81 -5 10 27 -48 -82 -81 100 -88 -57 -231 131 28 -4 69 141 88 124 30 117 182 -118 17 -23
6321 -23 -16 -19 58 -88 37 -50 -70 207 -59 -135 78 -76 -150 160 43 158 21 -76 114 -71 -20 99 24 13 -188
6346 -188 -48 238 45 -61 19 -62 -78 -61 4 -45 69 -161 -122 21 37 130 6 -48 -106 23 -35 -15 -67 -158 -56
6371 -56 -62 123 -211 -181 -127 -4 -91 -3 69 -66 -81 -198 54 -57 123 -82 34 70 -109 32 -183 -189 102 46
6395 46 -23 -10 87 -22 69 -89 -266 -53 36 67 50 111 -48 -63 159 85 -99 117 -155 57 100 -84 16 -94
6419 -94 -65 189 -53 -1 95 -54 -156 -134 132 84 -72 96 202 40 -36 -15 -57 -98 -126 76 -130 260 -52 127
6443 127 -72 30 -4 -58 -76 62 -76 59 -61 -28 105 -12 -107 77 23 -224 122 -92 -2 2 119 137 14
6466 14 -9 20 -12 -103 -72 -25 -216 139 -20 51 300 24 -104 -225 -144 -52 38 -48 -44 -12 -65 -87 -22 -21 -96 -17 -22 24
6494 24 14 -108 189 85 50 123 -128 70 -18 -86 60 42 -153 -41 88 -86 17 -85 -41 9 110 71 60 238
6518 238 10 60 -56 42 -15 139 81 -27 -106 -76 28 -23 31 -156 48 -38 -120 -111 -53 45 -39 -23 27 -98 154 16
6544 16 -68 333 -29 -90 67 79 6 60 -128 -1 -28 55 16 84 -130 6 -26 28 -13 -125 -33 10 -136 -43 -60 195
6570 195 42 -35 17 93 -19 -41 175 140 -44 -60 130 -212 -44 -14 110 -107 -224 170 -62 190 53 -20 -38
6593 -38 143 -82 104 -31 91 -55 -80 134 25 148 0 233 -28 -18 -4 -108 90 -57 -75 12 -181 -53
6615 -53 -184 69 -106 48 61 9 -181 63 -35 -66 -72 262 96 -91 -87 -46 -21 9 106 -1 -33 -142 4 -109 1
6640 1 47 -81 81 44 223 84 99 129 -96 -92 83 20 -51 -97 226 54 -160 59 -26 -56 -161 -11 -200 -109 47
6665 47 -110 -112 -37 43 -59 -76 -6 5 112 11 157 -112 100 -147 27 112 62 107 -123 19 160 203 -43 -68
6689 -68 28 -36 8 10 -97 91 86 77 61 30 53 5 -56 -46 44 -86 54 48 162 -96 158 72 231 -7 187 -23 63
6716 63 23 -70 -110 -107 -115 93 -33 -14 40 -49 -37 -88 -143 -63 -189 -202 -1 0 74 -46 86 137 -53 -101 248 98 -160
6743 -160 92 -70 67 58 -13 -45 -71 4 -65 90 -45 52 50 -31 -217 -37 -74 24 36 -84 -149 -21 287 85 12
6768 12 120 119 -30 107 -196 -20 -28 58 -58 33 -84 -108 -173 -76 -112 84 45 58 146 -89 169 -116 -34 -9 150
6793 150 -227 -62 -147 -89 38 41 115 51 72 -48 -115 -69 28 -3 -109 -3 -202 39 49 -51 -187 187 64 146
6817 146 -10 -211 -66 -86 33 -65 -83 127 106 6 -106 95 12 -47 -38 93 150 -78 -12 -16 3 283 66 -48
6841 -48 87 30 1 3 76 -117 -224 -51 76 107 17 141 10 -147 -61 -90 46 -47 57 36 -74 65 -67 -52
6865 -52 7 -118 -156 55 -37 -26 8 -111 -56 -291 -122 -230 -21 -19 -137 95 -128 58 -82 29 43 103 49 -75
6889 -75 91 -13 -27 139 -147 -78 -74 -115 -47 -23 -130 -19 71 92 -11 -142 -43 -94 -41 -70 142 -9 -75 -6 -17 172
6915 172 238 -267 -49 -182 -65 37 45 -150 -63 -2 49 109 -120 123 -86 -24 -38 -143 -127 142 2 -4 -68 -143 -143
6940 -143 121 181 119 12 -106 32 83 5 53 -26 71 56 169 -53 -30 101 -24 33 27 40 -28 32 -10 14 -32 -48
6966 -48 113 20 -175 59 -22 -60 -101 -85 36 -24 -82 73 20 25 30 90 -35 174 -68 161 251 -33 123 9 -90
6991 -90 -6 -232 31 -65 85 117 -14 3 1 29 23 111 -95 -86 -3 -156 -64 28 55 -1 30 -54 75 -128 -48 14 7 78
7019 78 -73 -15 -152 22 -115 29 133 11 48 107 -32 -83 126 -50 66 -100 153 -175 -26 -38 -149 -106
7041 -106 27 64 -26 178 -72 116 -133 6 89 -74 129 -127 -39 85 113 -64 -5 282 -149 23 -179 119
7063 119 -4 30 178 -82 -13 -68 108 11 54 -93 -13 -152 217 -97 33 93 36 56 -22 173 25 137 -153
7086 -153 98 12 94 -102 123 -13 -23 -227 36 -72 -57 102 149 16 -52 -132 0 29 -175 -71 131 9 -42
7109 -42 -32 -45 -44 -152 21 80 22 13 -74 0 41 62 54 -7 100 -121 64 275 154 67 -11 120 11 -90 -75 -104 81
7136 81 125 -47 8 150 145 79 -7 -109 -58 -48 19 150 -59 71 -34 -113 51 53 132 -86 -103 -270 -12 -117 -10
7161 -10 33 -34 -30 29 1 116 166 162 23 -34 14 146 -65 -111 6 96 -129 -176 -17 -58 203 76 61 -32 29 -15 76
7188 76 10 141 -106 -143 -180 -88 -81 12 120 -22 3 -13 -16 36 -50 -27 104 -115 73 3 -19 55 78 20 -68 78 66
7215 66 19 44 6 -21 57 -125 0 80 -64 -134 -56 32 -48 -199 -42 18 -128 250 149 78 -92 -36 96 -4 38
7240 38 -100 23 149 -45 32 -230 -37 144 -159 20 43 202 -20 -95 -348 50 66 54 5 -125 59 51 -72
7263 -72 81 54 -142 -76 33 120 80 212 81 -4 130 57 -180 42 -67 303 210 -27 54 -232 193 -1 -177
7286 -177 -1 35 56 -140 -159 -58 38 -80 65 -39 -28 23 2 -37 100 92 5 -58 -24 127 -98 -34 -65 -100 136
7311 136 -54 107 -139 -79 76 -5 87 -181 -58 -84 -47 -95 -132 -86 57 -60 -114 58 42 -82 77 -48 -253
7334 -253 176 -89 108 48 -48 -29 -114 -15 -95 46 -10 -68 28 147 42 -60 -188 -9 -6 -16 -1 -86 -63 103 -6
7359 -6 93 44 -52 77 201 41 -52 70 -182 -45 -115 43 -71 105 -27 -118 -105 -116 77 -4 -22 130 37 -125
7383 -125 68 40 74 -83 117 -51 88 124 22 86 -34 36 -107 -17 54 -4 13 24 0 259 187 18 41 -11 -178
7408 -178 7 247 129 58 -146 22 -99 27 -3 -18 -60 -90 9 11 -118 -143 -131 13 1 -79 18 19 185 14 -38
7433 -38 -50 132 -77 69 -64 125 40 -81 60 -38 -13 0 -94 -107 -103 87 -82 -13 75 48 48 -98 -3 163 125 35
7459 35 -79 -50 95 50 -152 -9 12 -45 -101 80 -203 -10 -68 -132 21 32 -34 -13 86 -12 97 -117 -39 118 99
7484 99 -261 6 -34 88 -93 43 -27 -48 -120 54 46 -124 191 29 -70 42 -22 -26 -33 -35 -158 -91 123 -74 -22 110
7510 110 13 138 128 -63 60 -6 28 -162 177 141 58 -26 72 162 101 -69 -150 171 79 116 200 39 -159 -74 -47
7535 -47 43 164 13 -145 140 -245 70 -26 26 -127 31 87 23 53 -27 135 45 -134 -17 -10 236 163 -47 -268
7559 -268 -46 -109 -121 -95 110 -147 -6 84 -125 -50 -120 125 -208 -10 105 15 -198 29 -48 86 -135 -6 151
7582 151 -167 46 77 94 -28 -3 83 36 43 -96 77 -130 -29 -170 -89 142 105 122 -35 -33 -269 74 -106 -36
7606 -36 -81 50 -94 61 -67 128 128 -16 -72 141 63 -175 23 161 97 -21 74 63 -108 31 15 97 196 -14
7630 -14 114 149 146 -88 12 65 -73 -65 79 -118 34 -97 -28 -9 -11 -215 66 -23 -200 102 160 -50 -133 16 23
7655 23 -49 299 51 160 188 33 78 156 144 27 -24 -82 -184 169 -118 -7 -6 51 -53 63 100 -126 132 -85
7679 -85 -56 264 62 -110 -246 -155 24 21 -12 15 43 -10 -27 123 129 -84 105 -102 142 -32 102 -147 -52 -151 -59
7704 -59 9 -21 72 -73 -31 -127 -119 53 90 20 166 50 63 -86 44 55 -100 -24 -233 43 69 48 111 120 9 69
7730 69 -129 103 147 -136 62 266 -42 -8 -192 77 -138 28 59 89 -89 -92 -86 68 16 108 -111 -124 -43 -43 142
7755 142 -40 -9 -16 119 6 -9 30 62 36 -157 -105 -118 -99 112 -50 83 146 -2 -162 -1 65 -114 -14 -141
7779 -141 -4 -26 -43 -118 116 107 213 150 -10 37 175 55 -19 152 117 -79 -73 191 8 81 -126 -41 95 -69
7803 -69 -14 74 46 236 176 -66 120 -226 41 -21 12 -167 -79 125 6 130 252 27 -5 20 -129 -31 154 -10
7827 -10 -93 -167 -93 153 -50 -80 -58 82 62 122 21 -66 123 63 -151 -26 157 -152 24 16 -92 -220 -159 -184 113
7852 113 -26 31 112 -152 -86 -68 -122 -103 -134 -1 79 -204 -88 -189 -78 -81 -121 15 25 -38 73 -45 -53 81 163
7877 163 69 36 -45 16 -177 -15 17 74 34 110 -8 52 -31 122 -114 -1 50 -146 134 -91 111 149 52 0 73
7902 73 -62 -123 23 -74 64 -18 -71 43 -206 92 153 -169 -112 214 54 37 -31 11 -32 122 -50 56 -2 -37
7926 -37 195 54 138 13 14 105 17 5 53 22 -7 -10 78 -10 -30 70 126 -25 2 45 -91 52 20 2 -95 -32 93
7953 93 78 -121 50 -171 -144 72 -260 -127 -43 174 -154 133 -14 11 197 -15 250 -2 3 -13 -77 171 -61
7976 -61 -17 -96 134 -25 -80 -64 -53 -37 112 -54 -135 -169 206 20 -5 84 -97 128 -225 42 155 -100 8 73
8000 73 -116 170 -49 -84 -27 -20 65 92 88 -42 -104 95 166 83 -84 -47 134 -10 -188 -153 55 -3 31 -3 99 -102
8026 -102 132 -71 -121 -93 21 21 18 -53 -14 15 -133 18 -68 -19 35 -31 -47 83 75 -98 119 -47 -43 84 -20 -209
8052 -209 2 100 126 -38 52 15 -26 -19 -45 37 -11 91 101 -52 49 65 136 57 -42 67 63 0 -14 -26 138 -40 -59
8079 -59 -237 38 -18 -58 -102 69 54 83 144 -41 2 -186 -50 -55 224 45 25 1 97 -90 -161 27 22 37 -40 -247
8105 -247 -242 -23 28 -62 126 -92 -19 151 -8 217 -52 -11 -45 -40 -43 90 -9 -14 31 -12 7 240 124 9 -30 217
8131 217 188 27 -53 -57 -231 -87 -44 31 21 68 63 3 -46 -70 41 -103 194 142 1 -100 7 43 36 -214 58 54
8157 54 -42 -21 52 105 28 -139 36 152 -25 17 72 143 -45 87 100 65 140 28 18 -90 44 118 -239 90 126
8182 126 4 -120 -99 -102 5 125 60 -9 -207
8191b07
##END NTUPLES=NMR FID
##END=
