##TITLE=1H_LR-684B-C2-TFA
 CDCl3, 8 sc, 
 2.8.2019
##JCAMPDX= 6.0         $$ Bruker NMR JCAMP-DX V2.0
##DATA TYPE= NMR FID
##DATA CLASS= NTUPLES
##ORIGIN= UXNMR, Bruker Analytische Messtechnik GmbH
##OWNER= root
$$ XWIN-NMR		Version 3.5
$$ Fri Aug  2 15:34:55 2019 Russian Standard Time (UT+4h)  she@DPX200
##.OBSERVE FREQUENCY= 200.13155
##.OBSERVE NUCLEUS= ^1H
##.DELAY= (6, 6)
##.ACQUISITION MODE= SIMULTANEOUS
##.ACQUISITION SCHEME= undefined
##.AVERAGES= 8
##.DIGITISER RES= 18
##SPECTROMETER/DATA SYSTEM= spect
##.PULSE SEQUENCE= zg30
##.SOLVENT NAME= D2O
##.SHIFT REFERENCE= (INTERNAL, D2O, 0, 15.7039)
##AUDIT TRAIL= $$ (NUMBER, WHEN, WHO, WHERE, WHAT)
$$ ##TITLE= Audit trail, XWIN-NMR		Version 3.5
$$ ##JCAMPDX= 5.01
$$ ##ORIGIN= Bruker BioSpin GmbH
$$ ##OWNER= she
$$ F:/spectra/data/she/nmr/H-F/1/audita.txt
$$ ##AUDIT TRAIL=  $$ (NUMBER, WHEN, WHO, WHERE, WHAT)
(   1,<2019-08-02 15:33:36.12 +0400>,<she>,<DPX200>,
      <created by zg, POWCHK disabled, PULCHK disabled
       configuration hash MD5:
       00 E9 B6 7A A2 85 ED C7 34 08 36 98 17 FE 4E 26
       data hash MD5: 16K
       4C F3 D0 55 E0 64 B3 2C 6A CE BE 3B C5 D2 F6 E0>)
$$ ##END=
$$ 
$$ hash MD5
$$ 31 B5 99 CD 01 E1 2E 68 7D 35 EB 6C 88 F8 64 DB
##$RELAX= 
##$RELAX= 
##$RELAX= 
##$RELAX= 
##$RELAX= 
##$RELAX= 
$$ Bruker specific parameters
$$ --------------------------
##$DU= <F:/spectra>
##$EXPNO= 1
##$NAME= <H-F>
##$PROCNO= 1
##$TYPE= <nmr>
##$USER= <she>
##$AMP= (0..31)
100 100 100 100 100 100 100 100 100 100 100 100 100 100 100 100 100 100 
100 100 100 100 100 100 100 100 100 100 100 100 100 100 
##$AQSEQ= 0
##$AQ_mod= 1
##$AUNM= <au_zg>
##$AUTOPOS= <>
##$BF1= 200.13
##$BF2= 200.13
##$BF3= 200.13
##$BF4= 200.13
##$BF5= 200.13
##$BF6= 200.13
##$BF7= 200.13
##$BF8= 200.13
##$BYTORDA= 1
##$CFDGTYP= 0
##$CFRGTYP= 5
##$CHEMSTR= <none>
##$CNST= (0..31)
1 1 145 1 1 1 1 1 1 1 1 1 1 1 1 1 1 1 1 1 1 1 1 1 1 1 1 1 1 1 1 1 
##$CPDPRG= <>
##$CPDPRG1= <>
##$CPDPRG2= <>
##$CPDPRG3= <>
##$CPDPRG4= <mlev>
##$CPDPRG5= <mlev>
##$CPDPRG6= <mlev>
##$CPDPRG7= <mlev>
##$CPDPRG8= <mlev>
##$CPDPRGB= <>
##$CPDPRGT= <>
##$D= (0..31)
0 1.2 0 0 0 0 0 0 0 0 0 0.03 0 0 0 0 0 0 0 0 0 0 0 0 0 0 0 0 0 0 0 0 
##$DATE= 1564745615
##$DBL= (0..7)
120 120 120 120 120 120 120 120 
##$DBP= (0..7)
150 150 150 150 150 150 150 150 
##$DBP07= 0
##$DBPNAM0= <>
##$DBPNAM1= <>
##$DBPNAM2= <>
##$DBPNAM3= <>
##$DBPNAM4= <>
##$DBPNAM5= <>
##$DBPNAM6= <>
##$DBPNAM7= <>
##$DBPOAL= (0..7)
0.5 0.5 0.5 0.5 0.5 0.5 0.5 0.5 
##$DBPOFFS= (0..7)
0 0 0 0 0 0 0 0 
##$DE= 6
##$DECBNUC= <off>
##$DECIM= 24
##$DECNUC= <off>
##$DECSTAT= 4
##$DIGMOD= 1
##$DIGTYP= 9
##$DL= (0..7)
0 120 120 120 120 120 120 120 
##$DP= (0..7)
150 150 150 150 150 150 150 150 
##$DP07= 0
##$DPNAME0= <>
##$DPNAME1= <>
##$DPNAME2= <>
##$DPNAME3= <>
##$DPNAME4= <>
##$DPNAME5= <>
##$DPNAME6= <>
##$DPNAME7= <>
##$DPOAL= (0..7)
0.5 0.5 0.5 0.5 0.5 0.5 0.5 0.5 
##$DPOFFS= (0..7)
0 0 0 0 0 0 0 0 
##$DQDMODE= 0
##$DR= 18
##$DS= 0
##$DSLIST= <SSSSSSSSSSSSSSS>
##$DSPFIRM= 0
$$ [...]
##$SUBNAM2= <"">
##$SUBNAM3= <"">
##$SUBNAM4= <"">
##$SUBNAM5= <"">
##$SUBNAM6= <"">
##$SUBNAM7= <"">
##$SUBNAM8= <"">
##$SUBNAM9= <"">
##$SW= 24.9336996594482
##$SWIBOX= (0..15)
0 0 2 0 0 0 0 0 0 0 0 0 0 0 0 0 
##$SW_h= 4990.01996007984
##$TD= 16384
##$TD0= 1
##$TE= 0
##$TE2= 300
##$TE3= 300
##$TEG= 300
##$TL= (0..7)
0 120 120 120 120 120 120 120 
##$TP= (0..7)
150 150 150 150 150 150 150 150 
##$TP07= 0
##$TPNAME0= <>
##$TPNAME1= <>
##$TPNAME2= <>
##$TPNAME3= <>
##$TPNAME4= <>
##$TPNAME5= <>
##$TPNAME6= <>
##$TPNAME7= <>
##$TPOAL= (0..7)
0.5 0.5 0.5 0.5 0.5 0.5 0.5 0.5 
##$TPOFFS= (0..7)
0 0 0 0 0 0 0 0 
##$TUNHIN= 0
##$TUNHOUT= 0
##$TUNXOUT= 0
##$USERA1= <user>
##$USERA2= <user>
##$USERA3= <user>
##$USERA4= <user>
##$USERA5= <user>
##$V9= 5
##$VALIST= <valist>
##$VCLIST= <CCCCCCCCCCCCCCC>
##$VD= 0
##$VDLIST= <DDDDDDDDDDDDDDD>
##$VPLIST= <PPPPPPPPPPPPPPP>
##$VTLIST= <TTTTTTTTTTTTTTT>
##$WBST= 1024
##$WBSW= 4
##$XGAIN= (0..3)
0 0 0 0 
##$XL= 0
##$YL= 0
##$YMAX_a= 156200
##$YMIN_a= -150057
##$ZGOPTNS= <>
##$ZL1= 120
##$ZL2= 120
##$ZL3= 120
##$ZL4= 120
##$ABSF1= 10
##$ABSF2= 0
##$ABSG= 5
##$ABSL= 3
##$ALPHA= 0
##$AQORDER= 0
##$ASSFAC= 0
##$ASSFACI= 0
##$ASSFACX= 0
##$ASSWID= 0
##$AUNMP= <proc_1d>
##$AZFE= 0.1
##$AZFW= 0.1
##$BCFW= 1
##$BC_mod= 2
##$BYTORDP= 1
##$COROFFS= 0
##$CY= 11.3945322036743
##$DATMOD= 1
##$DC= 2
##$DFILT= <>
##$DTYPP= 0
##$F1P= 20.1720416913024
##$F2P= 0.152960286110954
##$FCOR= 0.5
##$FTSIZE= 0
##$FT_mod= 4
##$GAMMA= 1
##$GB= 0.15
##$INTBC= 1
##$INTSCL= 1
##$ISEN= 128
##$LB= 0.24
##$LEV0= 0
##$LPBIN= 0
##$MAXI= 10000
##$MC2= 0
##$MEAN= 0
##$ME_mod= 0
##$MI= 1.114404
##$NCOEF= 0
##$NC_proc= 0
##$NLEV= 6
##$NOISF1= 3.799351
##$NOISF2= 2.8
##$NSP= 1
##$NTH_PI= 0
##$NZP= 0
##$OFFSET= 15.70392
##$PC= 1
##$PHC0= -9219.507
##$PHC1= 12.20097
##$PH_mod= 1
##$PKNL= yes
##$PPARMOD= 0
##$PSCAL= 0
##$PSIGN= 0
##$REVERSE= no
##$SF= 200.130013532006
##$SI= 16384
##$SIGF1= 3
##$SIGF2= 2
##$SINO= 400
##$SIOLD= 16384
##$SREGLST= <1H.CDCl3>
##$SSB= 0
##$STSI= 0
##$STSR= 0
##$SW_p= 3612.71676300578
##$SYMM= 0
##$S_DEV= 0
##$TDeff= 0
##$TDoff= 0
##$TI= <>
##$TILT= no
##$TM1= 0
##$TM2= 0
##$TOPLEV= 0
##$USERP1= <user>
##$USERP2= <user>
##$USERP3= <user>
##$USERP4= <user>
##$USERP5= <user>
##$WDW= 1
##$XDIM= 8192
##$YMAX_p= 0
##$YMIN_p= 0
$$ End of Bruker specific parameters
$$ ---------------------------------
##NTUPLES= NMR FID
##VAR_NAME=  TIME,          FID/REAL,        FID/IMAG
##SYMBOL=    X,             R,               I
##VAR_TYPE=  INDEPENDENT,   DEPENDENT,       DEPENDENT
##VAR_FORM=  AFFN,          ASDF,            ASDF
##VAR_DIM=   8192,          8192,            8192
##UNITS=     SECONDS,       ARBITRARY UNITS, ARBITRARY UNITS
##FACTOR=    0.0002004,     1,               1
##FIRST=     0,             0,               0
##LAST=      1.6414764,     0,               0
##MIN=       0,             -150057,         0
##MAX=       1.6414764,     156200,          0
$$ Real data points
##PAGE= N=1
##DATA TABLE= (X++(R..R)), XYDATA
0@%%%%%%%%Qj6J6j6K4l2M0m8N6p0P8q9J05j26J50j69J94k25K57k95L35l78M26
31B25m80N40o03O75p54Q37r31J034j147J272j408J559j726J911k119K351k614
48a378K917l266L678m167M759n499O448p721R536j2347J7338k8934J07819O7017
62A56200j09653k1972p4337p1693l317J02783Q2955N0333J7369l3143j10595q4303
74i9373j2577J9638K2715Q3406J01328J3000q2753p3840m8676n2287j1543Q5544
86e5418J05467L7845j2205k2776o5061r3501l9480M0188N9668O0514O7373K1914
98A04528o4859q1035l0056j1780j7962L9513J04392O5663k2797m9318l9077n1909
110e4697m1838K4518O9362N2723L4231K2202l5506r0018n9222J0596L0994K9738
$$ plain form
0 0 0 0 0 0 0 0 0 0 8 -8 8 -8 16 -16 24 -24 32 -38 40 -49 56 -70 80 -89 105 -120 137 -158 177 -201 225
31 225 -255 285 -318 357 -397 440 -491 543 -604 668 -740 819 -907 1004 -1115 1236 -1378
48 -1378 1539 -1727 1951 -2216 2543 -2956 3492 -4229 5307 -7040 10298 -18636 89183 156200
62 156200 46547 24575 -49762 -121455 -124772 -21989 60966 111299 128668 95525 -15070 -99373
74 -99373 -111950 -92312 -69597 13809 115137 128137 45384 -28456 -77132 -129419 -140962 -55418
86 -55418 50049 87894 75689 52913 -12148 -105649 -145129 -104941 -45273 15241 82614 104528
98 104528 39669 -41366 -71422 -83202 -101164 -61651 42741 108404 85607 36289 -2788 -54697
110 -54697 -96535 -72017 -2655 50068 84299 106501 70995 -19023 -78245 -67649 -36655 -6917
122f917N9756O0017r021o3161n0595l1195k9266J1799P0857O4928J0477j3838
134G3841k1987n5935o6862j0172M3665M2968L8060M3973L951o6574p2005k2590
146f9667K7M940M7058P6913L0123l2970m3363l8719m9985k5171M0501O4930L3909
159C8526J4956Q962l3565p3862m5091J2483K7912K9904N3046M2854j8643n5661
171A821l9014k3958k0777J7479O5232N4556O454j3582k1305m8938n0702M04M1344
184c0986L5637L0187L3596J112n1109n1333j4716J789Q694L9946N5159J6190k6433
197D7733k9296k7569l6207j2757L6415M9071K2798Q928L03l1473n3584k5760J3833
210c7565K1566K4856L8173K3437k2767m3002k7163j6730r663K0459M6959L0741
$$ plain form
122 -6917 52839 112856 103835 40674 -9921 -41116 -70382 -58583 12274 77202 87679 73841
134 73841 51854 -4081 -70943 -81115 -37450 5518 43578 87551 91502 24928 -47077 -69667
146 -69667 -69640 -64700 -17642 59271 89394 56424 13061 -25658 -75643 -100814 -60313 4617 38526
159 38526 53482 62444 28879 -44983 -90074 -77591 -49679 -19775 33271 76125 57482 1821
171 1821 -37193 -61151 -81928 -64449 783 55339 61793 48211 26906 -22032 -72734 -72330 -30986
184 -30986 4651 34838 68434 69546 18437 -32896 -47612 -45823 -37129 2817 57976 74166 47733
197 47733 18437 -9132 -45339 -58096 -21681 27390 50188 59116 59419 27946 -25638 -51398 -37565
210 -37565 -15999 8857 47030 70467 47700 4698 -22465 -39195 -48858 -28399 18560 49301
222D9301k580j3866k2078l9531l1613J0110L3557K6104K0501J6979j1824m2821
234g761l6271q507M030J4929L5995L6375K673k4802k5232k5044k4430O88L4246
247b3111L6482J5682N280o626l1272l8213j1492J5204K1174K5136L0275J0338
259D8857k2970l2389j9659j1474r73K4732L9730K1642m232j2529k0748l0617j8644
272c9274J2810K8284K2822J7405R548j4392l4361k5246m759O172J5269K8812K4289
285D7379k003k1325k2040k0130j6699M438K6562K5948J0108L13r805k6431k7605
298c1290p886J1300J6458J9265J9317K459k0295k4812j4937p454K389J9286K6333
311A0133J3250n053j2043j7479k0966q499J1599K1126J6665J1843K776j3309k3636
$$ plain form
222 49301 46721 32855 10777 -28754 -60367 -50257 -16700 9404 29905 46884 35060 -7761
234 -7761 -44032 -52539 -48509 -33580 2415 38790 41463 16661 -8571 -33615 -58045 -57357 -23111
247 -23111 13371 29053 34333 27707 -3565 -41778 -53270 -38066 -16892 8244 38519 48857
259 48857 25887 -6502 -26161 -37635 -38608 -13876 25854 47496 43264 30735 9987 -20630 -39274
272 -39274 -26464 1820 24642 42047 51595 37203 2842 -22404 -27163 -20991 -5722 23090 47379
285 47379 45376 24051 2011 -18119 -34818 -30380 -3818 22130 32238 32551 22746 -3685 -31290
298 -31290 -39176 -27876 -11418 7847 27164 29623 9328 -15484 -30421 -37875 -35486 -16200 10133
311 10133 23383 18330 6287 -11192 -32158 -40657 -29058 -7932 8733 20576 23352 10043 -13593
324a3593j5586o77Q488J5936K1243J3921l828j5775j6437j3649n880J0094K0793
337E050J8244P200k122j2413j9809j5574p30J1015J5750J6489J0914m008j7522
350A2484j8448j1042l127Q013J8224J8377O073o706j3188j7567j5395k762J1885
363a3179J7205J3591P242k806j5177j9867j2064o89Q087J5747J6237P811n986
376A6152j3672j5366j1869l074R587J6774J3364O193l067j1701j6357j1221J11
389b4146Q927J2969J3440P753l435j2930j3219q220j473P012J4214J2671M767
402A8330m528r620j1576r046m87R337J2260R593L620l394j0236j1919o818J854
416a2630P757J1256R318L311n402j0518j0682n928J772Q236J1560Q481J977n876
$$ plain form
324 -13593 -29179 -29856 -21368 -5432 15811 29732 25904 10129 -6308 -19957 -25837 -15743 5050
337 5050 23294 30494 28372 15959 -3850 -19424 -20154 -9139 6611 23100 34014 30006 12484
350 12484 -5964 -17006 -20133 -12120 6104 24481 30554 23848 10660 -6907 -22302 -25064 -13179
363 -13179 4026 17617 24859 22053 6876 -12991 -25055 -25744 -17657 -1910 14327 22138 16152
376 16152 2480 -12886 -24755 -27829 -18242 -1468 11896 18089 15022 3321 -13036 -24257 -24146
389 -24146 -15219 -2250 11190 18943 15508 2578 -10641 -18861 -20334 -13322 892 13563 18330
402 18330 13802 4182 -7394 -16440 -16927 -7590 4670 14263 17883 14489 4253 -7666 -14484 -12630
416 -12630 -4873 6383 15701 19012 13610 3092 -7590 -13518 -11746 -3510 8050 16531 18508 12632
430A2632j0677j0362n469K628Q597J0933Q451J041o512j1272j0523m628K270Q945
444c946J1001Q143J111o744j0769j0667n242J955Q914J1138Q440L99n876j0343
458b486j0479n514K262Q566J0370P692J370m996j0154r647m638K316P591R394
472A647P778J851m991q778q007m455J636P438R358O895J322m226p379p673l607
487a1191K422O707P803O225Q57m774o495o044k980J966O675P900M215m02m199
502H685o750o252k510L124O423N976L560j24n316p631n625j124K725N102O688
517F951L556j904o179o215n286j829L059P055N857K086j899n000p274n532n86
532a3140M493N632N804L917j196o856o442l743r56K718P161P212K922k114m358
$$ plain form
430 12632 1955 -8407 -13876 -11248 -2651 8282 16733 17774 11262 -10 -10533 -15161 -12891 -3946
444 -3946 7055 15198 16309 9565 -1204 -11871 -17113 -15158 -6244 4894 13334 13733 7857 -2486
458 -2486 -12965 -18479 -16217 -7651 2719 10411 11781 6785 -3369 -13016 -17654 -15338 -7747 1647
472 1647 9425 11276 6285 -2493 -10500 -14955 -13319 -5881 3477 10372 11694 7468 89 -7584 -11191
487 -11191 -8769 -2062 5741 11966 12823 8049 1554 -4490 -7470 -5504 1171 9071 13286 12884 8685
502 8685 1935 -4317 -6827 -3703 2720 8696 12256 12132 6816 -815 -6440 -7564 -4839 263 6951
517 6951 10507 8603 2424 -3791 -9077 -10906 -7847 -792 5065 7151 5252 252 -7022 -12554 -13140
532 -13140 -8647 -3015 2789 6706 5510 -1346 -7788 -11531 -12487 -9769 -2608 4604 7526 5412 1054
547A054n495n352j190M746O761N313L028L35m911p433l497J49K329N672O560L401
563A1470j732m639n359l655j915L279N815N144J782q33l418o199m595J75K881
578a799L573M018L209j513n160m940k489r43J504M958M466Q19j762l631m269l825
594g784j52L662L582K898J583n70m564m834j243J218J532L763M431J314l068l725
610a957k328k304n29M043N248J982J29o01k861n624k050K701L361K417L515K321
626G463k991n177k859k9n71J996N861L612j508k077k386m025l512J610M867K958
642C232J123J909m90n821m690j20J769J065M115M184M78l995k487k086k970o85
658e469M060M805J025m80k19k506m888j885K353K222J307L439K372l042m563j604
$$ plain form
547 1054 -4441 -9793 -10983 -6237 524 5837 8865 9200 4289 -3144 -6641 -6492 -4163 1509 8069 11470
563 11470 9738 5099 -260 -3915 -5830 -2551 3264 8408 10190 9357 5939 -260 -4855 -4680 -1799
578 -1799 1774 5792 9001 7488 2328 -2612 -5101 -6044 -4540 418 4884 5703 3941 310 -3959 -7784
594 -7784 -7936 -4274 -692 2206 3789 3219 -1345 -6179 -7422 -6204 -4672 -909 3522 4836 1768 -1957
610 -1957 -4285 -6589 -7118 -3075 2173 4155 4284 3683 822 -4802 -6852 -4151 -790 1627 5142 7463
626 7463 4472 -705 -3564 -3593 -4164 -2168 3693 7305 5797 3720 1334 -2691 -6203 -4593 274 3232
642 3232 4355 6264 5774 -47 -4737 -4857 -3088 -2023 2092 6276 6754 2759 272 -1814 -4784 -5469
658 -5469 -1409 3396 4421 3941 3722 1216 -3672 -5557 -3204 -982 325 3764 6136 3094 -1469 -3073
674c073p6q34J395M363K293j272j419r00l319k895J639L662J337O20J527r28l738
691a618k851O64N01P78L225K869j355k859j051o36k012nM219K524k78j69k14k370
709f38l375j54L595R94M98K859J022l291l343K5N69n99K274M447P53k634j175
726A827n10l113j706K678L815O58N1J176j708m705j329J222Q46K11L264K446j540
743C583l893r21m52k483J43L935K677j224l98O11l147l915N34L075N37K76K903
760A841R29l510k937P20J37j287J701M229K98j932l02Lk639j589K775K873o13
777F97O83J720j169l232o88K001J37n97K704K405j723k517j1j34j621N40L479
794B674R75j561j32O34k383k516J196K367n7k68K017l32l254j364Q21j17n47J799
$$ plain form
674 -3073 -3149 -3983 -2588 1775 4068 2796 1377 477 -2842 -5737 -4098 -436 901 1521 3048 2120 -1618
691 -1618 -4469 -3805 -3304 -2526 699 3568 2213 -646 -1697 -2333 -4345 -4350 -131 2393 2115 1946 1732 -638
709 -638 -4013 -4167 -572 422 920 3779 4801 1510 -1833 -1808 -1239 -1838 436 4883 5636 3002 1827
726 1827 1317 -1796 -3502 -824 2991 3649 3700 4876 3168 -1537 -2866 -1644 -798 -587 2677 5123 3583
743 3583 -310 -1231 -1683 -4166 -4023 -88 2589 1365 967 1578 -1569 -5484 -4950 -1875 -1338 -1062 1841
760 1841 2770 -740 -3677 -2957 -2820 -4107 -2406 1823 2121 189 -113 -110 -2749 -4338 -1563 1310 697
777 697 1380 3100 1931 -1301 -1989 12 149 -448 2256 4661 2938 421 410 276 -1345 -805 2674
794 2674 3649 2088 1956 2590 207 -2309 -1113 1254 1197 929 2946 2614 -640 -2004 -1183 -1300 -1847 -48
812d8K723q51k480j45j32k222n99K688J742m75R0P80j454l073o1J910K8M05K515
831A341J486k561j716J57m38j394J615L054O28j338K85M94k643j893J582K113
847G72k75O25K151k82k839j350R63l28q95K428K281j100j827P20p89k084n73K679
865B77J192p43L27Q70j678k239M56R51k91o5K070Q18j535j545R16q16j114J063
883a086K263J73j201L73M66k257j011J674R33m17N35J340l17k389j87P54m63K22
901e95J490J229j128j040Q2N5j819O59J810P20o89Q3L18j473j500K52J606p19
919f59L27J502K27j909o43M18o19o60J448J664m38m76j72N8j982n66K014P83k48
938F9Q26O08n02k219j75Q99m12K37J827R12p72r96K43l34j382L46J744K29k72
$$ plain form
812 -48 2675 1824 -656 -801 -933 -3155 -3754 -1066 676 201 291 1071 -383 -3456 -3517 -1607 -1579 -1174 1341
831 1341 2827 266 -1450 -1293 -1731 -3125 -1510 1544 2172 834 1119 1613 -1030 -2923 -1341 772
847 772 497 1122 3273 2991 152 -1198 -235 -563 -1458 970 3251 2151 324 1044 255 -1829 -2402 277
865 277 1469 726 1053 1923 245 -1994 -1538 -587 -878 -943 1127 1945 410 -1135 -219 -1035 -2149 -1086
883 -1086 1177 1350 149 522 988 -1269 -2280 -606 327 -90 445 1785 1468 -921 -1108 -354 -817 -595
901 -595 895 2124 996 -44 38 93 -1726 -1067 743 1463 774 857 1175 -298 -1798 -1546 60 -659
919 -659 -332 1170 1397 -512 -1155 -737 -1356 -2016 -568 1096 658 182 10 68 -1914 -2480 -466 317 69
938 69 895 1503 1001 -1218 -1393 -494 -906 -669 1158 2070 1298 302 545 211 -1171 -825 919 1148 876
957H76N18K33j583j153P02N40j76L59J485j70j360p14M23p12p59R48J314m62k97
976A2M0J41j681l2R76K76n51P77N96q44j087K54O32r18M88Q07P16j190r1Q22q94
997g51n07P01J422l49k56L65L1p25p65P32Q50k39M37N47l80q15j71K48j14k97
1017c6R16P07l88k96r6m29j293N86P11J27L33j36K38r19q50j32J41k0J11J329
1037F04J08q37j16l92n21n29M78Q83J20O42pr9j089m13K80P7L57N01O36M0r09
1058a86O4l08k51K05M55P73q5k63M48o14k46k5L81j3L18M45L3j032L12J46l63
1079A94N2k65R72m43k84k19o1K30o09J48N73k49J73j59m44l08J8L48P8K0K42L31
1101C38j50r30k0k0K90L16L73j34m9j66l00n9k7L1N62K29K04j2j58l02n12L96
$$ plain form
957 876 1394 1627 44 -1109 -407 133 -43 316 1801 1631 271 -443 -20 -732 -1491 -543 771 309 12
976 12 52 193 -1488 -1520 -544 -268 -819 -42 554 -290 -1377 -1123 -491 -1409 -921 -114 602 -588 -679 143 -751
997 -751 -1258 -557 865 516 260 625 656 -69 -834 -102 748 509 946 1493 1113 298 127 375 261 -36
1017 -36 880 1587 1199 903 807 378 -915 -329 382 509 842 706 944 25 -825 -957 -816 -836 -725 604
1037 604 712 -125 -241 -633 -1154 -1683 -1205 -322 -202 440 433 334 -755 -1168 -888 -811 -454 47 683 723 -186
1058 -186 -122 -430 -681 -476 -21 752 667 404 852 238 -8 -33 348 335 653 1098 1131 99 411 557 194
1079 194 246 -19 953 510 226 7 -54 176 -433 -285 288 39 212 53 -391 -699 -681 -333 -255 -235 7 338
1101 338 188 -742 -762 -782 -492 -176 197 63 14 -152 -452 -511 -538 -507 55 284 488 476 318 16 -496 -100
1123a00L1LK42N54P6j73q2q80N3P9J15M25L75k3r6r8o82j48J2JO50j01K02l38
1147I7pl49l61k68K82N91m1J97j22O8k47l92K04r4J62K23j61J45P4n9J4k59J66
1170a37K16J56p9K02k24m0J3M2P8J38J72L0j46l24n2k35K69J27L32Q9l14Q0k59
1193A34k94K50pL15k09K00p2m67p0j99m9p9P9N76p3M0j74n6k38k33O1N33J28L9
1217A35j66lk37P8k17k7K02K04O2M13r9m95k92O09j70j24N90M0r3J89l95j8J71
1240C57l53K19Q1J70j47Lpn05l8J38J58M02k60r7m5J19n33j55K02O9k8J50J02
1263Bk2j81j37l03M68n2O8J30k21K10m19P5M1k06L56J93J86j01n5j49r8O4J88
1286C7Q5MM63k91N0j29l58M55l76N76o7l7m2k80M16l36k02n7M13k68J83k08k3
$$ plain form
1123 -100 -69 -66 176 730 806 633 551 -329 -276 -197 -82 343 718 695 599 501 -181 -329 -317 -316 334 233 435 97
1147 97 90 -259 -620 -888 -606 -15 -56 141 19 87 -160 -552 -348 -442 -280 -57 -218 -73 1 -58 -44 -303 -137
1170 -137 79 235 156 358 134 94 107 149 227 365 537 567 421 97 45 -190 79 206 538 627 313 393 134
1193 134 -160 90 83 398 189 389 317 -150 -220 -419 -468 -547 -468 108 35 75 -99 -155 -393 -626 -565 -32 96 135
1217 135 -31 -34 -271 -193 -410 -437 -235 -31 31 444 345 -150 -442 167 -3 -127 463 503 410 599 204 186 357
1240 357 4 223 304 474 327 330 323 -182 -220 -82 76 478 218 121 76 195 -338 -493 -291 -222 -250 -100 2
1263 2 -20 -201 -338 -641 -173 -225 -157 -27 -248 -38 -457 -382 -341 -547 -191 2 188 87 32 -117 -215 -151 37
1286 37 122 126 589 298 348 219 -139 316 -60 516 449 412 370 90 506 170 -32 -89 324 56 239 31 8
1309Hj88J84k17J05jL6M1P0k35k17k7l72N43K19J3q4j6j00j21Q1j01OJ4m5Q73
1334D69l25j69P8l21k0K83j8J59N1j03K56n56J95M45l43J84K65J97k41R5o65L1
1356e3M34m72qK86K21l20J27m6j13m76M38j81J74J80m5m9m3k56j02J30k72L70
1378g6J4j51N6m7l3o4K14J17k62K50k41N1k22J36L32k0K0K0K05p6j15k64L39J13
1402B96R3k21K57m03JJ35Ok65M58m6J94k98q8j9kJ18m06J71L6j10L90k45j94l26
1426d68J71k60K76J13j17L70j63j76J69m41L92q5O0k80M02J87k19j81M5Q9p7o3
1448b56L10k86K19K4M23k85k33p5L00k2l33O73j49l84L80k43K25j98Q5L9R9n1
1470B62%M28o39J16l7j69j00j58M46k64l5M6K7q8K4lr3n1k42O61l30J31L4k10
$$ plain form
1309 8 -180 4 -213 -108 -109 -73 -32 38 -197 -414 -441 -813 -270 -51 -38 -122 -138 -238 -359 -278 -379 -373 -359 -404 469
1334 469 144 -25 53 -268 -288 -5 -23 136 187 84 340 -216 -21 424 81 265 530 727 486 581 -84 -53
1356 -53 381 -91 -99 187 408 88 215 169 56 -420 18 -163 11 191 146 97 54 -202 -304 -174 -446 -76
1378 -76 -62 -213 -157 -204 -237 -301 -87 30 -232 18 -223 -172 -394 -258 74 54 74 94 299 223 108 -156 183 296
1402 296 389 168 425 22 23 158 164 -101 357 311 505 207 119 100 98 216 -190 -19 17 -93 297 52 -142 -468
1426 -468 -297 -557 -281 -168 -285 85 -78 -254 -85 -526 -134 -219 -159 -439 -37 150 -69 -250 -205 -116 -193 -256
1448 -256 54 -232 -13 11 434 149 -84 -159 141 119 -214 459 310 -74 306 63 288 90 175 214 313 262
1470 262 262 690 51 167 130 -39 -139 -297 149 -115 -150 -104 -77 -165 -141 -144 -237 -288 -530 131 -199 -68 -34 -244
1494b44K1R7k04J02k72M33M2L28k68p8J19J08k40j28R8K61Q5k15K96j87o8J65
1516B51L78q53K71j10L18o1J26K5l3k81J7k73P59m69R5K40m46o8L00o00RL47k24
1539b82K09j60lM14m26k39N54n1j22k40J98J23o9l73M12n6k4L76k33k26K26P3
1561H1j01J09K8j49O5l5J50J07j52J13J34l18K2J28j06J99l18L77j30L01k25p8
1583B02k18K47k65N5L65n81K65N3o2j03NJ95l07J2k15K22j5Q4j7J35l00j80L33
1606i0j02r2M8O63n43j74K45K58l85J18j81L67r4J58m03L93n8J23n1k45Q6K56
1628B97m7j75p8J37RJ1j69J69J98n28J68M1j24L84R0k71k32Q1J45o4l15K64m5
1651e4j06J02l66L16J13k78R8K38l18J64r8N3j73J50J17j60rj09L13o6J04ON6
$$ plain form
1494 -244 -223 -126 -330 -228 -500 -67 -25 303 35 -43 76 184 -56 -184 -86 175 260 45 341 154 86 251
1516 251 629 -224 47 -63 255 194 320 345 312 31 48 -225 534 65 160 400 -46 -114 186 -414 -405 -58 -282
1539 -282 -73 -233 -236 178 -248 -487 67 16 -106 -346 -148 -25 -94 -467 -55 -111 -135 241 8 -218 8 81
1561 81 -20 89 117 -32 33 -2 148 255 103 216 350 32 54 182 76 275 -43 334 204 505 280 202
1583 202 -16 231 -34 21 386 -195 70 123 61 -42 -37 158 -149 -137 -352 -130 -145 -61 -78 57 -243 -423 -90
1606 -90 -192 -284 -236 427 -116 -290 -45 213 -172 -54 -235 132 38 196 -207 186 128 251 200 -45 41 297
1628 297 250 75 -3 134 143 154 -15 154 352 -176 -8 33 -91 293 383 112 -120 -39 106 42 -273 -9 -54
1651 -54 -160 -58 -424 -108 5 -273 -175 63 -255 -91 -189 -136 -309 -159 -42 -202 -211 -320 -7 -73 31 37 93
1674I3K23j22j9k14J86k58M33l4j56J61j53M2j86J75kl08M07J9J41k21r1l2j90
1697a06L31k06P4N8j54K8J88k33mL5J45m10K65o2k91K57j24L9Jl16L68q4K13j79
1721a67M05k79l61K82R5k07J35MN8R1j82k11J91L48k60L41k48r0K11k14k1L88
1743C09l2J11m74M80l47j45J39J5N2K15K8j74m96J38R5J71m81M98L6j07ml85K34
1766a24o9J69j30J26J54k99K48k42kJ51k01M25k63r4N8J2J05j09J2J00p1j36K30
1789E0L4j99K88k04R6J86Qj12j03J03R8J41k47j01j03P5K1J80j56J67M9j78k43
1812a50K63k36J42j53L39q4j30j55l44L02N6Q2JQ7j41P3O0l45n3K90j42M23q0
1835A05k73M4mJ32k70O9Q1J88l11N11j56m4k13K04K07k20K28l29L39l1j0M5j1
$$ plain form
1674 93 316 194 175 -39 147 -111 322 288 132 293 140 182 -4 171 169 -139 268 287 428 207 116 84 -106
1697 -106 225 19 93 151 -3 25 213 -20 -24 11 156 -254 11 -51 -342 -85 -209 -170 -169 -485 -117 -201 12 -167
1721 -167 238 -41 -402 -120 -25 -232 -97 -93 -35 56 -126 -337 -146 202 -58 283 35 -55 156 -58 -79 309
1743 309 277 388 -86 394 47 -98 41 56 108 323 351 177 -319 -181 -86 85 -396 102 138 31 27 -358 -124
1766 -124 -193 -24 -154 -28 126 -173 75 -167 -169 -18 -219 206 -57 -151 -93 -81 24 -85 -73 27 -44 -180 50
1789 50 84 -115 173 -31 65 251 259 147 44 147 245 386 139 38 -65 10 31 211 55 222 271 93 -150
1812 -150 113 -123 19 -134 205 121 -9 -164 -508 -206 -150 -68 -67 20 -121 -48 12 -333 -386 -96 -238 185 105
1835 105 -168 -124 -128 4 -266 -197 -116 72 -239 272 116 72 -141 63 270 50 278 -51 288 257 247 292 281
1858B81j42o4p2j57L96q0J39l67J06k55O4K15J07k19r6L21k86or9K61l11NLK58
1882Bl09L83k83K53r8r5K14j87O9M0j19J92k03j39K26K1N9J16j70Q1L76n31L52
1905B50K4P4k93o1M51m74J06J62l59K26j1O4j90L08Kj64j79j01L60n04K93J74
1927A58k49k8P0L6R9k20L21k04J30l58K43j39J92j45J23l52M63J32j52k48P7j25
1949a76Q0q1L4K11J01n7p4K45p4j41J00Q0j48J13j9O2l91N26l41j0P8j86J91K53
1973C76l72K08mj2K21m71R4P8N5L5k97k8J39j5k15kJ56J61l44L04o8J54j00k70
1997b17J36l4L61J7k77m7j95J56j03J85l7J20j35J08L0k11o2r0L63LK35k15j97
2020a06J27L69k0k18J39m9q6l58L38j38k64M16K6m6j71J46J70n40O05k28k10r
$$ plain form
1858 281 139 75 3 -154 242 162 301 -66 40 -215 -151 64 171 -48 -144 177 -109 -115 -214 47 -264 -259 -256 2
1882 2 -307 76 -207 46 -52 -147 67 -120 -51 -11 -130 62 -141 -280 -54 -33 26 142 -28 53 429 -102 250
1905 250 274 348 55 -6 445 -29 77 239 -120 106 95 159 -31 277 279 115 -64 -165 195 -309 -16 158
1927 158 -91 -119 -49 -13 86 -134 187 -17 113 -245 -2 -141 51 -94 29 -323 140 272 120 -128 -51 -176
1949 -176 -96 -177 -143 68 169 112 38 283 209 68 168 248 100 213 194 256 -135 391 50 40 118 -68 123 376
1973 376 4 212 208 196 417 -54 40 118 173 208 -89 -117 22 7 -208 -210 -54 107 -237 67 -1 153 53 -217
1997 -217 -81 -115 246 263 -14 -61 -256 -100 -203 -18 -55 65 -70 38 68 -143 -205 -295 68 71 306 91 -106
2020 -106 21 390 370 152 291 242 156 -202 136 -2 -266 150 176 130 -41 105 275 -265 340 112 -98 -107
2042a07J56k19K18k56J42o1L7M8l16K25J4j44L25K7l00L42j95n60O93r9J30m8
2064E2pK47k28mJ28k9K73n31K21k04J57J7j68K76j21Nj73L72k98O6K46k10j54
2087f7k89L74J56Q0j46k13J91l25J22O8K09k78K7j8K02n7l23L46k93R3j32j9j71
2110d63N43k44Q8K29j54j19J43K01m53J04K41l6l75J82j33L23m5m5J51J23k90
2131b9j15K33O9l82J99j78K13J71j46K54j85k2j59J24P0q3j53M05k65l4K76l8
2153B25l82j54N84j55k42k2r4J87k24K19K33l29%M5l5j98K65L2J19j11l8J12M3
2176H0P4j24K45O3k85j88J06k03M67k8n8k19J14L2J57j08P7o2Q7k74J89J19R3
2199C54m30k3o6L13m24J80Rj91N86q27L49L23m7j74L4j6k52O8Q2j88K60k90J24
$$ plain form
2042 -107 49 -170 48 -208 -66 -127 -90 -42 -358 -133 -119 -263 62 89 -211 131 -64 -624 69 -30 100 52
2064 52 45 292 64 60 188 159 432 -99 122 -82 75 92 -76 200 79 84 -89 283 -15 51 297 87 -67
2087 -67 -356 18 174 254 108 -105 86 -239 -117 -49 160 -118 -91 -109 93 36 -287 59 -234 -141 -273 -292 -463
2110 -463 80 -164 -76 153 -1 -120 23 224 -229 -125 116 80 -295 -113 -246 77 32 -13 138 261 -29
2131 -29 -144 89 158 -224 -25 -203 10 181 35 289 104 82 -77 47 117 34 -119 286 21 -13 263 225
2153 225 -157 -311 273 118 -124 -146 -240 -53 -277 -58 175 -154 -154 -109 -144 -342 -77 -45 74 -37 -75 37 80
2176 80 154 30 275 338 53 -135 -29 -232 235 207 149 -70 44 76 233 125 202 140 227 -47 142 261 354
2199 354 -76 -99 -165 148 -276 -96 -87 -278 308 -519 -170 153 106 -68 -34 -50 -302 -234 -152 -340 -80 -370 -246
2222b46N08k96k09J85j37J84j98L79O4k52j66J03j62m5L35L8j84J59K02l05O1
2243A8J34J44l75K85p2j04m3R1n2L6m98L60J44K87k04k78L58n69K94r0J33J70
2265A69k87J50j58J04l6j28J57J61m79K51j37j33L1O55m41j94R0J56J3j18R6P9
2287AK4k32O49m64m2k94M02j80M7J11J13j7j9l67M61J7R2j78j45L6k24J89K5J80
2311A85j90P6K1k00L98j89j58K7L5m70K98K55j30k8P0j13j69J65K28k48J10m7
2333g4K02j70k17J97j2r3K1m2j00J69K10o4J83l14K00j26K60j61j8k00j65K93
2355b1J5J24l9j06K40k15J15J60k45Q4j49nJ2J92J7k20J09q8J1R1m21K55o5K37
2379H8k6k24J27k43J33o9j18K94L0j92J20J71k20J12o2l5K82l59L0j61K08R8k3
$$ plain form
2222 -246 262 -34 -243 -58 -195 -11 -209 170 234 -18 -184 -81 -243 -288 47 85 -99 60 262 -43 18
2243 18 152 296 -79 206 134 30 -13 78 26 62 -436 -76 68 355 151 -127 231 -338 -44 -134 -1 169
2265 169 -118 32 -126 -22 -58 -186 -29 132 -347 -96 -233 -366 -335 320 -121 -315 -225 -69 -56 -174 -78 1
2287 1 25 -207 442 -22 -64 -358 44 -136 -89 22 135 118 99 -268 193 210 302 124 -21 15 -209 -20 5 185
2311 185 -5 71 92 -108 290 101 -57 -30 5 -465 -167 88 -42 -70 0 -113 -282 -117 111 -137 -27 -74
2333 -74 128 -42 -259 -62 -74 -167 -146 -188 -288 -119 91 27 210 -104 96 -30 230 69 51 -149 -314 -21
2355 -21 -6 118 79 -27 213 -2 113 273 28 112 -37 -42 -30 162 179 -41 68 -20 -9 82 -339 -84 -149 88
2379 88 62 -162 -35 -278 -145 -214 -332 -38 -8 -200 -80 91 -129 -17 -79 -114 168 -191 -161 -322 -114 -16 -39
2402c9J11j33L3L51j98J00q0j64p4J5M32l41J30j35M3Km1k65L48m7J0q3K07j86
2426dj23n3k0J82K3Q4p7mj5o5J90j82N8J3l47L44k69L71j53Qj82L09k06j02k7
2451b47N12k48q6j8J67J00j64m7k7jq7L8Q8K84k06KJ7J24r6j45K55j94k4J45J4
2476A56k29J72M4j06J32j70l7J94j01n8J2J77l25J06k23M49pm6k27k82L70P5j32
2499e6o6qn0j42M50k49m53M68J25m2j30J00L2k96K72k0J37R2k06J26j4j68M07
2522C09j43jl0m8j18J41K62l96Q9R0J07k34J3k41J70L12j46J75m89K13l82N13
2544A66k20Q4N0J46l70M10n50J05L31n10K39K5J80j99j12K67l06K65J74k65J49
2565E9j57R1K14k19j09L13J49m01J83j7J0j62L39k81j20R9K19Nk17K08k17j08
$$ plain form
2402 -39 72 -61 -28 323 125 225 145 -19 -93 -78 354 13 143 8 51 53 12 -253 95 48 58 -25 182 -4
2426 -4 -127 -180 -200 -18 5 89 12 8 -7 -72 118 -64 -6 7 -340 4 -265 106 -47 -39 -221 88 -118 -220 -247
2451 -247 265 17 -69 -87 80 180 16 -31 -58 -59 -146 -108 -20 264 58 60 77 201 105 -40 215 21 -3 142 156
2476 156 -73 99 143 37 169 -1 -38 156 55 -3 9 186 -139 -33 -256 193 186 140 -87 -369 1 76 -56
2499 -56 -122 -130 -180 -322 128 -121 -574 -106 19 -23 -153 -53 -21 -317 -45 -65 72 164 -42 84 70 -98 309
2522 309 166 165 135 87 -31 110 372 -24 65 155 262 28 41 -200 -30 282 136 311 -178 35 -347 166
2544 166 -54 30 80 226 -144 266 -284 -179 152 -358 -119 -94 86 -113 -225 42 -264 1 175 -90 59
2565 59 -98 -7 207 -12 -121 192 341 -60 123 106 116 -46 293 12 -108 -9 210 215 -2 206 -11 -119
2587a19J16j92M18j63j11P2k08q9L66K5k50J33j69O79m95K92j59K7l33J55M1J38
2609A74j35j79n4L87m86K08p4J2rK93m7k9n8l68O0L51n1QJ73p0j6k46L4P4J91
2634A43pJ45k31j02K30QJ3l46L2J87l11J68Q1r4j11N40L8l94J68m14M33N2n40
2657c12J33K70j6j6J24l27K19r3J9J85k59j36Q0r9L29l52K04R9j97L10k84J50
2679C1jj21J30L58m08q5K15K3k28J64K6m4j22K57k87J80r1m4J50j4r8j89M54l94
2703a38J73j6l06L05j24K9K36qr3J41j57j54J60l13L57j77o0J39j60p7L81j43
2725em36M19j34o9P6lL67q0J73n15M19r0j30J95K0m0k28J95k47K07j66M13m18
2748g7J53J8n8N3L2l21K26r7J59q9j35L30l29L46o89L61K57l0k04L93l15k0k2
$$ plain form
2587 -119 -3 -195 223 60 -51 21 -187 -276 90 115 -135 -2 -171 508 13 305 146 173 -160 -5 36 174
2609 174 39 -140 -194 193 -293 -85 -159 -147 -156 137 90 61 3 -365 -305 46 -5 3 176 106 90 -156 -122 -48 143
2634 143 136 281 50 -52 178 186 199 -147 -115 72 -239 -71 10 -84 -195 345 383 -11 157 -257 176 228 -312
2657 -312 -179 91 75 59 183 -144 75 -18 1 186 -73 -209 -129 -228 101 -251 -47 52 -145 165 -119 31
2679 31 30 -91 39 397 -11 -96 119 142 -86 78 104 60 -62 195 -92 88 -3 -47 103 89 -9 -198 256 -138
2703 -138 35 19 -287 18 -106 -77 159 151 58 199 42 -112 48 -265 92 -85 -145 -6 -166 -243 138 -5
2725 -5 -441 -22 -156 -225 -149 -152 215 135 308 -207 212 122 -8 187 207 167 -61 134 -113 94 -72 341 -77
2748 -77 76 94 36 89 121 -200 26 -71 88 -1 -136 194 -135 211 -478 -117 140 110 -94 299 -16 -36 -58
2771e8k41L98k1j43q3j30L00j43j30K83pJ53m24K33J1j93N26m40p5NJ90P7j17
2794b9J36J17j17j17j41K24k45M60m86L22j71J88j74K8j88N29j21k79J56j53J65
2815A04k31K67K9l13K41pk21L71o54M27k3J24k61l6J03%J43o5k8j52K59k83L46
2838A40m7Pj45LJ7j84L28o2j48LN7k40J85N3m7K58m44L94n74M52J89j06k91j52
2862c54L05O4k4J42l09Q8K08j9K07j31m28J77P4j11J51j08J46k04K51p7k62m2
2884b56K51j08L54j15k30m3q1m8L47k55K83q3k04K4l1K80m25K85P8k51M29Kk14
2907a1K34j53J66l66Q9L41k05k62M65l90j24K92l6J39n19M69L8j58N7jJ4j1k58
2930a90K42j75J09o7m2L9l7L38k62K06n13K75K28k19j02NR6L8k29J77K7l84M53
$$ plain form
2771 -58 -299 99 78 -65 -148 -278 22 -121 -251 32 25 178 -246 -13 -2 -195 331 -109 -184 -179 11 88 -29
2794 -29 107 224 107 -10 -151 73 -172 288 -198 124 -47 141 -33 -5 -193 336 215 -64 92 -61 104
2815 104 -127 140 169 -144 97 90 -131 240 -414 13 -10 114 -147 -183 -80 -80 63 -2 -30 -182 77 -206 140
2838 140 93 100 -45 -42 -25 -209 119 57 -91 -88 -31 -271 -86 -33 -80 178 -266 128 -446 6 195 89 -202 -354
2862 -354 -49 15 -9 133 -176 -88 120 101 308 177 -251 -74 0 -111 40 -68 78 -126 125 48 -214 -256
2884 -256 -5 -113 241 126 -104 -147 -228 -276 71 -184 99 16 -188 -164 -195 85 -340 -55 23 -228 201 203 -11
2907 -11 223 70 236 -130 -41 300 95 -167 298 -92 -216 76 40 179 -340 129 167 9 66 65 79 68 -190
2930 -190 52 -123 -14 -81 -123 -84 -121 217 -45 161 -352 -77 151 -68 -170 -165 -69 -31 -260 -83 -56 -440 13
2953A3J52m03L76J8L3q2k61K31m0p2l7L6j24J53k93L81j71K25m5j63l19M38m5
2976APj86K55p5k73R7L6L90l63j9J36p8J49l12L60O3o3p7j05J50k84R2k59M30
3000G2j23l7oK35Q0k03l6l0O1j66K07J06J95l47l7J07L30k69k40m1J62N5m8l45
3024c18N69k19l01R6J57L34j19k14J78p5l4Q9k04k28L55J70k68Oj3K6J87n5m4
3047G5p6L58l96O1K01k68K54l6j76J27j44j70K65j56J75l1k63J04P9J05k0P8j27
3070A9j42J00p9J45Q6K3j31j68k49M19n3j44K91N8k03J97j18J70l41kK50l14K84
3093I8Rj76j35P2K13n8L15k15j64Pj90q7L45l61J81O9p0K3J46j30J10M6Q6k59
3117a25J25q7OK60j31o2J29J07P3k94J51m19M30l40O2R6O5p7j32p3L52j20j95
$$ plain form
2953 13 165 -238 138 156 189 107 -154 77 37 -35 -72 -36 -160 -7 -300 81 -90 135 90 -73 -392 46 1
2976 1 8 -178 77 2 -271 -174 -138 252 -111 -130 6 -72 77 -235 125 188 125 48 -57 93 -191 -99 -358 72
3000 72 -51 -88 -94 141 221 18 -18 -48 13 -153 54 160 355 8 -29 78 408 139 -101 -142 20 75 27 -318
3024 -318 251 32 -269 -173 -16 318 199 -15 163 88 54 143 -61 -289 66 236 -32 -26 -39 -13 174 119 75
3047 75 -1 357 -39 22 223 -45 209 173 -3 124 -20 -190 75 -81 94 63 -200 -96 -17 88 68 146 19
3070 19 -123 -23 -102 43 129 152 21 -147 -396 23 -30 -174 117 175 -28 169 51 221 -120 -122 128 -186 98
3093 98 107 -69 -204 -132 81 23 338 123 -41 -34 -224 -311 34 -327 -146 -77 -147 -124 22 -108 2 48 134 -125
3117 -125 0 -87 -81 179 48 -14 115 222 295 1 152 -267 163 -177 -115 -19 46 -31 -163 -236 116 -4 -199
3140a99J65N4R2J29j45k08L51m48L04k33P1o0k35P2L52p9m9j50K81j56n9L32k38
3163e6r7J76N5k48J33P9k93L66j91K02k50O1L8R4j94J33j24k07L46J47j37O9j44
3186d2l1o1K37l6j03J6j98k33K88RK50m7J18k46p7L17r6n6J2r6m56L83K54J53
3210B59k15l9m2J17j71J94k19m0M22l78J58J97m68J07J87k8r9J15K6j59J50K1
3232I5k36K80j70J75J66n97K80q0L5Q4n7J7l5K76k4j44r3pj14O9M01l41k18L27
3256H9M4M8j46k04J15J97l22K56q4O9n8j40j54K95p8K33k03K36j81j17K12j71
3278f4K99j13k9k66J99J92l21J47j14K5J14j31K41r2L9k86K32mO0j76J51l7j80
3301a14j08P5L58k27R4J75r6l40J24J10L84l97O7j85j6J79j99n4kK82j49m3j20
$$ plain form
3140 -199 -34 20 112 241 96 -112 239 -209 95 -138 -67 -127 -362 -290 62 -17 -66 -216 65 -91 -150 182 -56
3163 -56 -153 23 78 -170 -37 42 -251 115 -76 126 -124 -63 -25 69 -125 8 -116 -323 23 170 33 102 -42
3186 -42 -73 -134 103 67 -36 -20 -218 -451 -163 -154 96 49 167 -79 -156 161 65 9 21 -75 -531 -148 106 259
3210 259 44 5 -37 80 -91 103 -116 -156 266 -112 46 243 -225 -118 69 41 -58 57 83 -76 74 95
3232 95 -141 139 -31 144 310 -287 -7 -87 -52 32 -25 -8 -43 233 209 65 -28 -35 -149 -80 321 -20 -238 89
3256 89 133 181 35 -169 -54 143 -179 77 -7 62 4 -136 -290 5 -73 160 -43 193 12 -105 107 -64
3278 -64 235 122 93 -173 26 218 -103 44 -70 -45 69 -62 179 87 126 -160 72 68 128 -48 103 66 -114
3301 -114 -222 -147 211 -16 78 253 157 -183 -59 51 435 38 105 -80 -96 83 -116 -170 -172 110 -39 -82 -202
3324b02J56J08k82J78J33j7P7n63N37J09l71P7K13k16K01k09r3K98j99J05J3Q1
3346A34l20N6Q1JJ30j38j15K57k78K23Q5J7n09J97L38l9q2o5m30K81J89OM3k11
3370a49J34J22l77L81j83K8M8R7k44J21O3lK8k52K34J8n4L0J92j91l25K64m0r6
3394a54K29m1J03r3k59R3K51J44l98L59l22J9K70R9l96L3L67j35k07J0J44n33
3416d17N48m33L0Q3J32l8P1k14N30o0o11N48K40m69J38j09l08M81m98L66Rj48
3438a29j49L0L13k2O6j92P1J37j49j55R8J97j70O1M3j27L60n03M22l67j7O9m7
3461a60K03p6l6R5j25J1L69j17m21L86l00M58j68k83J65j01K63R8l58J8K3p1K42
3484A15l40J05M05%k30J24j40l53M05q6L0J99k14k99J62j25N7L81k58M2O3K46
$$ plain form
3324 -202 -46 62 -220 -42 91 74 151 -412 125 234 -137 -60 153 -63 138 -71 -164 134 -65 40 53 134
3346 134 -186 -130 -49 -48 82 -56 -171 86 -192 31 116 133 -376 -179 159 120 38 -27 -457 -176 13 19 62 -149
3370 -149 -15 107 -270 111 -72 -44 4 101 -143 -22 41 38 66 -186 48 66 12 42 234 43 -282 -18 -58 -154
3394 -154 75 34 137 44 -215 -122 129 273 -125 234 -88 -69 201 300 -96 -63 304 169 -38 -28 116 -417
3416 -417 131 -302 -272 -189 -57 -95 -24 -238 292 232 -379 169 409 -60 78 -31 -339 142 -356 10 19 -129
3438 -129 -278 -248 65 43 109 -83 -12 125 -24 -179 -81 116 -54 7 50 -77 283 -220 202 -165 -182 -113 -160
3461 -160 43 -33 -69 26 -99 -88 281 164 -257 129 -171 287 119 -164 1 -100 163 261 -97 -79 -56 -127 115
3484 115 -225 -120 285 285 55 179 39 -314 91 5 35 234 20 -279 -117 -242 -185 196 -62 -20 43 289
3506B89n06L34l06R4K52k07J11k89L94j29j41J86K2j52K18o0l4Q4k31J77M2o1
3528H7k3r1k40M21j88L54k83j08R3j24j67J73K18m2m2n4K58o40L41j09J17J20
3550G1l50K23J31K32l84M3j33L26n6N5M5l02J90p6J6J62j56k2k69K95J49k50K14
3573A54Qr2j32r5K82j38k7J65j35J36n10M67l23N93m06K70m22J87L39l48j10J24
3595a3p4j28K11rq1J52M8j88K57k56j7nJ61L0j26k8J16j8k6J80j58R8k44J83p3
3620hK20oj01k03K06k49K60l66J7K74m2J37j49k91L36J25m16J85K97r0k56K89
3642A69m08K20K7k40K94j62J23J97m72J31L23m10J67J79q0r4O9k18O6M01l22J16
3664G6q0K3k16K62j06n9K34k75o8J85J02P4k80j84M22j97o6n6K39j54L32j45j74
$$ plain form
3506 289 -217 117 -189 -95 157 -50 61 -228 166 37 -104 82 104 -48 170 110 76 160 -71 106 148 87
3528 87 64 -27 -267 154 -34 320 37 -71 22 -102 -269 -96 122 80 38 -16 242 -398 -57 -166 -49 71
3550 71 -279 -56 75 307 -77 -34 -167 159 103 158 203 -99 91 15 31 193 37 15 -254 41 190 -60 154
3573 154 162 70 -62 -157 125 -13 -40 125 -10 126 -384 83 -240 353 -53 217 -205 -18 321 -27 -137 -13
3595 -13 -87 -215 -4 -13 -94 58 106 -82 175 -81 -98 -103 58 88 -38 -66 50 32 6 186 28 126 -118 65 -8
3620 -8 212 206 105 -98 108 -141 119 -247 -230 44 2 139 -10 -301 35 160 -256 -71 226 136 -120 169
3642 169 -239 -19 8 -232 62 -100 23 220 -252 -121 202 -208 -41 138 58 -36 33 -185 -119 282 -40 76
3664 76 -4 19 -197 65 -41 -100 134 -141 -209 -24 78 152 -128 -312 110 -87 -153 -209 30 -124 208 63 -111
3687a11L96l89K19J12k86L54l56L64n49J88L9J88r5r6J92kk1j64j45KM6O4q5K54
3711A19j17J69l4l7p7k8J94K4n06J94J9K98m06K01O2Mm1j35p1J17j05J15j13m9
3735b03K75o7k6oj77L54n2J38k53J04R7j85J28k23J96l95K97K05j78P0j49J04
3757E4j63M0K06k80J81J46j52j04L80R2j85l23j21k35O10k38p2J77J18q8K52k50
3779D5lK38l64P0l83N53j29J57m78K81R7N8j18nR4k49k1M77k11j46l55M27J45
3802A80r3l5j56K04lm0J67j70k60p7K52j76n2K62M94m47k6o6R5J48n2k06J48j38
3826d7R9o9n7r8K85k04L08j07j97M36k93K00m57L83k47L02k21k8Q6j14N9O1J0
3849I0l7k08k61L12r8N7J44j11M6J18J26j73K73m73K4L17k85J30K30l86L81k51
$$ plain form
3687 -111 285 -104 115 227 -59 295 -61 303 -246 -58 -19 169 74 -22 170 168 147 -17 -162 -160 -114 -50 -135 119
3711 119 2 171 137 100 23 -5 189 213 -293 -99 -80 218 -188 13 75 79 38 -97 -168 -51 -156 -41 -154 -203
3735 -203 72 5 -21 -27 -204 150 98 236 -17 87 184 -1 127 -96 100 -295 2 207 29 99 -50 54
3757 54 -109 -69 137 -143 38 184 32 -72 308 400 215 -108 -229 -464 146 -92 -164 13 131 43 295 45
3779 45 42 280 -84 -14 -397 156 27 184 -294 -13 84 142 24 19 113 -136 -157 320 109 -37 -392 35 180
3802 180 87 52 -104 100 97 57 224 54 -206 -283 -31 -207 -259 3 497 50 24 -42 53 201 149 -57 91 -47
3826 -47 52 -17 -74 -172 113 -91 217 110 -87 349 56 256 -201 182 -65 237 16 -12 74 -40 19 80 90
3849 90 53 -155 -416 -104 -202 -145 -1 -112 -66 52 178 5 278 -195 -171 146 -139 -9 221 -165 216 -35
3871c5k1k3j08J76r5r0M3J89j24o3J91M3q9M6j11P0j74L99j60KJ65j56K17k72
3895B0j19NK4k25K96j02o7L21N8l54L1J0K68j13k37j12L29%k37N87m23J20j81
3918a01N4k2K6K1J5r9N0J6j62K71j31P9RP9M0l08J53o3J85J62l89L05j76j55J41
3943@j17L2P9M65m38K3l68J65Q0M2l8j01m2j72M03l97M87j82m8J7M9q8K04J51
3967B06j41r2J1O7k21rK47j06k21P6M31m05K30Q8k02k43K32N1Mj07j29J59J14
3990D0OJ40j95j03J6J6K25j27j86M20l92K07j76Q1J16k18Q8L0j12j5J86k73P5
4013a51J98J25l36N62l94O1J35k95J17j18J63j29J73J23k44K7J30l52J82p3j14
4034b10J74l4l9K58j84k28L13P9N2l97K35j3n3j6p1K44m7j95j61L72J40m84K71
$$ plain form
3871 -35 -56 -79 -187 -11 -106 -196 -153 36 -88 -151 40 83 -6 40 -71 -1 -175 224 64 66 231 75 292 20
3895 20 -99 -94 -70 -295 1 -101 -168 153 211 -143 -112 -102 166 53 -184 -296 33 33 -204 383 -40 80 -101
3918 -101 -47 -69 -43 -22 -7 -106 -56 -40 -202 69 -62 17 26 105 145 -163 -10 -73 112 274 -115 190 14 -141 0
3943 0 -117 -85 -6 459 21 44 -324 -159 -79 -37 -75 -176 -218 -390 13 -384 103 -79 -127 -110 -61 -149 55 206
3967 206 65 -27 -16 51 -170 -179 68 -38 -259 -183 248 -157 73 161 -41 -284 -52 -1 3 -104 -233 -74 40
3990 40 46 186 -9 -112 -96 -80 145 18 -168 252 -140 67 -109 -28 88 -130 -42 -12 -124 -139 47 -226 -151
4013 -151 47 172 -164 398 4 65 200 -95 22 -96 67 -62 111 234 -10 17 147 -205 -23 -96 -210
4034 -210 -36 -70 -109 149 -35 -263 50 129 181 -216 19 6 -47 -63 -134 110 63 -132 -293 79 219 -265 6
4057FJ41j03q9n1K52p9k88K73k28J20J71j39k24K12K84m52K49k98L59Q4q6j03
4079A1j83L69J0k53r3M43m10J69Q2J2r7Q7j33r0K96p5j63M4K6j85M3K60k3k74
4103a27K29%p3j08Q0l52L44J14j8K4N0l3l34K42m52M27k70j56L50J59r5m9j50
4126a98L05p8l79O5J34K94p5j85q8L49l1q5r2K6K52l89L56m16lM34l57J93rJ4
4150C7L0l30J99J56j40J9J99j05k17p2K6M63m97K55m3M1RK7L5O0n3o5Q3N1j92
4175b4M5p6j27K03K62m31M06k62n2J20j78j35J98N0m7Q1J37j24k14j11K13L12
4197B46k62Q4j21Q4o5n4l6O3J24o5M4p3p7j05J61N4J38j92J05r9J98Q8j82j35
4221g7L5k34J95L76n18R9L91k72N1j74J98m9k35K33j33l6k0J87l95L25l20M88
$$ plain form
4057 6 147 44 -45 -96 156 77 -211 62 -166 -46 125 -14 -238 -26 258 -194 55 -243 116 200 114 11
4079 11 -172 197 207 -46 -139 304 -106 63 145 157 60 147 14 -76 220 145 -18 26 52 -133 -90 170 147 -127
4103 -127 102 102 29 -79 1 -351 -7 107 89 113 163 130 -204 38 -414 13 -257 -413 -63 96 1 -48 -198
4126 -198 107 29 -350 -285 -151 143 68 -117 -205 144 113 28 -64 -38 214 -175 181 -235 -238 196 -161 32 23 37
4150 37 67 -263 -64 92 -48 -29 170 65 -152 -224 -198 265 -232 23 -20 21 30 57 92 152 99 34 117 168 -24
4175 -24 21 -55 -182 21 283 -148 258 -4 -56 64 -114 -249 -51 -1 -48 33 170 46 -168 -279 -66 246
4197 246 -16 68 -53 31 -34 -88 -124 -61 63 -2 42 -31 -108 -213 -52 2 140 -52 53 -46 152 240 58 -77
4221 -77 -42 -276 -81 295 -223 -124 267 -5 46 -128 70 21 -214 19 -114 -150 -170 17 -378 -53 -373 115
4243A15k02k3J68n1k3p9J73J65k10K71k30J44j23k51j34K37Q2J1j50j0J69k17
4265a68L30m85L58j89J66mk41J92KRK6J54m4n09M03p9J6J76k21j43J02M9K19k21
4289a02L4N7l4L37l50m0M5K07k93N01l86k52K33m2Q7J17J18j32j14Q0N3R0j15
4312I9l86K09k97L62r1r3M43j75J0j19N3N5J19j22L06j60k13M2r4J03J49j73p
4335B0J55l85K24J1k55O6N6L74n5r8n7j70J49L8j45M1J20j59Qj31J16J81j33J14
4359H5q3K4R4N6j12k73j40N29m46J16J98k1j59J51k30K03Q2K7l09J16J48q1K31
4382B06j40J16j2r1J05o2L2k25J30k42N8K67j22lo1O0J42k86k0J61n9J76l29L25
4406A26k81J57j29K13j15L33j94j18K12l31K52p3j31L5l67L33O0K04k34K15j75
$$ plain form
4243 115 -87 -110 58 7 -16 -95 78 243 33 304 74 218 95 -156 -290 -53 29 40 -110 -120 49 -168
4265 -168 162 -323 35 -154 12 8 -233 -41 -39 -30 -4 150 106 -403 0 -79 -63 113 -108 -251 -149 -100 119 -102
4289 -102 -68 -11 -45 292 -58 -98 -53 154 -139 362 -24 -276 -43 -85 2 119 237 105 -9 71 124 214 99
4312 99 -287 -78 -375 -13 -104 -197 246 71 81 -38 15 70 189 67 373 213 0 42 -52 51 200 27 20
4335 20 175 -210 14 25 -230 -164 -108 266 211 113 56 -114 35 73 -72 -31 89 -70 -62 -193 -77 104 -29 85
4359 85 2 26 120 176 64 -209 -349 180 -266 -150 48 27 -132 19 -211 -8 74 101 -208 -92 56 -25 206
4382 206 66 182 170 79 184 122 154 -71 59 -183 -125 142 20 17 -44 16 158 -128 -148 13 -46 130 -199 126
4406 126 -155 2 -127 86 -29 304 110 -8 204 -127 125 52 -79 -44 -411 -78 -18 186 -48 167 -8
4427hk54M60k60J30J12m30L03M2q4l4R7N5j82M7K58j72j13%j04J93J24O3k14j24
4451i5rl2l9Q5K78k58J70m53N07n8m2r7P8j4k29L39J83k18L0j38j11K39k50n5
4475a89N5K7K40J2j65J28j84Q6J73p2k66O4l4N7k15N67k84k79L76j83J13L6k34
4498a71K41r7N0Kk02K50Q5J08m15L97n59R5L58k23M5K74j78nj38l2n9K74j69j67
4522b36Q6J75R5o8j85K92k52J06qr8k9P7q5Q9j8j97K44k2J17j41j85K92J33k24
4546d2J00n7J03l05K01k29O48k88J7j29Q0j49J48r9p7J58n2n5j46R9K06k78J77
4569C1j50K59k87K53o8l5J6j23J72L7J12j89j1N4k9n8j01K35L0k2l4j25L85l21
4593C1J03R6kp6j98J59j05J89m67N59l01j38L71l36J09RQ5Jn6k10j19J36q1J87
$$ plain form
4427 -8 -262 198 -62 68 180 -250 53 95 11 -23 74 129 -53 -6 252 80 -33 -33 -137 56 180 243 29 -95
4451 -95 -104 -136 -175 -90 188 -70 100 -353 154 96 54 -43 35 21 -208 131 314 96 126 -12 -123 116 -134 -189
4475 -189 -134 -107 133 145 -20 108 -76 10 183 111 -155 -91 -125 -68 -283 284 0 -279 97 -86 27 63 -171
4498 -171 70 -27 23 25 -177 73 158 266 -149 248 -311 -216 142 -81 -36 238 60 55 -83 -115 -174 100 -69 -236
4522 -236 -150 25 120 52 -133 159 -93 13 5 -93 -122 -45 -130 -41 -59 -256 -12 -34 83 -58 -243 49 182 -42
4546 -42 58 1 104 -201 0 -229 419 131 148 19 99 -50 98 -1 -78 80 28 -27 -173 -74 132 -146 31
4569 31 -119 140 -147 106 38 3 19 -104 68 105 217 28 17 71 42 -16 -117 118 148 126 92 -33 352 31
4593 31 134 230 228 152 -46 113 8 197 -270 289 -12 -150 221 -115 -6 3 88 89 33 -177 -296 -160 -241 -54
4617e4j28K34j08L2m6k44K67K91m40L03k05L13j76j69M20m51J79l32L64q1K22
4638A91j88j79j96M37kr3q0K47j14n0J4M2J27j18j55O3%j54M32j18m1k47K85k25
4662a22j4O1OoL7L9j25J62J23k22J35j0k71K55q2N8L4m3k21M1J94k1M01m54k24
4687b69M75j28j93M9R5Q3J02m95M85k59L4L04l7p4j53j44j8L74j52O6P7k48RR5
4711G8l06K33R9j38n5K49M7n04K6j8K28M5l27N21N8j45J10l21K62k15L31j36j71
4734d9k17J43L32l57L75n2k41J89J33l04J1J14o7j23J37q6L99p8j96KQ9r1j78
4757a15J10Kj09Kj96L25J18k84J31J7k02J68R4q1K11j53p0mK60o2l22J04J97j29
4781A2j51J32J15k55j0K84l1Pj78P0P2N2l64M50l20J12k16K43J91m9k06M3J22
$$ plain form
4617 -54 -182 52 -56 -24 -70 -314 -47 244 -196 107 -98 215 39 -130 290 -161 18 -314 50 -31 191
4638 191 3 -176 -372 65 63 -30 -110 137 23 -27 -13 29 156 38 -117 -54 -54 -208 224 106 65 -182 103 -122
4662 -122 -136 -75 -69 -75 -38 1 -124 38 161 -61 74 64 -207 48 -34 24 58 15 -206 -165 29 8 409 -45 -269
4687 -269 206 78 -115 -66 29 112 214 -281 204 -55 -21 283 246 172 19 -125 -143 231 79 145 222 -26 -17 78
4711 78 -228 5 104 -34 -89 160 207 -297 -271 -289 -61 -16 -343 178 236 91 201 -120 142 -73 258 122 -49
4734 -49 -266 -123 209 -148 227 175 -66 123 256 -48 -37 77 10 -113 24 -62 337 259 63 65 154 63 -115
4757 -115 -5 -3 -112 -110 -306 19 137 -147 -16 1 -201 -33 61 -20 191 38 -32 -36 224 162 -160 -56 141 12
4781 12 -139 -7 108 -147 -157 127 96 103 -75 -5 67 119 -245 205 -115 -3 -219 24 215 166 -40 3 125
4804A25K20n64J95J91m33k7O9L11l4J9J77l89R2j02J16O5q4J24p4k4r6j63M21
4827A35j69j32j6n9L98j82K27k05J83j77J57l27K98l74M74m40J58J25k89M07j02
4848I0j17J57k46j33K91j26r4J74r7p1M86l35o5K11j62J54j35J92r5O7j99K18
4870A65l19J27p3RK69k31k6J95k4k91J61J19l35K63J93j02J88l79L04k63Q4r3
4892e9J23j11K11o4Q7j50L4m64L76n6l2Q9m0M7P6J75k88J22L9J7m20K18K26l94
4916b38M75m05L06k15p2qL03k00j63M1K93l09L06m05K63l6j37M64j83r6K44l99
4938a71m3K26k12K82q9J80j95J45j5J17m50n3J42L52k34J13m89J18K26J83K8j28
4960C3K13k78jJ47O6j54M7J01j36J28J43j51p2r4J4k32K76rrj18J26K33k91J08
$$ plain form
4804 125 345 -219 -24 167 -266 -293 -224 87 53 72 249 -140 -48 -150 -34 31 -53 71 -3 -27 -123 -286 135
4827 135 -34 -166 -182 -241 157 -25 202 -3 180 3 160 -167 131 -243 231 -209 -51 74 -215 192 90
4848 90 -27 130 -116 -249 42 -84 -178 -4 -101 -172 314 -21 -86 125 -37 117 -18 174 79 146 -53 165
4870 165 -154 -27 -100 -91 178 -53 -79 116 92 -199 -38 81 -254 9 202 100 288 -91 213 -50 34 -59
4892 -59 64 -47 164 100 187 37 71 -393 -17 -73 -105 -16 -56 -9 67 242 -46 76 115 132 -288 -70 156 -238
4916 -238 237 -168 138 -77 -149 -157 146 -54 -217 -176 117 -192 114 -291 -28 -64 -201 263 80 -16 228 -171
4938 -171 -214 12 -200 82 -7 173 -22 123 108 225 -225 -278 -136 216 -18 95 -394 -276 -50 133 161 33
4960 33 246 -32 -33 114 180 26 73 174 38 166 309 158 86 -8 6 -226 50 41 32 -86 40 273 -18 90
4984I0k52O1L60n11K53J13p2J73k2j83ql97M35r2J44L19k10j78l65K52k31K96
5006b5k70L17NJ32k42q7N32n23m0N48l86j91J54j16L42l14J98q8J7l8K97k47K3
5029bJ79j31k13K70j62J30o8J84j67k20L16r9J00k64K71no6j46J85m6l49K96o6
5052g3QJ18j28r9j84M27o7j91J18M8P3l1P7K82j27l11N1L09k45L2kp0J34j94K07
5077A62j24K1o8k10r7K13J54j5J01o5J2j94j5K46p2j05Rr2J15j05Q3l0J27m2j26
5102a17K29k98M07k61j35J13L24l07L07k39p3Q2J70k3l33n8J65j73P8m2P3J32
5124B1K55l06Q1k29R8q7L07j27k04K45q1O1J85q7l75L41j23j5J80l26j2J14j1
5147i5J98Qj69q7J62L2l9m5o9Q3N1o6p4j64M41p8j11j3J24q4rJ75l33M19l14K01
$$ plain form
4984 90 -162 -101 259 -252 1 114 42 215 193 10 2 -395 40 -52 92 411 201 23 -342 -90 -321 -25
5006 -25 -295 22 27 159 -83 -170 362 -161 -201 347 -39 -230 -76 -192 150 -164 34 -54 -37 -75 222 -25 -2
5029 -2 177 46 -167 103 -59 71 3 187 20 -200 116 17 117 -147 124 119 53 -93 92 46 -303 -7 -73
5052 -73 -65 53 -75 -174 -358 69 2 -189 -71 -23 50 19 96 378 251 -60 -9 300 55 87 85 15 149 -45 162
5077 162 38 59 -9 -219 -316 -103 51 36 137 72 84 -110 -125 121 49 -56 -47 -139 -24 -129 -46 -76 51 9 -117
5102 -117 112 -186 221 -40 -175 -62 262 -45 262 23 -50 32 202 179 -154 -212 -47 -220 -142 -184 -111 21
5124 21 276 -30 51 -178 -80 -167 140 13 -191 54 -27 34 219 132 -243 98 -25 -40 140 -186 -198 -84 -95
5147 -95 103 111 -58 -145 17 49 10 -35 -104 -21 30 -36 -110 -274 167 89 -22 -35 89 5 -4 171 -162 257 -57 144
5173A44k56P7M2j2J30p4J15k49k36M3L25k97L94k17l0k04O34n70L78M5j75MJ81
5196A92j12J19k22O2l2P2j95L78k45n0R0j16k24K32q5P2j23L22M0M1l29M4RK6
5220c4R4R4k70P6j2j81L10k73J25O1k34M39j53j93M87l99O4L27k68k64J20J64
5242H0J62n48L06J04k00J42J22K8m7m5j83k5m6J90P4k86O6L8o8K93j48J46p9k
5266G4j44k2j40K77J61j84q4J06J29Jj76J89j36l45O37m90P9Q3j59P2j73L12j71
5289a04n1K39M0j42l99L22M26k80l41M56j65j61L77m51K94k88J88KJ94J14k77
5310gK36M7j55o9j46J95k30L23n04J73J98M2m25L59n4k23L76m9j11k55L24M9k2
5333G2k26K65P0j8j19oj94P7N3J0j99K05J17q2j85K05o6N0M2Nj69j04M8K5P3o1
$$ plain form
5173 144 -112 -35 7 -5 125 51 166 -83 -319 -276 49 -248 146 -71 -101 -305 329 -241 137 182 7 11 192
5196 192 80 199 -23 39 7 79 -116 262 17 -33 57 -59 -283 -51 -136 -64 -187 135 175 216 -113 -69 -60 -34
5220 -34 60 154 -116 -40 -52 -233 77 -196 -71 -10 -244 195 42 -151 336 -63 1 328 60 -204 -84 80
5242 80 242 -306 0 104 -96 46 168 196 149 104 -79 -104 -150 40 114 -172 -106 -68 -136 157 9 155 76 74
5266 74 -70 -92 -232 45 206 22 -62 44 173 174 -2 187 51 -294 343 -147 -68 15 -144 -72 -245 67 -104
5289 -104 -155 84 124 -18 -417 -95 331 51 -290 166 1 -160 217 -234 60 -228 -40 -38 156 270 -7
5310 -7 229 276 121 52 -94 101 -129 194 -310 -137 61 103 -322 37 -17 -240 136 87 -24 -279 45 94 72
5333 72 -154 111 181 163 44 38 -156 -79 -26 -16 -215 -10 107 25 -160 45 -21 29 71 76 -93 -197 -149 -124 -51 -112
5359a12J41M8k27M29m75nM17l7M0l82K41J0l47K18J24k1Q3k16M3J53K08n55O8
5382a54q1M94J01j38l85J76R9o1J12l75j1L76j39j83K73j45q1K65j54N2l2P1M3
5405A23p3k84L44m50J92M21k39j04oK25o2J5O5p0r3J01J57n25K28J62k81J85P7
5428A08m71J77J69N0l0L98q1k08J34k33J60j55q5J33q1P2P8j88J47r6j18q6kK03
5452eo6P8q0J0j94J78J14qj29J96K56k84q1J52o5j04J33n01N00J11j69k7J43N
5476A63k32P9J39l28K39q4K41k15j42j66L04J35j13j7J01n1J76l77P3J32q0r3
5498a16N8r6L32p2l7k26K93Kj96n2J55k95J38k7K60J05l28J45J3J60l12J75j25
5521d6Q9R8j43m4J77J46k01q2j36j13N92l77l4O3K15j68O6pr5J35l08J79L7n4
$$ plain form
5359 -112 29 77 -150 279 -196 -201 216 179 219 -163 78 88 -259 -41 83 62 145 -71 -28 125 333 -222 -154
5382 -154 -235 259 360 222 -163 13 112 51 163 -212 -223 153 14 -169 104 -41 -122 143 -11 41 9 80 123
5405 123 50 -234 110 -340 -148 273 34 -70 -76 149 87 102 167 97 4 105 262 -263 -35 127 -154 31 108
5428 108 -363 -186 -17 33 3 401 320 112 246 13 173 18 -67 66 -15 57 135 -53 94 -2 -120 -206 -208 -5
5452 -5 -71 7 -73 -63 -257 -79 35 27 -102 94 350 66 -15 137 72 -32 101 -400 100 211 42 15 158 163
5476 163 -69 10 149 -179 60 -24 217 2 -140 -306 -2 133 20 3 104 53 229 -148 -75 57 -23 -116
5498 -116 -58 -154 178 106 69 -157 136 138 -58 -110 45 -250 -112 -139 121 226 -102 43 56 216 -96 79 -46
5521 -46 43 141 -2 -46 131 277 76 -6 -142 -255 337 -40 -74 -11 204 36 102 95 0 135 -173 6 43 -11
5545a1J85q0j59L2L34o1k28k25L81j39l92M59j29j8L80k24P2m68L45m9k36L91
5567A60j90J5L0LR0P6m63J30J80P1m03L44j69N9l4j05Q3K23j14J70p2j32Q9J83
5591B24M8l3k54%n1L3j01K00p4P6K21l41K04k24l4J46k00N6J94k81Q4J63j27L18
5615B47q5k43J90k99K80J22j72j58R0M3m7j93Q8o8P8L91m71K26J55l76J44J5N4
5638A1m9k38O10l42k33N6K8L05k83M60j45k60Q3j23J14m30N23K04j59Q1j15j42
5660d4J76k11j18J76m5j23K22j0r8P7j12N7k29M00j68J42j04n7J38O4j64Pj04
5683a28LJ82j46j6m7K11J70n8R4k42J58j35K35j33mm7n66L81N7j14L42j8o3K23
5707C39J26m78N0O7n3l3k7N6j66j03J92n4J72J17n8m9n7k65K18N1n6L11k39r5
$$ plain form
5545 -11 174 94 -65 -33 301 240 12 -213 168 29 -363 96 -33 -51 329 105 177 -291 54 5 -231 160
5567 160 -30 -15 15 18 108 184 -279 -149 31 102 -301 43 -126 -67 -101 -206 -123 100 -14 156 84 -48 41 224
5591 224 272 239 -15 -15 -66 -33 -134 66 -8 68 289 -52 152 -72 -106 40 -160 -104 90 -191 -107 56 -71 247
5615 247 162 -81 109 -190 90 212 40 -118 -28 15 -32 -225 -137 -205 -127 264 -207 19 174 -202 -58 -43 11
5638 11 -38 -276 334 -8 -241 -185 -157 148 -135 325 180 -80 3 -120 -6 -436 87 291 132 213 98 -44
5660 -44 132 -79 -197 -21 -66 -189 33 23 -75 2 -110 -53 -282 118 -50 92 -12 -69 69 133 -31 -24 -128
5683 -128 -125 57 -89 -105 -152 59 229 171 265 23 181 46 281 148 144 97 -469 -88 -31 -145 197 179 116 339
5707 339 465 -13 37 104 51 18 -9 47 -119 -222 -30 -84 88 205 147 98 41 -224 -6 45 -11 300 61 -34
5731c4j22k1J09J42N1j87k11L09k58N23l06l0P1m4L56l85J51K87m46J1m6L9j66
5754b07K0M66j92M2J97m73J48J17J14k97K1p4K53j05o6j05K90m63N87l3l2m7%
5777A61j74r8J2K59r0K1l35J08M67l95J78l20L28m78O27k39J75j36j58J32L1K2
5799I8p7o8pK75j41l2K86l62J59j56m82O00M6k19K77l42J15J55n2p8l5kK31n4
5823A35j03l51J21L92j35J83k50O5l10J85Nj40N3j20L42j42N29m02o8r8K97j22
5845F6m0k99N6L71k56L15k08n7K01j13j07n3l2K84j10r8J0J27k81K91J89j58R0
5868A88j50j51m8L64j17q7K54j46P0K8k21J63j7O5j69N1J26j65j95K23j27L66
5890C05j99k37J64R3k16J17L2r5K31l29K11k36K6J84m9j20J98r4N3Jk1j07J03
$$ plain form
5731 -34 -156 -177 -68 74 125 -62 -273 36 -222 301 -5 -35 36 -8 348 -37 114 401 -45 -34 -80 -41 -207
5754 -207 -187 279 87 129 326 -147 1 118 232 -65 -44 -118 135 30 -36 -141 149 -314 273 240 208 161 161
5777 161 -13 -111 -99 160 70 91 -244 -136 331 -64 114 -206 122 -356 271 32 207 71 -87 45 76 98
5799 98 21 -47 -54 221 80 48 334 -28 131 -25 -507 93 139 -80 197 -145 -30 125 73 -5 -40 -42 189 135
5823 135 32 -319 -198 194 59 242 -8 57 -253 -68 -63 -203 -150 -270 72 -70 459 57 -11 -109 188 66
5845 66 26 -273 -217 154 -102 213 5 -52 149 36 -71 -124 -156 128 18 -80 -70 57 -224 67 256 98 188
5868 188 38 -113 -161 203 86 -1 253 107 177 205 -16 147 130 195 26 77 203 38 -157 66 -61 305
5890 305 106 -131 33 126 -90 27 59 -36 195 -134 77 -159 -133 51 2 -118 80 -14 39 40 19 -88 15
5913A5N2p4J22K0k59M06r0J9k01K32k70Q9M57p01J89l19K32J32k94K11j51K50
5935F7k79J15J76m4J28k32P6O5L0p6jK22j80l15K18J68l05M39m01J75R1j54L30
5958C13l89k21L38J2J9n2j73J75j02J34j44P7j03J87M0q9k60M72l36j22J34K79
5980A89j21j75J74l28J83N6j29J93l55L07k36K36J27j08q9p8P8N9j79j05L25l4
6002a0K40n31J62K24K1J32Om43J80LJ72j63K47m42L25p6n4k12N8j79K28M81j91
6025A78j71o1L0QO0j82K52j02j48L84p19M54J74l37o1K1L01J52j77Q6k34P1J20
6048I9N6j18O4l46J02J31K02j46j96L05P0l01O8r4O33j94j84j36Qn6j87M14j87
6071Go1k26K48L5j89K02Q4M4j38Jk8LJ93l62o7K46r1p1lJ07M3J49k83K32j19R2
$$ plain form
5913 15 67 -7 115 135 -124 282 192 211 10 242 -28 61 518 -183 6 -313 -81 51 -243 -32 -183 67
5935 67 -212 -97 79 35 163 -69 7 72 102 26 25 247 67 -248 -30 138 -167 272 -129 46 137 -17 313
5958 313 -76 -297 41 53 72 20 -153 22 -80 54 -90 -13 -116 71 111 22 -238 234 -102 -224 -90 189
5980 189 68 -107 67 -261 -78 -22 -151 42 -313 -6 -242 -6 121 13 -76 -154 -76 -17 -196 -301 24 -10
6002 -10 230 -301 -139 85 106 238 244 -199 -19 -16 156 -7 240 -202 123 47 -7 -219 -161 -340 -112 369 178
6025 178 7 -54 -24 -16 44 -138 114 12 -136 248 -471 -17 157 -180 -241 -220 81 233 56 142 -92 -21 99
6048 99 155 37 101 -245 -143 -12 190 44 -152 153 223 -78 -10 -104 529 335 151 15 23 -33 -220 194 7
6071 7 -54 -280 -32 3 -186 16 100 144 6 7 -21 -18 175 -187 -254 -8 -99 -170 -173 -66 -23 126 -157 75 -44 48
6097D8J00k01J99l97N44k18J01l4j77j28L40r2k20K14k66K91Q1k44J83n7k14Q5
6119f2l7J83j66K81j26K9N36p46J51q2K41k86J73k63J24r5K30J52k53Ml91L20
6141h3J32k4j43q7K06J43p7j60OL49m54M88n00L59k06q3K90l20J73j51J81J96
6163B35k18q1Kl3J76Jj73j6J53J27M7l13J87j1J15p1m27M20J33k48K14k15j27
6186a23j2J11J7k14L76j31j08j22K02rJ29j54J70l46P7j93L91J54l08K81o11L72
6208e1L07j16k15M1J96k27q7L7pK00M7J3l07N10m31L9o6J42LjRk29N88n59P3J20
6234B9n3j68J90j14J34o6j19J04K06M1o2J68k35o8l9J96j54J8j14j63M32o49O73
6257A87J24n27K57k7L17j26j88k0M8n6j60R9M3J42J95m70K95n4k48J58k18M67
$$ plain form
6097 48 148 -53 146 -251 293 75 176 142 -35 -163 177 85 -135 79 -187 104 185 -59 124 67 -147 -62
6119 -62 -99 84 -82 199 73 102 638 -108 43 -39 202 -84 89 -174 -50 -145 85 237 -16 -12 -403 -83
6141 -83 49 25 -118 -205 1 144 67 -93 -87 262 -192 296 -204 155 -51 -134 156 -164 9 -142 39 235
6163 235 17 -64 -62 -95 81 82 -91 -107 46 173 220 -93 94 83 198 127 -300 120 253 5 219 4 -123
6186 -123 -135 -24 -7 -221 155 24 -84 -206 -4 -13 116 -38 132 -214 -137 -330 61 215 -93 188 -423 -51
6208 -51 256 140 -75 -34 162 -65 -152 -115 -122 78 125 138 -169 341 -90 -51 -117 25 28 27 36 -193 395 -164 -91 29
6234 29 -24 -192 -2 -116 18 -48 -167 -63 143 184 122 290 55 -13 -52 144 -10 8 -106 -269 163 -486 187
6257 187 311 -216 41 14 331 205 17 -3 45 -11 -171 -72 -29 113 308 -162 133 79 -169 -11 -229 238
6279B38k41L6n2K21j87j49K04r7j3J28o4j87J09p8K38j42M02Ol55J08Ll93J82
6302h3J22o3J10L5M0l61K04%k50L24J08m53M99j07j18J3m5l6L8J19Q7m64L63j54
6326g2L1L1j35K97l30J80l7j53K81j49J72o4J95P7o43K59q3P3R0j68j71L12l01
6349c08L22L65n66K05j30r7J29J43j17j16L68j3ql24J09k8K11p5j7R0k27J0L23
6372B49k21k69K17K62k47J58j35l5rJ3J48JL4j31k85oL17j88r7J17j40K10j58
6395a95k32N10k47J49J7n1n0K18k19K39k1l63L9R5k83M93k13L24m73M43r9o0K01
6418B22m38M17m71KK00j56J66jJ39k46N5n1m4K59q6j8j53L41r0j52l2mn4J03K11
6443A19m2j41j55K80k00K84n0p6j64j5K71k74J81K03j63j29PN0j57L93k37j20
$$ plain form
6279 238 -3 33 -19 202 15 -134 70 -27 -40 88 24 -163 -54 -132 106 -36 366 372 17 125 128 -265 -83
6302 -83 39 -24 86 121 161 -200 4 4 -246 78 186 -267 232 125 7 20 -25 -61 -23 96 183 -281 82 -72
6326 -72 -41 -10 -145 152 -178 2 -35 -188 93 -56 116 52 247 324 -319 -60 -143 -70 20 -148 -319 -7 -308
6349 -308 14 379 -187 18 -112 -209 -80 63 -54 -170 198 185 177 -147 -38 -66 145 70 53 143 -84 -74 249
6372 249 28 -241 -24 238 -9 149 14 -21 -30 -17 131 132 166 35 -250 -256 61 -127 -224 -107 -247 -37 -195
6395 -195 -427 83 -164 -15 2 -49 -99 119 -100 139 118 -245 -206 -111 -394 99 -114 210 -263 180 81 21 222
6418 222 -216 201 -270 -268 -68 -224 -58 -59 80 -166 -111 -162 -206 53 -33 -51 -204 137 47 -105 -137 -141 -195 -92 119
6443 119 77 -64 -219 61 -139 145 95 19 -145 -160 111 -163 18 221 58 -71 -64 -14 -171 222 -15 -135
6465a35J74P9p2l3p3J6MK94k81j46L29j55K13J18l08j3j85l7M14k81j38K17O7
6488F8jJ47l29L25j95J01k35K2K52J01k82n9J29k5k39J51P9N0K47m53J18j03P2
6511e9l8k5J57j27jN5K39l8k25P7j72J9K51k7r8Q2p1j81J73K86o82N36k41J79
6535F9o6J4j47K73l58K67k86J38J07n2O2n8K13k9q3q3J43J89k84k51J22J72k6
6558D6r0R5k85J79Q7J84k15k09K69l6J07K8k85J18o0pq9R5L2j44J38J95m7k91
6582a85p2L36j86M8K16J26m68K3K20k26K0J7j48K50o8k9J23o6J7J20K8j25k5R5
6606D1J56k14q0rL19m9J4j46J1k03J60J6L2K8j94K90k07l2P4k23L27r1m4K7K50
6631B53l98j00K7rK36k6p8k0K89k35L33j27m12Q6j68N72k42j79J63q0K64j41q1
$$ plain form
6465 -135 39 118 46 13 -60 -44 -40 254 -27 -173 156 1 214 332 24 11 -174 -211 203 -78 -216 1 68
6488 68 67 214 -115 210 15 116 -119 -97 155 256 -26 -85 44 19 -220 -69 10 60 307 -146 -28 -131 -59
6511 -59 -97 -122 35 -92 -93 -38 201 163 -62 15 -157 -138 113 86 -12 70 -1 -182 -9 277 -405 131 -110 69
6535 69 3 17 -130 143 -215 52 -234 -96 11 -41 21 -37 176 147 64 -19 124 313 29 -222 -100 72 46
6558 46 -44 51 -234 -55 32 216 1 -208 61 25 132 160 -125 -7 -67 -74 -163 -68 -36 -180 -42 153 106 -185
6582 -185 -257 79 -107 -59 157 283 -185 -162 58 -168 -148 -131 -279 -29 -97 -126 -3 -69 -52 68 96 -29 -54 41
6606 41 197 -17 -97 -106 213 164 178 32 43 -160 0 16 48 76 -118 172 -35 -67 7 -216 111 20 -24 3 253
6631 253 -145 -245 -218 -227 9 -17 -95 -115 174 -61 272 145 -267 -181 -349 223 -19 -198 -35 -115 149 8 -73
6654g3L45l50J21N0k3J01j31m1l87O97k38j28Q9R4n37M14J48k5K3j59k87J86J72
6677F1O5k19J34K22j8j12J8k39K65m0j74J90M0l32N6L68k70k13K25k10K86j39
6699c6K70k68J31K5j45j0J17l48L25Q5k49j10j0K99J16K8J19k33j1j45K1J62o1
6722G2l48K72k1J6o0K92m19L60j11P9l92Q0L56m18M01j66L7l6K11k95m1J43k02
6745a90R6K40O7k59K14k63K58%j18Q4q1Q3N4l16M02L4m38JJ84J84l59J21R0k10
6769a22J88J53l47K90k63n9L42j60j71J19K61l09L7Q1j93J25J24O7j50n6J90q6
6791F1j21Mo2q3K30K73o4r0Qm23M86j50J35k50O1N4J37k80O6j32J53l24M95K9
6815B13m55J40L25n5k04K07m9K6j91Q2n0K86l32M8k04L15k56J38j37J88j9j62
$$ plain form
6654 -73 272 -78 43 93 70 171 40 -1 -388 309 71 -57 32 126 -411 3 151 126 149 -10 -297 -111 61
6677 61 126 -93 41 263 245 133 151 -88 177 137 -37 153 193 -139 -83 285 15 -198 27 -183 103 -36
6699 -36 234 -34 97 122 -23 -33 84 -264 61 146 -103 -213 -223 76 192 220 339 106 95 -50 -29 133 72
6722 72 -276 -4 -25 -9 -69 223 -196 164 53 132 -260 -180 176 -242 159 -7 30 -6 205 -90 -131 12 -190
6745 -190 -94 146 213 -46 168 -95 163 163 45 129 48 131 185 -131 271 305 -133 -132 52 236 -123 -2 88 -122
6769 -122 66 219 -128 162 -101 -160 182 22 -149 -30 231 -78 -41 40 -153 -28 96 163 13 -43 147 61
6791 61 -60 -56 -118 -201 29 302 238 148 156 -267 219 69 204 -46 15 69 206 -74 -8 -140 13 -311 184 213
6815 213 -242 -102 223 168 -36 171 122 148 -43 39 -11 275 -57 -9 -213 102 -154 -16 -153 35 16 -146
6837a46K26m6L11m91m1M35k53rpQ1j52L44m35K15j38N2k34KK52j29n9OM49n39
6861c06K47J48Kj96Q6r9K08L1j20Q1j52J28Rr8K4P1l7j04J60J41k42J15J39j27
6885A09k26K89j79j05O6j48K97K24j29k53L54l33k22L81j24J11J59l27j53K44
6905C5n0J30j89j14P04k62l56k42O11m45K45J33k57J48m3N9p7k7j86L08k38j50
6927b63L16p5j45L76k97K74l63K34J14k72J45kK0j68K74k97J30n2M1O4k01J32
6949a5O4j79R3M1K22j56K16k95N8k57K5K04N1j71J65J04P8m7m11Q6K10n2L15n96
6973b47J69K18k02M9J59jj0p9K0J09k52l1L24j69L8J8j39O5M9P7j97Q7k1k58M21
6998A97j29j62j37L06j8k00K53J48n32L47J4k80J42K08k53j32K98p7j34J18m5
$$ plain form
6837 -146 80 34 345 -146 -187 248 -5 -14 -21 60 -92 252 -183 32 -106 -54 -288 -286 -34 -163 -222 -216 233 -306
6861 -306 -59 89 91 -105 -19 -118 90 121 1 82 -70 58 67 -31 -7 64 27 -77 83 224 -18 97 236 109
6885 109 -117 172 -7 -112 -46 -194 103 327 198 -55 299 -34 -256 125 1 112 271 -56 -209 35
6905 35 -15 115 -74 -188 516 254 -102 -344 267 -178 67 200 -57 91 48 107 30 3 -183 125 -113 -263
6927 -263 53 -22 -167 209 -88 186 -177 57 171 -101 44 42 62 -106 168 -129 1 -51 -10 54 -147 -15
6949 -15 49 -130 -37 4 226 70 286 -9 49 -208 -183 21 72 -99 66 170 248 201 -210 -124 86 34 349 -247
6973 -247 -78 140 -62 -13 146 145 135 56 76 185 -67 -98 226 57 95 113 -26 39 88 165 -32 55 34 -224 197
6998 197 68 -94 -231 75 57 -143 110 258 -274 73 87 -193 -51 157 -96 -228 70 -7 -141 -23 -68
7019f8J3N9J52k20m2K62j18n0Q6j75J50J49Nn7j37J99l68J01n0N5L17k08j0n9
7043a4J25J14j50J09nj29j07J77k49K94l66K88j78O6q7J18l16N9K84J45k04j44
7065a70L17k99J58K84m04J41p6M6j2L36k77%j01J51l7k92K27p7Q2P5k85J46K35
7088A68p9j96Q3K15k18J25j54NL7J01J76j7j04N8j98L15j85j93J40j26J98j59
7110hK21k29qJ46j79J10K1j58P9JJ99k97k5P4Q5j07K31l68P2J49j34K77k68Q1
7134c5J78N5l97J85J81n6k45N21o69L53J04j76L8k45M24m97J28o2K57j55J76L23
7156C86m44J15k6K20j9j64j84J1LJ24K20j37q9L8M1J12j51j92L91k96n2K52j30
7179B9K7k45K52o7L45l35k33L51j85K42k50m66M65M69l59rj2J52l34J10J43l0
$$ plain form
7019 -68 -55 4 156 -64 -106 156 38 -12 74 -101 49 198 203 146 9 208 -160 -59 -109 -54 263 55 45 -14
7043 -14 111 225 75 184 179 50 -57 120 -129 165 -201 87 -91 -25 -112 6 -310 -251 33 178 -26 -170
7065 -170 147 -152 6 290 -114 27 -49 -3 -15 321 44 44 -57 94 57 -235 -8 -85 -3 72 -213 -67 168
7088 168 89 -107 -24 191 -27 98 -56 -51 -14 87 263 246 142 200 2 317 132 -61 79 -47 151 -8
7110 -8 213 -16 -24 122 -57 53 74 -84 -5 -4 195 -102 -127 -53 32 -75 156 -212 -140 9 -125 152 -116 -35
7134 -35 143 198 -199 -14 167 111 -134 387 -282 71 175 -1 37 -208 216 -281 -153 -215 42 -113 63 386
7156 386 -58 57 31 251 232 68 -116 -105 -102 22 242 105 16 54 95 207 56 -136 255 -41 -93 159 29
7179 29 56 -189 63 -4 341 6 -227 124 -61 181 -69 -535 -70 399 40 31 19 171 -163 -53 90 60
7201F0J36l87K69Kk54M69l72jL4k3N8j84J66j73J60J35J74k71J47k67R3J58M7
7224A76j34k42R1J39L5m31M14j94k48K81J39j54K91j73J82P4r8l34K25M4on8L3
7247E2j65Q5J52o6k32L3L75k19N4M0k88K83K37l19n9J65n09N36R3k43p2K17j60
7270a0k67Q5J89L3r5J0L30k48L5k57K79M6m10K62Q9L1pl64J88K81n8j27Q4j8%
7295H1j28LnJ16K51k46J95k79J9k65M48k31J04J9n2j10o4m4K91L9j60L33l90N7
7319a8J85l85Q9O8J71j38o7L57j66j09J59k91k4J12J15k08j3Q5m8O8O8k21J98
7342a3L6K27k34J76o1o5j4j45k68N55j04n9k01L81k81K5M71l52J9o4L47l34J14
7365A56l85J11J06K9J27l16J61J26r8J09Q5J32l30J5M56n01r1R6n1J33R4j81p6
$$ plain form
7201 60 196 -191 78 80 -174 295 -77 -78 -44 -67 -9 -193 -27 -200 -40 95 269 -2 145 -122 -29 129 176
7224 176 42 -200 -109 30 65 -366 48 -146 -394 -113 26 -128 163 -10 172 246 148 -186 39 83 77 19 52
7247 52 -113 -28 124 58 -174 -141 234 15 69 109 -179 104 341 22 -37 128 -381 155 248 5 -67 150 -10
7270 -10 -277 -192 -3 30 -65 -55 275 27 62 -195 84 130 -280 -18 71 102 95 -269 -81 200 142 15 99 81 81
7295 81 -47 -44 -49 67 318 72 267 -12 7 -258 190 -41 63 82 30 -80 -144 -188 103 142 -18 315 -75 -18
7319 -18 167 -218 -129 -61 110 -28 -95 262 96 -13 146 -145 -169 -57 58 -150 -163 -78 -126 -58 10 -211 -13
7342 -13 23 250 16 192 131 66 52 -93 -361 194 90 31 -170 211 -70 -45 426 74 93 29 376 42 156
7365 156 -229 -118 -12 17 144 -172 -11 115 17 126 211 343 13 28 484 -17 -108 -12 -63 70 164 -17 -93
7388i3J49M9J50j96k46J91j65K40k62M8L25l98J88J63k91M73l70j23J91Q0j40
7409c7j78k2J33M55j20m63J85J13j81K0J42j67k16P17j01j97P8j51J24L0k42K4
7431e4N9M6J34j94l7j5J04K33P8l41K27l78N7K6j3L71l14J72l8m10L14J5k2P5
7455I5j56m9J32l9P3j4K29l03n3J04j33R2R0j47J06J06j31k8J06l0J84k23j12
7478a01J16j79K20j56J49J71k34L3m3N3lL73n06J95J07L7l24Q6n2L33l16L10l64
7501i5J17k66K9J04K0Q3k30L14l91N98k87L6J7m8j55K68j01j83K63k84j38M85
7523A56j24j23LK57l04K20j53r7K65m10K12J15Jk37J38N4R8k4J84o50M72j35O9
7546a3M4rJ3k74K41k27Q4J53k15J56Q3o0J54k19J91k53J21K6m3k9l6j91N5J16
$$ plain form
7388 -93 56 105 255 59 -187 4 -161 79 -183 -135 190 -208 -20 143 -148 325 -45 -168 23 103 -37
7409 -37 -215 -237 -104 351 231 -232 -47 66 -115 -95 47 -120 -336 381 280 83 161 10 134 164 -78 -54
7431 -54 5 51 185 -9 -46 -61 43 276 354 13 240 -138 -81 -55 -68 303 -11 161 123 -287 27 42 20 95
7455 95 -61 -110 22 -17 56 42 271 -32 -85 19 -114 -22 68 -79 27 133 2 -26 80 50 234 11 -101
7478 -101 15 -164 56 -100 49 220 -14 19 -24 29 26 399 -107 88 195 232 -92 -6 -58 275 -41 269 -95
7501 -95 22 -244 -215 -111 -91 -8 -238 76 -315 283 -4 32 49 1 -154 114 13 -170 93 -191 -329 156
7523 156 32 -91 -88 169 -135 85 -68 -165 100 -310 -98 17 18 -219 -81 -27 71 47 231 -419 53 -82 -13
7546 -13 31 22 35 -239 2 -225 -141 12 -203 -47 36 -24 130 -89 102 -151 -30 -4 -47 -76 -112 -303 -248 -132
7570a32r1L55J2m77K67K07j87K9J00k13n7J73k57J94L5j46K16jj52j2m6j16L48
7593D9o7m2J15N4j60Q9r8J67N9P6R7l17R8J08j70J75j59l4l6j8J59R2k37K33k05
7618B8j96Q2K88Rj21j97k28L04O2K4J9J77p2j21k5j76P9pj82K59L64o31K66k2
7642a7j67N1J79K21m16L31j75m0J38m33L47j65r7J17P7Ll25N83q8p3j2L3k72L39
7666A39q1j21l7K28n6j58K08m0j53Rl4L23j30j88P9j30L76k23L5k84M03l0q6j94
7690a45J75j66L6J83j65K47l25l0L38l24r3M25J6m5j68Q2J80m89J11K49n2l62
7712c22J81L67k20j70J06J37j71J56j03J71j27L9k57M44k57J57Q9j87pk20k0L06
7734I2L1m6j47J99k94J29q2J27j4R2o8J45l55K43j73M8j33L42k01l61P86l01j98
$$ plain form
7570 -132 -223 132 144 -333 -66 141 -46 -17 83 -130 -187 -14 -271 -77 -42 -188 28 27 -125 -137 -183 -299 49
7593 49 -18 -60 55 109 -51 38 -60 107 166 242 339 22 120 228 58 233 74 40 4 -14 145 237 0 233 28
7618 28 -168 -86 202 211 90 -107 -335 -31 31 55 74 251 179 58 33 -143 -64 -71 -253 6 370 -261 5 -17
7642 -17 -184 -133 46 267 -149 182 7 -33 105 -328 19 -146 -243 -126 -49 -46 -371 212 124 51 39 72 -200 139
7666 139 58 -63 -100 128 72 -86 122 82 -71 -62 -96 227 97 -91 -12 -142 234 11 46 -238 165 135 49 -145
7690 -145 30 -136 -100 83 -82 165 -160 -190 148 -176 -269 156 172 127 -41 41 221 -268 -157 92 40 -322
7712 -322 -141 226 6 -164 -58 79 -92 64 -39 132 5 44 -213 231 -26 131 220 33 26 -194 -214 92
7734 92 123 77 -70 129 -165 -36 -118 9 -5 87 19 164 -191 52 -121 -73 -206 136 -65 -426 360 59 -139
7757a39oK10n34M45J06k91J14p9J9K16j4k10K3J48J51m5Ql3j24j28J94J07l43
7780b05L10l73K09K1J19k6j50p8K9K49j99J46k21K85k65J74ok33K25mj40J89l89
7803c33K02k48L33k8L55k77K8K20j39j44PJ12N5l02J31k10N25l04k05J6J00J2
7825i4M03k42j71K55L4k10j30P3o9J20M7Mj22P5L44l59k08L44J0j21o8jp5J24
7849c7K11j55K80l31l4K00k85K97j50j5M3k13K76j10J65j28j75K98o1L37m68K3
7871c2J69l78J06K69j82J80K20j33k06j20O4J7j18J54j42J35J51m03M76k11j25
7892a09Q4K23J12q0n8N6j10k92K26j26k3K66m46L62r9j44L62j87L87l59KM8o5
7915C0K5p2N01o21K67K15l34l11M73p6j99K82m8j21L35l72j0J09O4o8j89K59j66
$$ plain form
7757 -139 -145 65 -469 -24 82 -209 -95 -174 -155 61 47 -163 -140 8 159 114 122 89 -35 -163 31 138 -205
7780 -205 105 -268 -59 -38 81 55 -95 -173 -144 105 -94 52 -169 116 -149 25 19 -214 11 7 -133 56 -333
7803 -333 -131 -379 -46 -74 281 4 32 252 113 -31 -24 88 143 -159 -28 -238 287 -17 -222 -206 -106 -94
7825 -94 309 67 -104 151 185 -25 -155 -82 -151 -31 16 20 -102 -27 317 -42 -250 94 104 -17 -85 -86 -161 -37
7849 -37 174 19 299 -32 -66 134 -151 146 -4 -19 24 -189 87 -23 142 14 -161 137 76 413 -55 -32
7871 -32 137 -241 -135 134 -48 132 352 219 13 -107 -43 -26 -144 10 -132 3 154 -249 227 16 -109
7892 -109 -25 198 310 230 172 228 118 -174 52 -74 -97 169 -277 85 -14 -158 204 17 404 45 47 95 30
7915 30 55 -17 484 -137 130 345 11 -300 173 97 -102 180 132 11 346 -26 -36 73 137 69 -120 139 -27
7938b7N3k35L36l2j7J68l32M8m1J3N0N0p4l3K34n7P7L6j04j31j24J89j66J64k59
7963b14J23J14J51j90k62K68m0k00L04j55JJ40j3n8N2J62j32k08K30n1q7pL30
7986B58k76J38j97J06j91M12l04J05m80M83j00l0J52k54J70r3j74K55j48K17l5
8007A4J07l02N22n27P5%J22Q4l4j29L92l58k36M10J52k56j39J92j07J76K0k53
8029g5J70m8K7m4M6j0J47p19O86J01k14o3j98M31j67P0j61J2r4L52k29J5k41L98
8053A92j60l6k07k5K93j8j15L33j93l3K48k3j01P2k74L4l02L32O5k0J00j94L50
8076C18k88k28K83j94n2j01L2O1J70M5l97N15m94R8J97K13l03k07p3N58N8k09
8098Bk62K50L3k22J69kJ63k22J00k4j69R1P5p0M37l93N6M5m8m0N5j75R0N7j60
$$ plain form
7938 -27 26 -209 127 95 78 246 -86 -38 -79 -66 -16 34 -40 -73 161 104 181 217 113 -18 -142 47 -119 45 -214
7963 -214 -91 23 174 -16 -278 -10 -50 -250 54 -101 -100 40 27 -31 21 183 51 -157 73 22 -65 -72 258
7986 258 -18 120 -77 29 -162 250 -54 51 -429 54 -46 -76 76 -178 -8 -101 -275 -20 -168 49 14
8007 14 121 -181 341 -186 -111 -111 11 95 61 -68 324 -34 -270 140 292 36 -103 89 -18 158 178 -75
8029 -75 95 47 74 30 76 66 213 -506 180 281 67 4 -194 237 70 140 -21 -9 -103 249 20 35 -206 192
8053 192 32 -4 -211 -236 57 39 -76 257 64 31 279 256 155 227 -47 -13 -315 17 82 62 162 -32 318
8076 318 30 -198 85 -109 -161 -262 -230 -169 1 46 -351 164 -330 -232 -35 178 -125 -332 -405 153 211 2
8098 2 -260 -10 23 -199 -30 -32 131 -91 9 -15 -184 -93 -18 -88 349 -44 12 57 9 -31 24 -151 -61 -4 -164
8123a64j09K88L29m44J58j90j76K70J88lk70N5K06j86Lm0L13k68N74m87r7j19
8145a69J93j47K0R4K44p4l81K39j42K87J7o2o5k85K02nJ49M0l28J77Q4K51l4m06
8169a01Kj03K0j23J37N09m59K04Mk11J83J4k88K63j06L7Q2q8j68J68k07K55
$$ plain form
8123 -164 -273 15 344 -100 58 -132 -308 -38 150 147 -123 -68 138 -48 -45 -85 228 -40 534 47 -50 -169
8145 -169 24 -123 -103 -9 235 161 -220 19 -123 164 181 119 54 -231 -29 -34 115 155 -173 4 88 339 305 -101
8169 -101 -99 -202 -182 -305 -168 341 -118 86 90 -121 62 76 -212 51 -55 -18 64 -24 -192 -24 -231 24
8191B4
$$ Imaginary data points
##PAGE= N=2
##DATA TABLE= (X++(I..I)), XYDATA
0@%%%%%%%%%Qj6J6j6J6k1K9l2M0m8N4o3P3q8J01j14J31j49J69j91K17k48K77l10
33a65L48l88M34m82N36n97O61p33Q12q97R94j101J219j354J509j684J884k121
51a125K406k750L178l730M472n535P181j0109J6889o0091j4119J50022M9694o1043
65G5340r5583m6341n1856k1046N4755R6964N0781J9725m277o6460j15712m6347
77a50057M7670N8631L9103O6600N2552m1425r7702n2964j3971j0200L2071R7552
89B7860P6268l921m1617m4647o6493n4311K1623P2432N6400M5282M2395k2863
101A08408j05922q6352J416L4353K6957N9573Q0737J7483o0424p0491n2224m1731
113h8217M375P1485P5467K5467L256p638n9275r2390l6867L7732M9479M3004N4949
$$ plain form
0 0 0 0 0 0 0 0 0 0 0 8 -8 8 -8 8 -13 16 -16 24 -24 30 -33 40 -48 53 -61 70 -79 90 -101 116 -132 145 -165
33 -165 183 -205 229 -253 283 -314 347 -386 426 -471 523 -578 641 -713 796 -888 996 -1125
51 -1125 1281 -1469 1709 -2021 2451 -3084 4097 -6012 10877 -49214 -63333 86689 136383 75340
65 75340 -20243 -66584 -118440 -139486 -84731 12233 63014 82739 78462 12002 -103710 -150057
77 -150057 -102387 -43756 -4653 61947 114499 73074 -24628 -77592 -91563 -101763 -69692 27860
89 27860 104128 100207 58590 13943 -52550 -106861 -85238 -12806 43594 88876 131271 108408
101 108408 2486 -83866 -82450 -48097 -21140 38433 119170 136653 76229 5738 -46486 -88217
113 -88217 -83842 -12357 63110 88577 91833 84195 24920 -67470 -104337 -66605 -17126 25878 80827
126H0827K6712m8146p9844m5361j9262o592M2420Q3471N0057j4828l5131m0768
138f445o1935m3056K6641O2112L8672K7403K8026j9013p6066n7843R54J9478K2314
151c8758N2324N6701q19m8296m0243l0151l2721N312O3182O0988J2563o304j1457
164D2321m5612o1522j2237L8531L7906L0894L9358J2103m5356n7868k1699k879
176d6060K532L6899O1464K6429k1797k9926k9809m3267k4028L2651N3987K8685
188D7760J3764Q556k7671o2324l8449P861K1581K5702M4633L5762j5137m6800
200A5238l4154k3156j9880J3322N2184M3138N173r999j8703m3378m4819k119L3118
213c4035L1128K6156K7633r69m1864m5161j8263k661R012L6775M7125J4610j9075
$$ plain form
126 80827 107539 59393 -20451 -65812 -85074 -91666 -49246 34225 84282 69454 34323 -6445
138 -6445 -68380 -111436 -84795 -22683 15989 43392 71418 52405 -23661 -81504 -80550 -61072 -38758
151 -38758 13566 70267 69448 21152 -19091 -49242 -81963 -76651 -13469 47519 60082 53778 42321
164 42321 -3291 -64813 -77050 -38519 -613 30281 69639 81742 36386 -21482 -43181 -46060
176 -46060 -43528 -6629 54835 81264 59467 29541 -268 -43535 -67563 -34912 19075 47760
188 47760 61524 70080 42409 -19915 -58364 -50503 -28922 -3220 41413 77175 62038 15238
200 15238 -18916 -42072 -61952 -48630 3554 46692 51865 41866 23163 -20215 -65034 -67153 -34035
213 -34035 -2907 23249 50882 49913 8049 -37112 -55375 -58036 -49024 -12249 34876 49486 30411
226C0411k4360k7442l4389j1779K9277M1031K3017J2828K032k6515m4295k2404
238e2588P813J7569K4473L6197K1785j5588l2758k3144j7792r303J7971M1464
250A6099K8740L100p801j7510l3747k7226N347K5706K3391K0889J7149p432l4253
263A2452k9599r530M53J0835K9403L0764L686j8822k1247k1644k2128k611K5494
276a2494K8570J3520M436n486k5792l2971j3076R209J5795J9502K3887Q912j7943
289A6069k7448j8406j1147j875J8499L1155J7949j838j1045j8079k5247j4798
301d6211Q979K3325J9824J6186Q657j1074k7229k1399m775N559J5210K5447K1339
314C3838R49j5483j8036j8014j3137M818K2731K3559J2345K303q491k1499k2784
$$ plain form
226 30411 6051 -21391 -55780 -67559 -38282 2749 25766 38594 40626 14111 -30184 -52588
238 -52588 -44775 -27206 -2733 33464 55249 39661 6903 -16241 -34033 -43336 -25365 16099
250 16099 44839 47939 40138 22628 -11119 -38345 -32998 -7292 16099 36988 54137 46705 12452
263 12452 -17147 -26677 -26224 -15389 14014 44778 48464 29642 8395 -13249 -35377 -37988 -12494
276 -12494 16076 29596 34032 28546 2754 -30217 -43293 -34084 -18289 1213 25100 34012 16069
289 16069 -11379 -29785 -40932 -42807 -24308 6847 24796 22958 11913 -6166 -31413 -46211
301 -46211 -37232 -13907 5917 22103 30760 19686 -7543 -28942 -33717 -28158 -12948 12499 33838
314 33838 34787 19304 1268 -16746 -29883 -25065 -2334 21225 33570 35873 27382 5883 -16901
327a6901p496P774J5790J9327J6953K815j4903k0756j5991q948K097J6623K1920
340A8304J1702r54j0548j7205j9862r106O893J5497J5016J2109K701j1638k0271
353g362j5049m649L621J2874J8038J1678k351j1020j4359j3475p117N835J6112
366g224J5008P340j10r162j5572j3574j750P426J2699J4572R656j882j2126j4007
380h706r748k821O677J5194J4512O090l450r685j3995j1545j442R059J3994J2603
394A6737O210k181j2401j4885r646k56P452J2910J4197O837m749j2089j3645j0034
408a5543k459P218J4792J2774N431l857j0359j3805j0719j584P692J2090J1899
421A3570O062k918j0528j3130r497j543O329J1813J0904N543k699r481j2083q488
$$ plain form
327 -16901 -24397 -16623 -833 18494 35447 38262 23359 2603 -13388 -22336 -20239 -3616 18304
340 18304 30006 29052 18504 1299 -18563 -27669 -20776 -5279 9737 21846 24547 12909 -7362
353 -7362 -22411 -27060 -23439 -10565 7473 19151 16800 5780 -8579 -22054 -29171 -23336 -7224
366 -7224 7784 15124 15014 5852 -9720 -23294 -25044 -17618 -4919 9653 19309 17427 5301 -8706
380 -8706 -18454 -21275 -14598 596 15108 21198 17748 8063 -5932 -17477 -18919 -9860 4134 16737
394 16737 22947 20766 8365 -6520 -16166 -16422 -8970 3940 18137 24974 20225 8136 -5509 -15543
408 -15543 -18002 -10784 4008 16782 22213 18356 7997 -5808 -16527 -18111 -10419 1671 13570
421 13570 19632 16714 6186 -6944 -16441 -17984 -11655 158 11062 16605 13906 4425 -7658 -16146
435a6146j870N635J0619J0135M667k504q520j0222p611j156N717R639Q702M034
449A1119k505q203r576n572j3N915Q635Q484L192l862q040p968m569K77O591R425
465C330P260J816l792p603q157m212K049P084Q654O624J599m553p967p887l559
480i314J989P110Q836O505Q74n148q236q267m240K105P267Q331O369J224n149
495A0256r206q036m059J337O121Q767O364L71m878q144p832m739J150O736Q014
510B222N497P04l625p883q444k939J760N331P349O089J637m665o876n765l104
525a2712N41N796P666N048K87k625n111o140k853K437N491N292M607J759l429
540F054o410m273j008J848L970O555M420p13m053m514m430k504K279N582N274
$$ plain form
435 -16146 -18016 -12381 -1762 8373 13040 10536 2016 -8206 -15817 -16973 -11256 -1617 7085 11119
449 11119 8614 411 -9165 -14737 -14750 -8835 -200 8284 11476 7614 -426 -8394 -12963 -12686 -6095 3330
465 3330 10590 12406 8614 1011 -7146 -11358 -9309 -2225 6429 13053 14652 10099 2132 -5755 -9314
480 -9314 -7325 -215 8621 15126 16000 10852 2616 -5651 -9891 -7786 -519 7812 14181 15405 10256
495 10256 1050 -6986 -11045 -9708 -3587 5180 11544 11915 7037 -1107 -8939 -13678 -12528 -5792 2222
510 2222 7719 8423 4798 -3085 -11529 -14468 -12708 -7377 -28 6061 7698 3033 -3843 -9608 -12712
525 -12712 -12171 -6375 1291 6339 6626 4001 -1110 -7250 -10103 -7666 -2175 3117 7724 9483 6054
540 6054 -356 -4629 -5637 -3789 181 6736 11156 10443 6390 1876 -2554 -5058 -2779 2803 8077
555H077J834n34k895n718n279n09L245L412M113L198o72n344n728l159r50J575
571e334N068N452J622k290l369m932n065j261L705N196L212K816p2m886o098k952
587i188J36K138M055N895L039k479l399m110l799j547L399O305L628J623J84k781
603C099n938m059N67L314K921M650L787j109m963l590j986j975J446N800M524
618F488L82r70k035m005m632m03M035L117J724K555L70m280m897j407L66M77L076
635c9M687R63k318k523j892l114j618K927N009J141j41K46j767n112j939J894
651c596K135J049L135K380k191m435k141J1j115J443M752K889j244j584r65l254
667b731k985R66M078K097P56J364Om391l788j09J655M37L003M260m65l175k174
$$ plain form
555 8077 9911 9377 6482 764 -4515 -5024 -1779 1633 5746 8944 8272 2928 -2800 -5959 -6909 -5334
571 -5334 -266 5186 6808 4518 1149 -3783 -8848 -10109 -6404 -1208 2004 4820 4748 -138 -6236 -9188
587 -9188 -9052 -6914 -2859 3036 6075 3596 197 -3913 -7712 -9259 -5860 445 4073 5696 5880 3099
603 3099 -2839 -6898 -6331 -3017 -96 4554 8341 7232 2269 -1321 -3307 -5282 -3836 1964 6488
618 6488 6870 5900 3865 -140 -4772 -5175 -1140 1977 3701 6256 6626 2346 -2551 -3958 -3592 -3115 -39
635 -39 4648 5611 3293 770 -1122 -4236 -5854 -2927 2082 3223 3082 3328 1561 -3551 -5490 -3596
651 -3596 -1461 -412 2723 5103 2912 -1523 -3664 -3653 -4768 -3325 1427 4316 3072 1488 523 -2731
667 -2731 -5716 -4750 -672 1425 2181 3545 3551 -840 -4628 -4737 -3082 -2645 358 4618 4153 978 -1196
684a196r12k720m52L560M682J93j73M85k815m494j099K590J663J287L730J559
700E888k789l822j091l25j253J825M897J890j168j242l91l456l128J687L763R75
716B260K58K472p04l945k644M27L49n23K521L752n05l372o17p51k419r68L171
733a238K565o06O9P69k236m165K03K549O07k49K694J719l021k689p2Q4p81J278
751b520M144L25j995j99M27k607k148K562L213Rj96K217p95l697j250J825O67
768a8j65K813K739j880k717l67m9k078R7L760K367j520p0L54k580l368N69K423
786C10M10L13K565L62l332k532J03j35j235J996L627p1k402J69n97k686j695K615
804b215K150k48N52J494j091l385r87J220N06k78K435K646j994k035O33m55k115
$$ plain form
684 -1196 -2108 -4828 -5280 -1720 2962 3155 2982 3467 652 -3842 -4941 -2351 -688 599 4329 5888
700 5888 3099 -723 -1814 -2139 -3392 -1567 3330 5220 4052 2810 2419 -1037 -4165 -2478 1285 2260
716 2260 2518 4990 4286 341 -2303 -1876 -1527 -2050 471 4223 3718 346 -271 -1022 -3441 -4409 -1238
733 -1238 1327 721 790 1559 -677 -4842 -4639 -2090 -1483 -1732 962 2681 -340 -3029 -3101 -3017 -3798 -2520
751 -2520 1624 1949 -46 -245 182 -2425 -4573 -2011 1202 1211 1015 3232 2437 -1260 -2510 -685 -18
768 -18 -183 2630 5369 3489 772 405 356 -1722 -1625 2135 4502 2982 2912 3266 686 -2682 -2113 310
786 310 720 1033 3598 3960 628 -1904 -1801 -1936 -3171 -1175 2452 2381 -21 148 -449 -3135 -4830 -2215
804 -2215 -65 -313 239 1733 642 -2743 -3730 -2510 -2004 -2282 153 2799 805 -1230 -597 -1052 -3167
821c167O31L145J202q94N24L12k089j876R23J950l68L02J935L67k691j066J001
838A41l40o85J871K025p06j691M32k91j921q15K349J105n82l3J218j092l183L7
856b161J664N1n40K146J403k130j955M55J9j706J381K704K65j138K20J91k468
873a599j308J407J962m58N53J627n59k504o91J031n21l34J783J999o64j246j89
890B89k96j719l10K234J020l27K70R10j763j845P6R93j54o2J976N96j450j187
908g49M62o93j191R05J966J30o44N25%j827r05J084R03l79Q80J360l04j924m66
927h67N38l90j77J467J083q63p78M65j48j545L47J633M35r07Q42O21j410j336
945i90J088J29k98J45J390j71j347n64P48l51q50P70J105j99p62K77j54j318n68
$$ plain form
821 -3167 -2536 609 1811 917 1441 1753 -336 -2212 -1289 661 293 595 2530 2897 206 -860 141
838 141 -199 -884 987 3012 2306 615 1047 756 -1165 -1980 369 1474 892 859 2077 985 -2198 -2161
856 -2161 -497 -446 -986 1160 2563 433 -1522 -1067 -1048 -2754 -1373 1331 1596 458 678 869 -1599
873 -1599 -2907 -1500 462 4 557 2184 1625 -879 -1570 -539 -1060 -1394 389 2388 1724 478 289
890 289 -7 -1726 -2036 198 1218 891 1161 2071 308 -1537 -1461 -468 -622 -684 1292 1888 438 -749
908 -749 -287 -980 -2171 -1266 700 830 186 711 711 -1116 -2021 -937 -34 -413 467 1827 1523 -401 -867
927 -867 -329 -719 -896 571 1654 791 13 478 330 -1215 -868 765 1200 293 1135 1756 346 -990
945 -990 98 227 -71 74 1464 1293 -54 -618 130 -221 -1071 -301 804 605 -157 120 -34 -1352 -1920
964a920J103P97l87N53L27o51j237j52P86l61R7J504M26p94o85Q0k92r55M27J467
984A33O38j57K95J12j518m62N74L41Q3N89J181K67j202o42jl91k82J059Q37J82
1004A636p01M74o66j008m60N19O08l44P42M82j67j278k80rl75K56Q14K49q26J88
1024a46n4n93p75L56O02o1j13O75q5l72n70L88O0O3L39Q50m37l53L07q3l84k60
1046f46J148N93o11j32N9l44k58m5P13M38L7L2Q5p90o39P08J8l56M90M66K48n16
1068F98n81J36p71r7L18N05R5Q9j12j12j109q3L15L1K43O85K92l70o20j15K2n01
1090a042qJ048L48n8j43R6n49m42K3M8M54K09L72L59q1o78j12J5k15M83O20K51
1112I98n76L2K20p78j07J31K65K19p0J9j26l31r6K07Q7K00m12M78l3m40k37k68
$$ plain form
964 -1920 -817 -20 -407 146 473 -178 -1415 -1567 -781 -1142 -1045 459 885 91 -594 -514 -806 -1761 -1334 133
984 133 771 614 909 1021 -497 -959 -385 -44 39 628 1809 2076 874 232 231 -160 -442 617 1454 1636
1004 1636 935 1409 743 -265 -725 -206 402 58 800 1282 1115 -163 -443 -452 -827 -571 243 492 -334 -146
1024 -146 -200 -793 -1568 -1212 -610 -671 -784 -109 -194 -566 -1136 -748 -688 -625 -286 564 127 -226 81 -2 -386 -646
1046 -646 502 1095 484 352 411 67 -191 -236 477 915 952 984 1069 279 -360 348 366 10 500 966 1214 698
1068 698 117 253 -518 -615 -297 208 303 392 280 168 -941 -1024 -709 -678 -435 250 542 172 -448 -563 -541 -1042
1090 -1042 -1050 -2 346 288 145 241 -308 -750 -727 -679 -225 -16 356 715 634 -44 -156 -141 -356 127 747 998
1112 998 422 454 674 -104 -211 -80 185 404 334 353 227 -104 -200 7 94 294 -118 360 327 -113 -350 -618
1134f18N50k75J79L43l35j42r1k66j19K32K90J44P5kJ54n44J45k11K25R1L39M53
1156F17l07L05m62m50j10K14N49l5K16L37m39l56R5m80L59J02J81L05N3K4o87
1177C1J25m09R5L22P4j7L73l24l8o20P5l38K59O72l73J0K16k36j63l69J90M4J49
1200b52J92o7mK1j19j41K85o5n6L85J57k63L09m69k82M19M49k26j74M05P9k69
1222C14J1L6l57L1m7M66Opl75rp9l80M26K60KJ2l10l3k61l03K25J81Q2J5K74m6
1248A34n36N6N5m85L80J12M0L27n76J49j64K59k4M80j36k55K47k37J34o5k71R8
1270b78J98j0M72k12K33m80k9j07J80J48M05j55m6L49p61j08N02k79J78nj5L75
1292E55m82J1l53J46j38K33q6J96j92K25l45k88K69J50j15K1K9J43o0k71p6K17
$$ plain form
1134 -618 -68 -343 -164 179 -156 -298 -389 -655 -774 -542 -252 -108 -33 -35 119 -425 -280 -491 -266 -175 164 617
1156 617 310 615 153 -297 -407 -193 356 321 537 874 435 79 174 -306 53 155 336 641 694 718 31
1177 31 156 -253 -158 164 238 221 594 270 232 -388 -313 -651 -392 280 -93 -83 133 -103 -266 -635 -445 -401 -252
1200 -252 -60 -127 -131 -110 -229 -370 -85 -150 -206 179 336 73 382 -87 -369 50 499 273 99 504 583 314
1222 314 325 361 4 35 -12 454 460 453 78 69 -10 -390 36 296 298 310 0 -33 -294 -597 -372 -191 -109 -94 180 134
1248 134 -402 -346 -291 -776 -396 -284 -244 83 -493 -344 -508 -249 -273 207 71 -184 63 -174 -40 -105 -376 -278
1270 -278 -80 -90 382 170 403 -77 -106 -213 -33 115 520 365 319 668 -93 -201 301 22 200 195 180 555
1292 555 73 84 -269 -123 -261 -28 -114 82 -110 115 -230 -518 -249 -99 -214 -193 -164 -21 -81 -352 -428 -211
1314b11m0J7K51J77j87K04l00j22O3K20k72K61J67n4O3k19RL85q9k61lM44l08
1337A95k3j05L9L7N9J31r4J06l49Q1K97m96j36J09J76r8J50p1n4j43J74k93J59
1360a49l6J73n3q4k95J18k8j32K78K65p4j02k29J09j73J77j00J68P6Q5K66l47
1382h7q0k4K23p5N0J39L23m0l2j27k69n2L8J91j16M4K11J49j83k30J33k67m4Q6
1406c9K17j57j23O3J90m20l7q2l3J48K34n1k94K43j78oJ49k84M4N08l78l6K22
1429a00L31o46j17N57p9l10N98l8K4n11L54K97k01K8j30P9n8qKJ67J2k19M70k64
1453B38k16q1K47j89o4K46J27l43j65K80j35l76M20r1j71L40l15L43k38J2K2j56
1475b65K05j10J50m9j6L5P3k11l44K14M61k58K67j39L46m33k08J72qJ00N1J84
$$ plain form
1314 -211 -251 -234 17 194 7 211 -89 -211 -148 72 -200 61 228 174 237 18 27 412 323 62 59 503 195
1337 195 172 67 106 143 202 333 239 345 -4 77 374 -122 -258 -149 27 -71 79 8 -46 -189 -15 -308 -149
1360 -149 -185 -12 -65 -149 -444 -326 -354 -486 -208 57 -17 -119 -348 -239 -412 -235 -335 -167 -91 -6 260 -87
1382 -87 -167 -191 32 -43 7 146 469 429 397 270 1 -51 -13 178 62 106 317 466 283 53 186 -81 -125 -39
1406 -39 178 21 -102 -39 151 -269 -306 -388 -421 -273 -39 -90 -384 -141 -319 -325 -176 -460 -416 92 -286 -322 -100
1429 -100 231 -415 -532 25 -54 -364 234 196 220 -291 63 360 159 187 57 136 78 70 72 239 251 32 502 238
1453 238 22 -59 188 -1 -65 181 308 -35 -200 80 -55 -431 -11 -102 -273 67 -248 95 -143 -131 -109 -265
1475 -265 -60 -170 -20 -69 -85 -50 23 -188 -532 -318 143 -115 152 13 359 -74 -282 -110 -118 -18 33 217
1497B17k49Q6O4J37j62j5J38j44K31l56M01k38p0n2J49K7m8L26n00J9O1L01l88
1520f5m4n4R5K66n21L54N2j36k06n4M99l50L0j07j06p2K72J05q6j49K2N68p33
1543d20J69J57k23K03R4K42M4l28L10j40j52p7K11J24j30K6J57N3k90r1M73j74
1565B38n64N90P4J4k07j18M2k10j31M14j17j00J19J00m98RrK16j42m72N08L57
1587A13k79J08j5K89o36M72l20J07j11L8K65J37l75k69L15J79n1Q0m7p2K58qj48
1610C0Q6j43K23q4n3N4o7k98L06J55J43l31j9K48j17k57J97J97m59J34K59k5q7
1633I2m9l56N60n81M26k83K09l17M02l26M3j72J50K04l31K29J30M1m12O3J05P0
1655a03j45J95K27j62J4k5K56n24J77j3K37j7K16J55n74j75N42K30m91M3J09k8
$$ plain form
1497 217 -32 54 118 255 93 78 216 72 303 -53 348 110 40 -12 137 164 116 442 -58 -39 22 323 -65
1520 -65 -109 -163 -68 198 -323 31 83 -53 -259 -313 186 -164 -134 -241 -347 -419 -147 -42 -128 -277 -255 313 -420
1543 -420 -251 -94 -317 -114 -20 222 266 -62 248 108 -44 -121 90 214 84 110 267 320 30 -61 412 238
1565 238 -326 264 338 352 145 27 69 -141 -272 142 25 -75 44 144 -354 -345 -354 -138 -280 -752 -244 113
1587 113 -166 -58 -73 216 -420 52 -268 -161 -272 -234 31 168 -207 -476 -161 18 -33 47 0 -72 186 178 30
1610 30 116 -27 196 112 59 113 46 -252 54 209 352 21 2 250 133 -124 73 270 -189 -55 204 179 92
1633 92 43 -313 247 -334 92 -191 18 -299 103 -223 -180 -352 -202 2 -329 -100 30 71 -341 -278 -173 -103
1655 -103 -248 -53 174 12 26 1 257 -267 -90 -103 134 117 333 488 -86 -261 281 511 20 63 172 144
1677A44j72J64j50L52m02J55Jm36L26o6K88j04l62J77J4pm5m4K8j07J29j16L6
1700a97KJ06j66l3J29K4j97O0J34K59j56k8p3K69j70j1J28j54K54l36L76nk04
1723A1Q7J82o6l67M15k44k0K70k61K27j25l0N2Q5k95M08q9j65k47K59J43j12j18
1746@J62n4k9j65n3K51l88K05R6q4p7N9j36J0L6p5K3R9m2J63L28n73L88k26%J39
1772E7k23K70j40K70l88K64l29L10npk64K23j35M3K71J00m5m17M68jj43Q8k53
1795A4O3R9k50j30L04j42L8J31N2j48j56K58l6m25K82K78k01k22J99N9l08J1J71
1818e9r4M48l90K81n23K11p0Q9K44k95J79l0q6K18m8J36j15l72J9L08K21M8j74
1841A46O1p8Q8K15j9l35R4K05m91J82j20J58P2j41O5j93J71j32n6j66J37N6P9
$$ plain form
1677 144 -28 136 -14 338 -64 91 92 -344 -18 -84 204 100 -262 -85 -71 -78 -123 -167 -139 -246 -117 -233 -197
1700 -197 -195 -89 -255 -288 -159 -135 -332 -272 -138 121 -35 -63 -136 133 -37 -48 80 -74 180 -156 220 215 11
1723 11 98 280 214 -153 262 18 -2 268 7 234 109 79 131 216 -79 329 240 75 -172 87 230 118 0
1746 0 162 108 79 -86 -139 112 -276 -71 25 -59 -136 -77 -213 -203 -167 -242 -219 -120 -162 1 329 -244 144 -82 -82 57
1772 57 -166 104 -36 234 -154 110 -219 91 86 79 -185 38 -97 -54 217 317 272 -145 323 322 179 267 14
1795 14 77 176 -74 -204 100 -42 -4 127 179 31 -125 133 97 -328 -46 232 31 -191 8 67 -241 -230 -59
1818 -59 -153 295 -95 186 -337 -126 -196 -107 137 -158 21 -9 -95 123 75 211 96 -276 -257 51 272 320 146
1841 146 207 129 217 432 413 78 172 377 -114 68 -52 106 178 37 102 -91 80 -52 -108 -274 -137 -81 -2
1864bL5J5n6J3o6k7O0l79K56J85k07j64K17j74M49m06L39J5j37L8l08N17k83M9
1888b1L8r6MJ2o4J01L08l02j80K90j77M8L73m92N31r2n90L32j2J72j56J6K35k10
1912F8K59m17L15m22R2J98k70p6J44K67l49J96j49j02K52L2n6J34p3j51r2j01
1934c01J23R2j29k7N11q9k45O2o3N7J26l09L50M8k31J32R4k47L59k11q3j15K11
1957A15J58k33j10J6J82j32l4L34j23k33M17m92n1J88J23j59k3J0j84K38p8J12
1979D1j8J03k32j70M67l81q3j59K93P7k31K38k47L02J46K8n31J89K48P1k92J66
2001B5J20K0k41J34k31J74M9q3N3q4J12m8K49j68k30J8J93K01r3j5k72O1J37M5
2025A26n9r6Jj65J07L20m36K50k09r8K77J44l22J61j62%j63RJ17j63M15j85P7
$$ plain form
1864 -2 33 48 -8 5 -61 -88 -28 -407 -151 34 -173 -337 -120 -294 155 -251 88 103 -34 4 -304 213 -70 -21
1888 -21 17 -79 -75 -63 -127 -26 282 -20 -200 90 -87 -39 334 -158 373 281 -309 23 11 183 27 43 278 68
1912 68 327 -90 225 -197 -105 93 -177 -253 -109 158 -191 5 -144 -246 6 38 -18 116 43 -108 -200 -301
1934 -301 -178 -86 -215 -242 269 180 -65 -3 -66 -9 117 -192 158 206 -25 107 201 -46 313 102 19 -96 115
1957 115 273 40 -70 -54 128 -4 -38 296 173 -60 357 -135 -186 2 125 -34 -57 -47 -231 7 -71 41
1979 41 23 126 -106 -276 191 -190 -273 -432 -139 -62 -293 -55 -302 0 146 174 -357 -168 80 151 -141 25
2001 25 145 165 -76 58 -173 1 50 -33 20 -64 48 0 249 81 -149 -131 62 263 170 155 -117 -56 81 126
2025 126 67 -29 -28 -193 -86 234 -202 48 -161 -259 18 162 -160 1 -161 -161 -324 -315 -198 -361 54 -131 -54
2048e4O0K5O1k11K73j9r8k35P4M29l01O5L05n59NM6J95K1J03q9j13K37j53L51
2072D18j82j63JP3j44o9K68j49K8l7k13L18l60J77J25j25K06m19J47N5J61j09
2094Gm15M31N2L4o7k47L7R4J91j88J86j9j02m9j74K64j35J13M8MN3Q4j57K48l54
2119f1L43k1j54J78k48J59J98k92l10J15J65R6k09J91kp3j42Q1P6l79M54k43j24
2142b02p4k6K23j36J28J39j21n4PJ44N1m0k63q2M04K5j96M2p6J0K34j65j10M23
2166B85o44M23j75K22m5J54j10K09m75K71n0k12M20k24L25p2L3m57Q8M29l82l02
2188b89M87k93Q3j8m9j33L03p0l23K33K96j41p5K0j68M5j70M9K8j87J08M68l8
2211A66n33M98l11l3L21j71kK23M1N0l79j80N79p9l17L89k4j63J89k87J05K24
$$ plain form
2048 -54 6 31 92 -119 154 135 37 -198 -124 305 4 69 374 -185 -180 -134 61 82 185 96 -17 220 67 418
2072 418 236 73 74 147 3 -66 202 53 81 44 -169 149 -211 -34 91 -34 172 -247 -100 -45 116 7
2094 7 -408 23 75 109 42 -205 -168 -74 117 -71 115 96 -6 -55 -229 35 -100 13 61 65 118 202 45 293 -61
2119 -61 282 261 107 285 37 196 394 102 -208 -93 72 168 -41 150 148 75 -67 14 90 -289 165 -78 -202
2142 -202 -276 -302 -79 -215 -87 52 -69 -123 -116 28 79 39 -224 -306 98 123 -73 -31 -107 -97 137 -28 -138 285
2166 285 -359 64 -111 111 66 220 110 319 -156 115 65 -147 273 49 374 302 335 -122 -34 395 13 -289
2188 -289 198 -95 -12 -30 -79 -212 91 21 -302 -69 227 86 11 31 -137 -92 -262 -213 -185 -372 -264 204 166
2211 166 -367 131 -180 -213 108 -63 -65 158 199 249 -130 -310 269 190 -127 262 238 75 264 -23 82 306
2233C06j96P8k57L72j10mL6l99J85k8j94K41n19N43l21K09K15m12k7Q7j6J81L97
2256C67l83l0l8jL3j39K3L14m62L16j09J56j05o7K29M9k26K8r2J55P8p9J89k46
2280d0J72J3o2k4m8J03K2j84J97l97M94k01J35J10j90J41l40J79K44l38r3L80
2302B73j47j50N6j45L74k09n6M3k24m8M5L37m97j11L82o2Q1L20p16M4K04K01Q8
2325H3nk33N5K10k01N8j44K50o4j05K11j90R6l7L57m24l8J42l9K4K30p5l45K76
2349I2j62m8L42j08j31J41k73K19R0k66L93k49k31q7r2K04J81q1m4r0J72JJ05
2372G8j35r8J28J4j72K8K86k08K09j60J17k02m6J03K22j70M4n0lJ48K32l72K0
2395A3Q6k25N0J33j61n4N3J05J11kj63K44j57J74p4j30k28M8K59k36j32L85k54
$$ plain form
2233 306 110 188 -69 303 193 189 225 -174 11 -17 -211 30 -489 54 -267 -58 157 -255 -282 -195 -211 -30 367
2256 367 -16 -46 -84 -85 -52 -191 -168 146 -316 0 -109 47 -58 -125 104 153 -73 -45 -137 18 96 17 206 -40
2280 -40 132 145 83 59 11 114 136 -48 149 -248 246 45 180 290 100 241 -99 80 324 -14 -107 273
2302 273 126 -24 32 -113 261 52 -4 39 -185 -233 -188 149 -348 -459 -77 -139 -58 262 -454 -410 -206 -5 83
2325 83 78 -155 -100 110 -91 -33 -177 73 9 -96 115 -75 21 -16 341 -83 -121 21 -18 6 236 161 -184 92
2349 92 -70 -118 224 116 -15 126 -147 72 162 -104 289 40 -191 -278 -370 -166 15 -66 -110 -200 -28 -27 78
2372 78 -57 -155 -27 -13 -185 -157 129 -79 130 -30 87 -115 -161 -58 164 -6 38 -12 -15 133 365 -7 13
2395 13 99 -126 -76 57 -104 -158 -105 0 111 109 -54 190 33 207 133 3 -225 -177 82 -154 -286 99 -155
2418a55J31p1j83L45n2j81j6Q4j59M56k26k18Q9RM6j12K0j3K18J71m74K53Q3l5
2442A0R2o4J21j13l8kl33O46m11K20j58L25p1k22k3J09M4Ml10J50L64j56o3J43
2466B64l25J01N5k60j43K78K37O9l21K7j56J35k5j53K41j27q5L60k20l06L34r6
2488a16O4k67O5l2J21o5M9J12R8m0j32O7N5r2L02k19q9J68j09j10m0K29N7j3J5
2513G8l30O0J36K17j62K12n5m9j6K40l40j69J97o5n6L29m70N6J05L08n20N0O91
2536D47m07Rj40L26k40j08O8L8k16J81P5p1j18J35K29l01O0j4j37O4J73l56J87
2559a16J47J40j9k40J80n9j95n2J66M3J95j58J21k67J07P5K28m47L08j13j98L9
2581a15Or6J71K62l29J50n2oP9j73J27K33l44jJ01Jj31K95k27R6l4k56l9L10k03
$$ plain form
2418 -155 -24 -95 -278 67 15 -166 -182 -98 -257 199 -27 -245 -156 -147 -101 -213 -193 -206 12 183 -291 -38 45 10
2442 10 102 38 159 46 8 6 -327 319 -92 128 -30 295 224 2 -21 88 132 136 -174 -24 340 184 121 264
2466 264 -61 40 95 -165 -308 -30 207 276 -45 -18 -174 -39 -64 -217 24 -103 -188 172 -48 -354 -20 -116
2488 -116 -52 -319 -254 -286 -165 -230 -181 -69 29 -11 -143 -76 -21 -113 189 -30 -119 49 -60 -170 -210 19 76 63 78
2513 78 -252 -192 -56 161 -1 211 156 107 91 331 -9 -178 19 -46 -102 227 -243 -187 -82 226 -294 -244 447
2536 447 40 49 -91 235 -5 -113 -45 -7 -223 -42 33 -38 -156 -21 208 -93 -33 -47 -184 -120 53 -303 -116
2559 -116 31 171 152 -88 92 33 -162 -214 -48 -5 190 32 153 -114 -7 68 296 -151 157 44 -154 -115
2581 -115 -109 -205 -34 228 -101 49 -3 -9 70 -103 24 257 -87 -88 13 14 -117 178 -49 47 13 -243 -282 28 -175
2606a75N48m78J06k1p4m7J6L5j48K73M8l26L68p9j44K42j75K36l2j22K04k73k2
2629d0K58L4j48P1j13l3j77L48q1J05k37k6L4n2P2l6q4n6L56q1k63j63L29P3k29
2654a39K39m04K79o7K72l07K82j56J51k10J01J19n9R4m15J11K39q9j3K09l78K00
2676E9k37j4M38j69N6Nj46o4L14j57q9jj2Lj47L77n25L48o6M8j06PJ06l5k3j54
2702a84J63J24l33N39l15j35J12J53l77L6J34k32L17j56L09l60N0J8l56L51J65
2723B3j3j12J32p0J71l47J72J0L40l86k4K99Qj09K3qr8J60o9r2J42%j25R5r3M9
2749G8J89q7M7k46J28l22L01k15K47j80M8r7K3N0KQ2j93K11l03O5K82q4o1P2j06
2774f9k3L65j26l55J37J24j69m6J50k81K81k49O29l29o9J36k96J81j76K71k14
$$ plain form
2606 -175 373 -105 1 -20 -94 -141 -125 -90 -238 35 83 -243 125 46 -98 144 -31 205 173 51 255 -18 -40
2629 -40 218 252 104 175 62 29 -148 200 119 224 -13 -39 -5 -57 15 -21 -105 -161 195 114 -149 -312 17 90 -139
2654 -139 100 -304 -25 -92 180 -127 155 -1 150 -60 41 160 101 195 -220 -109 130 41 28 237 -141 59
2676 59 -178 -192 246 77 133 138 -8 -72 242 85 -4 -5 -17 -14 -161 216 -309 39 -27 21 -85 -78 28 -7 -30 -184
2702 -184 -21 103 -230 309 -6 -141 -29 124 -253 -217 -83 -315 2 -154 155 -205 -155 -137 -493 -142 23
2723 23 10 -102 30 -40 131 -216 -44 -34 306 -80 -104 195 203 94 117 109 11 171 102 10 152 152 27 122 29 78
2749 78 267 180 227 -19 109 -213 88 -127 120 -60 -12 -109 -86 -36 -34 48 -145 66 -237 -172 110 26 -35 37 -69
2774 -69 -92 273 147 -208 -71 53 -116 -162 -12 -293 -12 -261 368 39 -30 106 -190 -9 -185 86 -128
2795a28J66l9j37L95l16J55pr2P0j2l08J25m6M1j20K87Qj14J01l5Pk9o9p7J43
2820c1J22n5k86L49k82K69p2J6l0L99n93L82k9j68q3J39j01K55k25O2j54n7J19
2843e4l0K3J50k62Q3j7PK88m71M06k06J52M4p7j05J32r8qQ5j56J66J42k62R5O0
2868H7p8k65K13K58l2l71L4M74l36J08n73P56l84N6K85J01l77M76n67o5J35p0
2890a35K86j31j55J87p3M6j00L8j84L26O6m57K82J07r1j56M03j47L2j75K0J11
2912A00k83J84p7j47J77J35l09L24m5J11M7j97K31J09l55J9n3m6K83j60J9j80
2934a13M4NL83j63k23N2J90k68J56Q6k89J34j47R3k46O77k73N7k99Q4j17q2L77
2957A18j77r6m7L72j93N6J0J80l34K09M6j00k08J98L53l73J97k86l38M63J57k98
$$ plain form
2795 -128 38 -1 -138 257 -59 96 89 -3 67 55 -253 -128 -174 -133 -253 34 42 -72 29 -6 1 -28 -97 -174 -31
2820 -31 91 36 -250 99 -183 86 14 30 0 399 -194 188 159 -9 -92 47 -54 201 -24 38 -116 -173 -54
2843 -54 -84 -61 89 -173 -90 -107 -100 188 -283 123 -83 69 113 36 -69 63 -35 -43 42 -114 52 194 -68 27 87
2868 87 9 -256 -43 215 183 -188 -154 320 -16 92 -481 275 -109 -53 232 333 -44 432 -135 -200 -65 -135
2890 -135 151 20 -135 52 -21 25 -75 -37 -221 105 171 -286 -4 103 12 -144 259 112 144 -31 -11 100
2912 100 -183 1 -76 -223 -46 89 -220 104 59 170 217 20 251 360 5 24 -29 -75 208 48 67 -113
2934 -113 -69 -64 319 156 -67 -15 175 -93 63 149 -140 -6 -153 -60 -306 371 98 155 -144 -60 -177 -259 118
2957 118 -59 -155 -202 170 -23 33 43 223 -111 98 144 44 -164 34 387 14 211 -75 -413 50 207 -91
2979i1L95j63r9k68K36k46K88k13J48J90l09J46j22m5j4K44k73P4O2l0K61l38
3001a67K78p9j2j69r3K84j68K24K36l82r5LnJ17L9p3J05L8J57j94j93J59j76l
3025a69K99k54J28l1K96j74n08L72LK95k45o2M44l92j87m7M40k40M7P4O0m3l67
3048b61J42L01k60j07K55j47j67L59j09lk79P0J40Lo3l0l1K10Q4k10J36K82n84
3071b69R0n3m0L55r7k41J08j04K62M5l52K55R0J64j89j05L13m92Q9J80K1l60L05
3094b5L9j53P6NQ8q4Q5K54j17j14Jk39K02m40N27k20J5J26q4q5K88k68OK75l41
3119a83NJ90q5L44M4q4ml85j14K30J76j18j57L81k41O7L3k06K13k37L32l26J48
3142B3J40j36k08P2J16k68K92qj9J37l6k2j64j35K54mJ72j33J73j59k96K63l3
$$ plain form
2979 -91 304 141 42 -226 10 -236 52 -161 -13 177 -132 14 -108 -153 -167 77 -196 -122 -60 -90 171 -167
3001 -167 111 32 20 -149 -242 42 -126 98 334 -48 -143 -140 -145 -28 11 -62 43 81 238 44 -149 10 -166 -169
3025 -169 130 -124 4 -27 269 95 -413 -41 -38 257 12 -50 394 2 -185 -232 208 -32 15 89 149 106 -261
3048 -261 -119 182 -78 -185 70 -77 -244 115 6 3 -276 -206 -66 -63 -126 -156 -187 23 107 -103 33 315 -269
3071 -269 -179 -232 -272 83 -14 -255 -147 -251 11 56 -296 -41 49 213 24 -81 232 -260 -171 9 30 -330 -25
3094 -25 14 -139 -63 -58 30 -54 31 285 168 54 55 -184 18 -422 105 -115 -100 26 -58 -143 145 -123 -117 158 -183
3119 -183 -178 12 -73 271 315 231 227 -158 -272 -42 134 16 -141 240 -1 66 99 -107 106 -131 201 -125 23
3142 23 163 27 -181 -109 7 -261 31 23 4 141 105 83 -81 -216 38 34 206 73 246 87 -209 54 21
3165B1k06r2K67k70M15k10l5J9J9PL27l25l8R9P5k08L20o4m00J67J33P5j77J34
3189E3n5K3j18J14J48l06J25p8Q5P4k41J24M0n9l24N26k56J00J89k06k10J88j47
3212b11J27k79M33j63j71K51k03J26j6J19L59m09J86rk62R6J15j83J3nj9l9J28
3235a6j44J26J98l29k5K96n19O28j07mk17M71j19l41L04P6m13J72k18M88j53K02
3257C56m01K81n0m05N8j96J24L35k48J70R7j09m57O05k81J20p6j5K77m89N73k08
3279F1n3J66Q2k44k52O9K98L8k4j83K21j01j16l23J51L03n11M33j61J75k5k90
3301b86L03J08P0j10J13m46K47m0M7J05k42J0Q7j4J9r5R1J13O4J1l25J08J58j4
3325H2l3l01K18J71J67k92o4k5K33l06R8J6K17k21m8P8k6M12m40N5l07O53m57
$$ plain form
3165 21 -185 -277 -10 -280 135 -75 -110 -91 -72 -65 262 -63 -101 -2 73 -135 185 121 -279 -112 21 96 -81 53
3189 53 -2 21 -97 17 165 -141 -16 -94 -9 65 -176 -52 -12 -71 -395 131 -125 -25 164 -42 -252 -64 -211
3212 -211 -84 -363 70 -93 -264 -13 -216 -90 -106 13 372 -37 149 140 -122 -26 89 -94 -81 -86 -105 -144 -16
3235 -16 -160 -34 164 -165 -190 106 -413 215 108 104 -113 358 239 -102 202 278 -135 37 -181 307 154 356
3257 356 -45 236 186 -219 -161 -357 -233 102 -146 24 121 12 -445 160 -121 -1 -77 -92 185 -304 269 61
3279 61 8 174 256 12 -240 -171 127 165 141 -42 179 78 -38 -361 -210 93 -418 15 -146 29 4 -286
3301 -286 17 125 195 85 198 -248 -1 -41 6 111 -131 -121 -34 -48 -29 -124 -33 80 144 155 -170 -62 96 82
3325 82 49 -252 -34 137 304 12 -52 -77 156 -150 -52 -36 181 -40 -88 -10 -36 376 -64 -9 -316 337 -120
3348a20J16K34k28Q2k35K49o9M0l2N3O1o2lP1n44N19p3n40M23k90N22k53Q9R8
3372A08O4p9J29k01R3k72M6qp3L05o7r7j25L99k61J79n7mJ27k26K16q0m6j20k12
3397b62M39r2k6j55J28r3l20L01L9K56j90j16J49j58J7R0m7j35M5q3r2K60K44
3420A99Mj04n02L23J75l97J21K29k08R3J17J63j26k31K76n4k25R0r5M9L36k36
3442ck19J91L2k1O4n4K8R1J19k31l0J9R2j28J46j49o9K27j70j7j8J87k43J46J65
3467A55k5j26j03r4P6mK22o0J86j85j8J23j47n4K4L7p1L38j61r7L7J21k56j04
3491a86J30j18p3L1K08K7Q4l39K35j22M8J19J53K2k70j60j15M79k39J35k10J25
3513c6J55m12J78j0k34L33J4j4J13j33K67k24k61J97j9ml0Jm4J0K63l67M90k07
$$ plain form
3348 -120 -4 230 2 84 -151 98 29 69 37 90 151 89 86 157 -387 132 59 -481 -58 -348 174 -79 10 108
3372 108 172 93 222 21 114 -158 -112 -120 -193 112 45 -52 -177 222 -39 140 83 79 206 -20 196 116 70 -50 -262
3397 -262 177 85 59 -96 32 -61 -381 -80 -41 215 25 -91 58 -100 -83 7 -40 -175 -130 -213 -305 -45 199
3420 199 203 99 -403 -80 95 -302 -181 48 -160 -67 50 213 87 -144 132 78 -147 -57 -152 -103 233 -3
3442 -3 -222 -31 1 -20 44 -10 18 109 228 -3 -33 -14 78 -50 96 -53 -122 105 -65 -82 -100 87 -156 -10 155
3467 155 130 4 -99 -193 -117 -121 101 41 227 42 24 147 0 -54 -30 7 -64 274 113 16 53 174 -82 -186
3491 -186 -56 -174 -247 -216 -8 19 103 -236 -1 -123 -75 44 197 219 -51 -211 -326 153 -86 49 -161 -36
3513 -36 119 -293 -115 -125 -359 -26 -12 -26 87 -46 221 -3 -264 -67 -86 -90 -120 -119 -163 -153 110 -257 233 26
3537B6kK4k28KK48k59P5R9o9j0L76l37q9O8J72n4R7l58K13j89l3J54M2J3l09J99
3563a29K78j52j02N1L7j40M05l42p4O4J53j63J48J87k81L47l84J56j87j9J53M14
3585D20m93OL33j71q4P0k52O4L84k09j04j32K02j86J04k51L73k24L4r2K31J01
3607A24k50M22k01j06J41p2j96M10k16oK8N0j14q7M45n74K03K66l51N7K35j49
3629E9R8K3J35j75j12Mj02K00l09Q7j08J91qn1L28k29o01M76J79K8k10O6n9J38
3653D8pj95K10j36p6K34j44J5l6r2K19N4k54p4J36j47L17k82L1J77n4K61j33k3
$$ plain form
3537 26 24 48 -180 -178 70 -189 -114 -15 -84 -94 282 -55 -144 -76 96 42 139 -219 -6 -195 -228 -74 -32 -19 -328 -129
3563 -129 149 -3 -105 -54 -17 -157 248 -94 -168 -104 49 -114 34 221 -60 287 -97 59 -128 -147 6 420
3585 420 -73 -67 266 95 11 81 -171 -107 277 68 -36 -168 34 -152 -48 -299 74 -150 -116 -208 23 124
3607 124 -126 296 95 -11 130 58 -138 272 56 50 78 128 14 -73 372 -202 1 267 -84 -27 208 59
3629 59 157 180 315 140 28 32 -70 130 -179 -92 -200 -9 -17 -68 260 31 -570 -94 85 113 -97 -31 -90 48
3653 48 41 -154 56 -80 -156 78 -66 -51 -87 -179 40 94 -160 -234 -98 -245 72 -210 -179 -2 -56 205 72 49
$$ [...]
8191b45
##END NTUPLES=NMR FID
##END=
