##TITLE=1H_LR-684B-C1
 CDCl3, 8 sc, 
 30.7.2019
##JCAMPDX= 6.0         $$ Bruker NMR JCAMP-DX V2.0
##DATA TYPE= NMR FID
##DATA CLASS= NTUPLES
##ORIGIN= UXNMR, Bruker Analytische Messtechnik GmbH
##OWNER= root
$$ XWIN-NMR		Version 3.5
$$ Tue Jul 30 15:09:32 2019 Russian Standard Time (UT+4h)  she@DPX200
##.OBSERVE FREQUENCY= 200.13155
##.OBSERVE NUCLEUS= ^1H
##.DELAY= (6, 6)
##.ACQUISITION MODE= SIMULTANEOUS
##.ACQUISITION SCHEME= undefined
##.AVERAGES= 8
##.DIGITISER RES= 18
##SPECTROMETER/DATA SYSTEM= spect
##.PULSE SEQUENCE= zg30
##.SOLVENT NAME= CDCl3
##.SHIFT REFERENCE= (INTERNAL, CDCl3, 0, 15.7039)
##AUDIT TRAIL= $$ (NUMBER, WHEN, WHO, WHERE, WHAT)
$$ ##TITLE= Audit trail, XWIN-NMR		Version 3.5
$$ ##JCAMPDX= 5.01
$$ ##ORIGIN= Bruker BioSpin GmbH
$$ ##OWNER= she
$$ F:/spectra/data/she/nmr/H-F/1/audita.txt
$$ ##AUDIT TRAIL=  $$ (NUMBER, WHEN, WHO, WHERE, WHAT)
(   1,<2019-07-30 15:08:40.84 +0400>,<she>,<DPX200>,
      <created by zg, POWCHK disabled, PULCHK disabled
       configuration hash MD5:
       00 E9 B6 7A A2 85 ED C7 34 08 36 98 17 FE 4E 26
       data hash MD5: 16K
       66 0C E8 2C 52 9F E2 10 C4 92 91 39 17 90 B3 3A>)
$$ ##END=
$$ 
$$ hash MD5
$$ D0 59 E4 49 C7 87 A3 08 80 C7 63 CC 00 18 55 B5
##$RELAX= 
##$RELAX= 
##$RELAX= 
##$RELAX= 
##$RELAX= 
##$RELAX= 
$$ Bruker specific parameters
$$ --------------------------
##$DU= <F:/spectra>
##$EXPNO= 1
##$NAME= <H-F>
##$PROCNO= 1
##$TYPE= <nmr>
##$USER= <she>
##$AMP= (0..31)
100 100 100 100 100 100 100 100 100 100 100 100 100 100 100 100 100 100 
100 100 100 100 100 100 100 100 100 100 100 100 100 100 
##$AQSEQ= 0
##$AQ_mod= 1
##$AUNM= <au_zg>
##$AUTOPOS= <>
##$BF1= 200.13
##$BF2= 200.13
##$BF3= 200.13
##$BF4= 200.13
##$BF5= 200.13
##$BF6= 200.13
##$BF7= 200.13
##$BF8= 200.13
##$BYTORDA= 1
##$CFDGTYP= 0
##$CFRGTYP= 5
##$CHEMSTR= <none>
##$CNST= (0..31)
1 1 145 1 1 1 1 1 1 1 1 1 1 1 1 1 1 1 1 1 1 1 1 1 1 1 1 1 1 1 1 1 
##$CPDPRG= <>
##$CPDPRG1= <>
##$CPDPRG2= <>
##$CPDPRG3= <>
##$CPDPRG4= <mlev>
##$CPDPRG5= <mlev>
##$CPDPRG6= <mlev>
##$CPDPRG7= <mlev>
##$CPDPRG8= <mlev>
##$CPDPRGB= <>
##$CPDPRGT= <>
##$D= (0..31)
0 1.2 0 0 0 0 0 0 0 0 0 0.03 0 0 0 0 0 0 0 0 0 0 0 0 0 0 0 0 0 0 0 0 
##$DATE= 1564484920
##$DBL= (0..7)
120 120 120 120 120 120 120 120 
##$DBP= (0..7)
150 150 150 150 150 150 150 150 
##$DBP07= 0
##$DBPNAM0= <>
##$DBPNAM1= <>
##$DBPNAM2= <>
##$DBPNAM3= <>
##$DBPNAM4= <>
##$DBPNAM5= <>
##$DBPNAM6= <>
##$DBPNAM7= <>
##$DBPOAL= (0..7)
0.5 0.5 0.5 0.5 0.5 0.5 0.5 0.5 
##$DBPOFFS= (0..7)
0 0 0 0 0 0 0 0 
##$DE= 6
##$DECBNUC= <off>
##$DECIM= 24
##$DECNUC= <off>
##$DECSTAT= 4
##$DIGMOD= 1
##$DIGTYP= 9
##$DL= (0..7)
0 120 120 120 120 120 120 120 
##$DP= (0..7)
150 150 150 150 150 150 150 150 
##$DP07= 0
##$DPNAME0= <>
##$DPNAME1= <>
##$DPNAME2= <>
##$DPNAME3= <>
##$DPNAME4= <>
##$DPNAME5= <>
##$DPNAME6= <>
##$DPNAME7= <>
##$DPOAL= (0..7)
0.5 0.5 0.5 0.5 0.5 0.5 0.5 0.5 
##$DPOFFS= (0..7)
0 0 0 0 0 0 0 0 
##$DQDMODE= 0
##$DR= 18
##$DS= 0
##$DSLIST= <SSSSSSSSSSSSSSS>
##$DSPFIRM= 0
$$ [...]
##$SUBNAM2= <"">
##$SUBNAM3= <"">
##$SUBNAM4= <"">
##$SUBNAM5= <"">
##$SUBNAM6= <"">
##$SUBNAM7= <"">
##$SUBNAM8= <"">
##$SUBNAM9= <"">
##$SW= 24.9336996594482
##$SWIBOX= (0..15)
0 0 2 0 0 0 0 0 0 0 0 0 0 0 0 0 
##$SW_h= 4990.01996007984
##$TD= 16384
##$TD0= 1
##$TE= 0
##$TE2= 300
##$TE3= 300
##$TEG= 300
##$TL= (0..7)
0 120 120 120 120 120 120 120 
##$TP= (0..7)
150 150 150 150 150 150 150 150 
##$TP07= 0
##$TPNAME0= <>
##$TPNAME1= <>
##$TPNAME2= <>
##$TPNAME3= <>
##$TPNAME4= <>
##$TPNAME5= <>
##$TPNAME6= <>
##$TPNAME7= <>
##$TPOAL= (0..7)
0.5 0.5 0.5 0.5 0.5 0.5 0.5 0.5 
##$TPOFFS= (0..7)
0 0 0 0 0 0 0 0 
##$TUNHIN= 0
##$TUNHOUT= 0
##$TUNXOUT= 0
##$USERA1= <user>
##$USERA2= <user>
##$USERA3= <user>
##$USERA4= <user>
##$USERA5= <user>
##$V9= 5
##$VALIST= <valist>
##$VCLIST= <CCCCCCCCCCCCCCC>
##$VD= 0
##$VDLIST= <DDDDDDDDDDDDDDD>
##$VPLIST= <PPPPPPPPPPPPPPP>
##$VTLIST= <TTTTTTTTTTTTTTT>
##$WBST= 1024
##$WBSW= 4
##$XGAIN= (0..3)
0 0 0 0 
##$XL= 0
##$YL= 0
##$YMAX_a= 140103
##$YMIN_a= -278583
##$ZGOPTNS= <>
##$ZL1= 120
##$ZL2= 120
##$ZL3= 120
##$ZL4= 120
##$ABSF1= 10
##$ABSF2= 0
##$ABSG= 5
##$ABSL= 3
##$ALPHA= 0
##$AQORDER= 0
##$ASSFAC= 0
##$ASSFACI= 0
##$ASSFACX= 0
##$ASSWID= 0
##$AUNMP= <proc_1d>
##$AZFE= 0.1
##$AZFW= 0.1
##$BCFW= 1
##$BC_mod= 2
##$BYTORDP= 1
##$COROFFS= 0
##$CY= 11.3945322036743
##$DATMOD= 1
##$DC= 2
##$DFILT= <>
##$DTYPP= 0
##$F1P= 20.1537800932815
##$F2P= 0.134698688090026
##$FCOR= 0.5
##$FTSIZE= 0
##$FT_mod= 4
##$GAMMA= 1
##$GB= 0.15
##$INTBC= 1
##$INTSCL= 1
##$ISEN= 128
##$LB= 0.24
##$LEV0= 0
##$LPBIN= 0
##$MAXI= 10000
##$MC2= 0
##$MEAN= 0
##$ME_mod= 0
##$MI= 1.114404
##$NCOEF= 0
##$NC_proc= 0
##$NLEV= 6
##$NOISF1= 3.799351
##$NOISF2= 2.8
##$NSP= 1
##$NTH_PI= 0
##$NZP= 0
##$OFFSET= 15.70392
##$PC= 1
##$PHC0= -9218.882
##$PHC1= 13.20097
##$PH_mod= 1
##$PKNL= yes
##$PPARMOD= 0
##$PSCAL= 0
##$PSIGN= 0
##$REVERSE= no
##$SF= 200.130013532006
##$SI= 16384
##$SIGF1= 3
##$SIGF2= 2
##$SINO= 400
##$SIOLD= 16384
##$SREGLST= <1H.CDCl3>
##$SSB= 0
##$STSI= 0
##$STSR= 0
##$SW_p= 3612.71676300578
##$SYMM= 0
##$S_DEV= 0
##$TDeff= 0
##$TDoff= 0
##$TI= <>
##$TILT= no
##$TM1= 0
##$TM2= 0
##$TOPLEV= 0
##$USERP1= <user>
##$USERP2= <user>
##$USERP3= <user>
##$USERP4= <user>
##$USERP5= <user>
##$WDW= 1
##$XDIM= 8192
##$YMAX_p= 0
##$YMIN_p= 0
$$ End of Bruker specific parameters
$$ ---------------------------------
##NTUPLES= NMR FID
##VAR_NAME=  TIME,          FID/REAL,        FID/IMAG
##SYMBOL=    X,             R,               I
##VAR_TYPE=  INDEPENDENT,   DEPENDENT,       DEPENDENT
##VAR_FORM=  AFFN,          ASDF,            ASDF
##VAR_DIM=   8192,          8192,            8192
##UNITS=     SECONDS,       ARBITRARY UNITS, ARBITRARY UNITS
##FACTOR=    0.0002004,     1,               1
##FIRST=     0,             0,               0
##LAST=      1.6414764,     0,               0
##MIN=       0,             -278583,         0
##MAX=       1.6414764,     140103,          0
$$ Real data points
##PAGE= N=1
##DATA TABLE= (X++(R..R)), XYDATA
0 0 0 0 0 0 0 0 8 -8 8 -9 16 -16 24 -32 33 -40 48 -64 72 -86 97 -114 136 -153 177 -202 233 -265 298 -338
30 -338 381 -428 482 -539 601 -669 745 -828 918 -1019 1126 -1249 1381 -1530 1696 -1880
46 -1880 2088 -2327 2599 -2913 3287 -3732 4279 -4966 5859 -7079 8847 -11661 16867 -29828
60 -29828 140103 124351 -60992 70670 96584 -57 -49570 69796 103410 42930 4050
71 4050 19648 -30268 -70842 -46617 -22559 -66320 -58063 17889 39133 -41547 -88553 -73613 -79514
84 -79514 -115273 -98751 -52312 -36555 -43355 -46391 -73128 -108391 -112184 -95482 -93312 -79180 -45007
97 -45007 -30957 -40979 -34518 -29663 -60705 -83707 -50177 -10778 -12000 -4456 43586 66199 29151
110 29151 -1099 11569 18764 10772 31771 69333 77493 74011 85709 75335 37379 32950 62873
123 62873 60363 41931 71445 111409 88541 48160 55298 65574 29978 4828 33678 58744
135 58744 43517 35183 46345 29749 -8502 -15194 -3347 -20262 -32933 -816 21988 -12258
147 -12258 -43513 -28002 -25515 -64742 -80650 -50152 -32509 -45904 -44959 -29556 -39403 -63840 -64583
160 -64583 -55079 -64848 -69675 -41847 -14963 -25324 -43936 -35674 -23793 -37378 -50003 -35262 -11149
173 -11149 -845 1741 3453 4486 6100 7131 2560 -380 11515 31287 40675 38687 35387 36006
187 36006 37064 33558 27097 28175 42296 57284 57242 45495 41397 48482 45370 26859 17601 32996
201 32996 46644 39998 31167 33322 32126 18815 7618 4540 3737 6249 13859 13495 1848 -6342
215 -6342 -4055 -7425 -23254 -31382 -21479 -12493 -18468 -25160 -23581 -23398 -31064 -37209 -39550 -41499 -36304
230 -36304 -23285 -21172 -33245 -36006 -26190 -27806 -41675 -42158 -24786 -13512 -16903 -19072 -14518 -11979
244 -11979 -14012 -15242 -16022 -12998 -2222 10695 10914 3673 7574 17335 12858 855 4233 20107
258 20107 27763 26726 27124 28810 27431 25432 22482 16599 19092 32299 38923 31038 23747 28706 30518
273 30518 19089 9221 13424 20928 20827 19719 19604 15261 9545 7655 2055 -9084 -10411 2225 7824
288 7824 -1633 -8341 -4086 -5335 -18736 -28358 -24902 -16948 -14097 -14410 -16086 -18253 -19006 -21270 -28512
303 -28512 -34603 -30390 -18788 -14327 -17382 -16701 -11998 -12125 -19983 -25961 -24107 -15240 -5322 -1895 -3173
318 -3173 -975 4306 1940 -8339 -11444 -1104 10019 11244 11245 16052 20064 17301 10433 5796 6372
333 6372 12801 19725 22175 21371 23772 26956 21186 9930 5107 9737 15699 17636 17498 18711 19929
348 19929 17486 8569 -2203 -4400 2138 7100 4338 2154 7575 10064 136 -12332 -14757 -10824
362 -10824 -10123 -11007 -7470 -3612 -3496 -6169 -11057 -18897 -24004 -18695 -11475 -11503 -12560 -6271 -516 -5831
378 -5831 -18587 -21413 -14223 -10412 -11275 -9260 -860 4543 1486 -4506 -7798 -8418 -6720 -2482 731
393 731 3188 8820 13874 11485 1876 -3349 264 5254 4482 4720 11947 19927 17755 8278 3369 4541
409 4541 5570 4203 4839 9130 13899 16202 12902 5495 430 464 2083 895 189 5302 11967 10954
425 10954 2426 -3376 -3093 -2692 -5199 -6519 -2698 3006 4813 1103 -4921 -7877 -7500 -7992 -9605 -9163
441 -9163 -3262 2276 1647 -4115 -8109 -8024 -8003 -9566 -10297 -7318 -1135 2538 159 -4783 -6828 -5439 -5270
458 -5270 -7795 -7475 -1807 5101 4632 -675 -3465 -1531 -686 -4139 -5611 -411 5924 7184 4069 1942
474 1942 2252 1501 646 -677 -8 3825 8349 9589 5278 1631 3012 4926 1577 -1576 2191 9611
490 9611 9983 4902 3139 4976 4472 511 -809 1207 4280 5424 5621 3070 270 137 1220 -1138
506 -1138 -4355 -2025 3339 4224 -731 -3837 -1830 -1586 -4619 -7125 -5175 -2139 -104 -1147 -4321 -5891
522 -5891 -4812 -3854 -6277 -8038 -5064 110 250 -4211 -6195 -3847 -3078 -4939 -6608 -4309 -148 1912
538 1912 300 -2363 -2516 -54 139 -2376 -2247 1496 5787 5279 2064 575 2197 2746 1386 76
554 76 2603 6454 8310 5662 2853 3104 3857 2793 946 1697 5094 7398 6476 3409 1257 1007 1315
571 1315 317 -2267 -213 4363 5772 2103 -1908 -1579 -1137 -3264 -5602 -4090 -610 1782 808 -1801
587 -1801 -4300 -4890 -4622 -5279 -7472 -4790 282 2105 -1249 -4708 -3832 -3290 -5023 -7264 -4848 126
603 126 2712 1919 -199 -1749 -1470 -1962 -3440 -4118 -730 4408 6238 3248 1484 1807 1557 -1521 -3136
620 -3136 -107 4488 6830 6127 4430 3146 2163 710 -1039 -1726 737 5165 6473 4392 2433 2249
636 2249 723 -1940 -4604 -2902 1234 3874 4034 2012 886 -244 -2396 -5695 -6096 -2603 1333 2580
652 2580 1066 -387 -697 -1715 -4596 -6808 -5558 -1709 1783 1582 206 459 419 -1950 -6165 -6693 -2157
669 -2157 1496 2259 1878 2069 2067 67 -2964 -4607 -3353 251 3276 3191 2688 3213 3098 498 -3535 -4114
687 -4114 -534 2411 2324 2971 4362 4029 1605 -1238 -3284 -3526 -125 2909 3286 2294 2927 3628 446
704 446 -4044 -4280 -1332 470 669 1616 2732 2723 894 -1410 -3911 -4497 -1676 1112 1141 722 2626 3400
722 3400 -157 -4279 -4670 -2370 -555 -181 619 2190 2530 1318 -1642 -3990 -4065 -1466 -27 -519 358
739 358 2781 2862 -133 -3108 -3256 -2050 -1227 -413 411 1848 3159 2368 -975 -3963 -2630 -55 -460
756 -460 -994 1404 3584 2682 266 -990 -1397 -1426 -681 540 823 1493 3531 3318 295 -2222 -1147 722
774 722 -113 -570 1198 3679 2843 820 -500 -1073 -1149 -461 -169 -355 1166 2910 2000 -971 -1941 -1290
792 -1290 -802 -1462 -1307 172 935 1428 -35 -1670 -3032 -1433 -584 -2331 -2510 375 2130 284 -2588
809 -2588 -1970 -1428 -1877 -2250 -1318 -71 386 1016 328 -1460 -1844 -556 384 -790 -934 1736 3066 1233
827 1233 -408 -26 1006 713 46 617 1526 2382 2987 1887 232 244 1610 1219 33 649 2655 3263
845 3263 1491 236 -294 271 468 115 -452 333 1651 1370 -435 -1660 -1359 -552 -1427 -2024 -1268 -186
863 -186 372 -788 -2042 -2564 -1969 -1563 -2354 -2587 -1172 701 -353 -2311 -2627 -1944 -1193 -2017 -1690 -571
881 -571 616 775 76 -1168 -1259 -124 303 -193 -702 1364 3029 2114 763 828 965 849 462 1032 1879
900 1879 3007 3273 2509 1012 481 1200 1143 674 810 2236 3030 2633 510 88 119 148 -636 -566 441 1451
920 1451 1653 399 -1186 -1408 -1399 -1708 -2126 -1455 177 946 -389 -1923 -2422 -2115 -2218 -2667 -2832 -1432 113
939 113 -14 -983 -2055 -1547 -1510 -1940 -2158 -1383 177 1159 1015 1 -525 -461 -813 -1120 -1296 738 2389
958 2389 2313 1504 828 591 821 110 -157 615 1919 3249 2758 1588 904 1348 882 -392 -222 1178 2246
977 2246 2386 1854 777 1001 339 -438 -1291 -391 899 1641 1060 428 -162 -284 -1037 -1921 -2467 -851 469
996 469 760 -94 -753 -605 -1011 -2384 -2569 -2148 -757 182 -152 -247 -402 -314 -1466 -2676 -2355 -1125 253
1015 253 453 -64 93 290 -143 -1458 -1892 -1027 156 840 622 737 1119 1007 -120 -1063 -1016 -58 1239
1034 1239 1438 998 1309 1707 1174 -7 -867 296 788 1450 1363 1487 1739 1569 545 -430 -482 421 1453
1053 1453 1116 857 1447 1548 1018 -316 -1067 -430 328 660 380 380 771 697 -313 -1601 -1417 -1103 -478 -540
1073 -540 -473 -41 235 -270 -1520 -2345 -1718 -842 -819 -901 -803 -27 -126 -1140 -2096 -1924 -878 -546 -995 -444 -51
1094 -51 561 54 -678 -1127 -580 51 -154 -219 421 1287 1329 366 -304 148 873 1039 895 939 1499 1855 1681
1115 1681 700 515 942 1144 1111 775 1166 1751 1972 832 327 427 916 671 165 472 765 1111 492 -289
1135 -289 -584 -405 -253 -530 -668 -577 -404 -158 -1013 -1507 -1180 -914 -863 -1439 -1564 -647 -500 -1419 -1505 -1555 -1151
1156 -1151 -1160 -1144 -803 -578 -268 -150 -737 -1152 -568 -156 -215 -53 30 803 690 227 132 407 666 832 770 820
1178 820 1139 1390 1495 871 289 684 1329 1381 854 1314 1784 1593 1035 138 543 769 736 680 644 1061 870
1199 870 638 -185 -436 -281 -248 112 -323 -131 106 133 -831 -1115 -1322 -777 -648 -892 -847 -389 -348 -1068 -1359
1220 -1359 -1427 -1064 -1054 -890 -720 -510 -111 -159 -528 -1166 -949 -622 -448 -495 -438 502 698 393 -292 -584 84
1241 84 520 113 420 893 870 979 544 173 13 472 754 517 715 1297 1309 808 138 285 435 474 610
1262 610 479 368 1112 817 203 -308 164 119 -65 17 173 402 551 -20 -657 -553 -581 -655 -602 -567 -245 202
1284 202 183 -110 -912 -846 -711 -908 -645 -326 204 -172 -454 -848 -848 -599 -600 -794 -645 171 428 174 -291 -337
1306 -337 -421 117 -255 -510 -160 673 755 220 176 118 -132 -214 -283 -222 588 743 679 353 241 115 344 18 -115
1329 -115 490 1085 865 861 392 235 462 211 -123 -6 741 681 701 646 351 -15 -74 -349 -507 160 255 641
1351 641 134 -14 198 -298 -395 -850 -495 -373 -64 54 -169 -198 -489 -565 -978 -951 -662 -355 -21 -318 -224 -535
1373 -535 -547 -626 -904 -899 24 451 -216 -188 -88 49 -31 -478 -264 67 321 694 490 537 388 203 535 -22
1395 -22 327 480 839 519 404 351 796 343 82 201 541 768 452 615 560 419 355 102 44 -173 147 315
1417 315 257 31 251 261 -275 -680 -450 -11 -80 -296 -575 -175 -259 -441 -335 -688 -629 -480 -385 -586 -381 -224
1439 -224 -245 -420 -612 -688 -292 -279 -148 -489 -236 304 46 -190 -151 -281 155 230 42 256 377 412 347 -110
1461 -110 390 633 409 400 288 563 512 337 141 6 201 728 321 618 176 494 463 7 145 54 320 313
1483 313 238 155 34 117 -153 -266 -193 -223 -11 -282 -18 -124 -59 -445 -586 -600 -208 -136 117 -338 -12 -43 -249
1506 -249 -212 -316 -111 -343 28 -142 -253 -136 -180 -196 -456 -380 -52 46 -3 158 475 194 -82 -283 -415 -59
1528 -59 -101 168 199 303 306 404 284 204 -61 213 213 228 248 187 336 347 58 100 -5 361 232 454 431 519 305
1553 305 28 -20 -76 23 97 162 426 55 285 201 -70 -203 -166 -111 -92 -25 12 37 135 -149 -517 -291 -395 -353 -437
1578 -437 -191 16 -171 -92 -306 -196 -160 44 -183 -127 -22 118 120 116 -368 -102 -358 164 -191 45 130 287 149
1601 149 128 -62 -273 -319 42 77 151 373 179 -53 15 132 244 183 83 -119 221 621 546 -250 -147 -98 130
1624 130 168 -36 162 507 -41 -55 150 136 -184 -15 67 252 -174 186 26 -187 -32 -496 -239 -205 -52 -72
1646 -72 60 238 -266 -367 -118 -265 -198 -491 -160 -32 199 133 -151 9 -416 -17 -234 -135 -22 148 209 80
1668 80 100 -25 163 -118 -63 76 248 478 333 358 99 107 170 -206 117 328 287 169 181 195 135 1 32 -42
1692 -42 149 277 117 156 677 -194 18 141 -95 -200 9 249 126 102 133 -359 -55 -140 -313 -450 -247 -169
1714 -169 -71 -164 -291 -161 -189 -294 -263 -183 58 -188 -266 269 -277 7 -285 -184 -296 379 144 303 235 -31
1736 -31 -69 -165 276 4 186 513 194 203 -91 52 127 114 -87 258 387 102 147 56 180 -86 193 -15 110
1759 110 224 313 -54 -137 186 188 -129 -163 -8 -101 -217 210 -50 153 71 -282 123 -448 -193 -143 174 -155 -234
1782 -234 -125 -467 214 -43 -205 -277 -194 170 -106 -36 52 195 -214 -62 -129 -57 102 -85 -80 22 59 -126 -305
1805 -305 -51 206 132 -93 106 31 125 213 -30 -213 -355 205 67 121 3 178 128 -125 -66 -35 38 44 -95 -68
1829 -68 58 -17 -167 -85 12 -238 140 99 175 177 -91 15 43 -84 118 -39 558 162 74 257 -72 -132 18 76
1853 76 -103 276 88 -46 -384 -96 -258 -17 -43 60 242 1 231 -34 228 103 -75 -26 -406 -35 230
1874 230 -75 -46 97 322 -242 3 -337 -347 -121 70 618 93 -89 63 -185 -23 207 121 188 231 363 -75
1896 -75 131 175 -49 -72 14 -4 49 394 70 73 50 95 -99 54 27 17 47 -192 -213 -19 59 -273 -333 140 4
1921 4 73 -146 -290 118 -111 180 -88 -182 -178 -100 -165 63 -242 -231 -402 -328 -256 -115 -83 217 -314 -24 126 102
1945 102 29 293 22 -170 286 193 -58 168 165 0 -205 127 273 53 -53 -132 193 -189 25 -120 -12 -156
1967 -156 486 -29 151 52 86 391 -19 -259 88 -152 41 89 7 -12 50 -103 -78 -207 -41 103 -132 -214 -8
1990 -8 149 -91 -210 -256 -427 -292 428 -84 -187 -230 -62 -24 133 32 -82 -211 -194 169 4 -75 325 38
2012 38 -287 100 -146 -46 -491 -178 -71 60 400 -71 -45 -14 6 80 173 93 171 63 120 -68 -94 -131 81 44
2036 44 -84 -246 306 -96 -133 -59 44 113 315 19 224 -73 1 79 -30 -44 -98 3 68 3 -66 75 427 -212
2060 -212 -39 126 -117 -74 -434 203 -50 -35 83 -112 -151 12 93 87 32 -294 -13 -154 249 -398 49 -101
2082 -101 152 -57 293 195 226 -221 -128 -208 34 88 108 -218 70 205 -127 68 55 -113 35 36 -236 281 146
2105 146 -101 5 -87 50 -77 149 60 115 47 77 76 143 64 -47 -151 93 -169 102 0 -18 -230 -17 159
2128 159 65 -57 76 14 -142 63 -169 -171 156 -215 -102 -368 -31 366 -262 70 -101 138 108 -51 -205 -108
2150 -108 202 -26 140 -45 -464 146 -37 -23 307 8 243 -27 -96 -30 -44 19 121 -174 -64 142 148 210 -231
2173 -231 138 -226 108 19 16 255 217 -48 130 272 -126 20 56 73 -189 209 -45 -10 -160 -94 -111 -4 -57
2196 -57 -69 59 -72 48 106 -207 78 -3 -58 14 79 19 22 -5 -204 -244 -201 -222 -461 -66 -145 83 365 334 4
2221 4 392 247 -238 -183 233 -76 -51 66 -211 77 244 -100 -112 149 62 255 -172 337 74 -15 134 189 9
2244 9 -39 102 88 111 0 -21 308 18 -116 -85 -114 140 -6 -165 -12 -55 -31 -168 -105 -29 -346 -134 -188 -12
2268 -12 -191 176 -304 14 24 1 -5 138 -137 -147 220 -157 -54 138 122 -78 67 -191 306 -33 180 142 44
2291 44 -187 -222 -14 -237 151 -16 -77 199 3 -221 -30 305 78 -11 252 368 -101 -18 -66 -301 70 43
2313 43 -291 112 -40 206 96 245 -97 108 276 -158 -21 -28 60 -222 130 -80 -289 -179 10 61 -153 -134
2335 -134 201 2 -75 17 -330 177 55 -18 -105 137 188 35 49 158 86 150 6 -1 155 129 217 -15 -105 47
2359 47 25 296 -145 120 113 -41 179 -98 13 -259 101 -294 102 -97 266 95 62 -274 227 -130 -164 -70
2381 -70 -171 141 171 -142 63 190 55 -28 -72 174 -426 -96 -66 -133 -60 112 114 201 -36 -280 47 -100 64
2404 64 -182 -241 -104 114 86 111 95 239 -34 -346 -171 -121 23 -289 -251 27 268 178 471 93 -378 110 -14
2427 -14 251 -289 26 -63 219 -70 -90 100 -153 253 8 105 231 63 338 -90 -78 306 -38 230 196 155
2449 155 96 166 164 70 250 137 25 75 -24 -66 -152 29 -60 -70 -264 -382 -117 -133 97 -13 -256 29 -28 187
2473 187 -110 -54 35 170 -42 -299 42 -265 21 -47 -90 -70 139 339 158 -94 -30 -119 194 -144 374 -3
2495 -3 46 128 94 204 82 48 -179 -54 -71 59 82 38 37 2 37 33 -195 -10 246 -56 -35 -56 11 95 -112 0
2521 0 133 120 315 -86 94 38 115 56 -59 83 -129 -46 -270 143 21 -72 -307 107 -91 -429 -291 21 159
2544 159 -112 37 79 -130 74 -232 68 118 2 190 -10 252 69 -336 104 -285 -44 94 -37 -145 -82
2565 -82 -9 -215 -1 97 -127 190 223 63 -29 -82 2 -120 -85 111 340 -112 158 -44 270 -70 -17 -104 -78 42
2589 42 -93 -18 -94 -55 -76 -1 -51 201 -110 80 -49 -41 45 -107 240 -41 -301 187 -72 -253 31 137 13
2612 13 71 -26 -88 198 -197 -137 199 329 27 -14 -64 127 -119 -167 62 -51 221 25 26 -123 79 178 27 -366
2636 -366 -7 361 77 -165 352 103 27 124 13 -107 292 231 177 42 -79 121 -189 106 -48 293 -93
2657 -93 -229 43 142 9 190 78 141 81 -75 -10 18 205 157 112 277 215 168 -29 57 123 -87 99 41 83 -184
2682 -184 -91 81 39 -41 96 109 202 192 -24 88 94 195 170 -94 -198 -9 4 148 -17 41 68 245 157 -93
2706 -93 -235 -24 147 121 -122 -37 -161 31 -15 -100 -63 3 267 -335 90 -113 -150 22 10 7 180 180 -1 -122
2730 -122 -135 305 228 25 88 14 54 -83 76 -109 -86 209 -139 147 -298 277 67 109 130 204 76 146 324
2753 324 211 86 96 162 -158 10 -201 -88 454 -144 -189 -126 307 44 176 -143 -351 -97 -107 186 40 -55
2775 -55 378 -54 -317 -445 -178 -109 -52 -21 -123 94 57 318 -155 -48 243 251 16 135 -217 -163 74 -119 244
2798 244 172 -125 -31 119 206 110 -95 6 264 -268 55 -130 -53 -330 -41 15 299 101 -162 119 -3 37
2820 37 67 -19 -146 285 -152 -135 -140 -116 -7 -287 41 -8 235 -258 -136 76 228 -111 -270 -259 254 341 -157
2843 -157 -63 -149 50 297 41 361 179 281 -46 -87 14 61 20 -12 41 274 118 -145 194 -138 -117 338 153
2866 153 -174 68 -76 450 89 -140 174 105 133 41 58 143 122 98 -55 2 -140 -148 -55 -91 -199 160 136 51 135
2891 135 -34 -166 -88 91 82 94 226 237 137 -244 58 -98 -63 -103 -113 178 -214 -53 -309 -241 340 -44 -121
2914 -121 -35 -194 195 -10 108 -24 344 -88 -29 46 -174 88 76 -109 103 56 -79 24 278 89 212 -37
2936 -37 -170 -172 -28 84 88 21 463 39 202 -261 -81 126 162 -208 -45 323 -173 160 100 42 -272 -103 -206
2959 -206 -146 -283 -45 -169 148 217 233 -34 13 53 137 41 10 -315 68 -45 51 -141 322 126 -12 213 -50
2982 -50 35 -133 62 113 -169 -134 -366 -8 -192 95 7 -258 -52 243 68 -73 -23 159 -348 -8 300 17
3004 17 16 -199 -160 112 -183 -154 206 129 59 -70 -83 261 -114 -3 -89 194 444 -123 164 -46 42 -20 195 217
3028 217 42 36 143 -323 91 141 171 256 136 38 84 92 264 27 101 168 -60 118 -109 -20 -186 49 43 -184 -283
3053 -283 -99 9 -184 121 -76 -61 -94 -34 -52 -128 271 147 105 -9 -185 25 -145 140 -237 80 156 -52
3075 -52 51 265 306 143 -19 -23 85 65 -34 264 159 -86 70 18 61 190 205 48 -148 -187 25 62 30 -267
3099 -267 -201 -37 -64 18 -63 -143 32 -100 259 155 -3 188 -94 -37 -232 -71 -33 -24 -84 -190 -126 124 -40 -11
3123 -11 345 131 -77 28 217 75 22 -7 -86 -117 6 -203 -7 -18 -116 -164 -67 69 -134 71 162 99 135 229
3147 229 -288 -133 -131 -149 107 -60 94 81 93 134 -144 76 -37 -71 54 -138 -45 55 -114 -127 84 -78 122
3170 122 399 -110 -243 -178 29 -20 328 205 18 -18 -40 72 -46 121 -38 236 -45 -282 -8 207 -38
3191 -38 0 -63 29 134 -81 -159 -306 212 76 -46 -186 -2 -5 164 111 -174 -95 -35 150 62 2 67 -253 57
3215 57 140 -156 -89 158 268 -86 115 -147 141 329 120 138 114 -162 -131 -49 -360 -268 -79 -115 -127 -73 -88 214
3239 214 189 274 182 -15 -47 5 -190 109 122 -106 70 85 112 285 32 39 -134 -59 -115 -444 -123 98 -322 -93
3263 -93 150 142 55 76 331 -16 101 -20 -72 -46 -19 -52 53 -30 73 46 127 -173 -240 126 -111 150 -102 180
3287 180 102 -202 260 -115 128 42 167 -136 -205 -35 -343 -59 101 -52 38 9 41 -315 1 100 -41 1 224
3310 224 116 38 -46 -27 326 59 -135 1 93 -84 1 65 105 -16 117 51 -156 -76 -21 -224 312 -291 -102
3333 -102 26 -65 81 25 367 46 -169 221 48 -121 -112 -132 -469 120 -245 49 57 -72 167 35 100 -147 -7
3356 -7 -68 232 -52 -106 168 -122 -319 3 -91 101 -113 121 72 94 -76 -102 -93 -45 175 224 -17 156 -118 -30
3380 -30 73 3 14 -37 58 163 -14 -305 250 231 221 15 -75 -46 337 -136 14 175 -135 58 120 -166 110
3403 110 -173 -176 -88 18 122 -351 -115 -200 155 77 -115 164 57 -40 58 -7 21 49 -172 -101 283 160 260 -43
3427 -43 255 -36 -165 -150 84 79 -51 33 129 252 -432 90 -238 -186 26 98 96 429 121 68 -41 147 111 241
3451 241 335 8 -265 -323 14 -145 160 -43 -249 -173 -5 -189 -49 9 60 21 -164 26 -144 3 83 186
3473 186 26 -108 -158 190 -23 37 256 -64 -48 44 127 -76 -186 82 -107 -237 -126 47 -1 -41 202 175 122
3496 122 -255 27 -154 44 -129 75 -32 -94 58 -2 88 314 25 -142 -11 232 -258 215 28 -250 289
3517 289 137 143 238 41 -232 133 -82 -111 127 4 -78 259 2 108 -152 -211 64 4 -54 226 192 5 61
3540 61 -141 71 -15 -163 90 81 6 -175 83 -55 121 73 122 -20 -204 211 392 13 215 101 -223 73
3562 73 24 -159 -184 85 173 -310 141 42 2 160 -271 305 95 86 -155 206 -23 -75 -36 136 -200 -47 100
3585 100 146 136 -98 -54 -29 -201 2 43 170 -3 191 -153 86 -75 55 8 -267 238 52 -116 133 61
3607 61 169 255 -129 141 47 171 134 197 74 31 -18 289 -141 55 -148 -56 39 -117 120 101 114 -61 144 -77
3631 -77 -16 -244 -65 134 -378 -56 -114 263 132 -303 253 184 221 -234 124 239 -254 -96 270 -97 -340 -251
3653 -251 331 -85 -202 275 67 16 206 -2 157 231 -138 45 -146 35 -297 -278 48 -259 27 67 -137
3674 -137 371 -160 313 88 386 -56 -40 133 -226 -55 -139 -153 -139 49 361 15 74 117 262 -24 -51 -79 -165
3697 -165 311 68 269 -95 -72 102 -14 -61 346 -15 -161 341 -321 176 -84 -33 101 106 -134 118 -171 72
3719 72 82 88 172 15 331 -149 -145 8 104 -52 106 -8 64 -190 209 -259 -55 114 -160 -26 70 -138 -63 -61
3743 -61 -39 150 121 94 -148 129 60 -178 -46 -185 21 -14 -366 -44 -131 69 -328 -196 -131 -185 45 182 -30
3766 -30 47 -109 -184 -57 -24 -281 51 -53 40 -90 152 320 -49 282 120 48 10 155 433 -38 -301 -57
3788 -57 -181 -1 105 -180 59 15 169 343 102 -232 69 -8 2 -298 55 -9 -282 -10 71 -1 -121 -38 -96
3811 -96 -141 105 -11 298 166 -188 -82 -126 194 409 132 21 -205 106 353 60 114 -122 -157 -108 88 73
3833 73 -30 244 93 314 210 -95 323 51 226 168 -37 112 -98 80 -227 -273 -82 -1 -128 -13 25 -12
3855 -12 -47 123 197 267 145 197 62 35 130 345 105 -31 62 212 -111 -289 73 11 -11 -185 171 -48 -53 162
3879 162 -18 129 -46 -20 -105 -63 154 -127 312 -107 -284 -182 78 174 -8 196 105 33 -196 -89 -53 247
3901 247 -75 166 -238 1 4 -132 201 -277 -91 -89 178 54 -9 298 230 -2 13 -66 239 -97 28 133 36
3924 36 156 189 -170 -95 195 -10 -17 -93 -232 228 175 -66 -238 -88 -45 65 -124 169 -47 46 -339 63 153
3947 153 -257 -18 31 -15 -182 294 46 240 106 421 -88 137 126 243 212 96 85 -200 90 116 26 -15 -75
3970 -75 -168 -204 -87 116 80 91 -53 136 -22 190 108 -274 -190 -15 171 28 145 -120 -162 169 -34 -230 413
3993 413 -175 96 -355 -23 -121 71 -350 159 -158 -133 131 -17 264 -305 -280 -177 60 -35 77 -45 125
4014 125 -141 16 -82 -16 -71 323 84 276 -45 -46 223 -192 58 -336 -75 -31 -103 -79 -182 75 -103 -122 -150
4037 -150 -100 41 -197 191 -225 7 -171 -104 -16 -135 160 81 270 30 -195 -80 -103 141 15 -217 -174 -204
4059 -204 184 -286 -41 89 -51 -226 75 -220 -67 34 -63 9 53 40 -139 121 -29 170 -147 -333 -14
4080 -14 188 11 -203 169 -93 -28 -66 39 -72 -98 239 181 -84 23 135 57 -127 -265 346 -119 -49 -37 -24
4103 -24 75 200 178 38 37 30 52 -200 77 -143 -85 106 128 9 249 34 -27 -153 -23 -226 16 20 -129 28
4127 28 232 71 -188 358 244 -16 119 78 -28 97 28 -156 52 -144 -62 68 305 126 -227 111 -278
4148 -278 9 113 -97 169 73 190 -281 -89 308 -43 67 -194 70 146 -196 -152 -363 250 -29 193 27
4169 27 -144 94 -157 4 41 -30 156 -158 -19 -191 -68 39 81 -25 -151 237 50 120 -129 -47 19 -178
4191 -178 38 216 -28 -164 -173 297 71 -226 135 104 95 12 145 45 -10 -124 45 187 214 81 79 4 -11 -38
4215 -38 125 -25 -35 -43 106 22 132 1 181 -26 92 65 36 35 -82 141 -262 37 -53 -96 -25 47 144 17 -29
4240 -29 -258 -150 146 171 111 -95 136 -148 83 84 -92 -125 14 -293 -35 255 185 -248 38 -39 -288 -25 22
4263 22 -84 -162 146 -232 14 336 89 16 368 220 64 208 114 -151 241 -138 -344 160 92 -126 76 -245
4285 -245 -229 -139 -430 -33 50 -17 142 30 -110 69 197 48 -152 75 -351 9 -31 -11 -239 -136 272 -113
4307 -113 105 10 25 -46 -439 -164 310 101 -176 -99 -10 53 -139 79 306 -33 -70 73 200 185 81 5 180
4330 180 45 122 -46 232 -306 46 -14 103 127 -17 -83 -55 61 -101 -106 -34 -142 -371 11 58 159 221 130 126
4354 126 91 46 87 190 48 -232 -51 -131 -65 87 3 -241 -22 -251 70 -3 -46 -100 62 -46 -57 44 53 31
4378 31 213 -79 271 -174 234 -204 -399 -128 -28 48 -129 118 4 208 -148 407 -186 -142 -56 -106 -148 118
4400 118 115 -116 204 140 -84 48 120 -57 37 59 290 -10 -130 32 -141 233 -114 -25 47 -60 -65 -83 -121 -350
4424 -350 -259 -7 -195 156 -114 -43 91 121 80 81 139 164 361 -95 -246 287 -28 -213 -103 70 -117 39 200
4447 200 30 91 45 -95 196 -96 -119 94 78 -41 116 -11 28 101 -25 1 -30 35 -28 29 -20 122 104 37 -152
4472 -152 427 -103 -58 -107 -9 -104 -22 0 35 107 79 -174 63 -55 50 -41 -181 -94 -142 -26 -367 -24 -8 -53 71
4497 71 -58 197 150 -32 -203 -132 -24 101 151 31 -56 -42 117 -14 58 -114 255 -55 7 233 -64 88 -30
4520 -30 64 -125 -126 -69 96 22 435 -8 -111 44 89 -183 137 -238 -25 -57 -81 100 -31 51 33 145 140 -17
4544 -17 -4 -4 -122 -110 46 244 37 147 -64 125 -36 196 -62 -255 48 186 83 -74 159 165 -143 -39
4566 -39 -74 -25 117 -304 -67 -128 -132 -210 78 -78 -252 -159 179 63 -137 270 223 28 264 41 277 -12 237
4589 237 35 -63 34 117 -131 -236 91 153 92 28 327 61 116 -61 -78 114 146 -93 -50 -63 -7 -20 83 75 73 -137
4615 -137 -126 -15 89 171 -97 23 -136 290 72 -176 -86 104 -211 102 -42 -53 13 -4 -40 229 295 284 -149
4638 -149 -41 -59 -150 -76 51 179 -222 115 36 79 -4 -22 -121 101 -206 -67 91 -178 93 -110 -148 34 23
4661 23 89 64 258 -78 90 -55 -89 -223 -59 -83 71 43 -191 -113 -24 37 331 107 -140 80 244 -53 -383
4684 -383 -46 -31 -22 -212 -40 34 -93 261 166 -161 227 24 30 -67 -68 -248 -108 389 225 -97 -248 -9 -164
4707 -164 -312 63 94 34 19 295 -82 -40 447 43 -401 -42 -240 -72 -189 319 -220 62 136 68 -164 142
4729 142 81 155 177 102 -34 256 -1 75 55 -53 101 -61 -139 -15 -145 -10 -104 139 35 80 165 261 147 43
4753 43 -80 14 50 124 -25 139 39 -235 -39 -107 -8 47 101 51 258 62 26 -280 -175 -210 -140 -174 -365 -258
4777 -258 -144 213 -86 101 -245 -141 -105 -53 -74 134 -19 20 -117 -227 107 -148 -206 37 171 -8 40 60
4799 60 -197 147 -11 367 125 -185 166 100 89 240 123 120 -44 8 -82 -41 232 176 71 -195 297 164 -103
4822 -103 -180 35 115 59 -159 -254 -92 160 -57 59 -76 -13 30 111 -8 135 362 289 -158 -139 118 54 122 -44
4846 -44 178 -148 95 92 -174 5 169 -7 19 -66 -150 -68 -220 -153 -81 128 -55 -14 -80 57 40 -36 -144 63
4870 63 52 153 -17 33 -92 -60 -55 10 139 131 134 39 44 -146 -242 19 -16 119 111 -133 -183 97 31 -78 -170 137 -187
4897 -187 124 -15 110 -32 -172 17 -53 58 -130 -31 138 -71 -26 112 -68 114 -40 26 -63 154 206 -86
4919 -86 -81 244 -88 -24 -145 70 -80 -106 140 198 123 138 41 -77 333 -222 -82 -99 209 13 64 153 30 249
4943 249 124 139 -129 -139 29 115 228 66 223 114 -24 297 -113 227 209 -152 -49 13 161 32 -88 1
4965 1 -13 62 131 51 -40 -306 160 192 22 222 -253 58 63 33 -44 -31 326 -145 -42 187 289 -4 -159 -131 17
4990 17 6 113 143 -243 107 99 131 244 187 189 61 -21 -361 -121 -70 73 326 -189 -2 -121 -200 -74 42 -160
5014 -160 8 166 86 -136 -223 -85 35 -30 107 -16 -28 -190 22 137 119 -223 81 -101 49 277 -201 49
5036 49 -160 123 7 -185 277 -247 110 76 -168 209 95 136 -111 147 193 -92 -44 -57 111 -213 315 138
5058 138 142 -52 -43 377 -183 0 123 169 -128 115 -75 107 46 207 395 27 158 190 -82 107 442 -158
5080 -158 194 -54 -116 -23 -153 212 -127 17 -100 187 6 187 66 282 -136 65 58 43 -4 86 -62 -199
5102 -199 -137 -137 -261 21 -8 -12 245 -216 0 126 240 27 49 42 -42 -155 249 -198 74 -39 260 181 -120 89
5126 89 93 16 334 -80 211 -159 23 89 233 20 118 -178 -29 372 -291 17 82 236 143 -96 72 -160 73
5149 73 -165 21 384 -77 3 167 0 162 282 7 125 19 399 8 -180 40 -254 -108 149 -63 298
5170 298 -188 -20 -19 -106 7 148 -262 -116 -12 -229 72 154 -114 30 75 19 222 7 -26 138 52 -138 181
5193 181 -93 -125 -140 194 -91 158 220 172 -43 -228 104 -143 -135 -160 26 118 163 -13 174 245 -125 -12 248
5216 248 -66 62 56 -28 -117 -34 -92 135 47 143 -25 -110 -200 -90 55 -110 222 -60 119 -169 231 7 166
5239 166 218 28 -184 282 -8 10 -68 268 75 77 50 -161 -65 49 -47 42 -21 -278 -14 -147 186 137 97 -212
5263 -212 109 21 -162 392 -132 116 -201 246 93 35 87 147 348 324 -79 -89 131 -6 -204 -83 158 -232
5285 -232 -185 -75 -92 -75 -51 -115 212 100 94 -282 -45 33 38 226 -54 85 -79 -224 -118 68 14 -24 264 95
5309 95 199 -34 17 124 220 46 -28 135 -11 -78 151 192 -242 -2 272 62 41 -2 4 54 159 -35 109 -2
5333 -2 77 364 131 -223 121 143 -227 400 -134 -113 -139 -169 44 108 73 6 -75 187 -71 6 -178 -185 45 190 223
5358 223 48 -80 125 -31 28 227 82 -155 127 -197 -417 76 -61 178 199 -20 -6 311 201 113 85 -94
5380 -94 161 -17 34 316 -179 204 190 68 -93 -163 -195 55 193 30 189 -22 177 29 -99 -58 241 83
5402 83 237 -55 -161 -63 -104 -41 -23 -100 -17 -150 1 188 95 -44 370 -196 170 -158 -17 -13 49 -219 113 -151
5426 -151 148 -16 56 119 -127 59 -147 -147 311 192 -7 -14 215 240 -168 -264 111 27 87 -41 267 -219 104
5449 104 5 -236 18 177 275 139 336 53 -40 -28 62 -96 371 67 355 263 -99 -24 19 -397 288 29 -99
5472 -99 297 -7 252 53 31 -160 -316 179 -76 13 109 96 -213 -65 -5 -196 136 86 -42 161 48 125 64
5495 64 -23 -15 -204 98 183 448 26 227 36 456 -84 -141 -119 109 165 -54 220 -113 -71 -81 163 -164 84
5518 84 -83 -101 -131 54 37 197 -293 59 -232 -3 62 -27 191 -97 60 233 -22 -135 -323 57 50 -23 -95
5541 -95 -1 340 320 -66 -238 -152 -222 -39 214 -64 -16 157 183 -315 181 -37 -27 -144 130 150 -176 90 -5
5564 -5 46 153 25 -31 151 23 52 160 -97 -415 -15 30 -188 -272 -34 -195 -94 -218 -29 -65 76 -17 -206
5587 -206 -134 -146 180 39 63 132 61 132 214 128 -40 32 60 -17 -79 195 15 -303 -174 135 59 -52 107 53 -63
5612 -63 -173 162 217 24 -68 46 37 -173 225 23 207 87 123 306 120 0 82 -138 -64 62 -112 -190 -139
5635 -139 -18 -23 -112 -27 60 33 -92 -180 85 34 -177 77 64 -180 -263 -102 57 18 170 9 -139 128 -17 -43
5659 -43 -173 -181 -209 -48 -75 -28 -35 222 -260 96 -166 -23 152 -71 42 -223 -146 -186 -210 81 155 130 -45 -33 -9
5684 -9 20 -62 -197 113 -109 20 -83 -41 -114 9 146 166 19 18 -67 9 58 11 297 -86 -102 84 -191 91 26
5709 26 -112 135 21 -61 124 -233 74 100 352 -184 1 -34 -184 -310 -91 56 30 -104 19 155 191 265
5731 265 -169 193 -78 -132 -73 -89 -18 5 -52 67 226 21 184 37 -95 -71 57 -66 24 -49 12 -67 41 -4
5755 -4 25 114 -148 -341 104 -150 56 -42 0 27 30 81 60 106 258 7 -52 -41 57 56 -258 236 -66 183 -124 252
5781 252 108 30 -137 84 137 -39 93 -66 -37 -264 -15 52 81 14 -92 202 -143 13 -215 287 -305 -25
5803 -25 -355 114 -46 -159 -41 -154 -325 253 126 -56 1 84 71 112 186 -6 -58 -119 226 -191 239 27 -67
5826 -67 -174 -192 79 91 -118 -43 -56 -271 26 -29 -67 -28 72 -9 -109 -78 -51 -148 5 3 28 -19 -102 97 -236 -64
5852 -64 33 -20 61 104 -154 324 5 -138 -178 -71 57 273 -107 81 -87 -112 -176 -75 118 -11 97 279 19
5875 19 -17 56 -176 250 -7 7 6 -87 -35 -110 189 4 -163 -383 -13 -56 90 138 -51 163 -124 -265 -34 -87
5899 -87 -38 -153 159 -225 168 -3 -149 -23 -282 -141 -123 16 109 215 -132 281 -147 -207 67 115 167 214 276
5922 276 -1 -336 -49 -64 -218 168 4 -278 56 230 -62 -184 -36 -132 -40 219 -190 59 -22 -294 5
5943 5 82 -292 -57 95 275 91 82 233 -45 -199 -44 28 15 83 -253 -1 -69 -227 -120 -100 13 -45 162 -134
5967 -134 -51 -86 -204 -153 -269 -101 -394 -58 -31 74 88 19 -175 -157 -82 140 61 -118 -149 -203 -295 -236 -230 62 24
5992 24 316 294 -144 85 -40 -206 50 334 101 -40 369 44 17 53 -99 -77 118 -16 248 138 9 -83
6014 -83 140 -128 54 -111 -245 -29 -233 -73 13 -192 148 -13 -47 305 -348 12 -17 -163 -168 130 -72 -2
6036 -2 -208 -271 63 22 218 -77 -254 63 132 -29 82 146 172 -207 -319 146 -118 -27 8 -69 65 53 194 237
6060 237 70 88 -148 160 118 -116 6 45 23 -274 -27 107 -32 71 256 29 158 107 160 -28 74 48
6082 48 -118 -58 -375 100 160 210 -44 -30 -32 -227 -70 -132 -75 113 -89 -39 66 -261 -108 -11 -196 -30 -38 -41 -102
6107 -102 -210 8 87 173 -464 138 -291 -45 145 131 -89 -220 293 -108 18 -154 45 -12 8 -27 -22 -120 124
6130 124 -185 28 118 -67 -153 47 58 150 18 -129 122 -173 0 -43 46 -147 -81 -167 -92 -107 -74 -232 65 49
6154 49 -112 29 -20 -283 20 -85 -29 52 -37 187 91 289 -33 -239 101 190 117 -250 141 -64 33 287 102
6177 102 -31 211 -192 -58 68 37 262 -34 -84 -97 52 -330 20 75 -120 -18 100 86 -40 -133 -3 85
6199 85 -15 -42 -90 -1 -136 -318 -154 -33 -81 43 77 89 -189 -152 153 133 -266 157 154 31 -37 226 -84 99
6223 99 54 -8 -275 378 -59 225 -2 293 227 300 -72 67 102 51 -9 -158 -14 -45 -6 263 -294 170 -106
6246 -106 -297 -68 -137 218 43 100 55 59 -52 113 -113 -80 14 -87 140 -334 -40 63 75 -81 187 -123 -128
6269 -128 -14 -92 2 277 363 -4 187 361 -309 -61 -80 -46 90 167 -89 181 56 88 -205 322 -37 -118 -219
6292 -219 -91 -95 117 187 142 61 -18 100 -302 24 28 139 -126 -267 96 -262 -87 -90 -33 -74 110 -121 14 33
6316 33 14 249 -68 155 -432 118 -206 -112 84 35 -161 -410 -121 165 -46 -63 -135 -117 -98 94 -52 -107 98
6339 98 -46 -39 359 261 -113 8 -13 152 78 139 27 200 228 -47 170 154 -2 -156 -55 27 -278 109 -29
6362 -29 41 150 86 -13 128 -107 184 -16 -34 -41 -187 20 117 -158 29 -85 168 -164 -43 -51 -7 78 -63 -94
6386 -94 -163 17 -77 108 157 14 -184 109 183 -157 15 -146 -297 -165 115 -84 140 -56 151 -67 55 2
6408 2 71 152 166 -132 -32 2 258 220 84 -34 -44 181 59 -65 -23 -217 41 74 30 29 -95 5 51 -57 63
6433 63 -75 -31 -112 154 181 -37 -156 -332 151 -244 57 167 63 -187 -88 110 268 153 100 16 236 137 -44
6456 -44 -99 48 -42 118 123 -19 -39 -353 101 -66 -104 112 -42 95 403 -10 -243 362 -96 53 -60 86
6478 86 -91 -36 206 213 392 37 -70 -201 -28 56 21 -207 -210 98 110 43 111 -62 -289 194 7 -157 -11 48
6502 48 277 -198 228 180 36 277 19 -120 147 -91 -447 -66 34 -245 23 4 -206 54 -191 168 -63
6523 -63 155 86 11 11 140 -96 -2 -143 162 95 -79 -101 196 -12 126 127 -2 121 1 240 238 -23 -90 143
6547 143 -228 106 -207 -17 -196 -96 163 83 69 93 285 104 135 119 170 344 232 -15 79 -107 64 284
6569 284 -148 14 -79 -136 202 68 -166 -137 73 -66 -133 -144 -378 67 -123 -44 91 -199 -114 -296 -221 105 18
6592 18 144 -161 107 287 -102 -218 187 -142 168 143 219 -110 122 -22 160 -11 -218 -239 -139 59 114 133
6614 133 4 -171 91 362 40 -86 -27 173 -51 177 -117 -45 -228 86 -26 225 -275 111 56 144 -88
6635 -88 1 -77 -199 -91 -104 -24 65 195 -11 39 -289 73 -150 -48 -35 -22 224 121 101 202 -246 -208 -137 228
6659 228 51 143 117 -4 -7 -55 320 -122 89 -42 -112 18 78 -76 31 -113 -66 62 65 -100 -219 210 -167
6682 -167 118 90 -55 -53 -248 -39 153 267 25 -303 -44 -185 22 -406 169 -75 -160 288 -52 50 123 175
6704 175 -82 -106 -238 52 57 -13 103 31 -30 -109 249 149 120 22 260 171 71 -83 -63 39 -143 77 20 -155
6728 -155 -15 -65 -8 76 -97 37 -96 -198 -22 -312 202 39 -111 53 192 84 176 51 69 -205 -133 46
6750 46 221 73 162 12 -17 -91 -113 -29 97 255 -171 -291 -38 -148 -228 -144 50 89 4 -12 17 216 15 169
6774 169 187 199 -114 -146 -5 160 -141 99 -158 33 -198 -18 58 186 -105 91 114 -44 -226 -174 -23 209
6796 209 66 -271 278 96 -135 66 -52 189 -118 269 -221 -174 -138 10 231 -184 -46 160 57 122 -138
6817 -138 64 394 276 -93 -9 90 90 133 131 -97 -49 -141 -6 88 -48 -87 -38 -13 -168 155 -232 -28 76 97 149
6842 149 97 -187 -82 -258 -120 -249 21 -86 -75 197 119 -18 16 -238 -21 -85 -66 -93 129 -34 153 -141
6864 -141 -294 -60 -226 18 54 31 -287 46 160 -84 50 203 -114 -110 226 6 144 232 -7 191 -25 -7
6886 -7 -192 -230 -50 66 -382 -55 -98 -122 149 -110 -25 33 -208 -121 1 77 222 36 -122 40 -82 141 -75
6909 -75 -254 -28 -297 -383 -50 67 13 -31 -115 -340 17 72 54 -137 242 -84 31 145 24 -236 -192 89 -317
6932 -317 140 -35 9 -81 86 -62 85 361 124 -90 -99 -95 -243 -158 333 67 -16 -69 251 100 -44 203 125
6955 125 58 125 139 -77 46 335 185 48 158 43 185 31 34 167 63 90 -126 -16 -52 265 -122 35
6977 35 -160 276 -118 74 -35 269 47 -318 33 -192 -53 157 213 53 171 314 96 -22 51 118 -161
6998 -161 78 21 -126 5 134 129 68 328 -45 -31 99 244 -63 -48 -240 -76 122 121 -25 -34 -146 187 -132
7021 -132 -5 -195 -153 6 77 65 -36 -62 -85 -392 -93 33 76 -146 -237 -195 28 80 -258 -218 134 51 -138 -98
7045 -98 -75 -71 47 37 62 129 -84 -142 40 111 -119 -291 148 -13 102 53 -13 -94 244 -10 99 40 -30 -19 -34
7070 -34 284 36 38 -122 -290 -108 48 149 -78 174 -40 50 -99 117 -14 14 33 -134 193 223 9 -79 7
7093 7 -193 90 168 -143 -371 -78 -156 305 284 -160 -27 -2 42 216 23 -131 183 -110 212 101 68 66 49 -115
7117 -115 -199 85 136 -273 58 16 -36 97 -111 -18 -73 152 -215 -209 -273 25 -167 157 -71 -215 282 159 63
7140 63 -303 257 -103 -231 -321 -25 -141 159 -15 120 -55 343 29 -144 -65 67 134 -92 85 2 214 -159
7162 -159 19 -160 35 24 -67 66 30 412 -122 52 295 115 -175 82 162 -165 304 -4 114 -238 -163 132
7184 132 101 -161 -49 -97 -137 -109 24 -47 -126 117 -144 70 278 144 19 212 -245 16 -44 137 -16 -82 -172
7207 -172 -230 121 96 141 321 101 23 193 43 213 -39 -139 68 -112 69 -11 60 -126 163 293 -35 165
7229 165 -69 130 93 -112 -15 -220 14 -9 68 -2 153 197 110 181 -61 210 -1 -56 152 295 107 100 -34 18
7253 18 207 260 -86 -54 218 18 -153 -124 152 -291 47 101 -112 -174 -53 -209 257 -217 -142 -95 -184 145 -71
7276 -71 -213 -319 -149 11 -374 -229 50 -70 -63 -104 30 -84 9 128 -71 178 -31 135 -15 128 269 155
7298 155 -31 21 -225 110 -51 -176 193 8 -145 1 -31 -22 379 153 -44 -132 -35 -14 140 116 -15 -34 150
7321 150 190 -16 -120 106 -11 94 27 -162 158 -127 144 -77 -17 102 37 159 58 288 1 -165 169
7342 169 265 72 6 -130 177 319 -11 22 -70 29 -160 128 -86 114 -23 -48 164 -81 -53 -4 2 -93 -103 72
7366 72 -117 125 -306 166 -48 113 -67 -55 -212 -68 81 -233 -31 -97 -397 219 -301 88 222 -133 262
7387 262 -246 -168 146 108 130 -115 -274 62 -63 -59 -79 -19 -50 46 118 45 111 239 83 -232 -223 92 169 -51 199
7412 199 109 -10 -174 59 238 -101 -229 -103 -62 -1 164 -93 -231 -94 265 -321 144 -315 -76 -139 -127 84
7434 84 -67 -128 79 -9 131 113 106 -148 125 190 -79 215 -37 542 147 -113 -110 86 17 78 -222 25 151 218
7458 218 91 239 158 -196 103 -90 68 159 -56 156 121 124 350 -71 48 114 -33 60 -281 -115 -36 -2 92
7481 92 -108 -125 100 -220 -139 114 34 -25 78 -97 141 62 -146 15 308 -63 15 98 156 -146 -53 145 -96
7504 -96 -91 130 -47 86 253 -109 -192 -14 127 -54 40 4 51 13 156 181 -212 -79 100 -32 59 113 103 -59
7528 -59 105 269 -21 -76 -181 12 79 48 -173 70 -42 267 -174 -172 190 83 101 -56 49 21 69 0 -106
7551 -106 -17 19 25 26 -161 -123 -382 39 -186 -176 7 14 82 25 74 202 -195 -10 108 -93 159 25 234 -245
7575 -245 103 98 41 -143 -95 -356 -38 -148 -199 -164 276 197 -152 -204 6 -85 44 -19 -252 -219 43 147 46 -51
7599 -51 -40 -129 -204 113 350 14 -28 285 -46 294 -390 -60 -137 -74 -169 -70 -11 -175 214 40 110 -68 111 192
7623 192 205 -68 -12 -323 -33 100 -114 290 -5 -67 -51 -38 81 149 -52 28 -226 -229 -236 -122 129 -9 -29 -79
7647 -79 172 -62 62 -71 -158 35 -5 -109 58 -229 34 294 -103 252 8 -76 -8 -38 141 142 -144 -177 56
7670 56 -315 129 270 6 146 -294 -3 -109 58 -92 -93 -96 108 280 31 107 -138 -103 -284 96 43 -99 84
7693 84 65 -25 -130 -6 -91 148 90 77 -25 -29 340 -24 177 -264 -33 63 -71 9 -296 68 281 103 -101
7716 -101 90 -66 105 7 37 -86 63 -215 159 130 122 -83 -66 -254 -83 102 131 6 -60 131 110 34 32 258
7740 258 -102 79 193 124 -58 -115 -20 -109 -161 -14 -21 -31 -21 -64 462 -75 -54 43 181 -101 91 -43 13 -26 215
7765 215 95 37 -116 128 224 135 76 -48 -85 -203 -170 273 78 78 155 -23 -237 -232 -129 29 174 -114 -32 -279
7789 -279 -32 -87 -126 -174 -133 -237 116 -92 10 -3 85 158 72 -124 194 11 177 -27 -86 -5 -92 142 -77 167
7813 167 -152 78 108 254 -84 -19 -4 -190 45 -16 69 110 56 -110 -54 -142 -83 167 1 230 -331 -100 15
7836 15 -124 -104 -95 -169 73 35 260 156 1 41 146 8 -53 -18 -107 224 -128 65 28 -55 -66 -110 -211 -218 179
7861 179 13 91 143 -61 45 230 -101 -81 -120 258 58 -229 -366 -66 -10 174 -45 69 72 -2 -104 -100 -83 -101
7885 -101 -288 86 -97 20 -55 190 -189 120 -37 -332 -32 105 -104 -108 -125 -281 -258 -217 226 -201 -43 -16
7907 -16 -85 18 -24 33 -69 -1 123 202 -71 53 311 41 234 -51 9 358 -52 -67 -78 247 -23 -82 156
7930 156 103 -63 -30 -121 35 -156 117 -106 86 -111 49 45 -140 20 -39 110 -36 -30 -94 16 86 13 76 -29
7954 -29 -33 -34 -261 3 -174 106 -1 164 19 197 -99 -132 271 -32 150 86 107 -61 138 175 -78 -48 -246
7977 -246 10 -84 140 -15 196 -99 -87 18 -63 93 -230 -23 206 168 189 204 240 -108 -224 -22 -208 -74
7999 -74 -76 20 103 101 59 51 22 116 -138 116 204 -60 20 16 268 166 -9 -254 271 72 -1 135 73 -226 273 -13
8025 -13 240 -22 -100 -87 11 36 -142 -181 -189 231 86 -157 -46 89 -40 230 152 -136 -235 -96 168 270 -41
8048 -41 201 91 -66 223 63 158 187 -193 -127 -241 20 -97 80 13 -123 -40 -95 -117 -62 -126 -239 38 120 -9
8072 -9 -115 15 -195 90 -20 171 250 153 -138 32 25 227 348 -119 272 -303 -2 -46 -172 4 -111 13
8094 13 -40 202 -53 -7 3 -72 -105 111 -13 -203 -100 -54 -63 256 -13 -156 -253 92 140 119 229 -269 129 106
8118 106 384 -61 82 43 -331 24 -154 -159 -116 8 301 188 -129 286 -2 -24 164 24 -60 94 254 -56
8140 -56 -103 64 78 -181 -61 -263 -128 268 6 -20 -154 67 -35 111 171 -67 166 20 40 109 226 281 -225
8163 -225 -94 -47 0 -186 65 81 -33 -305 188 98 -143 11 127 176 -103 21 62 27 -198 207 -144 356
8185 356 86 -371 -57 84 -52 -11
8191a1
$$ Imaginary data points
##PAGE= N=2
##DATA TABLE= (X++(I..I)), XYDATA
0 0 0 0 0 0 0 0 0 7 -8 8 -8 8 -16 16 -20 24 -32 32 -40 48 -56 64 -74 87 -100 113 -128 147 -164 187 -211
31 -211 235 -266 294 -332 367 -408 454 -503 558 -618 683 -756 837 -927 1029 -1146 1277 -1429
49 -1429 1607 -1817 2071 -2386 2786 -3315 4053 -5152 6968 -10513 20047 -101602 -278583 -104123
63 -104123 -25623 -112939 -153790 -31051 2551 -88262 -139266 -105052 -116817 -136129 -91397 -43935
75 -43935 -69554 -66410 -5232 -752 -88770 -127239 -79437 -49108 -61742 -33888 18489 25193 -1869
88 -1869 -13968 -26766 -40627 -20810 19445 36993 48848 73345 77353 54038 48494 54237 36633
101 36633 28639 71111 112339 102377 88529 110206 109551 56679 21654 43275 63901 57185 66904
114 66904 90295 79048 48907 39094 24696 -8306 -9770 23430 24567 -193 12660 34695 -1538
127 -1538 -52991 -47496 -28552 -53062 -70810 -36869 -11342 -35460 -57448 -51178 -61648 -91158 -86504
140 -86504 -58682 -58644 -65751 -38178 -20051 -55759 -85335 -61645 -43112 -65852 -67932 -24341 312
153 312 -16450 -22320 -7208 -12725 -30583 -22241 652 3670 4768 30845 50942 32685 9554
166 9554 19023 35542 27322 19947 39837 63799 64694 53966 47343 44937 42455 40945 38216 37411 47536
181 47536 59417 56766 41816 30284 26908 25253 20276 15401 17479 26845 31610 20219 1036 -6530
195 -6530 -2574 -6035 -21390 -25591 -9171 1488 -11694 -26724 -26945 -26981 -38050 -45168 -39731 -33025
209 -33025 -28907 -24588 -26703 -38626 -44154 -37959 -35599 -43356 -43444 -27788 -15979 -21550 -29097 -24129 -20314
224 -20314 -23854 -24603 -18563 -12515 -4119 6649 7004 -4733 -6417 5834 8438 -158 4032 24097
238 24097 33011 24323 17556 21510 24413 21424 20452 22979 27460 35224 40809 34857 22788 23008 29878
253 29878 24051 12628 17376 32322 33967 23722 17253 14865 10618 5936 3109 682 2978 11872
267 11872 12836 -563 -11450 -8814 -6866 -17202 -24611 -16390 -7417 -10080 -15714 -17943 -22225 -27156
281 -27156 -27831 -28166 -32040 -28008 -14025 -9835 -21343 -28773 -22784 -20442 -28735 -31189 -19746 -7485
295 -7485 -5211 -7788 -9327 -10107 -9582 -9264 -10335 -9583 -192 12208 15080 8862 7522 10994 10973 4829
311 4829 3700 11425 21475 28641 27040 21299 18998 20728 17267 9264 10092 21662 30616 26571 20333
326 20333 19404 19004 13135 4677 2708 6752 13465 16653 14042 8318 5052 3526 -3526 -13027 -13690 -5068
342 -5068 1392 -20 -3924 -6287 -8766 -13464 -20469 -25731 -22142 -11536 -6173 -10729 -14317 -10938 -10781
357 -10781 -20048 -28691 -24006 -13839 -9785 -9583 -6787 -4307 -6396 -10054 -13575 -16105 -14106 -4490 4561
372 4561 4525 1666 5344 8037 1143 -8649 -6002 5818 12134 10461 11002 16337 17070 10077 3331 2513
388 2513 5541 9994 14004 15719 15793 16102 15773 9361 189 -2112 4423 11059 10185 8603 11792 14389
404 14389 6966 -3877 -7223 -2536 605 86 852 3729 5033 2132 -3869 -10919 -12612 -8944 -4524
419 -4524 -4517 -4758 -1314 2346 -2767 -12287 -15853 -11292 -7631 -8161 -7430 -2783 1123 -404 -6066 -11770 -11550
436 -11550 -7921 -5288 -4598 -2498 2061 4685 1389 -5344 -8293 -5294 -2029 -1834 -672 3339 7714
451 7714 7764 2715 -2467 -2969 516 2609 2049 3136 8257 11721 8262 789 -1525 1864 4229 2345
467 2345 2263 6930 11314 9387 3629 1075 1390 2133 1718 1814 3625 6083 7967 5902 83 -3471 -1056
484 -1056 1546 -728 -2949 1560 6954 4404 -2645 -4994 -2185 -2025 -4889 -5425 -1979 867 653 -1497
500 -1497 -4836 -7296 -6089 -3887 -4857 -6364 -3515 1206 441 -5535 -7810 -5042 -3114 -4812 -5916 -2671
516 -2671 960 950 -1419 -4124 -4143 -2243 -359 -1400 -1973 1767 5541 3932 -803 -2227 786 2923
532 2923 1363 832 3483 7247 7305 3785 1344 1655 4006 4357 2743 3073 6587 8505 5648 1358 161
549 161 1836 3301 1992 1158 3117 5999 5313 559 -2753 -1711 -407 -714 -2380 -774 1630 1926
565 1926 -954 -4080 -5990 -5009 -3532 -3605 -4009 -2632 805 435 -4754 -8031 -6285 -4207 -5138 -5261 -2847
582 -2847 740 963 -1485 -4192 -5435 -4421 -2452 -1750 -1703 876 5092 4652 -579 -3515 -1309 739
598 739 -66 -226 3355 6955 7085 4076 1129 338 997 1362 1247 2160 5115 8452 7365 2580 -474
615 -474 97 792 -356 -744 2840 6355 5951 2734 -575 -2116 -2154 -2466 -3010 -1927 1360 3926 2577
632 2577 -1396 -4076 -3936 -3904 -5093 -5182 -2065 2117 3117 308 -2881 -4226 -4386 -4882 -5627 -3728 793
649 793 3708 2525 -535 -2737 -2705 -2690 -4160 -3837 -506 3694 5339 3137 425 -557 -290 -1972 -3859
666 -3859 -2040 3183 6474 5366 2523 1436 648 -948 -2774 -2211 1097 4930 5979 3893 1334 638
682 638 272 -1626 -4069 -2405 2266 4527 3365 1712 1367 192 -2295 -4097 -3845 -1675 1407 4068
698 4068 2821 -72 -746 -890 -3018 -5479 -3822 536 2591 1343 1115 834 -439 -2110 -3789 -4205
714 -4205 -2432 900 3369 2449 414 739 741 -2485 -5240 -3343 674 2476 1491 1650 1842 1021 -1118
731 -1118 -3190 -3837 -1536 1623 2695 1626 1451 2321 1774 -1761 -3449 -2210 186 1642 2126 2038 2396
748 2396 2264 532 -2512 -3759 -707 2175 2067 1072 2239 3337 1127 -1779 -2157 -1111 -278 873
764 873 1738 1460 1382 2029 1300 -1958 -3638 -1595 959 685 -65 1300 2268 437 -2145 -3283 -2733 -997
782 -997 -113 -10 -298 252 1185 -357 -3360 -3836 -1369 -504 -994 -459 569 1189 234 -1340 -2388 -2421 -535
801 -535 466 -386 -482 1728 2885 324 -2117 -1424 601 583 231 1325 2476 2445 1666 870 -875 -344
819 -344 1608 2066 1031 1072 2805 3206 815 -715 128 1299 1259 828 1083 1459 2091 1355 -129 -1783
837 -1783 -1214 149 204 -651 -560 936 945 -1422 -2875 -2234 -1603 -840 -1336 -1268 -775 -449 -1006 -2515 -3372 -1875
857 -1875 -995 -1511 -1811 -846 184 -417 -1269 -2366 -1750 -656 108 248 -226 1095 1979 989 -1003 -1067 712
876 712 1341 944 1416 2311 2553 1947 1145 91 478 1658 2149 1586 1301 2792 3275 1976 -304 -65 681
895 681 1144 590 1081 1491 1964 1024 -476 -1758 -1652 -259 16 -426 -580 476 488 -775 -3106 -2801 -1866
914 -1866 -1477 -1890 -1933 -609 -91 -629 -2132 -3145 -2808 -1751 -1466 -1164 -1019 513 616 -745 -2198 -2534
932 -2534 -1076 -31 -571 -167 1345 2148 1256 -199 -650 30 167 579 831 1759 2930 2919 1951 383
950 383 107 956 1129 639 1234 2601 3388 2425 674 -29 586 277 13 -139 1039 2160 2229 831 -611
969 -611 -765 -519 -731 -1375 -1101 613 1229 405 -962 -1548 -1545 -1926 -2218 -2008 -686 483 325 -402 -1589
988 -1589 -1868 -1866 -2069 -1775 -1653 122 970 430 -871 -1348 -962 -1210 -1939 -1668 -145 1271 1618 811 30
1007 30 -127 -475 -696 -737 -115 1337 2242 1785 777 524 459 446 -238 -30 926 2276 2348 1503 1225 869 510
1028 510 61 -280 -10 1342 2225 1742 987 361 507 76 -1241 -797 454 1579 945 587 281 243 -300
1047 -300 -1030 -1410 -1337 133 607 434 -675 -603 -684 -1252 -1884 -2247 -1392 -176 56 -843 -746 -527 -1127 -1937
1067 -1937 -2365 -1577 -329 372 -115 -467 -354 -300 -837 -1435 -1138 -338 521 427 119 523 930 293 -372 -820
1087 -820 -344 668 1324 1218 1095 1279 1359 589 351 -23 918 1687 1873 1312 1358 1832 1533 375 269 617
1107 617 1163 1330 1030 942 990 964 495 -670 -365 84 423 197 21 173 181 -623 -1398 -1294 -1066 -571 -717
1128 -717 -820 -746 -483 -800 -1297 -1696 -1879 -1155 -1001 -1149 -1057 -854 -414 -970 -1207 -1567 -958 152 -17 -558
1148 -558 -172 620 144 -374 -656 174 553 755 650 566 1282 1190 1056 322 413 806 1524 1554 1264 1218 1792 1454
1170 1454 882 615 1002 1684 1463 1090 969 980 950 764 152 -216 546 639 516 109 -366 211 -265 -827 -1306
1191 -1306 -899 -294 -265 -332 -818 -732 -553 -1370 -1891 -1760 -939 -534 -741 -1267 -882 -757 -747 -1496 -1479 -924 -698
1212 -698 -212 -383 -472 -129 -202 -557 -825 -543 53 217 565 291 721 770 688 221 -156 -42 799 1030 945 1295
1234 1295 937 1050 505 271 553 791 904 865 965 1179 1109 473 -23 -266 75 639 439 318 236 429 371
1255 371 -575 -703 -698 -159 86 -165 -231 120 -219 -381 -972 -1160 -855 -583 -459 -648 -217 -29 -159 -786 -1186
1276 -1186 -1197 -606 -586 -301 -245 -230 92 -135 -842 -912 -497 -439 -34 -313 367 765 407 -273 -436 -396 239 -124
1298 -124 -34 362 750 827 380 -21 -95 4 527 421 294 809 797 971 451 -384 -109 593 401 174 527 1086
1320 1086 882 530 162 -73 3 -88 123 11 297 669 591 46 -403 -236 -243 -513 -314 35 176 116 -16 -589
1342 -589 -803 -628 -782 -607 -715 -78 118 19 -483 -639 -701 -629 -692 -693 -281 -229 134 -243 -493 -216 -330 -288 -566
1365 -566 -320 36 245 666 190 -45 381 30 226 333 577 641 729 635 499 494 531 265 -99 323 686 733
1387 733 814 688 264 346 273 395 372 310 706 606 411 11 88 162 -221 -690 -251 250 123 -342 -358 -138 -482
1410 -482 -515 -741 -553 -410 -198 -442 -420 -472 -451 -671 -589 -1069 -743 -347 -116 -260 -517 -107 -513 -385 -657 -874
1432 -874 -44 218 -200 -59 33 164 131 4 96 22 426 463 739 75 517 522 602 317 599 689 684 973 517 599
1456 599 403 339 439 -29 411 318 489 57 190 204 264 92 -96 -31 252 358 -280 -91 -52 -249 -419 -457
1478 -457 -190 -312 -100 -290 -155 -481 -269 -310 -479 -514 -564 -120 -90 -546 -286 -299 -114 -386 -264 -375 -325 269
1500 269 -58 55 -262 -40 38 49 -188 -30 224 270 301 33 69 212 -15 73 -307 273 341 549 142 300
1522 300 518 667 190 144 87 154 477 658 75 116 330 -155 -145 -185 442 461 -30 2 19 211 -255 -639 -457
1545 -457 -113 273 25 -66 -191 34 14 -140 -294 -327 -167 212 -138 -181 -141 -222 -188 -166 -372 -241 30 96 -60
1568 -60 -71 -166 10 -140 -575 -275 -117 4 193 60 -27 -77 -193 -90 -216 335 266 -60 12 268 206 -46 348
1591 348 194 -325 -170 336 418 339 410 201 208 -44 -192 -115 133 227 401 226 455 -30 323 -129 -117 358 439
1614 439 172 31 346 166 -147 -215 -268 -182 180 -134 -76 -218 110 148 -421 -83 -230 -195 -296 -243 -93 -259
1636 -259 -251 -454 -514 -168 -104 -159 -14 -57 -4 -169 -2 -176 -166 44 -304 -38 81 220 38 -56 237 -86 -17
1659 -17 -208 176 292 90 122 431 340 168 -151 114 296 90 218 236 220 422 -67 133 8 273 71 78
1681 78 26 -54 380 173 73 -126 94 -228 -194 -68 57 184 -13 167 -392 -193 -365 14 -478 45 -34 -76
1703 -76 -159 -278 -248 -209 -432 -482 -362 66 62 -105 80 -204 -296 124 150 -164 -281 292 -97 248 -244 332 94
1726 94 44 187 -163 295 258 252 201 165 220 75 -25 245 307 407 107 12 94 -35 14 -48 -98 -105 256 179 101 -233
1752 -233 -380 -16 197 -39 155 -122 -86 105 107 -134 -149 -3 -281 -384 -253 -31 15 -36 -166 58 -165 -49
1774 -49 61 -160 233 -40 115 -168 -97 -125 -163 65 -125 -105 331 74 -79 91 257 144 -71 109 -17 134
1796 134 -100 113 5 81 115 -35 -171 230 -122 82 196 -148 -64 -45 33 32 251 18 142 152 -149 181 -102
1819 -102 -148 -238 53 -5 -271 -49 138 90 117 69 -2 -55 -338 18 -144 85 -149 -127 -261 -141 -67 -201 130
1842 130 -127 72 190 -157 -31 -323 165 -311 -319 -128 -48 124 103 -298 -52 -54 327 -279 -106 -308 -93 -66
1864 -66 128 -207 -272 64 -59 -51 -44 189 284 88 -124 63 174 80 115 296 71 317 68 154 227 61 71 -31
1888 -31 -97 -50 203 257 -48 243 -206 -29 -251 -76 -77 255 -66 -20 20 -30 67 -262 186 43 406 130 -74
1911 -74 16 -271 -45 23 -310 -50 -131 -419 -129 -87 -205 115 -58 -6 31 -164 161 -67 117 269 -338 92
1933 92 154 29 -18 -54 195 232 210 227 242 282 -293 325 169 155 426 10 121 75 163 146 -45 -52 -8 216 283 175
1959 175 -223 -25 39 170 -213 -239 -35 109 -53 84 67 21 -278 331 -54 -394 -222 -13 -173 76 -333
1980 -333 85 185 -235 -92 -22 18 75 185 -10 45 -110 8 34 -174 -148 -84 186 316 -20 226 153 112 109 0
2004 0 -16 16 -169 -14 291 205 -119 -57 -96 80 10 132 62 142 19 -79 -93 3 291 -39 163 22 79 -10 -75
2029 -75 222 -8 74 -64 49 -234 180 31 -103 15 -305 -226 51 -108 109 -112 112 212 -74 -15 67 256
2051 256 -54 314 -54 38 -72 280 110 94 -106 -419 45 130 76 112 220 61 -187 28 130 2 -56 -237
2073 -237 256 74 -225 -21 -30 146 -121 52 192 -16 32 111 -32 108 -33 -102 232 228 -61 178 224 -118 54
2096 54 119 51 207 52 -19 59 60 18 272 88 -100 114 79 -137 -413 -55 129 27 -18 68 -7 -21 -286 -29
2120 -29 172 350 -194 -350 -74 33 -138 180 8 -220 20 -311 -26 -278 -10 -93 -328 -62 -40 245 172
2141 172 138 131 -21 242 -240 -80 216 16 128 48 -31 90 152 -231 389 -140 -78 -127 6 48 74 156 -265 -47
2165 -47 164 109 1 -136 33 -107 -40 -260 97 182 149 76 39 -7 -23 26 -205 288 -123 129 114 79 65 110 150
2190 150 -209 79 -60 -14 248 24 30 -147 113 -4 -208 -99 73 -9 -322 -76 -59 -10 105 34 -504 100
2212 100 84 -110 -55 -51 125 200 226 121 -113 199 -18 254 -74 -27 107 -38 69 -19 222 60 -199 104 16
2235 16 269 -13 -93 -245 -138 -242 -126 -69 77 -6 105 -265 -152 42 121 -139 -2 -53 103 89 69 -259 -144
2258 -144 -77 -99 -64 54 76 194 102 -179 5 -16 -20 -367 -127 -172 150 184 158 -104 59 -439 -328 -64 155 147
2282 147 261 154 480 239 145 297 123 28 35 195 -17 14 -26 56 76 -6 -266 -237 -166 -117 1 -91 -175 -82 -86 -68
2308 -68 -97 -132 286 137 -320 8 -333 -343 -37 -413 -271 203 194 -205 66 -95 -218 -140 158 -299 -38 -84 191
2331 191 48 13 -30 -81 160 58 11 282 -39 133 -5 104 200 -165 -62 52 52 -164 165 388 35 101 185
2354 185 -59 -130 92 278 -103 -29 -183 297 83 46 -105 -208 79 -232 230 -210 -310 -154 -184 -92 144 -265
2376 -265 -147 152 -3 -153 -287 62 -200 -61 -102 1 188 122 -19 5 225 -164 76 86 -105 121 101 46
2398 46 259 249 26 76 140 -185 -79 13 102 -8 -117 151 6 -151 -119 -66 -20 82 -180 51 -255 558 348
2421 348 139 253 -170 -182 115 83 -46 69 219 -107 218 -156 -43 76 -83 32 46 160 -7 -265 -310
2442 -310 48 306 339 -206 165 64 -76 166 49 17 248 169 72 -33 -118 -52 67 41 -2 -96 96 -122 24
2465 24 -379 -27 -357 -246 -6 -187 -73 -340 -240 -101 -320 106 17 -63 -30 105 251 177 -324 -262 92 -9
2487 -9 -126 109 -98 -75 220 -91 324 103 32 -37 86 133 -57 38 177 118 153 105 235 9 236 -115 61
2510 61 39 333 24 -5 -63 -148 -205 22 139 280 289 -184 -175 -32 163 125 -232 -134 -67 85 -327 -203 -57 -20 -218
2535 -218 -138 140 -159 -47 -118 27 -395 -318 62 -330 -118 42 125 56 79 117 194 -181 19 242 -105 116 110
2558 110 -206 228 330 179 8 88 -163 -40 79 180 -90 387 -61 146 -188 83 109 204 -49 87 -53
2579 -53 206 -228 -49 94 -187 122 10 -209 188 40 34 -263 -181 251 -109 -189 7 -70 29 262 140 -285
2601 -285 -307 3 -4 -50 128 -106 0 78 -376 142 -119 73 -53 -42 12 -8 -239 -80 152 332 -86 -324 42
2624 42 -91 -71 137 116 379 58 134 -13 -114 233 126 -262 121 270 161 80 11 113 373 -48 -261 113
2646 113 -97 -60 -22 -54 5 34 39 -361 -40 -230 52 14 -61 -86 254 -48 -94 -48 -43 70 92 -139 90 36 -7 -72
2672 -72 0 61 187 134 -171 -134 9 -37 19 196 -148 294 33 32 -42 50 153 -265 21 -114 -39 -26 116 -237
2696 -237 -150 -133 188 -241 -105 -62 50 161 175 -187 142 27 -74 -203 -95 165 19 200 -25 -81 196 123
2718 123 -55 -192 -113 -15 135 -148 -79 212 -69 20 -242 147 -136 325 325 -61 -237 47 67 -114 166 -34
2740 -34 253 138 73 89 69 96 123 -210 209 -114 -198 -162 -55 -254 45 -163 -64 68 5 157 -20 -103 -55 -233
2764 -233 -117 -188 181 -212 52 192 92 -97 -123 64 181 28 -107 49 109 93 20 -165 151 126 141 -4
2786 -4 185 -415 -240 5 -56 -30 52 -39 -129 109 23 -173 -54 -10 171 137 44 317 -38 52 -86 355 -69 -1
2810 -1 -75 -87 137 -270 -116 123 -71 -160 141 26 34 99 -111 -154 355 86 -200 12 63 -9 26 -215 -26 -338
2834 -338 -121 -17 83 -37 -105 104 78 117 -12 -89 182 46 129 -19 -122 223 -204 14 -103 109 -173 175
2856 175 208 185 -405 144 178 173 -36 -281 254 -165 273 76 -9 228 212 44 -17 12 31 -75 -91 51 -218 -148
2880 -148 0 -283 -31 -8 -172 69 -43 273 68 -201 15 -209 -167 11 -81 -186 -166 201 74 516 -313
2901 -313 139 -119 -6 134 246 137 -56 0 159 -155 193 252 -144 56 -414 126 50 32 307 -52 65
2922 65 81 -94 -9 205 -163 -103 144 100 132 82 -28 14 112 70 126 12 46 114 -95 54 6 -120 -225 -87 98
2947 98 -112 -19 -9 18 22 82 181 -14 29 57 -34 -63 183 77 397 217 -99 47 261 323 45 -82 -39 85 -74
2972 -74 268 120 -73 -204 229 -212 -89 -38 -79 -41 -220 87 -47 -23 -123 317 18 90 36 -352 -135 213
2994 213 -52 152 23 120 58 107 -293 20 108 -75 -120 80 -67 -5 131 30 339 182 314 -77 -10 42 174
3017 174 -73 21 282 127 262 109 51 95 326 181 11 439 -190 -111 93 280 116 -143 42 66 2 46
3039 46 230 -168 93 3 28 -246 127 -267 201 -113 -87 -105 -257 33 169 3 -212 251 -47 307 156 7
3061 7 18 -157 75 9 -1 -153 67 -36 52 -25 -64 -160 -111 214 -8 -84 190 10 139 16 -26 83 -16 98
3085 98 158 -211 215 38 -221 -31 -305 -46 -213 30 423 -86 -44 98 -55 8 35 -229 -193 10 -52 -45 24
3108 24 -86 -236 -13 -195 -44 -201 -160 283 -199 -66 216 -159 53 6 -47 -268 79 -48 -66 45 -80 -178
3130 -178 98 -244 5 130 82 112 -354 126 -133 239 -255 293 81 -69 -81 25 78 31 420 53 -137 195
3152 195 -241 -90 348 66 24 -18 143 211 21 54 -237 -214 154 267 196 259 -322 -64 -154 -251 143 151 141 -19
3176 -19 55 -270 1 258 466 158 -17 288 -31 -138 -203 55 98 68 114 83 66 -47 25 78 162 -119 158 54
3200 54 -29 4 -59 107 130 6 -44 126 266 -330 -7 66 55 23 -180 65 -166 -69 -64 64 170 36 24 -34 -217
3225 -217 133 -145 83 -323 106 36 61 -14 26 -12 -32 74 304 130 -19 -31 100 124 136 197 -13 101 -40
3248 -40 -159 51 195 -272 264 177 75 -67 -153 -44 144 5 71 46 -249 39 283 -19 -40 40 -136 -165 -187
3271 -187 5 175 54 76 389 17 284 91 124 -54 -202 214 -39 -24 119 -133 -144 -38 71 299 -18
3292 -18 -129 -56 349 12 -45 -195 -197 75 -77 293 21 -409 215 8 131 39 -136 -225 -32 30 114 -164 -191
3315 -191 90 -57 183 -245 -183 -254 -250 -55 -167 -147 -228 240 -78 178 -47 -83 103 12 -95 -340 -45 -72 -10
3338 -10 -230 145 99 -262 -149 -166 24 -6 -52 50 -81 -84 57 30 -64 114 -1 -53 -169 -94 -209 321 -9 -145
3362 -145 -189 -21 339 -5 83 139 6 146 6 -178 -30 -39 93 -51 56 45 -63 105 206 -291 239 155
3384 155 275 -18 -290 34 -165 181 84 -93 -53 -165 -214 195 -63 175 -35 -99 242 -96 -57 -52 -235 -149 73
3407 73 148 62 -150 31 -263 -254 40 -177 277 86 70 -207 -53 209 -122 38 -147 48 -249 -136 199 -116
3429 -116 -113 8 95 17 -114 64 13 -55 -51 -162 9 -202 118 75 92 -39 248 -195 35 -25 37 323 -287 18
3453 18 287 -187 35 44 -22 89 186 -359 234 -150 -178 -110 -7 170 -77 89 -97 -131 201 -9 106 -12 -340
3476 -340 331 -153 97 66 -186 -142 175 -157 -126 193 -91 -110 122 -88 -36 79 104 195 -117 -66 -159 111 -52
3499 -52 4 37 163 -115 -112 -61 -21 -9 293 -83 -180 -50 -95 -88 -160 40 -5 -1 -235 -27 -34 43 161 48 120 -120 116
3526 116 -11 47 70 -104 -155 12 -352 269 55 -28 219 -205 -255 -54 88 -289 29 -34 7 173 -28 368
3548 368 -126 41 -42 44 25 71 94 131 -88 -26 -207 -49 -319 115 -95 -37 71 128 -134 350 154 -273 187
3571 187 -33 -95 -161 -287 19 59 22 -77 -328 -293 -156 145 -160 -138 -301 -279 116 75 -93 55 120 120 -202 131
3595 131 -215 -242 232 51 5 142 122 -282 -140 67 -151 103 95 -159 -181 -24 77 -127 58 -175 187 -118
3617 -118 -4 -185 259 350 -283 90 206 135 -104 -42 -249 -128 -122 -105 -249 6 -182 -99 -197 134 136 147 -76 -161
3641 -161 -20 -119 -156 -292 -82 44 -188 117 25 156 -184 249 -64 -172 -390 -222 -50 -192 -77 -68 -138 83
3663 83 -21 116 -12 -183 -5 -227 64 -42 308 146 -259 171 -52 70 183 -103 -162 143 179 10 -196
3684 -196 -199 64 -168 198 17 -124 190 -186 62 -269 -98 339 17 -89 -106 -224 91 -7 66 173 70 -382
3706 -382 153 514 62 -20 -18 407 -20 -372 -209 -252 49 236 -130 69 360 -24 -95 -149 -34 75 -81 186
3728 186 60 -59 -257 359 -80 143 -229 191 -11 377 -113 -130 69 -205 -169 210 -238 -153 -78 -26 198 -127
3750 -127 -173 -99 279 -6 -299 74 15 -185 237 194 276 -76 -120 -130 -149 117 -25 -63 444 -107 44 199 66
3773 66 25 98 -118 66 -39 -272 153 18 -117 127 -174 -50 -281 43 155 -55 -236 45 -45 -20 133 -119
3795 -119 -105 -102 -20 62 -158 7 -10 71 236 75 -123 180 47 -214 275 54 164 -213 -203 -223 -184 88 -58
3818 -58 -57 99 239 -112 -51 77 -76 -17 120 54 -144 205 -239 59 11 -256 79 100 238 24 16 150 32
3841 32 -31 -79 -64 337 -29 9 67 -171 -60 119 -104 -222 35 -35 0 -132 -177 66 98 -65 -343 105 142 -28
3865 -28 323 176 -258 -142 62 -91 -42 176 -144 -124 118 -95 284 -5 -111 -193 -33 112 179 76 59 163
3887 163 -328 72 -45 -179 226 -144 -61 220 -132 -34 72 -111 266 -103 -6 65 163 -240 -204 -16 68 -64
3909 -64 -8 255 -28 -88 264 -91 -228 116 -7 -407 -152 -5 183 -133 98 -200 125 110 -62 167 208 -235
3931 -235 -16 58 0 42 22 10 37 -180 -38 -99 -96 -38 -438 22 -80 101 -66 32 -109 63 -153 272 68 39
3955 39 235 -450 -193 139 7 238 -136 -229 123 68 -175 34 -191 180 -83 31 132 35 -130 -88 -187 172
3977 172 -192 279 -188 -21 20 -157 -25 -35 -90 77 237 35 236 -125 138 -91 134 7 -356 -186 -44
3998 -44 -231 437 161 443 -111 -123 -269 -95 70 71 -20 91 138 -105 -1 227 -236 -252 -20 -326 -47 -24 73
4021 73 -150 24 -105 144 -187 152 136 -125 159 -151 112 227 82 -7 -111 -98 -87 2 -65 -235 -155 199 19
4044 19 44 182 57 -102 -143 -96 -283 65 -96 -152 111 -1 -265 60 -96 -139 39 -195 129 146 74 -94 123
4067 123 224 -58 69 231 39 -275 39 -36 303 -196 100 28 165 -162 -41 175 167 23 47 124 -319 -20
4089 -20 138 -126 65 -58 -347 348 86 -108 -27 -126 -453 -134 12 -65 263 -40 -197 -162 118 43 -183 -118
4111 -118 -132 -67 -106 -23 -148 128 -76 -247 23 84 -16 271 163 -76 141 56 -102 -293 119 -112 -160 143
4133 143 -171 -93 -115 -178 -28 -48 -86 111 339 -29 -72 -63 217 -51 94 -23 -219 285 -166 -209 -78 89 -131
4156 -131 -185 -62 59 118 51 -152 -242 113 62 156 -83 -196 -325 81 189 -77 -35 24 -70 305 -245 -86 -26
4179 -26 7 76 19 339 204 -70 123 -173 72 -40 146 240 21 -59 -40 -238 177 -35 -60 -189 -151 -134 130
4202 130 69 34 9 56 -85 -267 -329 60 -110 -37 110 195 -247 -147 -31 -144 -18 -134 -177 141 -104 -118 -313
4225 -313 -23 133 86 -132 64 112 -184 102 -30 -1 152 82 85 9 26 -4 87 202 -39 118 61 185 20 53
4249 53 -45 -64 42 -182 77 -58 -77 32 33 135 -225 166 10 212 -317 -56 -213 -238 -5 91 -120 22 124
4272 124 39 -339 -55 -80 28 38 -122 -5 14 314 -15 -45 20 156 -26 -50 -190 -205 19 -88 -217 43 16
4295 16 -151 154 2 -74 180 -30 120 -235 -288 -23 94 -58 -326 213 -28 27 348 36 -20 99 175 167 -168
4318 -168 252 185 -128 55 239 -113 27 201 342 -19 -107 75 -20 183 180 -43 -123 72 -248 123 194 -82
4340 -82 332 -18 133 -228 45 51 106 156 367 -57 6 -322 77 49 -289 237 290 177 99 210 -145 102 199
4363 199 -3 26 -47 -95 -32 29 62 -162 -41 1 94 -71 120 15 -17 39 -35 -112 -51 133 79 -95 64 -125 115
4388 115 -192 14 -19 -124 -30 31 -160 72 -25 -47 -169 5 -51 55 116 -76 123 -192 215 -4 -32 174 -52
4411 -52 -61 -12 -292 80 123 138 190 125 154 -219 45 83 58 316 -29 56 -435 -107 70 -137 -383 -35 -64 135
4435 135 -4 63 -215 -224 -122 -26 -33 59 73 -3 -130 -161 -97 40 86 15 16 -88 60 62 84 272 -132 33 5 20 81
4462 81 -79 241 123 171 -87 19 -82 191 -51 -3 -249 -200 12 141 331 -106 -72 95 123 40 -62 -62 194
4485 194 135 -182 67 166 -113 -141 -267 -37 -183 144 107 18 -7 5 -12 -317 25 -147 -151 -386 -284 -108 -66 -21
4509 -21 -230 166 -84 56 -95 -128 -41 108 75 72 12 -227 -88 -38 -54 3 -183 133 -369 -189 13 84 34 -174
4533 -174 92 -94 85 25 11 231 -185 70 -169 19 191 -76 -467 -233 274 37 -115 43 -97 252 262
4554 262 -18 183 -11 55 -144 -30 77 -34 210 72 34 95 97 -150 67 -88 -244 -351 200 80 49 -163
4576 -163 -197 219 306 137 -282 14 132 -146 -88 -233 25 -325 -14 -32 79 -15 110 29 64 26 149 110 -62
4599 -62 -2 100 93 -29 43 -61 201 121 -60 148 -162 133 179 38 25 -28 17 -72 265 -284 156 69 1 109
4623 109 189 -148 61 -40 -343 -257 -92 -147 220 -84 82 -342 -249 24 13 -287 -76 47 -181 -49 -45 251
4645 251 -191 101 -68 -147 24 188 155 -208 -59 -68 -158 -58 55 -39 -77 -64 185 154 -312 -169 -117 218 91
4668 91 -194 232 171 -182 -237 71 48 -166 58 244 -56 -205 155 18 69 -127 -176 -1 -201 208 172 -38
4690 -38 -11 98 248 124 -56 28 -176 128 -57 45 30 -261 -203 -46 -21 -179 -184 -34 240 24 -97 -82 -15
4713 -15 133 -22 -80 165 -177 -253 111 82 -44 172 -117 -217 247 -119 -139 81 75 113 -16 58 78 53 -104 55
4737 55 -66 23 184 -40 -49 157 78 -50 169 10 44 -114 -344 -89 -207 238 -76 -173 160 -251 -360 -175
4759 -175 -1 -115 24 105 6 188 67 106 -188 -61 -83 385 390 -129 137 236 72 65 -126 195 161 -140 -32
4782 -32 62 -139 -69 124 85 -107 109 61 -31 -232 54 -55 -135 139 -122 -48 -39 -222 81 -251 114 211 -89 -302
4806 -302 -241 239 -82 -74 59 -113 1 4 -124 30 -155 -173 -42 299 -122 362 -66 264 -313 -109 -32 -145
4828 -145 135 125 299 -204 29 61 -266 -328 -156 249 -74 -28 19 430 -242 7 137 -124 6 -42 100 -1
4850 -1 224 345 68 -127 135 185 21 -293 -84 11 -255 -16 113 -226 43 -32 245 196 54 72 148 62 -90
4873 -90 -125 49 117 1 1 79 -93 184 -274 -8 -42 -274 -224 41 24 18 -212 -5 -138 -6 70 -57 199 -180
4897 -180 -50 -146 -74 132 62 249 93 -86 -222 160 -225 128 64 59 130 -282 45 152 80 -91 -313 -37 34
4920 34 -102 -17 -93 -136 -31 -159 -162 74 289 169 -42 11 -32 208 9 136 -150 66 88 -155 205 8 150
4943 150 -274 43 89 164 -60 -62 -64 120 92 102 167 -8 324 211 332 248 -103 58 93 -1 105 93 -199 388
4967 388 -65 50 24 29 -167 127 146 19 -10 -165 145 53 262 -179 11 -61 -35 -100 -38 -87 30 -109 22 82
4991 82 148 -325 6 -29 -56 83 -76 -242 -113 -108 -4 102 -125 -45 -17 47 -245 -223 -8 141 -38 199 -310
5014 -310 -82 284 206 -43 169 210 75 72 64 -126 68 -259 -20 67 19 -141 234 125 41 -245 138 23 -79
5037 -79 -64 10 39 140 -155 75 -248 68 32 54 113 -159 47 -97 18 -3 -37 38 114 -262 56 -92 429 -179
5061 -179 8 -101 90 19 -63 -135 -89 169 -146 -28 109 161 -57 -166 -219 -90 204 -155 79 -119 30 -327
5083 -327 -110 -189 -131 -107 131 132 159 102 70 -198 -57 151 -38 176 -105 -81 -56 -111 126 -8 84 85 -77 134 102
5108 102 135 -49 171 -99 -67 -141 -86 -215 -114 -74 -156 -15 183 191 308 -23 -73 193 -209 96 156 201 94 -132
5132 -132 -9 -87 50 91 62 128 -95 -83 -66 55 78 212 133 104 -166 285 -83 -84 3 22 86 112 182 -17 -122
5157 -122 -76 17 78 -151 111 -106 -47 266 -131 -105 -140 129 -59 244 15 171 122 -132 25 40 25 31 69 -20
5181 -20 129 41 87 -147 7 133 -178 -203 124 156 -80 147 152 65 76 -117 141 80 144 -230 -148 -51 -176 -125 295
5206 295 -7 198 -116 93 12 -40 13 -79 459 85 169 -58 69 -62 92 142 -135 -57 7 115 -86 41 198
5229 198 -23 -243 -37 -204 81 363 -168 -234 127 93 -20 -56 -274 343 -42 194 59 65 -87 -64 7 -381
5251 -381 -192 179 -189 -186 153 -390 -16 110 -285 -198 68 79 -125 -86 -139 97 41 -144 155 -178 -174 175 -222
5274 -222 120 -157 331 -12 53 315 -201 120 -189 -159 -200 -254 -358 25 87 18 -226 -68 -131 8 312 57
5296 57 114 237 74 32 295 280 25 -141 -285 -63 114 -203 189 -102 147 66 254 -110 85 125 220 -3
5318 -3 133 -241 -97 84 -370 -8 -216 -13 -252 154 97 -78 -206 205 -108 69 -70 -21 -251 -142 136
5339 136 37 -49 48 -238 -16 102 -22 64 98 -83 -188 -49 -226 212 34 3 16 -11 -133 87 192 -52 101
5362 101 29 163 -70 43 -49 166 127 -15 56 227 -238 -313 146 39 -36 -49 -35 -6 -202 3 129 -170 -23
5385 -23 -65 95 -59 6 -135 -38 -5 73 -74 -29 -80 -128 -10 -72 -149 -432 173 -120 310 -228 -163 43 -179 33
5409 33 -74 -143 -97 200 110 137 153 -182 98 87 -14 -59 -10 15 137 97 -146 -205 -121 -97 -332 -137 48 189 161
5434 161 2 -142 73 131 94 256 36 30 15 -122 -81 -43 -49 44 61 136 108 -209 -335 1 -55 12 -27 82 -55
5459 -55 283 143 -57 5 -44 -342 111 -83 -20 107 199 -87 -238 -76 -61 6 175 74 -12 58 -96 244 133
5482 133 -438 -195 171 -12 -77 51 172 -40 -250 51 -55 135 32 -240 105 -77 -470 -273 136 185 -9
5503 -9 38 -404 52 155 -202 -50 229 258 -80 101 -85 132 196 -1 -77 207 -80 114 14 57 105 130 -11
5526 -11 -10 -172 185 278 44 238 151 186 -83 -72 399 -155 -15 -36 -55 92 -293 216 -88 -360 46 109 -203
5549 -203 534 20 91 -173 2 127 -196 7 104 123 -28 -257 216 -64 263 30 -116 88 217 266 -38
5570 -38 234 -186 -117 -278 -80 -123 -63 -63 178 54 -160 182 -97 -299 301 7 138 -16 4 59 -179 43 106
5593 106 5 -300 9 -6 -1 44 -218 -114 -239 52 -86 -83 221 113 54 -379 -97 144 82 -211 310 256 33
5616 33 -217 -108 -294 54 -28 5 64 -42 -50 -80 -147 -108 -343 71 280 84 -126 28 -137 234 72 -117 -62
5639 -62 16 -50 189 -74 150 13 -274 10 229 -41 -124 114 28 91 -252 217 -93 132 229 27 -130 -135 -45
5662 -45 94 173 -325 228 -313 -125 -94 -190 -15 -107 133 135 64 247 -78 169 -102 -340 36 -38 -58 497 48
5685 48 134 -74 325 73 220 90 -252 87 -472 108 -58 -310 -169 274 -201 37 -15 -15 -229 -125 78 -36
5707 -36 -34 205 -19 86 82 -97 -15 -132 -126 8 22 -258 77 218 7 -168 132 -33 17 209 -176 -72 50
5730 50 -64 -75 308 65 163 59 183 -99 -360 52 -343 -179 -120 -198 -193 116 352 185 -344 108 -13 -133
5752 -133 117 112 -19 -255 -286 -118 -180 -118 -80 110 -185 -119 -23 -4 -28 -15 119 -142 -381 -118 -150 -218 0 71 15
5777 15 -81 -15 -53 74 268 -98 -223 -30 -90 49 167 -55 212 -83 -160 113 -90 279 72 -87 -42 -27 110
5800 110 -246 87 -5 151 -1 215 -179 -280 -32 81 82 -107 -74 -129 208 -246 -31 -71 38 76 -377 86
5822 86 -27 -228 60 72 -104 -157 -34 -222 128 -1 -168 -9 24 48 -31 -61 -257 -111 55 117 133 254 182
5845 182 -126 59 -131 56 106 98 35 -182 -98 -50 -163 217 -380 48 46 118 53 236 -134 -509 102 200 -124 -96
5869 -96 87 -251 -4 -90 34 107 27 231 265 -196 12 -105 -67 6 337 -40 192 -109 -127 -104 130 331 205
5892 205 71 -72 -131 -172 278 128 -146 -83 39 -78 2 134 -23 -92 -73 297 31 136 -27 208 -116 -62
5914 -62 109 -66 -141 -77 -219 136 -13 117 -414 68 -291 -205 -104 -161 77 -25 -135 37 29 -200 340 -107
5936 -107 -135 216 167 -5 -195 189 -52 212 216 -128 -84 -209 -12 313 7 228 84 -86 63 184 -35 -191
5958 -191 9 -214 -58 -44 -114 -304 89 38 5 88 196 -119 17 -157 -194 -201 -126 -190 52 -93 164 67 -232 -158
5982 -158 -182 182 -6 -39 -86 -93 98 75 274 -38 -74 37 11 14 308 17 346 62 -75 -102 155 -8 119 -58
6006 -58 -254 244 19 98 -122 -78 -48 37 -229 -12 -158 190 -35 -103 345 -131 -273 238 -98 -97 -40 282 -110
6029 -110 -67 -238 29 -81 -153 -136 -37 -92 -71 -174 -20 247 -182 -240 -7 -283 103 -67 -274 -117 198 -297
6051 -297 -302 299 294 -39 5 80 112 -65 -131 -79 55 91 -268 155 175 30 379 9 267 104 -140 324 6 -128
6075 -128 242 42 52 -52 90 70 -53 215 -168 -225 -213 136 214 -137 -94 -81 27 94 -247 -76 117 -34 168
6098 168 267 191 136 247 59 110 155 -91 109 4 -267 -115 -270 -66 -248 50 -48 14 282 -81 -105 -45 -64
6121 -64 173 145 61 211 181 205 13 32 45 -249 143 -46 83 -172 -155 -2 18 -26 -37 -83 7 -65 -2 -55 262
6146 262 66 -238 -223 -322 -307 -194 12 -154 -68 87 -217 -130 48 -33 -28 -179 -8 30 -78 3 3 48 -253 94
6170 94 81 -60 265 -64 53 -144 -189 -75 166 -300 292 -54 110 128 -30 8 86 188 75 -9 -146 -98 49
6193 49 -280 -474 26 -48 -7 85 136 216 -419 78 27 -40 -105 99 172 -86 60 -46 50 79 -197 218 -260 -95
6217 -95 174 -213 116 20 60 -73 75 -79 24 -137 95 -377 34 -87 13 -235 28 126 -17 -128 40
6238 40 -199 -45 -79 198 95 36 53 96 6 -65 104 -256 143 -121 -273 -173 -151 146 -71 0 -150 170 148
6261 148 -149 309 97 9 -68 120 133 -179 334 73 -87 -134 -150 281 -230 -39 193 43 -63 179 -425 124
6283 124 -67 -76 -110 58 -88 130 201 -15 137 -75 -157 -63 -95 -278 -149 277 -138 82 175 -45 19 -56 359
6306 359 191 180 112 -87 -87 -74 140 24 -102 -239 -251 -59 283 48 92 106 -48 27 248 -67 160 -138 99
6329 99 -151 -50 -201 173 -114 -65 4 -28 15 20 36 -170 90 -13 258 166 -322 -70 454 22 99 -196 319
6352 319 69 65 -135 1 67 7 23 -39 2 -113 -11 -234 -286 54 -166 71 -74 41 -151 -176 71 -135 3
6375 3 -172 206 29 -39 6 -24 -51 -153 4 73 55 -58 -37 -88 116 22 -127 45 -138 -302 -226 -38 -52 -240
6399 -240 -92 373 39 161 29 -110 -15 -42 112 -32 -24 161 -66 -34 261 -45 166 -105 190 11 -185 133
6421 133 -208 16 -33 -382 30 229 285 109 83 54 -186 -16 25 41 -140 66 106 71 173 344 76 141 -193
6444 -193 -193 -10 28 29 -65 55 -210 -231 42 164 206 68 22 -21 286 55 -36 221 14 117 -176 -239 153 255
6468 255 177 53 -51 -267 242 98 -172 -201 -84 99 56 -182 -175 101 127 -32 76 -291 121 -151 69 213
6490 213 104 129 -181 -394 64 59 -166 -132 -124 116 180 -30 -157 147 168 -14 158 -249 122 126 54 59 45 -60 -219
6515 -219 -66 -172 64 -394 23 91 11 176 -23 -22 98 -170 -256 17 35 83 -369 54 48 -85 222 -99 131
6538 131 77 158 -88 -232 -392 -42 -56 103 -59 86 -164 -13 -64 88 134 -130 132 -168 -236 -227 93 -331 -63
6561 -63 -199 -88 -182 -122 126 -136 -139 -11 -204 -142 -3 172 154 82 -182 31 -281 -26 22 2 -210 -151 129 94
6585 94 -17 82 43 -257 187 344 3 177 -75 -129 167 154 -65 -3 351 10 287 189 -47 -21 -27 234 14
6608 14 -99 22 104 -382 -77 98 -67 -57 -54 74 -49 201 -246 -113 178 -203 103 220 26 15 43 133 -77
6631 -77 -191 77 67 -18 -130 -265 34 75 -146 -62 169 38 -199 97 -164 12 70 -119 -64 -204 -160 69 -74
6654 -74 -16 175 -22 36 308 -18 29 215 -275 60 -3 290 63 -133 124 30 -13 -73 157 320 2 44 85
6677 85 136 -107 165 -102 124 33 -106 56 -2 154 -21 -201 46 129 11 -418 118 4 63 158 -352 276
6699 276 270 -178 -92 -42 63 -76 59 -184 -58 17 -272 -180 -237 22 -55 -192 17 -46 -173 57 -24 -253 -87
6722 -87 277 245 -171 -176 61 -151 -32 343 -178 -64 -67 114 61 -11 165 -65 26 21 -83 -34 -195 -32 -74 177
6746 177 5 20 -100 -198 -70 -201 -156 -178 150 -222 -46 258 -65 -102 6 100 289 32 188 74 301 -84
6768 -84 -16 -14 -37 -2 -141 -11 -166 125 -38 21 -278 -271 33 139 350 10 240 88 -207 -222 178 191 -75 -208
6792 -208 -50 227 -153 218 70 -83 -49 82 105 191 -110 -208 -13 -426 47 256 4 152 -176 137 247
6813 247 -4 70 -145 30 164 30 155 152 160 -49 -84 -95 -200 -165 -22 191 -142 119 -167 -57 -171 195 -310
6836 -310 19 -35 175 11 -45 23 -154 -42 -88 -198 61 20 -233 -91 140 139 90 -136 -121 -20 231 -229 42
6859 42 -65 80 113 313 -119 -157 189 53 -89 -53 -78 -131 -213 -88 166 -62 -222 265 -180 161 191 -31 -49
6882 -49 -273 -48 -230 1 -17 118 -45 -25 196 -116 -247 148 -59 -58 -27 114 84 4 -218 40 -269 74 -39
6905 -39 -448 -60 30 -392 12 71 68 58 78 -202 -151 3 133 -24 254 -29 -5 189 -309 139 -104 77 43
6928 43 -81 -84 -194 212 149 -98 -195 47 -59 114 85 262 -44 105 111 -12 61 -212 -215 194 233 43 37 -53 134
6953 134 -212 127 -104 -177 -151 -386 104 86 214 -147 -65 -105 178 158 -89 214 152 -160 -196 98 24 -62 -204
6976 -204 56 34 -329 130 138 -74 -132 146 36 125 70 -155 -91 -37 11 184 -16 66 -32 -81 -223 -65 -178 102
7000 102 202 9 54 163 -278 -61 -90 196 106 258 159 -170 199 -70 212 -149 58 407 -91 -84 26 -409
7022 -409 8 -130 -50 206 -174 206 131 -38 260 50 240 -26 126 -45 85 12 -30 189 -2 125 -65
7043 -65 228 -208 242 -104 76 -2 64 -91 -3 141 106 148 22 48 64 119 -200 74 -294 -128 -189 308 -189
7066 -189 -13 166 142 -109 57 -39 185 138 -44 -99 -15 94 16 -110 -4 286 146 -82 -139 294 165 166 -70
7089 -70 -59 -36 -115 -233 -123 -96 238 141 -91 141 -113 -31 369 106 -162 -110 206 -80 230 147 121 -301 30
7112 30 81 -71 -393 -33 169 17 -142 106 -137 62 232 -36 -99 -61 -147 -42 258 -9 -152 212 142 -85
7134 -85 93 15 258 -87 139 1 -64 -61 111 4 -144 -4 73 13 3 -150 85 257 238 189 -236 -76 95
7157 95 -267 116 33 -394 59 17 -72 33 -113 22 39 -5 216 105 273 -90 -219 30 7 -27 -53 -1 240
7180 240 67 57 74 -234 -90 34 -403 176 128 37 -13 -341 160 -67 188 188 -123 -191 -24 243 307 31 -12
7203 -12 -314 80 -97 -4 -63 -112 11 85 80 -139 -143 -22 251 -152 -205 102 46 -60 -13 -23 253 -197 -285 -146 -62
7228 -62 111 -153 -261 128 -304 46 393 -111 -45 -156 41 -27 -255 4 10 -87 -51 -103 -119 -104 -84 -6 -290 -235
7252 -235 -65 -25 26 93 335 115 153 5 -138 -6 16 39 309 191 -5 73 62 -180 -155 -109 -195 101 -198 72
7276 72 -41 27 149 101 -123 90 262 21 6 -12 116 289 22 -192 229 -16 164 -57 -14 111 247 -69
7298 -69 -115 -170 -192 300 40 -279 -226 131 -48 -275 -165 -4 77 -95 -106 -52 0 -102 -158 -296 -55 172 -109
7321 -109 -137 21 326 77 -145 90 -173 -153 3 -155 -303 -17 97 -37 -97 -189 13 6 6 248 -91 -43 -53
7344 -53 188 89 106 -107 -134 -203 -130 -131 -15 10 -78 -167 165 -129 205 43 -259 126 -58 -100 -140 -253 -100 21
7368 21 -378 216 -135 -227 -199 48 -150 -84 -55 -29 299 -157 111 -15 96 153 22 -223 -72 128 -157 -57
7390 -57 -124 -59 -107 -38 -124 143 9 -156 -101 60 -165 -95 143 -134 281 13 -13 187 94 -61 -162 402 -103
7413 -103 108 -96 195 245 -82 27 -66 -3 -279 17 -69 38 -154 -348 -183 29 -43 5 124 9 46 25 76
7436 76 -71 -60 -187 -133 51 41 188 -40 40 -311 -118 253 -107 200 66 50 -22 85 -79 -226 -284 134 -69
7459 -69 -85 -68 -49 58 -135 119 67 25 29 125 7 -209 18 -9 -150 -148 8 -17 229 -169 -334 26 248 -152
7483 -152 -19 -99 -48 58 -155 -106 44 192 -32 -99 -315 -28 36 69 -147 82 -65 232 61 65 55 -265 72
7506 72 86 -120 224 170 116 11 -126 -133 -97 44 220 -27 49 103 -199 -87 -222 200 -128 39 132 -200 -103 94
7530 94 -109 159 -164 182 -256 215 -77 -51 -17 29 -110 1 -127 96 81 60 309 -87 173 152 -23 139
7552 139 216 374 -83 257 97 -218 -143 91 -131 -99 39 -172 171 31 198 -62 11 195 242 -60 94 156
7574 156 -158 112 -230 6 205 282 -348 -146 -143 69 -146 -25 -208 -61 -162 -56 -133 -95 136 -26 -52 -38
7596 -38 -135 -134 -196 -50 133 285 106 83 -78 -69 124 -5 -307 39 -121 -72 12 -12 19 -83 -205 0 -70 -104 432
7621 432 162 -27 158 -99 -98 -329 -164 278 -228 -255 160 -209 -66 -220 396 -290 -22 -98 136 -117 -125 -47
7643 -47 -122 81 45 350 47 118 -84 -137 85 11 -43 4 10 -64 -22 106 23 -57 80 -123 -28 304 -93 119 -190
7668 -190 40 59 247 162 390 39 -17 16 -72 110 327 299 -61 103 -193 173 -359 45 -83 -106 -187 250 -363
7691 -363 -57 30 -387 88 336 -17 -225 40 -151 153 -113 5 87 -73 -125 95 -60 -93 -4 214 -19 187
7713 187 245 -240 -114 36 -129 -120 -302 175 147 121 272 262 -100 -283 23 -104 175 -236 2 -51 -4 -55 -179
7736 -179 -96 137 -65 -107 67 -258 166 -141 -91 78 139 34 -62 50 161 -286 142 181 -88 -145 -83 107 -220
7759 -220 382 80 -133 -206 -364 -188 117 351 55 42 -272 33 -197 25 317 139 137 -351 99 9 195 9
7781 9 -67 -185 -73 -184 -16 80 -209 -63 -3 117 206 -96 221 42 352 -33 -78 -153 147 -58 182 -150 -223
7804 -223 -53 124 364 -181 -73 -199 -53 71 98 7 -23 -96 14 92 -29 -226 13 -63 -182 -8 59 49 -28
7827 -28 -181 -45 145 -158 207 105 -218 26 -128 77 143 -271 81 -124 136 80 -245 345 34 54 -65
7848 -65 -183 58 66 188 -42 312 157 100 21 -52 -266 -36 -91 229 -177 53 293 -46 134 175 -55 128 18
7871 18 220 -73 -140 102 55 40 52 88 203 34 45 261 -210 20 -57 -153 -4 165 76 -62 -156 73 -92 177
7895 177 -222 190 -61 -183 140 -37 -278 46 222 19 -11 -172 -108 -198 163 135 -107 -204 111 179 -91 -10
7917 -10 8 -7 -31 125 -83 -48 279 63 86 261 -64 -124 -224 4 439 50 -129 -87 -206 69 -18 -95 47
7940 47 86 -158 -47 155 -192 110 -124 262 267 -57 -92 -366 -66 -1 74 -41 -187 -6 -142 -4 -141 -52 1
7963 1 24 -107 -1 -88 110 120 207 102 -110 -157 102 64 -156 38 112 -370 -370 -197 -64 15 -79 -184 197 170 -68
7988 -68 79 220 101 107 42 79 -59 -131 32 14 79 -79 -9 295 16 181 -93 -337 -401 31 -201 -81 -45 -279
8012 -279 58 -131 -88 -260 -355 149 -235 -220 -225 35 -262 225 174 -7 -35 -140 -178 118 -232 118 -226 -52 125
8035 125 296 558 168 1 -129 86 -46 -214 246 -278 26 -167 -338 -3 -49 75 228 -46 26 1 -30
8056 -30 160 -46 -32 -189 17 -289 180 -252 106 -67 -213 9 226 -91 53 -162 166 -114 115 88 -83
8077 -83 120 -1 98 27 102 -56 -150 -20 89 23 44 -41 -90 68 66 150 -227 -271 -24 -26 -3 219 214 -93 -172 -32
8103 -32 -215 -4 211 56 -56 134 191 103 -297 200 -218 -153 77 -205 66 427 19 20 -45 24 95 50 83 92
8127 92 59 168 -84 -3 153 110 68 -126 104 -12 -2 -51 150 52 262 -141 180 46 115 -3 127 217 177 0
8151 0 34 114 -11 236 65 -128 261 85 -2 342 -136 -30 142 -276 278 -35 -31 -137 -153 -41 209 131 158
8174 158 148 -251 53 158 -153 -125 104 -90 -171 149 199 -236 197 113 81 335 -119
8191a19
##END NTUPLES=NMR FID
##END=
