##TITLE=1H_LR-684B-C1-TFA
 CDCl3+TFA, 8 sc, 
 30.7.2019
##JCAMPDX= 6.0         $$ Bruker NMR JCAMP-DX V2.0
##DATA TYPE= NMR FID
##DATA CLASS= NTUPLES
##ORIGIN= UXNMR, Bruker Analytische Messtechnik GmbH
##OWNER= root
$$ XWIN-NMR		Version 3.5
$$ Tue Jul 30 16:35:18 2019 Russian Standard Time (UT+4h)  she@DPX200
##.OBSERVE FREQUENCY= 200.13155
##.OBSERVE NUCLEUS= ^1H
##.DELAY= (6, 6)
##.ACQUISITION MODE= SIMULTANEOUS
##.ACQUISITION SCHEME= undefined
##.AVERAGES= 8
##.DIGITISER RES= 18
##SPECTROMETER/DATA SYSTEM= spect
##.PULSE SEQUENCE= zg30
##.SOLVENT NAME= CDCl3
##.SHIFT REFERENCE= (INTERNAL, CDCl3, 0, 15.7039)
##AUDIT TRAIL= $$ (NUMBER, WHEN, WHO, WHERE, WHAT)
$$ ##TITLE= Audit trail, XWIN-NMR		Version 3.5
$$ ##JCAMPDX= 5.01
$$ ##ORIGIN= Bruker BioSpin GmbH
$$ ##OWNER= she
$$ F:/spectra/data/she/nmr/H-F/1/audita.txt
$$ ##AUDIT TRAIL=  $$ (NUMBER, WHEN, WHO, WHERE, WHAT)
(   1,<2019-07-30 16:33:57.76 +0400>,<she>,<DPX200>,
      <created by zg, POWCHK disabled, PULCHK disabled
       configuration hash MD5:
       00 E9 B6 7A A2 85 ED C7 34 08 36 98 17 FE 4E 26
       data hash MD5: 16K
       06 F9 17 15 23 06 51 32 8A D9 0E 0F 29 E9 80 10>)
$$ ##END=
$$ 
$$ hash MD5
$$ 76 71 11 7E E4 D6 6B AD 63 23 70 21 E7 90 E8 96
##$RELAX= 
##$RELAX= 
##$RELAX= 
##$RELAX= 
##$RELAX= 
##$RELAX= 
$$ Bruker specific parameters
$$ --------------------------
##$DU= <F:/spectra>
##$EXPNO= 1
##$NAME= <H-F>
##$PROCNO= 1
##$TYPE= <nmr>
##$USER= <she>
##$AMP= (0..31)
100 100 100 100 100 100 100 100 100 100 100 100 100 100 100 100 100 100 
100 100 100 100 100 100 100 100 100 100 100 100 100 100 
##$AQSEQ= 0
##$AQ_mod= 1
##$AUNM= <au_zg>
##$AUTOPOS= <>
##$BF1= 200.13
##$BF2= 200.13
##$BF3= 200.13
##$BF4= 200.13
##$BF5= 200.13
##$BF6= 200.13
##$BF7= 200.13
##$BF8= 200.13
##$BYTORDA= 1
##$CFDGTYP= 0
##$CFRGTYP= 5
##$CHEMSTR= <none>
##$CNST= (0..31)
1 1 145 1 1 1 1 1 1 1 1 1 1 1 1 1 1 1 1 1 1 1 1 1 1 1 1 1 1 1 1 1 
##$CPDPRG= <>
##$CPDPRG1= <>
##$CPDPRG2= <>
##$CPDPRG3= <>
##$CPDPRG4= <mlev>
##$CPDPRG5= <mlev>
##$CPDPRG6= <mlev>
##$CPDPRG7= <mlev>
##$CPDPRG8= <mlev>
##$CPDPRGB= <>
##$CPDPRGT= <>
##$D= (0..31)
0 1.2 0 0 0 0 0 0 0 0 0 0.03 0 0 0 0 0 0 0 0 0 0 0 0 0 0 0 0 0 0 0 0 
##$DATE= 1564490037
##$DBL= (0..7)
120 120 120 120 120 120 120 120 
##$DBP= (0..7)
150 150 150 150 150 150 150 150 
##$DBP07= 0
##$DBPNAM0= <>
##$DBPNAM1= <>
##$DBPNAM2= <>
##$DBPNAM3= <>
##$DBPNAM4= <>
##$DBPNAM5= <>
##$DBPNAM6= <>
##$DBPNAM7= <>
##$DBPOAL= (0..7)
0.5 0.5 0.5 0.5 0.5 0.5 0.5 0.5 
##$DBPOFFS= (0..7)
0 0 0 0 0 0 0 0 
##$DE= 6
##$DECBNUC= <off>
##$DECIM= 24
##$DECNUC= <off>
##$DECSTAT= 4
##$DIGMOD= 1
##$DIGTYP= 9
##$DL= (0..7)
0 120 120 120 120 120 120 120 
##$DP= (0..7)
150 150 150 150 150 150 150 150 
##$DP07= 0
##$DPNAME0= <>
##$DPNAME1= <>
##$DPNAME2= <>
##$DPNAME3= <>
##$DPNAME4= <>
##$DPNAME5= <>
##$DPNAME6= <>
##$DPNAME7= <>
##$DPOAL= (0..7)
0.5 0.5 0.5 0.5 0.5 0.5 0.5 0.5 
##$DPOFFS= (0..7)
0 0 0 0 0 0 0 0 
##$DQDMODE= 0
##$DR= 18
##$DS= 0
##$DSLIST= <SSSSSSSSSSSSSSS>
$$ [...]
##$SUBNAM2= <"">
##$SUBNAM3= <"">
##$SUBNAM4= <"">
##$SUBNAM5= <"">
##$SUBNAM6= <"">
##$SUBNAM7= <"">
##$SUBNAM8= <"">
##$SUBNAM9= <"">
##$SW= 24.9336996594482
##$SWIBOX= (0..15)
0 0 2 0 0 0 0 0 0 0 0 0 0 0 0 0 
##$SW_h= 4990.01996007984
##$TD= 16384
##$TD0= 1
##$TE= 0
##$TE2= 300
##$TE3= 300
##$TEG= 300
##$TL= (0..7)
0 120 120 120 120 120 120 120 
##$TP= (0..7)
150 150 150 150 150 150 150 150 
##$TP07= 0
##$TPNAME0= <>
##$TPNAME1= <>
##$TPNAME2= <>
##$TPNAME3= <>
##$TPNAME4= <>
##$TPNAME5= <>
##$TPNAME6= <>
##$TPNAME7= <>
##$TPOAL= (0..7)
0.5 0.5 0.5 0.5 0.5 0.5 0.5 0.5 
##$TPOFFS= (0..7)
0 0 0 0 0 0 0 0 
##$TUNHIN= 0
##$TUNHOUT= 0
##$TUNXOUT= 0
##$USERA1= <user>
##$USERA2= <user>
##$USERA3= <user>
##$USERA4= <user>
##$USERA5= <user>
##$V9= 5
##$VALIST= <valist>
##$VCLIST= <CCCCCCCCCCCCCCC>
##$VD= 0
##$VDLIST= <DDDDDDDDDDDDDDD>
##$VPLIST= <PPPPPPPPPPPPPPP>
##$VTLIST= <TTTTTTTTTTTTTTT>
##$WBST= 1024
##$WBSW= 4
##$XGAIN= (0..3)
0 0 0 0 
##$XL= 0
##$YL= 0
##$YMAX_a= 307747
##$YMIN_a= -445476
##$ZGOPTNS= <>
##$ZL1= 120
##$ZL2= 120
##$ZL3= 120
##$ZL4= 120
##$ABSF1= 10
##$ABSF2= 0
##$ABSG= 5
##$ABSL= 3
##$ALPHA= 0
##$AQORDER= 0
##$ASSFAC= 0
##$ASSFACI= 0
##$ASSFACX= 0
##$ASSWID= 0
##$AUNMP= <proc_1d>
##$AZFE= 0.1
##$AZFW= 0.1
##$BCFW= 1
##$BC_mod= 2
##$BYTORDP= 1
##$COROFFS= 0
##$CY= 11.3945322036743
##$DATMOD= 1
##$DC= 2
##$DFILT= <>
##$DTYPP= 0
##$F1P= 20.1537800932815
##$F2P= 0.134698688090026
##$FCOR= 0.5
##$FTSIZE= 0
##$FT_mod= 4
##$GAMMA= 1
##$GB= 0.15
##$INTBC= 1
##$INTSCL= 1
##$ISEN= 128
##$LB= 0.24
##$LEV0= 0
##$LPBIN= 0
##$MAXI= 10000
##$MC2= 0
##$MEAN= 0
##$ME_mod= 0
##$MI= 1.114404
##$NCOEF= 0
##$NC_proc= 0
##$NLEV= 6
##$NOISF1= 3.799351
##$NOISF2= 2.8
##$NSP= 1
##$NTH_PI= 0
##$NZP= 0
##$OFFSET= 15.70392
##$PC= 1
##$PHC0= -9223.506
##$PHC1= 16.00097
##$PH_mod= 1
##$PKNL= yes
##$PPARMOD= 0
##$PSCAL= 0
##$PSIGN= 0
##$REVERSE= no
##$SF= 200.130013532006
##$SI= 16384
##$SIGF1= 3
##$SIGF2= 2
##$SINO= 400
##$SIOLD= 16384
##$SREGLST= <1H.CDCl3>
##$SSB= 0
##$STSI= 0
##$STSR= 0
##$SW_p= 3612.71676300578
##$SYMM= 0
##$S_DEV= 0
##$TDeff= 0
##$TDoff= 0
##$TI= <>
##$TILT= no
##$TM1= 0
##$TM2= 0
##$TOPLEV= 0
##$USERP1= <user>
##$USERP2= <user>
##$USERP3= <user>
##$USERP4= <user>
##$USERP5= <user>
##$WDW= 1
##$XDIM= 8192
##$YMAX_p= 0
##$YMIN_p= 0
$$ End of Bruker specific parameters
$$ ---------------------------------
##NTUPLES= NMR FID
##VAR_NAME=  TIME,          FID/REAL,        FID/IMAG
##SYMBOL=    X,             R,               I
##VAR_TYPE=  INDEPENDENT,   DEPENDENT,       DEPENDENT
##VAR_FORM=  AFFN,          ASDF,            ASDF
##VAR_DIM=   8192,          8192,            8192
##UNITS=     SECONDS,       ARBITRARY UNITS, ARBITRARY UNITS
##FACTOR=    0.0002004,     1,               1
##FIRST=     0,             0,               0
##LAST=      1.6414764,     0,               0
##MIN=       0,             -445476,         0
##MAX=       1.6414764,     307747,          0
$$ Real data points
##PAGE= N=1
##DATA TABLE= (X++(R..R)), XYDATA
0 0 0 0 0 -8 8 -8 8 -16 16 -24 25 -33 48 -56 69 -80 96 -120 137 -161 190 -222 257 -297 340 -391 446
27 446 -508 573 -649 730 -822 921 -1029 1149 -1283 1425 -1584 1757 -1950 2159 -2391 2643
43 2643 -2930 3245 -3599 3998 -4454 4976 -5581 6293 -7150 8201 -9518 11239 -13585 16996
57 16996 -22431 32506 -57582 252245 307747 -84691 95306 72336 -138200 -167471 155853
68 155853 272836 182614 102214 40774 -164817 -211404 -27857 64354 -75490 -71604 82606
79 82606 36263 -199059 -213022 -67002 -80816 -180561 -104327 -30508 -141635 -224641 -120965
90 -120965 -64966 -140796 -151207 -100180 -172575 -252887 -167358 -80674 -131079 -95810 79595 70749
102 70749 -172558 -256398 -90294 -16192 -94215 -38952 123029 115513 -6582 -15706 12827 -42585
114 -42585 -23990 118170 146591 36612 52028 175199 143147 21617 64756 164880 103630
125 103630 36821 140900 218316 130979 98778 203092 196864 45677 11429 107650 102075 32598
137 32598 93013 175353 107729 37544 91050 74957 -72834 -91218 60502 87868 -35117
148 -35117 -30286 80962 32495 -115189 -108086 -22895 -61270 -116407 -48547 -8712 -96273 -130937
160 -130937 -55259 -64675 -173971 -173040 -75434 -83447 -151042 -98856 -14907 -62400 -133559 -97020
172 -97020 -72906 -137510 -141645 -47729 -19553 -68169 -43869 18083 -20321 -84988 -46592 3493
184 3493 -32908 -42128 39494 71787 15841 16128 76691 53237 -13285 29117 111395 85788 42346
197 42346 105448 154788 83437 31816 87636 111307 53097 53203 121763 119499 69825 92222 126632
210 126632 67301 13512 59807 89518 29434 10784 82521 98249 24044 595 39317 19466
222 19466 -36787 -19243 19510 -11915 -39451 -2056 -1137 -72451 -90094 -35427 -41683 -102135 -85100
235 -85100 -21680 -40396 -97335 -81214 -51067 -89465 -120219 -81223 -59541 -90636 -81675 -31200
247 -31200 -43387 -94864 -78863 -33901 -59610 -93912 -47816 1835 -22874 -42517 -3412 7670
259 7670 -31450 -27929 18090 15935 -7940 30501 75667 45119 8025 41441 69959 33695 16556
272 16556 63996 90257 64612 63750 92180 77891 41780 54215 77876 53606 36805 76779
284 76779 100600 63403 38974 60014 57331 19119 11669 36291 35019 21683 34354 38714 6029
297 6029 -14538 -726 -7235 -40237 -38149 -3532 -3189 -32151 -31477 -18700 -41724 -71539 -63307 -51302
311 -51302 -64131 -60769 -31145 -29746 -59384 -63832 -46426 -61177 -88405 -72089 -35870 -33297 -44535
324 -44535 -29986 -15625 -31459 -47826 -42160 -36256 -37267 -20880 3908 8636 4039 12888 17212
337 17212 -833 -13389 -927 14815 20667 33241 48302 47113 40202 43101 36700 16164 17049
350 17049 46309 59164 45146 47393 70697 66785 32178 16293 28991 30740 20747 31500 51970
363 51970 49863 36433 34698 28589 2155 -14775 -1282 12119 5520 3263 18940 24632 4376
376 4376 -19894 -28316 -28421 -29819 -30433 -23802 -14229 -7360 -11067 -26331 -41706 -46414 -45862 -46863 -43146
391 -43146 -29600 -17590 -15634 -18905 -24870 -37994 -49782 -47909 -37754 -32474 -24744 -5767 8956
404 8956 660 -18458 -24699 -19974 -21986 -26742 -17265 5889 20238 18809 14019 13354 10197 1898 -2547
419 -2547 2228 13556 26006 37003 41596 34964 23601 17687 16223 12206 9432 21363 41592 47773
433 47773 36730 28606 29512 24161 7346 -2123 7018 21862 27925 28895 30291 28050 17233 2541
447 2541 -8837 -13439 -11321 -2770 7204 10108 4446 -847 -4358 -13202 -27910 -34171 -23938 -11857
461 -11857 -11438 -13692 -9336 -6838 -19446 -35419 -38647 -33768 -30085 -23618 -11159 -5082 -9879 -15004
475 -15004 -16796 -25364 -37408 -35577 -20546 -10731 -10014 -3616 6489 6195 -4536 -13290 -13703 -10615 -4645
490 -4645 3218 10014 16038 21887 21418 9954 1125 5900 11265 10261 12473 23854 30584 26528 21005
505 21005 16984 10584 5921 11605 17886 16508 20325 33930 35414 16681 3351 8872 9934 -1774
519 -1774 -6196 7568 18727 15015 8324 5186 -80 -6640 -9326 -11786 -14705 -9367 718 1153 -7824
534 -7824 -11778 -10025 -14013 -20941 -20881 -16154 -11980 -6996 -4207 -10259 -17671 -16434 -14758 -22267 -25769 -14131
550 -14131 -2888 -5575 -8588 -2435 -1784 -10982 -14229 -8742 -9088 -11069 -330 10377 5687 -481 6703
565 6703 10622 -588 -6870 3513 10547 5696 5848 13242 11578 4820 7396 10732 3194 621 13643
580 13643 20352 9315 4659 15711 16976 2076 -3379 6207 9081 4065 6681 11780 6877 2663
594 2663 7866 5318 -6899 -7248 4868 4640 -6403 -4601 6626 4313 -6516 -5650 -538 -4056 -6319
609 -6319 -128 -746 -8013 -5743 1226 -5484 -14285 -6340 3591 -4207 -11899 -2344 3770 -6367 -11126
624 -11126 -2787 -1758 -10230 -7486 2569 -1266 -8393 -251 6904 -4535 -11938 223 7562 -3248
638 -3248 -8156 2304 4873 -4541 -5265 1582 -558 -3704 4625 8245 -1904 -4258 7550 7780 -5479
653 -5479 -7182 5256 6885 -483 2980 9150 3638 -188 7677 5371 -8637 -5345 12821 11881 -5486
668 -5486 -2230 14675 9081 -8215 -4137 9234 3919 -3549 6645 12013 -552 -3741 7749 5642
682 5642 -10180 -7851 7534 5923 -4413 1393 10243 1414 -8490 -2132 -432 -9642 -7668 6083
696 6083 4793 -5798 -887 7022 -4186 -14046 -3697 2978 -8209 -9887 6518 8688 -7720 -8901
710 -8901 4028 -1198 -16093 -8601 6363 -49 -7146 5542 11808 -5984 -14536 441 5065 -9807
724 -9807 -9731 8821 12467 6 -1096 4972 -1116 -7384 412 2731 -6238 -1539 15278 13060 -4616
739 -4616 -4429 7950 2488 -10039 -4385 6633 4251 3820 11707 6720 -7938 -4429 8462 -471
753 -471 -14782 -1216 17794 8735 -6861 1456 10141 -3442 -11773 256 3390 -7151 -1045 15356
767 15356 8628 -9567 -3841 8891 -2901 -16251 -2901 11034 2496 -2678 8166 7463 -7493
780 -7493 -7860 3668 -1588 -11881 -766 12940 3743 -5736 3544 6579 -7944 -12279 717 1426
794 1426 -7744 -407 12044 3235 -9488 -1217 4053 -10034 -14970 3243 8587 -6315 -6131 10356
808 10356 6316 -13240 -10951 3443 -1047 -12135 -2247 9186 1594 -4571 4554 3272 -11281 -9598
822 -9598 5462 3431 -8688 -479 14887 7091 -6471 -1111 5536 -1839 -4497 4790 5817 -269
836 -269 6215 14258 2992 -7792 2909 11134 -1288 -7318 7942 14796 1949 -1619 9160 6065
850 6065 -7218 -2736 8601 2043 -6498 5063 13636 297 -8645 2460 5184 -8412 -9860 3168
864 3168 3278 -6966 -3440 5775 -2215 -11629 -3614 1849 -8203 -12499 368 3560 -7649 -8362 1333
879 1333 -1456 -11153 -6978 1112 -4810 -8315 1279 3692 -6660 -7387 4099 1940 -10110 -6159 7042
894 7042 4348 -5828 -115 8812 2874 -3679 2802 6376 -1106 -946 8475 6370 -2172 2991 12820
909 12820 6364 -3652 2862 10998 3399 -2739 5106 9325 2055 316 6570 4906 -1455 2355 7628
924 7628 891 -4697 2807 7434 -670 -4396 2591 4041 -4943 -6135 1150 220 -5454 -1866 2561
939 2561 -2991 -7395 -1162 1418 -7069 -8977 -1510 -148 -6770 -5203 1951 -303 -5755 -3785 -1829
954 -1829 -6606 -7624 -111 1060 -5063 -4361 3563 1704 -6367 -4701 2724 320 -5015 -831 4477
969 4477 1590 -589 4221 3235 -3813 -2939 4792 4058 -1853 2170 9615 5543 -2131 -220 4848 1469
985 1469 -1659 2425 5576 3255 4095 7066 4189 -619 822 3700 202 -2282 3655 7777 3588
1000 3588 418 2873 2608 -2461 -2094 1104 210 -1819 2419 5152 256 -3938 -234 617 -5649 -7110
1016 -7110 -70 3254 -496 -1876 329 -1092 -5732 -5591 -3588 -5189 -5243 -954 1012 -2298 -3568 -392
1032 -392 -1478 -6377 -7414 -3552 -2002 -1496 -51 1127 -1172 -1876 -1159 -3044 -5040 -1946 2762 2049
1048 2049 -437 1697 4553 1495 -1648 -488 1355 60 1266 5486 5974 4187 4479 5454 1745 -1831
1064 -1831 864 5386 4696 2923 5381 7690 4718 1852 1542 1704 480 895 3047 2840 2431 3606
1080 3606 3664 -126 -3164 -2099 -716 -1380 -1244 691 883 -274 -1793 -3287 -5354 -5195 -3542 -3143 -4661
1097 -4661 -2802 -108 -1028 -4572 -5567 -4191 -4628 -6150 -4614 -1612 -1211 -1643 -1063 -2048 -3968 -4251 -2310
1114 -2310 -1205 -2243 -964 2442 2513 230 -578 618 1427 285 -242 1973 4443 4887 4014 3194 2836
1131 2836 2683 2250 1773 2485 3660 5021 5400 4842 3472 2484 2594 2598 1496 846 2260 4071 3695 1499
1149 1499 563 1074 987 -1490 -1855 -623 875 622 -455 -1264 -1474 -1723 -2787 -3197 -3529 -2491 -1731 -1702
1167 -1702 -2439 -2852 -2840 -2686 -3488 -4313 -4256 -2326 -736 -1595 -2844 -2318 -1032 -2391 -3702 -2740 -1052 132
1185 132 -497 -856 -309 0 -107 -320 -749 -83 1458 2044 1667 1306 1871 2059 1473 836 1085 1696 2797
1204 2797 3245 2695 1847 2512 2781 1570 319 1450 3379 3043 1947 1879 3014 1676 625 773 815 255
1222 255 990 2424 1611 -199 180 773 -140 -2431 -1435 546 408 -750 -411 -264 -836 -1954 -2057 -2639
1240 -2639 -2848 -1388 69 -793 -2327 -1085 -1054 -2436 -3983 -2890 -1330 -1177 -1003 -546 -852 -1149 -1025
1257 -1025 -1841 -3298 -2521 -316 323 -624 -5 1066 1022 -761 -1616 -795 -167 853 1942 1725 1905 2016
1275 2016 2370 327 -939 287 1997 1914 1661 2825 3898 2673 1327 1001 829 239 798 2574 2353
1292 2353 2266 3089 3439 1149 -924 -333 897 107 -174 1285 2268 1625 185 -459 -1617 -2244 -1810 -750
1310 -750 -1156 -754 489 445 -1440 -2804 -2743 -2910 -3520 -2837 -1187 -819 -710 -462 -1456 -3280 -3318 -2456 -2642
1329 -2642 -3103 -1414 984 1201 -588 -1265 -1024 -1539 -1970 -1514 -365 629 1955 2687 1310 180 301
1346 301 644 -166 -644 1056 3230 3454 2698 2578 2268 941 710 748 574 1030 3310 4351 2490 1363
1364 1363 1720 1243 -525 -955 370 1255 1504 1493 2338 1276 -112 -600 -975 -2362 -1736 -458 965 434
1382 434 -333 -533 -836 -2295 -3363 -2693 -1920 -1334 -740 -199 -370 -1302 -1592 -2485 -3240 -2866 -1609 -646 -556
1401 -556 139 144 -114 -1268 -1724 -1955 -1721 -453 813 902 679 1853 1918 -241 -1780 -395 740 370 387
1420 387 2147 2970 1956 1337 821 396 -406 440 1761 1635 1139 2546 3281 1096 -840 -368 485 396
1438 396 -335 901 1894 1907 1199 404 -624 -1455 -573 -105 -255 23 1388 1490 -95 -695 -1099 -1341 -1874
1457 -1874 -980 -346 -434 -190 765 11 -1961 -2178 -1065 -1185 -1934 -1080 724 789 -541 -447 -683 -1688 -2130
1476 -2130 -1062 -796 -703 190 1204 467 -729 -460 19 -858 -1458 -209 1219 707 400 1104 199 -340
1494 -340 -94 330 -101 -354 1564 2183 744 38 919 1245 -645 -788 854 1680 975 902 1931 1108 276
1513 276 484 620 -253 -292 1139 2074 812 337 1212 1144 -908 -1091 -296 209 4 514 369 -147 -751 -210
1533 -210 -740 -1729 -1015 -141 -413 -982 -494 -78 -857 -1572 -1280 -1481 -1773 -802 391 -200 -1274 -673 -79
1552 -79 -1571 -2119 -1080 -58 -580 -774 297 659 -897 -309 14 -380 -1044 243 1499 845 378 993
1570 993 1723 164 -511 680 1448 801 1054 1708 1777 914 1052 949 -275 136 1225 1435 566 844 1543
1589 1543 1482 -30 -805 44 113 -279 424 1048 337 185 270 -529 -1567 -1585 -195 -273 -913 -298 220 -244
1609 -244 -1678 -1538 -1210 -1897 -1596 -482 -431 -914 -359 248 -1115 -2060 -1284 -612 -1185 -1261 18 972 108
1628 108 -464 -180 -436 -1207 -416 513 66 547 1494 1846 602 -467 194 420 -36 1 1284 1408 984
1647 984 1070 990 107 -449 472 868 210 520 1745 2037 728 -38 438 -129 -583 -262 446 809 799 965
1667 965 477 -721 -882 -253 -810 -1322 -552 797 380 -105 -196 49 -680 -1572 -1184 -699 -675 145 681 246
1687 246 -842 -847 -600 -1147 -1711 -922 362 389 225 403 216 -905 -723 -875 -1072 -667 259 1182 457 6
1707 6 339 219 -843 -1002 -386 485 135 603 1422 801 318 -209 -11 -673 -610 709 1345 677 866 1280
1727 1280 709 -141 -852 -36 112 430 676 1165 845 794 448 -128 -567 -543 177 504 415 921 965 477 -356
1748 -356 -279 -799 -872 -182 411 256 -161 297 334 -316 -1543 -809 -538 -568 -409 -14 261 108 -371 -1085 -1068
1769 -1068 -1381 -1187 -477 -154 -189 359 221 -390 -735 -817 -717 -694 -243 65 258 746 251 -143 -448 -761 -283
1790 -283 33 118 968 1210 1064 556 296 302 -106 -176 -77 662 1081 1149 1309 769 77 -227 231 51 217 660
1812 660 1149 906 569 464 -128 -291 -473 -642 -46 185 117 463 285 -431 -314 -691 -478 -1175 -550 -213
1832 -213 178 -72 -230 -960 -759 -1008 -774 -875 -281 28 227 -16 -208 -529 -537 -704 -903 -288 314 561 691
1853 691 291 180 -154 -211 -56 -372 -45 571 686 750 495 360 429 5 -162 -111 676 986 616 732 495
1874 495 619 -49 29 -110 402 554 559 469 601 509 46 -234 -686 -258 -6 246 -25 -2 294 328 -259 -455
1896 -455 -587 -300 -134 -35 -132 96 -213 -356 -531 -837 -611 -458 71 225 -165 27 175 -100 -525 -984 -746
1917 -746 25 297 284 117 -159 476 -173 -285 -496 -65 163 -40 -60 215 603 126 -83 -592 -427 -92 278
1938 278 111 207 515 441 -49 -436 -274 -88 -113 175 385 588 580 164 -229 -206 -402 180 120 55 336 449 564
1961 564 -104 88 -131 -303 -268 128 157 470 540 286 131 -180 -289 -456 -161 -60 0 269 422 288 -77
1982 -77 -339 -589 -562 -592 -373 -111 239 424 47 -584 -688 -501 -1014 -478 -79 142 473 -36 34 -338 -869
2003 -869 -583 -437 -317 -120 518 585 581 -24 -268 -347 -324 -436 -8 671 768 721 411 -131 64 -39 208 -148
2025 -148 187 693 754 674 301 418 74 -77 -8 -88 165 648 659 566 253 306 -76 -630 -554 -427 221 257 287
2048 287 190 261 77 -550 -845 -883 -446 -306 121 75 52 -230 -470 -649 -668 -453 -480 -15 349 316 128 -54 -452
2071 -452 -404 -1077 -429 268 211 221 238 154 571 -505 -535 -255 -113 250 369 508 671 334 369 173 -268 -121
2093 -121 7 510 -34 613 530 525 163 -358 -373 39 131 128 548 356 190 490 -192 -655 -320 -282 -78 -138 256
2116 256 562 244 41 -130 -431 -403 -318 29 -267 150 532 399 -61 -529 -445 -417 -390 -146 204 508 501 213
2138 213 -50 -405 -382 -513 -178 -170 232 493 252 112 65 -369 -260 -538 -173 40 98 229 344 205 -490 -666
2160 -666 -197 -318 -487 -238 -48 182 276 -109 206 -238 -864 -390 -216 296 238 204 132 104 17 84 -68 -43 -72
2183 -72 480 400 177 446 167 318 196 -27 -59 139 480 388 220 515 293 445 -256 -439 39 -13 550 159
2205 159 332 -77 -48 -161 -182 -344 -188 51 271 -332 -213 -16 48 -328 -590 -351 -209 -85 -103 -159 -149 -18
2227 -18 -264 -498 -942 -582 -4 22 -164 1 286 307 -221 -297 -299 -439 -29 -18 371 204 -103 42 -62 -218
2249 -218 -128 380 86 174 424 639 -94 366 24 181 -69 269 717 576 378 42 360 -138 -120 -249 302
2270 302 -7 249 632 235 327 330 -33 -686 -260 226 -154 -21 167 132 288 -237 -342 -405 -639 -188 158 169
2292 169 302 92 9 -225 -598 -453 -184 22 -393 111 201 61 -252 -206 -354 -652 100 -232 122 206 57
2313 57 462 -61 -282 -198 127 -202 22 61 430 113 -45 -91 -256 -481 -104 252 -205 134 538 248 23
2334 23 -221 -116 215 -384 -251 12 55 100 238 85 40 -309 -14 42 -51 88 668 562 88 55 194 118 -66
2357 -66 -155 204 286 698 681 100 -245 108 -61 -137 -251 29 33 421 257 -87 -167 -73 -527 -423 -261 -272 55
2380 55 164 26 -185 -333 -242 -517 -706 -531 -25 82 -62 -390 -343 -106 -206 -646 -884 -475 -108 88 -19
2401 -19 41 142 68 -52 -23 -211 178 82 317 238 329 193 -176 -105 -204 189 582 368 327 447 484 628 115 195
2425 195 208 26 202 564 958 567 575 567 269 -102 -101 175 125 103 363 73 295 -162 -444 -185 -200 107 171 -126
2449 -126 99 38 -48 -330 -363 -593 -195 -661 -370 -560 -95 -142 -424 -172 -235 -451 -562 -162 -371 105 -172 199
2471 199 -136 -244 -391 -52 -122 -169 161 -115 -2 183 120 48 182 -58 11 64 241 558 154 513 208 610
2493 610 93 -2 253 306 425 478 502 176 75 -34 323 -121 166 458 116 136 11 74 23 103 -242 -63 319
2516 319 153 106 145 256 -225 -69 224 -127 -467 -222 -130 115 18 -180 -27 34 -131 -163 -389 -403 167 25
2538 25 -162 -145 -169 -290 -372 -152 -338 -282 -45 -258 -216 -413 -509 -282 -283 -140 -293 -160 94 138 60 237 -313 13
2562 13 -80 87 -127 285 51 333 -87 27 232 189 198 360 405 747 270 257 238 172 366 45 174 231 322 698
2586 698 172 168 518 43 173 193 346 222 339 436 122 267 378 -87 -444 146 -203 -180 -236 -271 -136 -365
2608 -365 2 -421 -346 -241 -193 -386 -122 -260 -135 -159 -185 -763 -798 -331 -358 -208 -274 -133 -335 -347 -237 -43 -175
2631 -175 -66 -214 -179 100 80 113 38 -327 -77 201 393 171 206 193 304 289 194 424 223 314 447 298 743
2654 743 570 568 236 507 360 25 408 215 436 87 65 261 21 -219 -239 -127 79 -96 -92 -235 115 138
2676 138 -123 -192 -373 -176 -307 -422 -244 -30 -260 -203 -306 -385 -344 -154 -322 -255 -26 -197 -179 130 -261 -521
2698 -521 -274 -320 -398 -33 -185 226 -64 -266 204 -4 -129 -382 -158 190 73 221 50 -28 351 -19 -230
2719 -230 5 -179 146 328 408 262 311 424 62 134 390 103 652 600 765 432 365 273 247 95 -167 270
2741 270 329 220 222 82 143 -113 82 -89 -361 54 -40 85 217 216 142 -300 -182 -55 -53 -133 49 -1 144 -340
2765 -340 -230 -278 -373 -708 -278 -103 -420 -251 -131 -178 -576 -594 -406 -239 -92 -110 -36 -151 37 -60 -286 -438
2787 -438 -174 -417 -66 14 -197 294 78 23 -55 -317 123 151 124 409 379 424 144 120 120 70 -66 582 543 398
2811 398 292 826 522 265 197 290 248 411 261 463 403 500 156 -10 -165 46 300 -106 135 -53 -111 245
2833 245 -208 -185 -440 -100 49 -525 -251 -197 -218 -336 -732 -600 -528 -400 -398 -381 -611 -403 -272 -430 -224 -481
2855 -481 -247 -184 -475 -391 -217 -155 -189 -251 -142 -324 66 192 432 371 -145 309 250 -83 220 317 206 140 52
2878 52 577 490 394 369 221 410 235 -8 129 104 437 291 432 312 200 389 4 77 207 244 384 64
2900 64 149 -72 -125 34 150 -287 -332 9 31 -91 -228 -261 -144 -342 -252 -412 -355 -294 -319 -178 -195 -94 -71 -527
2924 -527 -501 -346 32 230 -247 36 -82 -237 -45 -306 -394 134 15 59 -193 -28 52 -57 34 -205 9 170
2946 170 158 443 289 364 -35 46 -32 125 311 544 171 279 85 174 152 -141 -10 -2 127 194 263 413 370 244
2970 244 115 150 69 301 237 106 177 3 148 175 39 -226 -211 170 -1 477 70 -138 346 -240 -142 -537
2992 -537 -684 -245 -132 74 -169 144 -140 -602 -280 -407 -506 -228 -231 -136 -294 -425 -413 -16 -485 -498 -299 -246
3014 -246 -30 -109 -109 30 59 -156 -117 -134 -19 124 -174 381 282 416 277 -20 29 261 257 137 281 514 361
3037 361 529 291 364 222 104 544 23 316 416 568 660 363 283 -95 129 -163 -25 141 564 106 147
3058 147 -16 -234 -161 -248 -234 -124 54 146 -195 -481 -281 -249 -394 -168 -711 -534 -133 -172 -341 -420 -468 -158 -225
3081 -225 -402 -410 12 130 -3 -118 20 10 -137 -19 -58 -11 -5 135 212 57 209 -188 16 115 -143 43 253
3104 253 182 396 223 108 248 150 183 388 239 323 394 7 495 312 5 47 -124 -75 299 236 170 74 369
3127 369 -62 151 -185 -302 -10 178 17 -46 107 -104 -144 -206 -178 -290 157 138 -320 268 103 -29 -264 -365
3149 -365 -139 21 180 -265 19 333 -121 -371 -239 -252 -131 -101 -26 -136 96 -70 30 154 -216 -108 -66
3170 -66 -113 -249 -101 -36 -30 45 55 -127 -319 118 -159 -20 -129 83 210 102 -74 -247 217 136 -50 203 131
3193 131 170 161 -21 254 -3 38 91 118 168 251 342 170 -58 164 258 -75 -12 129 -82 430 -31 -57 226 18
3217 18 236 110 -132 -131 216 203 8 -304 -159 -191 -95 -354 -206 -141 31 -107 -52 -235 -241 -251 -283 -211 -138 -235 -106
3242 -106 -194 -15 -673 -210 -357 -49 77 -80 264 363 -29 80 28 217 -49 -256 209 229 110 413 463 53
3264 53 15 166 211 147 -136 300 217 268 71 219 80 65 126 -240 253 225 -4 318 -40 138 -18 172 254
3287 254 -223 -16 -78 60 -110 152 -109 -294 -170 -2 -505 -104 -34 -25 -97 -193 -186 57 -348 -63 -149 -289 42
3310 42 -54 52 185 -372 -296 -60 -100 127 157 59 134 178 229 -82 -178 -91 -263 169 288 402 -90 -32 261 -93
3334 -93 37 -137 -27 -60 332 234 20 143 -289 -240 -241 -15 22 247 41 -44 373 -236 204 -69 -426 -303 -30
3357 -30 -442 97 8 368 -132 29 -151 -213 87 -314 -20 64 65 29 -57 -178 -320 -129 -64 -211 -68 51 28
3380 28 -238 194 29 -199 53 -136 -255 -24 140 -71 -63 -175 -38 -124 -195 -12 26 158 18 256 -7 116
3402 116 43 -377 -301 -189 -84 -14 -163 -101 -104 -295 73 207 -306 -106 5 -119 77 373 304 66 4 97 77
3425 77 311 37 201 176 191 211 273 -149 67 93 64 78 26 221 273 251 -82 -47 -64 38 -240 -66 163 230 104
3450 104 -153 -80 118 -200 -80 -74 -221 -74 -294 5 -20 -9 -112 -82 -448 -33 -257 -242 217 23 -119 -248
3472 -248 128 -165 -71 30 -107 -257 -108 -91 70 -191 -131 -300 61 -113 -231 51 53 47 -143 -85 237 73 171
3495 171 105 -361 408 163 208 -170 -5 -121 115 83 104 186 101 42 -18 -362 -58 273 283 36 -136 114 262
3518 262 229 -186 -22 -62 -46 -71 14 -65 -197 50 25 -299 113 30 61 -230 -258 -230 -7 -15 -59 -138 -84 -65 -167 -387
3544 -387 -64 234 89 88 145 75 63 45 -346 -115 -73 294 -11 -36 -13 -137 124 128 -112 -88 -241 -17 264 -125
3568 -125 214 -117 -55 74 161 -21 183 77 -68 -194 174 -129 33 150 -81 -22 -31 83 26 -34 -120 1 -208
3591 -208 293 196 379 417 -80 432 -81 -36 -99 168 156 190 227 57 -1 -52 174 -127 -84 -147 7 30 -95 88
3615 88 268 122 -201 66 -27 -6 41 -90 -25 8 93 -251 -204 -86 -113 -22 -4 45 -67 131 -295 -220 -138 13 -215
3640 -215 -72 257 157 45 -374 56 -187 108 -320 -165 -125 120 97 142 -8 -41 -60 32 245 -42 218 136
3662 136 423 -161 129 -106 210 -68 81 75 -230 285 215 162 8 -13 206 105 -97 -41 120 401 -61 15
3684 15 -105 -255 12 -52 16 -385 -427 71 -5 -410 22 -198 -224 -40 -225 -385 21 44 -111 245 144 -128
3706 -128 -235 -243 -119 208 105 168 -80 264 345 -305 -128 -123 6 -91 -131 284 39 -64 -65 106 249 -128 192
3729 192 113 294 368 -96 -34 -255 92 -79 -163 -269 -25 103 149 122 45 2 -42 80 -49 -89 17 63 119 -160
3753 -160 150 -289 52 244 -104 -9 -142 91 55 153 44 -123 -334 297 -141 177 181 286 -67 -53 99 92 -91
3776 -91 -173 -100 -109 -92 134 -21 13 134 -23 -355 10 -150 155 249 169 -148 -27 -14 -88 -51 1 51 181 132 27
3801 27 3 2 131 -58 66 34 -73 -164 99 39 34 2 -68 -246 58 -179 -46 389 198 131 -11 180 55 476
3825 476 130 -60 -33 154 54 61 4 103 -19 -52 38 8 131 131 132 29 4 1 -316 8 187 -184 -119 -28 -237 23
3851 23 -158 38 136 -100 -47 -273 -153 -103 -102 -171 119 -213 -80 -73 -50 -154 240 136 136 -32 -99 72 -184 160
3875 160 -131 90 -155 -14 328 15 -29 164 6 97 -13 -18 235 289 437 293 122 102 -81 -111 62 80 238
3898 238 342 261 -123 -27 -142 -329 69 -67 344 161 0 -221 -137 190 -200 -211 -181 163 -37 -91 -265 -174
3920 -174 -32 -217 215 -108 107 -305 -341 -24 -123 -16 -299 -135 -2 65 -102 -276 233 32 17 -98 256
3941 256 28 -14 -50 -148 22 189 58 -32 164 62 -96 8 11 32 306 54 113 33 102 188 -124 88 255 174
3965 174 -109 108 -308 -260 -102 100 -34 -430 239 135 397 288 52 178 115 226 -47 -346 141 225 157
3986 157 -93 250 -36 64 -23 97 87 117 75 58 113 -57 127 -119 -93 229 112 -213 154 -212 249 -55
4008 -55 101 -77 75 192 -44 113 76 -36 -46 -166 -155 -49 74 -130 -231 -188 21 48 255 -207 158 -236
4030 -236 -124 -160 -188 190 -94 50 -298 -136 -122 -74 -1 -291 -122 -73 204 232 -54 -58 -41 -16 -5 -6 -149 183 22
4055 22 194 324 -7 407 58 -40 82 83 61 169 -200 92 -110 285 39 21 -12 -60 -121 -315 -272 108 -16
4078 -16 -225 -70 111 7 3 -154 -114 -22 -81 -95 144 -72 -277 -194 125 -51 94 -157 264 -79 -17 513 -37
4101 -37 53 23 101 48 110 230 -80 53 58 27 57 -71 195 10 59 -103 -218 -85 -100 84 -334 307 -67 110
4125 110 153 -38 185 45 -59 -154 15 80 10 221 51 -185 -221 -133 -251 -43 72 -6 -133 23 130 81 42
4148 42 23 -291 15 -210 -195 -228 86 335 -105 73 -129 -195 11 155 171 -38 -75 106 192 -124 219 139 369
4171 369 -41 448 229 -33 157 200 -66 -76 48 87 115 -5 228 -122 61 -38 -82 186 224 -100 131 -116
4193 -116 138 -14 -62 -29 -217 56 99 170 -353 -36 -73 -207 -64 -67 105 26 278 41 291 177 -117 4 88
4216 88 -33 -207 74 -66 -173 -6 271 88 -62 28 -45 162 59 -57 110 3 96 -98 126 61 -242 -468
4238 -468 14 -75 18 281 120 133 52 92 138 -411 -186 -22 -14 252 -108 -115 28 93 -147 -57 -160 -93 -130 -81 129
4263 129 -122 -222 200 -192 -8 -113 81 -108 -49 68 -10 -16 -172 64 258 246 136 0 22 258 371 243
4285 243 -137 250 113 121 211 152 -6 -219 -56 -35 274 -76 106 8 160 -119 -8 255 -23 274 -125 -60
4307 -60 -67 -124 136 54 39 -8 14 236 88 -98 -122 106 -103 124 92 305 34 174 -16 13 108 133 74 210 9
4332 9 -74 68 -143 108 115 360 -8 -399 110 -316 -53 55 -81 -8 -171 -14 105 -44 220 -167 -39 -264
4354 -264 -279 -54 38 65 -92 370 -6 113 -12 -89 12 -214 13 -28 -108 -291 -237 -53 -101 -187 71 -243 85
4377 85 -69 27 243 -59 -2 -93 6 57 -6 132 81 192 56 -26 152 3 -79 -52 131 -60 87 446 -22 77
4401 77 18 155 -203 22 -152 50 340 -247 19 -1 -71 52 -172 -132 179 -41 153 11 197 -21 -111 -37
4423 -37 -308 -190 -245 -98 -238 43 -206 -123 98 -270 285 -145 150 256 14 183 -19 177 -92 311 13
4444 13 107 -124 106 189 -59 122 194 116 78 170 78 -57 270 -49 -103 123 -321 -145 308 97 166 108 -90 164
4468 164 -295 -7 122 51 -136 -5 242 -21 -170 64 83 159 -384 -193 -59 -225 238 -81 68 -313 21
4489 21 -110 -100 -199 -53 -117 44 -184 52 -98 206 55 20 153 -117 46 -192 86 -126 30 -243 -18 -239
4511 -239 -56 137 -40 78 -81 83 67 -76 -215 -298 -177 -126 151 -15 129 -2 -16 -121 44 4 -80 -294
4533 -294 49 47 170 148 -28 -403 -229 10 45 -258 -383 -341 54 -167 -78 -211 31 75 -31 -147 -21 199
4555 199 303 194 -100 10 182 -120 -285 -59 15 91 131 36 -102 -92 -189 150 32 153 -95 82 -26 -213
4577 -213 -183 -213 62 64 -102 -116 -268 -61 -89 -125 -61 -180 -151 0 -1 305 -24 -274 -91 153 -189 49 -328 164
4601 164 -258 -225 -77 81 -221 -207 68 -105 -96 -237 25 108 -96 73 -16 12 208 -86 -15 159 -87 -53 -102
4624 -102 144 52 62 187 20 -158 270 119 -56 -92 -121 139 -133 101 -138 -187 173 -2 151 -10 -57 8
4646 8 -23 -147 -158 -132 -201 116 366 127 31 -317 202 167 -221 -118 70 -132 -170 -170 -93 70 -91 190 167 296
4670 296 -189 40 85 10 285 126 26 161 108 12 146 -119 29 206 324 -162 -264 -20 121 110 -107 94
4692 94 57 290 -182 -110 -35 -141 217 -88 -227 -82 0 87 68 33 54 -272 -242 348 -32 109 73 22 52 -102
4716 -102 47 -232 27 82 247 -310 -222 145 -7 15 118 75 -197 -230 48 50 90 95 -29 36 137 210 -320 117
4740 117 230 82 43 -84 77 -26 207 342 -278 155 -237 -76 143 -94 -206 -100 -227 31 -138 -161 -40
4761 -40 -204 87 -287 -360 -168 135 38 35 -73 -197 84 85 88 -78 -164 80 -43 -157 76 257 237 -18 65 79
4785 79 -197 -5 -99 394 -10 53 58 91 129 -129 -15 182 166 212 -134 252 -214 225 49 44 -62 287 12 -97
4809 -97 -46 -162 8 3 104 -79 -384 -266 -255 -178 -142 174 -300 -62 -132 240 -174 -335 98 -132 -91 -78 -155 -127
4833 -127 -302 -27 5 105 173 163 58 27 229 184 25 -106 -89 57 81 230 107 296 30 202 -104 150
4855 150 117 77 -28 140 211 -226 120 119 191 -263 -155 183 124 -103 -7 161 -211 30 66 111 -56 -254 101
4878 101 -47 -133 103 64 71 -119 -138 20 -17 -70 -263 164 -36 -269 -254 -55 -51 103 -80 -68 -186 50 -308 9
4902 9 -105 -2 -253 38 87 -106 201 -6 360 69 60 66 -217 -25 203 127 40 -6 313 195 175 40 160 -154
4926 -154 14 55 344 -196 -217 -2 282 -45 31 79 -162 -16 -42 -21 224 199 229 -82 53 -43 -19 101 -55
4949 -55 -211 127 204 122 -21 -124 205 -241 -112 143 96 128 170 38 147 -23 90 -77 -32 -111 -12 -201 -42
4972 -42 78 -58 4 237 45 60 -71 65 128 50 67 -72 132 104 172 -131 -423 -161 -77 209 -321 -179 -122
4995 -122 -187 -123 15 -192 -54 -200 41 12 -197 127 238 47 -90 324 -121 165 -80 64 161 239 168 -18
5017 -18 58 -89 23 67 -2 221 -47 34 192 362 6 -197 -189 -167 -184 -63 245 -52 -292 -70 -150 84 -50
5040 -50 -97 -116 2 -148 73 -2 -35 -35 47 -234 0 90 -89 187 -75 -181 -352 55 -70 -86 -115 47 174 89
5064 89 -72 85 -84 270 -31 -286 -175 265 -166 94 -68 347 150 33 -358 63 67 51 128 118 233 -171
5086 -171 -104 -28 137 118 -122 18 265 0 22 -127 -9 61 -118 41 108 -81 21 -7 209 -81 224 -77
5108 -77 254 31 144 -33 -110 99 196 -192 -189 -107 -8 157 -110 136 -77 17 -459 128 -13 -275 561 5 -47
5131 -47 -266 -151 271 -48 -119 177 -5 -19 -40 15 66 88 -17 229 -427 -115 -136 -345 -64 -69 -110 -340 77 -148
5155 -148 71 176 -221 243 -15 -142 60 235 108 0 110 -49 -87 -160 -85 123 154 -320 35 20 -161 -180
5177 -180 187 155 -91 66 -129 -172 327 106 121 135 9 127 -68 109 -309 250 236 33 212 -293 -15 65
5199 65 54 15 -94 192 153 133 216 199 151 -37 84 -78 -231 26 -347 -96 -284 191 -222 -76 -3 85 50 181
5223 181 82 -198 -89 -40 -228 116 -93 -97 211 -322 -56 -81 104 150 206 63 195 -59 201 -77 22 27 94 85
5247 85 38 -303 152 -234 115 -81 90 -153 135 58 38 20 133 -145 123 -370 -253 -67 -28 155 169 -119
5269 -119 -350 -55 -192 -155 3 -65 -63 226 -390 143 -147 -103 -13 -221 3 149 181 -246 -42 -134 -78 -291 -203
5292 -203 47 -19 -153 -202 -127 -92 -44 336 134 21 -232 385 139 392 200 -156 73 273 -96 -78 130 46
5314 46 42 -14 16 35 -294 18 -163 44 154 201 -183 80 -94 -18 -190 -159 -48 128 213 155 72 34 -119 -65 -8
5339 -8 181 -209 45 64 41 -54 43 -107 -186 -117 0 28 10 -46 52 -145 -125 -14 331 224 34 77 -350 37 -170
5364 -170 -146 47 -47 52 87 26 45 125 -13 21 -97 271 18 107 321 174 -357 159 -126 -291 3 177 81
5387 81 -126 -293 105 254 -26 -12 -224 -120 153 83 133 -78 -251 -102 -27 -34 366 25 40 204 -294 -88 -232
5410 -232 22 -28 33 -174 -40 200 118 234 101 225 320 58 -319 -28 126 -2 15 -28 108 177 34 -105
5432 -105 -238 64 -115 55 73 -55 89 149 -200 -104 -26 -189 60 102 189 -18 -332 -7 -102 100 -58 73
5454 73 -37 -174 -108 -124 -314 92 262 -65 247 88 8 -190 373 -71 -78 -23 -43 4 251 -151 49 81 203
5477 203 238 138 -68 -90 -71 36 25 62 -71 26 163 173 234 398 264 281 -41 -78 36 47 126 -7 -252 -9
5501 -9 -71 -168 161 34 22 34 80 -105 41 155 -187 -20 207 77 -54 -95 -163 50 222 220 31 51 244 96
5525 96 64 75 267 -85 200 -5 119 -64 -179 -86 -27 167 -231 21 157 3 -38 -505 220 -6 131 -71
5547 -71 166 74 -120 -47 95 -46 59 -25 -204 -120 21 -94 -237 -83 -36 128 67 242 259 -67 -264 -294 -176
5570 -176 -4 267 -179 -102 54 -95 446 84 139 -88 -26 105 111 -37 26 35 27 -88 -245 42 188 25 75 387
5594 387 -54 -41 -9 239 -32 -144 63 100 -44 15 -241 -247 -270 -233 15 -150 -64 20 435 224 -361 142 226 -23
5618 -23 -35 -168 169 -69 -130 188 25 102 -67 -220 -110 -64 -176 -34 62 -91 184 228 -148 161 -167 -102 -45
5641 -45 -114 -25 117 92 -26 187 145 -104 198 201 -149 38 -118 61 -254 296 -235 -121 74 -118 126 -52
5663 -52 13 -92 81 -93 93 7 126 108 -104 196 204 -168 123 -53 108 -167 164 -98 36 41 230 42 148
5686 148 -106 177 56 -392 192 -203 70 -13 -88 19 -208 49 251 -264 26 241 73 66 42 -100 119 85
5708 85 5 -162 -169 -83 -172 101 14 83 31 -123 -59 -10 241 191 -14 61 163 -66 11 88 287 103 15 33 -1 -240
5734 -240 -284 -100 -35 -183 158 43 -21 169 -123 149 296 -32 94 13 247 26 -188 -1 -39 327 -177 3
5756 3 -5 372 -167 28 193 -84 104 -266 -173 76 -31 67 98 62 -270 -13 62 118 36 229 247 -112 -13 -130
5780 -130 -282 204 110 -193 -10 298 99 152 -105 16 -41 -72 -26 67 -100 -56 91 195 -159 -17 -116 -279 261
5803 261 -140 53 -156 30 -212 -93 204 -191 3 33 -99 -147 30 -99 -135 69 113 -28 -26 107 -114 113
5825 113 268 -149 342 274 4 -191 199 96 -61 240 -172 -39 187 -51 152 -121 -238 14 6 9 -38 291
5847 291 -87 70 -173 223 -260 62 -67 -106 147 -215 -44 -128 -389 21 193 -148 62 -8 -149 32 173
5868 173 -68 59 -119 -89 106 -117 -241 104 77 230 107 -147 343 -126 177 81 34 -357 -82 26 94 3
5890 3 -403 25 351 72 137 68 -331 176 -180 58 217 -49 127 105 30 -231 -69 44 134 27 -136 239
5912 239 -341 157 -54 159 112 -114 -157 283 7 73 -21 54 154 -12 -31 -179 350 -219 -209 112 2 53 74
5935 74 -250 5 138 -12 -242 -271 215 -171 -167 80 300 -75 -73 94 115 -159 17 -22 -136 -35 74 -185 -2
5958 -2 70 218 -107 -31 42 -147 -19 20 -149 -219 -80 -237 34 -98 95 43 130 23 22 43 -225 -154 68 104 150
5983 150 94 -2 -90 -200 242 -65 128 -93 -15 -19 1 74 70 58 214 -68 38 22 -134 -152 95 249 -179 -62
6007 -62 224 161 53 -100 -108 118 186 -203 43 -236 -89 -257 -174 11 -279 113 56 1 141 -282 -208 -214 237 -105
6031 -105 -124 67 -172 -190 -257 12 -105 -23 -358 60 -285 -316 -78 -424 -145 -110 -261 -174 -4 -476 144 90 5
6054 5 -43 238 42 -34 -22 128 205 -114 -74 -75 -201 -55 17 -172 133 30 -84 225 241 59 24 117 179 38 191
6079 191 95 -28 -91 -10 -15 -330 119 221 -76 -43 -192 180 62 -228 -41 177 1 73 -60 160 -58 -173
6101 -173 56 335 -201 -135 73 110 -64 222 44 -36 6 68 -296 -41 -117 -63 -35 -120 161 25 -135 -226 57
6124 57 -123 117 -419 86 219 143 71 -61 -73 169 197 343 171 11 6 74 -79 29 298 111 36 225 -7
6147 -7 81 -60 31 -288 -8 202 74 286 118 -168 3 72 6 92 29 -24 -131 115 150 -333 -21 143 130 61
6171 61 171 -125 -315 -17 -55 -59 -115 -79 -12 -183 -149 -109 25 237 -28 -239 -92 -172 64 -140 123 19 118 -222
6195 -222 -161 -6 26 -43 55 -47 2 -107 182 -48 -238 -98 34 -60 -290 58 -9 159 188 -38 226 -147 -61
6218 -61 -94 -142 -426 165 188 -144 -1 255 200 -379 29 -196 191 1 -35 -152 -197 -163 139 -116 187 -453 -151
6241 -151 -92 -15 23 162 336 226 116 -203 -165 -48 -50 -13 54 277 90 -169 171 29 40 -31 -122 42 100 -220
6265 -220 109 65 218 246 -383 -95 19 40 142 180 46 27 -217 -23 68 -44 -14 -18 70 -473 151 53 -119 -192
6289 -192 -177 -222 -227 8 -117 161 136 -75 -239 279 -214 110 209 -55 -24 375 -6 152 83 -182 80 114 41
6312 41 -123 213 -82 31 2 -111 -43 129 -136 60 -178 -52 60 23 159 -64 47 107 165 -97 -132 134
6334 134 -39 -159 -45 -42 -32 -24 -46 -100 391 32 25 -52 84 49 50 25 -227 53 -119 303 88 -156 -58 112 11
6359 11 134 182 64 38 -247 141 197 -40 -117 178 84 3 -139 -79 -58 -77 260 -20 -85 15 54 -41 53 -27 -271
6384 -271 225 -95 65 -160 64 174 77 308 -357 72 49 -80 179 142 42 -97 123 -298 -285 -343 110 -201
6406 -201 -8 -16 -134 0 9 144 -146 53 -202 4 72 -169 100 -202 61 68 136 46 -18 -67 48 -220 -258 367
6430 367 -89 -246 -84 138 53 -150 14 248 -37 -134 122 -205 109 -6 24 -312 118 -181 97 43 229
6451 229 -59 -286 -83 118 200 1 30 284 151 150 81 -60 -61 137 44 116 -26 -122 84 61 153 27 -2 -42 49
6476 49 33 192 24 -29 152 165 73 37 59 54 -19 -117 212 -275 175 118 -25 57 163 -31 147 160 36 -130 -72
6501 -72 162 60 14 90 -54 1 89 96 -81 -159 -147 -107 -300 180 105 -9 -182 -38 -279 4 -152 -5 259 93
6525 93 36 -101 0 174 8 -37 -36 211 -87 192 -33 -296 -119 -77 -173 -2 112 250 158 81 -58 -242 196
6548 196 -74 23 35 -74 0 101 72 -229 -4 119 -288 175 97 -58 -126 135 324 250 -19 -85 193 18 -97
6571 -97 152 82 32 189 32 40 10 -154 -381 63 181 0 -288 -65 225 293 39 27 55 -7 31 -10 236 1
6595 1 -31 -257 -107 -104 -90 -72 -2 135 -45 -13 -93 -273 -69 -158 113 -16 122 11 -223 26 16 -42 -9 7 -5
6620 -5 -66 129 -120 -5 187 -62 303 90 27 -199 143 32 41 -244 -125 53 -155 68 -202 241 67 -172
6642 -172 57 -68 247 140 -251 -51 54 -62 -146 16 112 250 -347 -190 50 -124 9 -23 -240 4 33
6663 33 0 216 -35 435 -61 101 -114 30 -123 122 234 58 85 -13 158 -68 37 27 -61 -1 155 -158
6685 -158 -21 -128 54 -369 -229 -50 198 181 -16 -26 -195 213 -115 31 56 113 217 136 14 -200 -17 65
6707 65 51 170 -82 194 -135 136 -256 218 50 82 67 -128 215 -77 -125 -123 -4 -41 -73 364 57 444 99
6730 99 4 -13 -92 267 19 -132 -165 -11 -433 144 23 57 -2 158 12 -34 -151 62 305 -7 -73 -128 -39 143
6754 143 -131 79 55 -193 340 40 -102 -97 42 123 -37 100 -178 -153 163 -51 -82 104 -139 -83 -70 -153 78
6777 78 -31 71 -16 -209 -63 -5 193 -137 0 -103 -30 163 264 131 -42 273 177 -179 -49 -110 -37 110
6799 110 0 83 4 155 59 -31 6 21 -66 117 -312 9 121 -193 192 -35 -44 -334 -90 98 -19 39 368
6822 368 81 -221 133 115 166 -54 178 -22 84 402 -279 -63 181 59 -75 -91 297 -300 -86 59 -6
6843 -6 -77 -91 80 -124 -8 86 113 -129 -222 70 -90 -59 -48 -244 28 -156 -46 -82 -118 -124 -80 285 -140 39 -30
6868 -30 -21 183 68 -90 262 35 -251 -26 -105 -207 27 -94 87 -19 -27 -119 159 -46 -65 25 -296 -15 208
6891 208 54 83 133 159 72 -189 279 -62 30 21 -148 -186 -135 -207 -124 -49 82 -157 -222 -148 79 -3 33 186 -117
6916 -117 97 68 -18 101 32 -351 -5 -112 -81 -103 -87 288 241 -79 33 -9 -41 -145 -231 96 -38 -227 124
6939 124 339 -33 -155 -114 -155 -70 -122 -109 67 77 -134 -92 -134 -26 -107 306 -275 110 -99 157 223 350 0
6962 0 -66 76 -90 -350 -75 361 -148 123 -7 222 -123 -396 7 -164 -122 -233 -173 -59 134 -146 -91 62
6984 62 -120 -70 105 -367 -319 110 -39 34 102 -9 64 -162 -222 -221 -84 -106 51 -12 -105 51 -9 11 21 98 -94
7009 -94 57 358 -64 251 -175 141 219 101 69 -50 248 -100 -109 -160 -54 26 -81 98 51 110 157 203 2 -155
7033 -155 -139 96 61 -67 178 139 115 152 285 -187 -120 48 -332 -156 97 116 159 45 194 -195 147 -109 144
7056 144 253 -258 -245 -133 217 302 -389 -293 -66 -149 -153 -336 143 17 -141 -49 217 1 29 -5 57 251 112
7079 112 -180 -123 167 -144 12 -14 137 42 -192 -90 141 -19 193 61 -65 -71 189 118 17 228 -120 142
7101 142 -14 29 -180 -80 -164 199 19 142 22 -221 22 -223 290 95 8 154 -13 -140 244 -56 -290
7122 -290 67 -212 -59 -127 -79 -170 219 -351 194 -118 229 123 -70 -279 251 57 257 212 -238 -75 -58 -97
7144 -97 11 391 125 -120 -136 160 -58 113 208 276 96 -18 177 139 -38 -9 -108 -117 137 147 121 36 -75 -167
7168 -167 81 63 426 -154 38 -140 -15 295 -271 -75 -148 -68 -125 -42 214 -303 84 25 -25 -269 48 163
7190 163 -240 -203 -274 115 -27 -20 -24 52 -186 -61 -44 -154 -256 -34 -130 -234 61 -90 115 -1 -36 -179 -60
7213 -60 -62 77 -9 -153 128 -9 -144 -120 81 -90 -7 46 24 -59 -184 -294 108 -117 -42 137 -133 104 52 129
7237 129 188 -257 -10 -110 -118 38 78 59 204 234 -330 -298 48 -94 -212 35 -125 -13 60 35 -146 -184 -9
7260 -9 128 0 129 -11 -198 272 -179 -138 -33 -282 -71 -73 39 251 -210 -20 -45 73 85 -16 -71 32 148
7283 148 -18 -39 54 178 31 -89 129 119 44 -3 68 -158 203 165 -63 -61 -159 -41 -46 17 92 -188 -9 29 211
7308 211 -114 -3 272 183 174 -275 111 -209 33 -196 -87 -68 -67 9 -149 -132 -193 -158 -26 -38 3 9 -177 51 -214
7333 -214 256 -117 -133 56 197 118 285 66 5 210 -54 -54 143 -57 166 -13 -113 302 9 55 -168 -150
7355 -150 36 123 81 -103 -196 -96 -52 31 274 59 69 -33 106 -217 -74 -32 -187 70 -137 -172 35 91 -101
7378 -101 54 -46 -95 -252 -52 -6 -355 186 222 -3 -4 -110 168 -21 17 211 -162 305 -90 -11 -222 85
7400 85 -144 -291 -136 -300 -51 -346 -28 -15 -171 139 -59 -55 129 116 -98 121 -305 -237 -33 194 -45 -38 33
7423 33 -174 296 60 -136 -45 94 27 -97 -51 19 -164 205 -4 91 -93 -20 -4 -337 207 159 -236 86 200
7446 200 -136 -90 -5 166 201 170 241 162 83 -168 -470 45 9 -189 88 -301 -297 21 109 170 -308 25 34 125 26
7471 26 140 -243 -171 -220 192 -108 -228 58 -200 -1 147 -46 -79 138 -287 52 105 -457 -67 17 -82 -107 -177
7494 -177 -91 -18 -124 101 -167 138 189 -76 -55 64 -310 49 92 -50 -69 -126 109 -38 -135 -278 -83 -103 -68
7517 -68 179 174 -165 -5 30 -43 -145 -101 -163 -162 -64 86 -372 160 53 43 -143 -1 239 -138 -181 -129 148 -83
7541 -83 -42 -73 -208 -158 144 76 62 -260 60 202 -92 -64 -172 -275 355 71 -70 -33 -129 77 150 94 142 350
7565 350 -39 -91 183 133 12 -136 172 253 225 -153 234 -348 -268 124 -121 -141 74 -155 178 16 -77 155
7587 155 -15 -25 -96 -58 82 16 -24 31 106 -164 -82 -330 -149 -349 285 158 -81 40 -169 -207 -59 -34 33 -28
7611 -28 -109 18 132 219 187 -155 -58 -43 -226 -127 -36 41 302 136 -32 163 28 -1 43 48 -15 -161 -162 102 14 175
7637 175 -275 -102 -100 -121 11 16 -68 9 -176 -115 87 -8 -109 -82 -7 70 166 -116 105 -3 114 -151 183 74
7661 74 -189 136 164 55 -89 -58 -24 187 -253 -52 180 -181 145 189 35 -27 -104 86 206 -59 -132 -141 24
7684 24 35 156 -14 233 -106 230 -28 59 45 70 161 167 -50 -51 95 -48 115 -251 -126 20 56 250 -163 -140
7708 -140 -29 200 24 77 21 338 177 -207 40 -152 161 47 93 -96 259 -53 -7 358 -157 -254 -73 -45
7730 -45 226 317 343 140 -35 172 -113 136 -110 -101 199 82 -294 95 95 -160 -17 301 5 -146 287 -61
7752 -61 -115 29 41 -99 50 -390 -157 -113 -304 123 72 78 -311 186 -144 -76 -99 -13 -31 -229 17 119 -7 256
7776 256 16 -191 162 -46 364 24 -147 267 106 114 -205 -63 -213 -81 174 -96 239 294 1 -156 -52
7797 -52 215 -198 -136 24 -108 37 -78 91 267 -64 260 64 38 -268 125 -96 254 -9 -217 53 79
7818 79 -143 -39 157 -410 -104 -88 -55 -56 -119 113 -288 39 -82 -43 331 99 115 -131 -159 -79 -75 -74 -15 -94 161
7843 161 -195 -115 126 -235 30 -106 -134 -44 61 -204 20 -41 -182 -46 91 95 -124 51 -75 89 -142 153
7865 153 -11 -240 38 -30 -369 -198 149 -80 -216 54 3 10 187 200 -67 -83 -172 -202 98 89 57 306 -126 88
7889 88 234 37 -98 33 -20 108 -48 -6 153 70 -13 -22 -151 159 -9 118 -145 -169 71 -183 7 -177 -44
7912 -44 170 210 188 91 -115 84 -7 178 99 75 -279 114 -52 94 -24 30 -191 222 -69 -171 -13 152 -332
7935 -332 182 -14 -24 -58 -159 5 -190 67 162 -99 59 351 6 216 -87 355 -1 -68 -20 99 264 249
7957 249 230 52 35 126 -51 242 -178 -7 -120 71 280 242 97 -191 -120 73 -19 75 49 -106 27 -81 -11
7980 -11 -27 -62 50 -201 111 57 85 14 125 97 148 -150 -280 303 -76 -109 314 -81 105 186 -162 -402 -118
8003 -118 72 22 107 -308 -137 86 33 -375 -80 -71 -89 -6 -144 -79 28 23 7 39 72 88 35 74 209 -48 -73 168
8029 168 59 -55 -136 -295 105 -48 -76 -8 148 72 -91 -32 -91 -47 146 216 83 -406 -89 -7 -75 12 -133 -197
8053 -197 107 257 119 56 -170 168 293 132 -94 -107 172 139 173 -235 -101 -96 -172 -18 121 118 -137 -58 169
8076 169 373 -154 95 -54 30 87 71 118 208 145 78 -2 -119 140 -237 84 186 17 -71 36 0 50 108 -110
8100 -110 -191 -81 53 6 -146 -14 197 215 -343 -240 -105 155 -275 -192 8 -169 -178 214 -191 10 -203 47
8122 47 -94 30 4 -90 7 -120 -164 -42 -13 55 157 75 24 -11 -186 -315 29 86 -182 76 59 179 -7 121
8146 121 176 -10 136 15 227 -225 170 -65 144 95 389 -97 -55 -184 -98 114 -46 -67 283 -62 105 213
8168 213 -359 135 92 -148 -74 85 -91 67 3 181 200 -44 83 -36 -13 128 -46 345 184 104 -174 2
8190 2 119
8191A19
$$ Imaginary data points
##PAGE= N=2
##DATA TABLE= (X++(I..I)), XYDATA
0 0 0 0 0 0 -8 0 -8 8 -8 16 -16 24 -32 32 -40 48 -61 72 -85 97 -118 136 -155 180 -207 237 -271 305 -347
29 -347 392 -441 496 -554 622 -694 770 -858 953 -1056 1170 -1295 1435 -1589 1760 -1950
45 -1950 2163 -2406 2682 -2998 3370 -3811 4341 -4992 5826 -6924 8447 -10703 14404 -21541
59 -21541 40340 -191016 -445476 35667 200194 -79870 -302572 -163324 -119532 -197142 -141451
70 -141451 -7045 -87245 -191045 -156411 -177943 -326208 -242901 51402 116805 -105706 -197749
81 -197749 -133712 -191472 -275656 -109133 105863 83649 -15929 7528 -19362 -151834 -150548 7924
93 7924 76960 67828 136760 164411 36062 -12300 126823 161218 3427 -10123 181254 223583
105 223583 69519 58165 208847 221924 107498 101759 142362 74710 42156 144690 178323
116 178323 87623 100955 205869 140062 -34520 -31247 77127 50520 15 101533 162680
127 162680 29048 -73116 -13562 -14617 -133969 -128060 11260 24279 -77448 -69958 -14240
138 -14240 -86518 -161395 -96800 -70892 -179298 -189803 -44750 -20532 -150260 -150822 -26734 -55966
150 -55966 -196692 -179105 -64742 -77863 -130302 -57510 2642 -72324 -115158 -42669 -33831 -119548
162 -119548 -95004 33136 50336 -20432 11053 81658 25753 -51950 -1591 61511 28112 28763
174 28763 117674 137154 66056 64201 120776 91535 29693 69563 128458 92684 66498 129520
186 129520 152285 82523 60824 110680 90747 22887 55378 132530 101004 35886 72527 105634
198 105634 23302 -39581 16859 52911 -4173 -16574 43528 34248 -36691 -38049 -7081 -56200
210 -56200 -104699 -52691 -10956 -66270 -92555 -30088 -18467 -97459 -122502 -68834 -68272 -115683
222 -115683 -95415 -45655 -68038 -100783 -66525 -53468 -108159 -114897 -47182 -35195 -85348 -65415
234 -65415 3208 -11278 -69525 -50695 -3729 -25092 -46896 2773 39050 12396 11763 55171
246 55171 45897 -3644 13718 67485 53560 20972 63053 109729 75945 41254 72633 87463
258 87463 49213 47613 92907 92274 58269 78127 109594 69634 22446 49778 79124 41913 17988
271 17988 58553 77657 36082 14840 33241 17977 -21010 -12635 14414 -5191 -26914 2082
283 2082 16755 -29276 -61812 -39458 -33195 -65424 -68433 -36402 -33233 -53703 -50347 -46129 -73795
296 -73795 -89234 -66204 -56771 -76913 -68185 -29804 -28841 -60549 -60864 -40654 -51814 -69915 -48758
309 -48758 -20109 -22863 -20595 4577 5098 -24097 -26567 -378 -1526 -16605 7711 47144 45830
322 45830 25100 31672 42935 26930 13080 26765 43273 46143 56872 73039 66864 49351 47008
335 47008 47307 31459 22642 40078 57863 56911 55221 56037 43507 25751 21824 17698 4264 8113
349 8113 34236 40601 15801 5265 16905 6124 -29840 -39906 -17570 -7791 -17298 -12202 1355
362 1355 -9564 -32825 -39343 -41083 -55814 -60263 -36850 -17578 -24987 -32428 -23331 -22743 -45416 -63551
376 -63551 -57457 -42515 -33833 -28124 -19669 -12438 -11905 -20728 -33765 -39941 -32340 -19072 -10878 -2580
390 -2580 10031 17029 10864 1557 -4697 -9632 -10092 2748 20437 28532 32049 40295 42487 24847
404 24847 4327 3716 16863 22292 22747 33718 50661 53548 38993 25078 20842 18674 14360 14721
418 14721 23475 34031 38554 36671 28420 13702 72 -3351 187 1950 3507 13461 24296 18482
432 18482 -2108 -15385 -14574 -16468 -26463 -27294 -11612 3403 2744 -6739 -13625 -20480 -31951 -41479
446 -41479 -42266 -34603 -24367 -14064 -7626 -11257 -21394 -28675 -29966 -32268 -36653 -31677 -14771 -1407
460 -1407 -3250 -9967 -9151 -8203 -17979 -26560 -19407 -4402 4493 9489 16484 16545 6338 -1727 -1225 -2669
476 -2669 -5286 4941 23788 31856 27368 26012 28939 22814 9402 4446 10898 18476 25019 30140
490 30140 31419 29027 25906 19261 6809 1012 8790 17189 15181 14140 19954 19956 8782 -1638 -4219
505 -4219 -6223 -6555 632 7010 3629 1811 6527 1544 -19290 -30528 -20309 -12304 -19765 -20604 -5970
520 -5970 2015 -8012 -19505 -21802 -23291 -25453 -23106 -18894 -16384 -10113 -2285 -4631 -15312 -18220
534 -18220 -13196 -12709 -15460 -10807 -1934 2039 3067 2466 -3835 -9417 -6206 175 -2036 -1704 11058
549 11058 20670 14271 6148 9934 10813 2455 936 9883 13191 11194 18492 25046 16221 6437 10548
564 10548 14525 3823 -1167 10251 17505 10186 6164 11496 9078 550 1553 6537 1382 -1483
578 -1483 9128 13138 -567 -7573 1749 3115 -10830 -14796 -1605 3087 -4047 -4442 -312 -5195
592 -5195 -10558 -6762 -6610 -15056 -13623 -457 544 -11026 -9865 1686 -1085 -12550 -11168 -2906
606 -2906 -4294 -7407 -2278 -1053 -8035 -6220 1019 -3130 -10353 -2185 7847 757 -7986 801 7664
621 7664 -2338 -7756 1619 5470 -2086 -469 9340 6078 -2316 3487 10253 -61 -7298 5205
635 5205 12978 1168 -5400 5446 9484 -613 -2192 6289 5883 1161 6640 9948 374 -3736 6991
650 6991 8341 -4589 -5723 8196 10368 385 1013 6771 1531 -3856 1990 2474 -8247 -4410 11852
665 11852 9666 -8530 -6441 9831 4532 -12996 -8143 7751 3571 -6485 992 6403 -5821
678 -5821 -10842 566 794 -12402 -9543 6919 5597 -7568 -4233 4419 -4030 -14210 -6592 30
692 30 -6434 -5070 7199 5585 -6919 -5148 3468 -4759 -13288 -1982 7143 -2279 -5559 8598 9792
707 9792 -7604 -9670 4691 3170 -9861 -2346 13778 7809 -3275 5085 10944 -5353 -13074 4186
721 4186 11480 -2068 -3347 13801 15356 -1363 -4900 2973 280 -5700 2102 7479 111 1799
735 1799 13671 9133 -9470 -9029 5331 2687 -9045 -2713 10375 6879 155 3891 197 -11856
749 -11856 -7811 6418 950 -11705 400 17627 5727 -12876 -5277 5862 -5342 -13456 645
762 645 7284 -2904 -1017 12144 3737 -14365 -8857 6344 -2014 -13900 46 14482 3847
775 3847 -6243 2340 3386 -10469 -10319 3540 1796 -7612 1536 13774 2576 -10577 -2029 3461
789 3461 -8576 -11759 3107 6584 -3491 -31 10529 1296 -12401 -4603 4531 -6010 -9777 7506
803 7506 13349 -3069 -6163 8539 5496 -12911 -9560 8630 6397 -5709 2369 14029 4496 -4677
817 -4677 2725 4105 -7600 -4946 11237 10126 -3206 2788 15375 6270 -9147 -3055 7015 1416
831 1416 -2879 6196 8385 594 2573 8679 -949 -11459 -802 9432 -1859 -8958 4841 11476
845 11476 -3799 -10161 1175 605 -11658 -7745 5449 35 -9546 -603 7297 -6462 -15774 -3877
859 -3877 1928 -9623 -11520 2568 4090 -7903 -5847 3438 -2812 -12502 -3997 4566 -4157 -7797
873 -7797 4064 7651 -3961 -5989 4232 3542 -5923 -1956 7800 3643 -1618 6205 9326 -919
887 -919 -2880 8354 7866 -3318 -136 13540 10097 -1769 2119 11526 5335 -3017 3245 8395 1016
902 1016 -425 7777 6571 -2935 656 9494 3046 -7805 -1496 7433 -85 -7279 97 5202 -2541
917 -2541 -5804 246 24 -6658 -4210 1470 -3797 -9522 -2873 2898 -5393 -9914 -1969 452 -7687
932 -7687 -8962 -612 -51 -6177 -3664 1508 -3345 -7636 -1497 1739 -4828 -6846 1732 3790 -2876
947 -2876 -2222 4878 2879 -3784 -1759 2474 -783 -1411 5161 6942 93 -49 7124 5477 -3030 -859
963 -859 7182 5447 -589 2490 8387 4387 175 3797 4153 -2045 -843 6634 6392 -486 1979 7678
979 7678 3217 -4670 -2659 3776 1299 -2539 1406 4878 1263 -102 1755 -653 -5615 -3561 642
994 642 -1890 -3796 1017 4372 -1835 -5986 -3132 -2143 -5657 -5233 -815 -1181 -3469 -678 1186 -4237
1010 -4237 -7495 -3523 -1096 -5896 -6256 1433 4019 -1502 -4247 -1483 -2192 -5994 -4379 -367 -603 -1046
1026 -1046 2754 3536 -56 -2087 1068 724 -3281 -2597 2795 5210 3768 3810 3876 1549 556 1527 956
1043 956 876 3821 7758 5844 1808 3081 5169 2028 -1177 826 3908 3553 3508 5890 5326 1351 280
1060 280 1216 -1353 -3610 -29 4374 2861 -573 263 1283 -2038 -5398 -4649 -2502 -3152 -2316 -813
1076 -813 -1560 -2610 -2814 -3075 -6163 -7729 -5174 -2155 -2722 -2985 -1467 -1505 -3692 -5245 -5461 -5320 -3312
1093 -3312 -1219 -622 -1610 -92 1519 367 -3559 -3187 -83 503 -274 1358 4283 4501 2532 2163 1792
1110 1792 566 1011 3494 4794 3458 3862 6059 5199 2343 1224 2744 3605 2705 2329 4123 5598
1126 5598 4378 2201 646 608 772 601 160 1119 1732 1788 790 -556 -1485 -2781 -2628 -2077 -2386 -2841 -1751
1145 -1751 -221 -1082 -3661 -4453 -3326 -2908 -4444 -4285 -2423 -1212 -1978 -3336 -3570 -3364 -3167 -3354 -3202
1162 -3202 -2311 -963 -41 -371 -1714 -1728 -1034 -768 -846 -1030 -85 2156 2773 1479 359 735 1788 1042
1180 1042 469 1640 3303 3789 2895 2158 2409 2665 2594 1959 2312 2559 3534 3345 2257 1822 2042 1757 1117
1199 1117 865 1111 1913 2363 1974 755 -502 151 585 -746 -1891 -287 1398 666 -1348 -1362 -936 -1489
1217 -1489 -2572 -1854 -1301 -1331 -1400 -576 -1350 -3021 -2723 -1498 -2205 -3504 -2251 -24 -221 -2009 -2035 -1362
1235 -1362 -2036 -2604 -2130 -1496 -1427 269 1197 -103 -1610 -398 -141 -1124 -1510 -300 1919 1629 1182 1178 715
1254 715 640 370 168 -154 1282 3218 3379 2079 1606 2252 1988 42 71 1589 2371 2624 2947 2607 1654
1273 1654 1502 1236 -199 -792 379 2653 2231 1235 1743 1570 -48 -1624 -1192 -938 -862 -141 1007 638
1291 638 -613 -677 -984 -2595 -4015 -2400 -942 -1161 -1376 -201 -153 -1675 -3056 -3174 -2993 -3208 -1722 -442
1309 -442 -554 -662 -346 -934 -2714 -3426 -1884 -1013 -787 -131 1193 1149 604 601 -402 -1993 -1036 572 1605
1328 1605 1198 2233 3899 2932 908 -82 655 1004 1076 1944 2884 3337 3608 3122 1226 95 540 1254
1346 1254 878 617 2210 3502 2739 1237 448 -361 -1138 -984 -535 89 683 1535 1532 -798 -2394 -2070 -1521
1365 -1521 -3063 -2844 -1220 61 69 -825 -1122 -2054 -3393 -3005 -2395 -2179 -1926 -239 698 -824 -1905 -1849
1383 -1849 -1639 -2691 -2636 -1008 393 732 746 729 138 -728 -805 -1070 -953 212 1649 2499 1852 1888 1545 522
1403 522 -271 -375 370 1263 2296 2896 2612 1441 1702 1554 21 -999 937 2450 1834 1118 2147 2645
1421 2645 847 -805 -820 -403 -600 139 1801 1032 -18 341 432 -1334 -2960 -1647 26 -114 -602 209
1439 209 771 -109 -1484 -2118 -2367 -2012 -1112 7 -682 -491 313 -57 -1525 -2393 -1565 -1279 -1205 -416 534
1458 534 252 -41 319 -602 -1670 -1793 -84 491 -261 802 1806 1474 -583 -695 -307 -26 -510 859
1476 859 1170 1131 1419 1859 746 -507 -71 701 705 77 1388 2559 1505 635 725 524 -496 -4 1025
1495 1025 451 805 1626 2191 336 -747 155 513 -756 -882 687 1892 476 -298 26 -482 -1272 -803
1513 -803 -449 -758 -1077 762 750 -575 -1450 -564 -825 -1776 -1809 -379 -95 -295 -487 -390 -1148 -1631 -984 -832
1533 -832 -1331 -670 425 141 -827 -425 107 -1025 -1385 -389 50 -362 268 1656 852 -304 201 995 143
1552 143 -694 831 2218 1346 543 1508 1616 396 459 1273 1118 230 1627 2488 1501 409 912 951 169
1571 169 -640 700 1587 1100 399 932 357 -722 -564 -160 -742 -814 429 756 -572 -853 -74 -486 -1601
1590 -1601 -1950 -908 -458 -823 -510 -117 -845 -1302 -904 -1164 -1865 -1125 161 -114 -853 -661 276 -686 -1518
1609 -1518 -1251 -681 -311 -281 876 549 163 454 393 -364 -975 363 1342 1107 794 1445 2208 634 -51
1628 -51 759 629 34 738 1856 1524 1008 1086 1503 50 -624 -105 814 661 407 1465 1406 845 -33 -323
1648 -323 -838 -1074 -85 570 13 -43 924 208 -783 -1285 -676 -651 -1045 -517 355 312 -274 -263 -634 -1533 -1374
1669 -1374 -507 -305 -518 -175 724 539 -1119 -1107 -467 -946 -1198 -354 265 535 598 486 36 -847 -636 21
1689 21 -377 -488 480 1642 972 -98 232 314 -568 -609 188 531 696 1277 1670 504 -207 -152 -199 -921 -397
1710 -397 925 1526 906 623 857 107 -368 -751 -251 -171 222 1104 1314 548 -6 -74 -434 -826 -1026 -25
1730 -25 635 168 516 516 96 -248 -683 -964 -753 -535 681 518 113 161 -86 -487 -1407 -1484 -768 -837 -79 401
1752 401 152 -392 -423 -403 -1051 -1702 -436 130 175 276 396 565 -264 -580 -618 -526 -181 112 675 788 703 677
1774 677 321 -331 -680 -90 759 823 835 1275 1221 837 99 -67 -184 271 657 715 845 1529 1271 579 -140
1795 -140 -276 -375 -84 90 512 661 613 500 87 -430 -892 -1017 -382 -16 -177 198 248 -85 -903 -1025 -1166
1816 -1166 -1014 -829 -399 -294 141 -270 -154 -461 -1179 -1043 -481 -383 -256 -164 48 424 -70 -587 -672 -590 -322
1837 -322 -82 272 570 885 388 94 -223 167 79 90 223 894 1093 847 666 552 278 86 201 0 172
1858 172 339 950 848 259 -175 32 38 -376 -140 148 845 326 109 -267 -35 -281 -617 -699 -327 -46 282
1879 282 -76 -56 36 -646 -803 -645 -449 -52 -51 252 49 -253 -438 -376 -747 -847 -439 -336 30 276 -16 -34
1901 -34 -192 -344 -647 -477 -28 207 143 396 272 -96 -61 -551 -402 -366 -178 510 845 373 320 310 -3 -398
1923 -398 -728 -161 222 717 503 401 259 420 -206 -164 -415 -62 309 365 440 326 303 -92 -227 -521 -246
1944 -246 244 260 285 237 45 247 -14 -397 -388 -280 141 149 422 560 428 262 -591 -679 -140 -415 -423 282 301 454
1968 454 160 -273 -535 -810 -823 -212 -117 -412 -81 116 -187 -515 -719 -427 -743 -234 185 -68 169 340 0
1989 0 -80 -888 -425 -2 31 283 360 739 346 50 -369 -318 36 192 396 319 483 840 986 387 -241 -159 141
2012 141 101 -220 716 900 810 618 22 -137 -166 -196 136 -37 599 754 424 33 14 -261 -270 -632 -493 348
2034 348 372 278 43 -381 -827 -905 -576 -940 -489 -100 545 170 -65 -322 -425 -707 -745 -856 -221 367 816
2055 816 536 184 -201 -459 -356 -638 -327 107 263 769 680 544 -50 -441 -95 -135 -183 114 905 1050 464
2076 464 3 439 -23 -535 -281 37 398 271 737 563 585 123 -262 -559 -258 42 424 689 229 135 261
2097 261 93 -371 -563 -316 -75 118 363 353 27 49 -54 -756 -464 -355 -78 -22 245 360 466 -188 -253
2118 -253 -552 -386 -125 -140 413 -40 219 362 356 -429 -546 22 -210 -257 98 510 670 233 -61 -10 -558 -475
2140 -475 -44 -131 41 41 295 263 -257 -366 -242 -32 -433 -179 284 593 236 103 -281 -250 86 124 -380 -135
2162 -135 93 216 283 -55 92 75 9 -39 -77 443 225 301 659 72 -272 -251 117 -146 -68 465 760 686 218
2185 218 144 -230 -302 -272 -227 -87 43 655 244 -166 -256 -350 6 -450 -580 22 -105 155 -133 -298 -292 -634 -610
2208 -610 -147 -332 -39 168 41 -591 -713 -35 -175 -176 -675 -47 151 -131 -344 -147 -14 49 -80 -41 101
2229 101 82 177 404 178 132 99 296 -11 132 264 535 713 414 461 124 239 156 295 -48 296 532 252
2251 252 240 207 320 142 -453 -259 -9 -111 265 496 59 90 65 119 -219 -529 -169 -9 -241 -7 -124 -302
2273 -302 -335 -510 -427 -218 -352 -48 0 350 -290 -144 25 -499 -283 39 70 101 212 -73 -60 -106 111 -264
2295 -264 -386 -68 340 217 72 395 329 154 -81 -172 -191 -53 144 338 210 294 677 329 -287 -489 -225
2316 -225 145 -214 103 603 238 127 -215 -281 -526 -325 95 321 180 88 543 25 -344 -34 30 208 216 286
2338 286 364 252 350 -23 -122 -93 -360 121 450 110 314 323 79 -227 -281 -39 -39 38 193 165 311 243 31 -67
2362 -67 -343 -291 -38 -328 -465 -317 329 48 -397 -480 -453 -393 -820 -563 -66 -260 132 100 -231 -404 -67 -233
2384 -233 -397 -231 -96 476 423 153 -8 -280 -298 -90 -63 66 481 826 591 336 39 118 -117 -12 80 403
2406 403 510 394 631 477 310 92 29 4 -23 118 574 295 463 104 70 355 -266 -7 147 -30 111
2427 111 196 279 208 202 -397 -634 -478 -170 -134 -278 -255 -371 -224 -404 -630 -738 -490 -253 -316 -72 -188 95 160
2450 160 -43 -390 -627 -306 4 237 177 458 -10 28 -43 42 -73 -28 215 360 190 149 318 270 260 -188 365
2473 365 172 280 -31 559 503 367 287 13 177 39 225 35 246 119 62 379 119 -61 235 -2 -135
2494 -135 -203 20 231 187 237 -199 -241 -233 -111 -172 1 88 220 -243 -163 -273 -202 -36 -350 -22 -229 -13 -219
2517 -219 80 -173 -309 -282 -146 -155 -149 -153 21 43 -420 -503 -384 -205 -481 -422 -63 -24 -16 -106 118 -121 -7 100 -82
2542 -82 -107 167 169 210 232 -52 266 264 179 185 43 192 362 181 36 205 304 288 237 160 388 5 314 339 278 148
2568 148 226 411 125 56 -24 164 276 247 -232 -141 -157 49 0 91 240 40 -128 -62 61 -274 -182 -290 -294 -278
2592 -278 -195 -97 -141 -288 -364 -341 -505 -871 -351 -430 -169 -159 -423 -482 -353 -215 -460 -403 -526 -56 71 -153 113
2615 113 -119 -214 -363 -122 138 119 125 112 420 158 237 250 58 197 286 600 604 409 687 558 294 388 -121 553
2639 553 521 791 646 505 46 546 449 222 41 -127 115 413 145 -63 177 -96 -229 -135 -149 -397 -81
2660 -81 -85 107 -308 -290 -231 -472 -540 -714 -308 186 -210 -381 -427 -216 -303 -593 -566 -422 -322 -300 -57 -285 81
2683 81 -119 -10 -290 -439 -6 54 79 91 264 128 13 -246 55 67 364 93 385 583 601 350 359 220 247
2706 247 134 35 301 323 317 647 204 376 -95 342 -72 99 266 306 542 460 580 223 327 -16 -13 74 -36
2729 -36 -57 228 237 92 -341 -176 -333 36 -147 -256 -227 76 -165 -166 -364 -296 -315 -583 -272 -50 36 10 288 -157
2753 -157 -172 -327 -375 -417 -285 -238 -29 144 -197 -132 -336 -310 -334 -430 -166 -53 176 -175 -216 45 160 -275 -504
2776 -504 0 223 131 390 202 356 53 135 153 4 79 389 661 214 584 419 426 46 292 412 250 590
2798 590 218 203 438 384 491 323 -54 329 212 209 -156 149 377 -96 297 -196 -313 -211 -314 40 -258
2819 -258 -484 145 -107 -440 -481 -580 -401 -380 -473 -407 -580 -206 -424 -883 -604 -649 -211 -486 -187 -10 -153 -258
2841 -258 -152 -451 -85 -100 -393 -163 212 163 62 237 48 7 111 426 401 501 387 609 602 201 435 348
2863 348 312 451 389 267 502 623 661 354 57 31 366 230 172 401 463 625 188 33 297 12 48 59 39
2886 39 170 -206 -20 -170 -251 19 -421 -307 -316 -47 -71 -337 -340 -418 -361 -503 -383 -146 -383 -222 184 -124 -423
2909 -423 -362 -295 -404 -216 -81 -204 -85 -117 -10 14 -69 -123 -40 248 -264 -2 271 -31 76 -78 240 -77
2931 -77 -63 192 54 482 483 257 111 -87 211 100 146 38 226 364 365 296 125 90 22 73 92 57 189 345
2955 345 226 66 5 212 23 130 -186 65 263 42 327 57 -98 -16 -85 -330 -212 170 122 190 -143 -107
2977 -107 -362 -228 -104 -409 -224 -304 -167 -235 -17 -159 -135 -407 -453 -90 -287 -86 -91 -35 -208 412 -109 -484
2999 -484 -319 112 94 184 97 379 -211 41 363 9 7 -220 -36 467 388 322 397 277 267 -3 239 278 539
3022 539 343 360 370 318 411 320 162 -83 136 350 245 476 291 154 -85 -161 -281 -178 -197 -125 24 -19 -48
3045 -48 3 -42 -470 -479 106 -405 -139 -123 -4 6 -302 -277 -216 -295 -152 -32 -39 -147 -359 34 -358 -185 -208 -193 -138
3070 -138 -491 25 -212 49 -72 -61 -229 -281 173 -125 -198 316 292 247 -53 272 162 128 212 -23 13 279 447
3093 447 170 336 242 161 -10 -53 162 299 136 558 141 300 -95 -217 -50 -23 -48 91 380 120 -139 -70
3115 -70 -118 -167 -50 -12 -78 -77 -129 107 18 -132 -58 244 -31 -328 -110 109 139 -205 -209 -21 -375 -100 -71 -147 -176
3140 -176 15 -5 -183 -172 221 146 -127 -183 92 -104 -41 83 145 507 82 173 -49 -142 295 16 137 138 98 51
3164 51 90 49 -20 -62 57 167 211 314 134 228 239 -24 -107 29 228 82 -95 35 46 26 30 106 4 -78 78
3189 78 270 105 100 -138 90 -228 -93 -123 108 199 -31 74 -227 130 -283 -175 -148 -99 -80 -282 -364 -144 178
3212 178 -600 -53 -542 -246 -352 -251 -363 -107 -183 -59 -282 -438 -141 -145 -72 59 -59 -32 43 -70 149 -84
3234 -84 42 -54 370 135 -54 396 52 199 -72 -223 265 -135 75 318 350 532 226 -16 267 171 291
3255 291 232 83 365 113 148 460 145 244 -215 73 205 193 192 12 286 180 106 -196 -225 -236 33 -101 -79
3278 -79 109 -99 -244 -298 -196 -223 -272 -290 -183 66 -208 -392 -165 -31 -130 -331 -306 121 -14 -41 188 129 -192
3301 -192 -165 -73 -122 14 101 195 167 -231 107 -210 133 -150 -171 220 103 99 19 136 156 61 52 -246 76 67 -160
3326 -160 462 411 182 257 -38 106 -67 184 38 -160 143 178 437 -34 -170 68 -313 -54 54 45 236 62
3348 62 63 126 177 -253 -243 215 64 -16 -94 380 268 108 -20 -169 -206 20 -110 45 210 -127 73 49 -31 -539
3372 -539 -393 130 -67 -82 88 230 76 49 -360 -296 243 -208 -128 91 -132 51 170 67 -5 -186 -83 51
3394 51 -86 114 -2 -49 140 -259 -174 40 -175 214 92 252 299 -39 -105 -51 79 139 -208 -42 -129 133 158
3417 158 132 117 78 -73 114 83 19 274 32 89 276 -57 -38 -86 127 -168 -366 212 -9 224 -256 -276 -314
3440 -314 -192 -322 -125 -17 -56 -163 -195 -302 -242 -259 -223 -284 -424 -230 -8 50 -94 -132 49 -303 -223 -224 0 -296
3464 -296 -145 84 272 -62 -164 -239 -310 252 -89 -24 11 218 -115 203 32 -25 144 172 232 83 110 327 73
3487 73 341 411 232 74 -63 161 -30 -140 130 174 81 21 47 124 -97 -75 14 -286 45 112 -48 7 -248 106
3511 106 6 -52 145 -73 -260 -66 -113 -268 91 -262 126 54 125 170 10 29 -18 -189 1 -75 142 402 282
3534 282 147 -99 -32 -239 -177 -68 24 -224 106 378 156 187 225 -60 -34 123 77 -127 -56 -21 330 139 -130
3557 -130 -338 -338 -40 154 -48 -33 163 533 393 101 -41 -194 -11 -65 154 44 320 -89 83 -267 74
3578 74 234 162 136 101 115 107 18 16 -178 -271 -194 95 90 320 232 -112 -54 325 -137 -297 -110 99 65 300 -44 -80
3604 -80 -24 -184 -180 -83 224 -69 -199 -215 163 -158 80 -131 -68 -202 -219 -241 -87 37 -140 20 -137 -109 -253
3627 -253 -189 -36 30 214 151 10 120 120 119 98 -70 -137 419 187 181 289 191 122 -20 233 187 -6 -133 251 271
3652 271 85 -141 -59 -46 44 -37 10 151 -47 14 104 -56 -10 -122 -106 -66 -24 138 -155 -12 24 -213 -301 -81
3676 -81 -75 -267 -325 117 70 -35 61 -60 -277 -28 -101 10 -57 47 98 -85 -58 65 101 -197 -216 -42 280 -9
3700 -9 -92 -2 241 9 460 107 156 168 437 287 195 484 92 73 -46 -28 2 -62 173 -135 91 317 190 51
3724 51 37 89 297 139 -65 71 112 188 -238 -85 -216 -527 309 -56 180 -344 44 -288 -75 -325 61 -389
3746 -389 -221 84 -293 143 -181 150 -117 317 -170 -53 141 145 -47 239 11 52 -18 -191 -52 22 -42 -22
3768 -22 84 109 78 108 -234 -64 -127 -131 -30 133 -68 -106 30 -323 -7 -490 -147 -196 -157 99 -116 72 -6 103
3792 103 -149 -47 -163 38 298 -50 1 354 -202 -29 37 13 -113 181 -198 -2 273 146 243 81 27 42
3814 42 156 29 -61 136 32 147 -42 121 -45 -110 -143 21 -131 -221 -172 -68 -46 -25 -72 -113 102 174 60 140
3838 140 -132 -324 -115 -75 32 -479 -230 225 42 -63 -313 -116 2 -80 24 -197 125 -182 -12 7 5 104
3860 104 125 -215 -34 -207 15 -155 -35 91 151 18 -99 -24 8 208 -204 -25 -132 260 209 155 -315 37
3882 37 46 -121 119 -192 102 325 189 -15 -226 -76 -147 -186 -250 16 -37 266 330 -209 -9 -58 -31 32 -156 -99
3906 -99 47 -360 155 -101 -241 -258 -1 -74 -98 256 -123 -93 -351 -105 -29 -50 236 374 98 -72 39 31 64
3929 64 31 194 -20 20 134 316 -28 43 105 -32 213 -92 295 527 218 -87 59 -507 -121 -282 -128 60
3951 60 139 60 63 -112 4 170 284 -282 -12 252 -195 -155 -230 140 183 -120 -142 100 214 206 -113 -210 66 -101
3975 -101 -59 -44 -113 128 147 109 94 93 -10 366 24 -199 -38 11 -91 -162 93 -50 60 84 -62 109 169 33
3999 33 -62 -148 32 192 -119 35 163 -132 -53 161 -230 -24 -63 1 -57 -164 -163 -78 -158 -211 -363 -42 166 -108
4023 -108 272 -34 265 -61 -31 210 32 150 243 73 -24 225 109 370 63 -24 248 40 -47 43 209 -397
4045 -397 -81 150 -278 -124 227 84 145 -5 127 -53 136 -90 9 -283 -30 169 -119 -70 -222 199 95
4066 95 -60 -110 -47 -96 -40 0 108 -127 78 121 -101 26 -304 -57 -239 131 363 -69 -48 153 -97 8 -416
4089 -416 157 22 73 -72 238 -123 -46 232 70 196 47 82 335 190 22 68 425 267 -127 -43 -131 110
4111 110 -44 7 313 67 -167 -76 102 93 39 -284 31 245 -29 127 268 -97 50 -231 -65 106 -50 -44
4133 -44 111 -139 -78 -7 -264 -174 -74 158 224 159 -156 3 -218 168 -17 -81 -28 153 -249 125 97 -4 -81
4156 -81 60 -77 -105 -37 -9 61 -34 88 148 138 -60 -44 11 -35 -9 -181 -42 5 -16 -80 -345 32 -145 -7 388
4181 388 -347 -68 -35 -452 -111 138 -346 -310 -112 47 92 118 -211 122 -40 -114 231 -174 101 83 290 54
4203 54 243 -58 -125 -68 213 -95 28 2 232 50 278 -1 220 -161 80 120 119 34 -174 502 -335 -10 -10
4226 -10 74 -142 195 117 48 2 -181 -333 -171 -106 154 195 -215 138 162 61 -78 -56 -256 9 -18 88 160 152
4250 152 -112 45 -86 110 85 -33 -112 -89 63 22 437 159 -432 37 -26 29 -17 134 140 -48 -78 -74 233 112
4274 112 194 218 50 -14 169 94 461 -195 79 -86 85 294 -39 -2 20 91 300 -46 77 34 -139 172 1
4297 1 -2 -49 -77 125 246 274 36 -6 -220 -18 -198 39 -185 -63 -8 -16 -84 146 207 120 26 1 -32 258 -82 -39
4323 -39 -29 9 -38 31 -220 43 90 -265 3 -535 -200 -54 107 -175 -102 -54 -230 -50 -76 -191 88 -67 -8
4346 -8 65 -17 -335 54 -72 -132 -279 -276 -240 -277 143 158 3 42 -17 -179 -59 32 -37 16 -244 47 171 -73 -35
4371 -35 60 192 26 206 50 143 32 211 -398 97 -178 15 314 146 -109 172 314 -31 22 -167 173
4392 173 10 -25 22 27 136 -148 -34 -58 -273 -194 -85 -178 21 93 111 -212 33 202 -197 -32 154 -54 -374
4415 -374 -135 -74 -17 -271 -31 16 -176 -109 -30 43 63 21 -39 -52 -110 147 70 -63 -54 -98 118 283 93 -53 -63
4440 -63 20 42 -47 227 -173 92 -57 -244 -56 27 -242 -129 -519 -55 158 -75 -392 -216 -40 132 48 -3
4462 -3 -530 86 37 24 -103 -61 -237 67 34 -526 131 -92 343 -179 -35 -152 156 -129 -70 121 126 113 45 -4
4486 -4 -77 -107 -11 72 37 211 106 177 324 21 -61 -53 96 -177 166 363 -91 -145 -397 -228 -51 98 -90 193
4510 193 -147 -16 -50 45 152 -86 -115 170 31 -91 66 128 92 -3 31 -308 -125 79 37 -116 -84 0 -193
4533 -193 -62 137 100 146 -38 419 122 163 20 187 18 -62 -158 30 -222 -95 -114 102 -112 338 -63 -81
4555 -81 -47 75 38 -1 -45 1 -51 -56 238 382 -213 -188 -169 154 -101 -165 -92 89 145 46 -100 -421 193 147 -40
4580 -40 121 -47 -87 6 -94 -6 127 -52 258 140 -307 97 357 263 -65 -102 32 270 246 -203 193 -22
4602 -22 236 58 333 321 -40 -107 376 81 -114 190 -17 -190 -212 353 60 47 6 86 -119 213 -18 114
4624 114 129 -337 303 23 84 37 19 -216 -162 96 -269 6 -188 -60 -224 170 -55 -79 117 -97 -49 -69 -25
4647 -25 3 277 115 94 123 1 27 67 19 90 -126 -302 232 2 -12 -64 46 290 -144 -331 97 29 -32 83
4671 83 -139 376 63 -1 -150 230 -65 -109 -44 102 25 -110 95 167 -68 -123 -30 -79 -132 -243 -22 -153 15
4694 15 104 -28 89 -120 10 102 -392 2 270 -32 130 -204 -38 -229 -88 -72 86 11 297 227 -499 -177
4716 -177 154 222 2 -35 -92 155 236 29 -16 111 -42 7 -197 -130 -331 64 266 -292 -173 -14 205 -57
4738 -57 172 125 313 251 -212 60 60 -154 -69 -100 321 288 142 240 -94 81 -217 -45 -73 -82 89 247 -46 -95
4762 -95 -5 103 -101 67 85 -101 170 76 181 -41 -132 321 -85 33 -75 -118 183 15 139 183 -173 92
4784 92 86 79 198 156 -110 95 234 -109 -65 140 47 161 -246 -122 19 -110 -229 -70 42 -127 -139 -236 53
4807 53 55 -25 -316 -26 58 226 -3 -312 3 -42 35 -139 149 -305 229 -43 13 145 -152 111 -100 -19 230
4830 230 32 221 236 190 -169 -113 -168 175 -4 52 -71 -188 -8 104 268 -37 -48 -197 160 125 263 409
4852 409 168 -58 20 159 281 43 39 169 -73 -60 -240 -64 153 -117 -155 79 -117 -43 91 -10 120 -179
4874 -179 -76 -33 -304 -134 137 -79 -232 68 18 222 7 160 -50 -79 -138 132 -79 -146 349 97 196 -263
4896 -263 -118 -4 32 -193 116 422 -37 52 252 46 325 -178 71 6 -87 -135 -154 -73 -269 665 298 86
4918 86 91 -92 -17 -60 82 -12 104 249 139 99 -86 -102 -66 164 95 29 17 -45 -280 -26 4 53 -280 5 143
4943 143 -41 10 243 -23 -71 63 177 73 -68 79 116 39 73 -146 -287 14 -79 -180 -256 32 98 -13 -30
4966 -30 -194 -42 74 -235 36 -30 -148 -1 320 -102 105 48 6 -1 -410 9 10 -218 -51 56 269 -259 -16
4989 -16 -168 -24 41 -201 -128 28 100 56 71 94 -28 -169 105 1 11 48 -104 -118 -183 131 -346 63 108 148
5013 148 174 -26 70 13 243 132 116 -143 28 -22 -166 33 -157 -79 17 89 61 -163 287 -200 -24 50 105 -71
5037 -71 -126 161 -420 113 -70 101 20 -210 108 -74 24 -132 -62 118 146 -159 308 154 37 161 -112 -87
5059 -87 256 -69 306 289 38 107 -66 -278 -91 -39 41 -320 -41 149 136 223 44 40 37 -132 -238 174 102 87
5083 87 17 11 201 -14 178 396 50 298 101 29 -19 324 93 -196 126 148 214 -38 -103 -10 -165 -43 -80 92
5107 92 98 -67 151 -242 -47 107 -16 60 -156 -71 -68 -147 -143 -249 75 106 58 -119 299 4 131 316 -96 230
5131 230 -19 -92 85 78 -136 47 7 41 29 -156 -99 -75 171 -165 -145 -214 -111 379 103 36 -73 17 63 -104
5155 -104 -104 112 -98 -180 82 -154 33 161 182 226 305 176 -43 34 273 88 -25 149 -77 8 44 -34 -176
5178 -176 9 -253 -100 -113 77 203 322 -77 -169 54 -92 -20 -61 121 -281 -43 116 19 -102 -365 75 88
5200 88 -222 217 182 -51 -18 180 188 82 59 -310 -93 291 -185 60 -139 -104 -132 26 -54 -3 73 71 274 213 118
5225 118 -81 61 21 38 83 -172 -73 45 348 296 -40 256 48 -17 110 56 387 -36 331 72 -247 -16
5247 -16 -137 -35 246 18 291 -50 -113 -144 141 -84 61 213 -167 -256 -77 -101 19 156 100 280 57 1
5269 1 -36 -101 132 242 37 -43 91 -260 59 239 340 85 -199 -387 8 86 -67 172 24 -43 50 -37 -109
5292 -109 -311 295 4 -3 -105 48 243 245 146 -104 -119 -6 101 40 -129 250 -172 -240 -129 154 -160 -55 -15
5315 -15 -22 43 -188 -147 -296 -332 115 183 -60 -211 -46 -251 193 88 -56 133 -27 -214 -36 24 -253 -54 -23
5338 -23 -162 -90 -79 -69 62 -80 75 232 256 93 -169 -155 123 -28 -32 -155 205 -50 19 -414 306 285 214 15
5362 15 203 -105 -118 190 -37 -73 -120 108 -48 58 -319 -45 96 50 89 -58 50 -191 29 -102 -27 -8 -15
5385 -15 61 356 -60 114 150 -286 113 57 -31 -193 197 -22 -133 302 -217 -117 -72 84 -39 -354 100 61
5407 61 -213 -281 -63 32 -1 -9 39 26 206 -91 -73 9 -149 211 -44 111 8 -13 16 -58 -129 -68 -105 51 170
5432 170 159 -96 70 -137 15 -200 -101 126 254 -155 -51 -262 49 -165 81 115 -153 -7 -65 146 34
5453 34 190 55 348 115 141 -385 58 -255 200 -18 -57 170 140 -143 140 303 -71 313 -329 219 -335
5474 -335 -242 161 -76 -57 25 -220 -208 -75 115 -123 -103 10 -20 -36 0 -15 62 137 136 -54 83 16 -127 -209 -134
5499 -134 32 -235 -161 309 131 -301 173 99 39 -59 270 -8 61 86 179 66 218 -43 154 372 143 -98
5521 -98 -124 174 -109 -56 -213 118 114 -151 67 0 -54 204 146 -249 -191 -4 207 -108 -68 -1 37 278 -91 -140
5545 -140 35 -266 -89 191 363 189 -138 4 308 -82 135 -53 -119 66 244 35 -66 183 107 93 -25
5566 -25 -83 -402 -22 -116 -59 349 142 148 86 132 192 49 -30 93 74 -212 80 198 95 83 -184 83 -185 -72
5590 -72 206 241 252 -92 -94 -413 -4 145 -167 137 -61 55 100 -17 33 -103 -90 123 -233 29 -154 19 314
5613 314 71 15 131 177 -177 2 -200 5 12 73 -5 365 37 -163 -294 49 -322 98 8 35 -53 8 154
5636 154 94 58 -118 90 330 18 -7 111 -64 -97 -97 61 -87 -83 -276 38 65 -76 14 34 -56 -143 -42 -115 294
5661 294 4 -148 -93 -6 5 5 193 164 207 190 114 -248 -118 318 -183 -25 193 90 164 -175 -289 172 0
5684 0 -194 -271 -116 111 156 -143 24 160 -118 92 -99 -72 78 -14 -2 -171 55 -240 -45 -287 33 180
5706 180 45 271 -29 56 227 68 4 211 -2 -182 -119 -160 60 -53 -2 -15 155 160 1 -108 218 156 35
5729 35 -431 -205 -58 53 199 -26 140 -34 -42 135 -77 -125 408 71 5 72 -30 -7 -6 165 -78 177 111
5752 111 7 -252 176 96 -120 -151 -101 243 307 57 101 12 96 267 -141 165 -191 -192 -171 -301 142 5 -104
5775 -104 167 46 -99 -218 251 -142 -40 -81 87 -23 -293 397 -101 -102 86 -68 145 -67 108 -195 -97
5796 -97 -34 -16 -138 -13 18 167 417 0 -1 -40 111 -196 450 244 -73 -55 -184 -224 -292 32 131 83 14 -78 -21
5821 -21 124 292 144 266 11 304 -122 123 -159 27 -135 -250 77 -83 -456 -16 -144 -11 -110 -14 -27
5842 -27 7 -98 -230 -336 87 281 93 214 110 -98 -96 103 -237 25 8 -114 -42 26 123 -27 -40 -301 -90
5865 -90 -67 -54 374 -156 -65 201 257 -145 -304 -61 -162 -16 -66 83 -118 96 145 44 -234 116 -103 -53 -16
5888 -16 -100 -90 265 -128 51 102 -122 52 30 -243 -30 89 135 72 39 -38 -77 -159 187 137 32 45 52 -20 -190
5913 -190 -53 -107 39 -78 -132 169 -66 -211 -49 -16 -129 -271 -29 72 440 -24 202 -55 258 348 25
5934 25 145 65 -131 12 -353 208 -107 42 264 -90 69 132 -83 -4 -39 -310 47 -128 6 -18 -64 -68 -127
5957 -127 94 -58 -81 -118 39 -26 -78 7 -31 190 45 -267 164 114 -179 3 330 45 -131 114 -199 309
5979 309 302 131 -90 -197 -165 -26 -57 230 -19 356 -271 -37 104 147 145 -9 156 -113 57 -86 102 -6
6001 -6 208 24 189 380 22 47 -119 310 41 -94 10 -261 26 52 -27 57 362 -49 30 -75 75 -70
6023 -70 86 74 -68 158 -64 -68 219 -154 -83 -31 -155 73 14 226 202 -223 88 -235 -40 116 -227 96 103
6046 103 42 -31 117 84 -52 -122 -31 -13 -105 -272 89 58 272 106 63 102 72 104 72 72 -128 73 -30 -50 -177
6071 -177 -85 89 -16 147 242 -121 -100 -151 152 32 107 204 -145 350 -13 60 115 -43 26 -99 112 -283 132
6094 132 101 42 97 249 -207 -25 63 -108 -170 -426 -67 -75 -40 -292 -179 364 -207 -46 -35 222 86 -400 95
6117 95 109 -57 -187 16 195 -19 9 181 -32 3 -67 -160 -74 -28 -110 -109 -57 -214 82 -87 136 14 25 77 -2
6142 -2 92 -63 -163 -124 5 61 86 -244 -85 -293 -285 101 157 167 -311 -55 -47 -179 -238 -146 -103 -58 272 87 111 -60
6168 -60 -103 220 -92 118 -140 118 -241 160 24 -132 -66 -176 23 4 37 -6 -180 281 95 140 258 -94
6190 -94 5 -354 161 87 149 -147 5 -219 134 -153 -5 -244 -37 205 -33 195 -314 -104 -60 184 -52 -83
6212 -83 39 40 -98 -109 -14 69 -79 -26 -44 197 171 -59 192 -215 -118 -25 -93 105 82 122 -24 -296 120 232 -219
6237 -219 -212 45 -16 130 134 49 157 272 182 -131 73 165 -87 40 71 117 -6 152 -41 -61 -61 -257 -192 132 -87
6262 -87 -206 -91 149 270 118 49 -60 -81 107 -98 -173 -136 -103 24 -447 -399 271 -60 -52 85 -196 -153 -121 133
6286 133 -85 193 10 -108 297 206 63 -93 -153 103 -85 366 -73 -213 153 -87 -347 -52 -106 98 -65
6307 -65 -348 -150 -129 139 -28 155 86 -61 -108 -95 62 187 -97 64 -45 -73 97 -272 101 135 33 -169
6329 -169 75 21 64 -99 8 -215 -37 14 -13 3 -21 187 62 22 185 -59 374 86 -42 113 94 -277 -215
6352 -215 -17 -65 -447 3 -45 343 -144 -242 -252 281 95 528 -109 116 104 -63 -102 -142 -26 25 99 96 7 10 -111
6377 -111 92 -120 265 159 -81 15 80 34 -47 15 231 -115 335 42 64 213 -82 37 213 -96 -54 19 26
6400 26 -168 -5 156 -58 1 66 -88 -287 -88 -132 176 -105 -212 -168 -34 -35 102 245 248 69 -7 74 49 -90
6424 -90 68 191 -289 -7 -214 61 -68 299 140 25 34 176 31 138 -25 58 82 -54 29 -126 -146 113
6446 113 323 -47 195 78 -226 -3 -48 -333 9 -112 -121 57 -179 56 123 -133 -68 56 -133 -58 1 179
6468 179 43 31 232 -109 385 -178 82 -33 352 279 26 276 -41 -122 21 269 202 246 22 -115 -235 -67
6490 -67 70 103 12 -34 57 102 23 -203 -221 47 74 -117 -79 -59 -29 27 40 31 210 -229 -36 63 -139 -159 132 -62
6516 -62 53 26 113 -101 88 -17 85 -57 -58 -129 217 254 -2 -23 -67 -132 36 -188 -125 66 39 132 18 -262
6540 -262 282 292 58 -135 121 -8 -82 41 128 -154 130 117 79 -5 -203 -123 -40 63 -143 -92 -34 24 199 -40
6564 -40 58 -73 154 -9 -122 -81 132 -136 -90 142 -93 -90 28 61 -98 109 58 -20 -95 150 17 -30 -166 5
6588 5 -147 47 -22 59 -16 -2 -146 300 83 34 108 234 61 47 224 4 -203 -46 126 -147 326 2 286
6611 286 -54 -21 -198 -135 -324 81 263 218 40 123 -205 193 -316 1 214 127 171 225 -138 13 152 16
6633 16 -212 -155 21 -65 -53 -25 220 -333 119 -28 -80 -341 5 61 -425 -77 38 -97 -382 192 -31 70
6655 70 129 224 -58 -13 40 -157 -44 54 87 91 51 35 -241 -167 -181 -219 25 -198 -311 278 91 22 -184 -222 76
6680 76 -164 -124 13 -1 -52 117 112 -7 279 204 -207 16 -39 -136 -125 193 -10 295 -68 94 -16 17 38 -30
6704 -30 -70 51 -58 34 108 128 59 139 275 -197 -70 274 128 -58 -85 128 -192 226 175 -273 98 212 84
6727 84 -172 -313 -76 -35 58 -129 47 -112 17 -119 57 61 -112 426 8 9 -156 -18 77 259 -198 41 36
6750 36 135 165 -109 74 166 178 45 402 6 234 84 2 -193 167 116 -144 -87 50 -29 67 75 237 -315 -61
6774 -61 -191 476 102 29 -126 -57 -57 -186 291 -83 -32 -137 40 -42 -426 209 95 27 355 99 -119 14 13
6797 13 140 201 243 -76 -81 168 -133 66 37 114 -86 241 -120 109 45 -217 -175 202 -222 10 453 65 20
6820 20 -111 134 -103 127 9 366 129 32 64 -25 -155 -34 15 -21 -2 -75 -78 223 280 -50 0 43 21 85 -218
6845 -218 -310 -196 -198 -177 178 -214 -234 -134 136 -179 44 211 245 -28 91 241 -107 -304 -112 -11 21 -144
6867 -144 -114 -212 327 -46 -49 221 118 -132 3 11 -2 -41 267 191 -54 -101 116 105 -62 142 66 72 -176 52 -36
6892 -36 116 -148 -53 39 -146 -38 209 30 230 126 78 -74 -259 187 193 -159 -3 27 -139 -89 -143 62 40
6915 40 130 154 3 28 -108 -83 140 51 67 140 -74 -329 128 143 -94 74 428 132 -68 -102 -49 140 -132 -85
6939 -85 -126 -24 97 207 174 195 -17 49 116 260 120 149 -107 103 2 -21 -22 -26 2 -27 251 -144 126 -140 -273
6964 -273 75 -5 238 -95 -15 -173 -55 -27 -44 40 -42 -79 114 -25 84 143 111 -58 -99 265 83 -173 -31
6987 -31 -103 217 -48 -232 -283 -71 -41 129 105 -222 217 296 554 264 230 112 -4 -134 -389 -60 -37 -61 1
7010 1 -202 369 92 -61 139 116 146 -92 -139 -184 -51 -139 181 -204 113 64 -40 -86 48 -235 -82 114 -219
7033 -219 -15 52 109 -31 188 71 -21 280 133 46 -139 -25 -167 179 57 133 63 -127 241 -71 48 -80
7055 -80 -128 -197 303 26 -93 68 107 50 120 -176 -8 190 17 419 -133 66 162 42 -153 -27 -103 -107 -101 -192
7079 -192 -38 -264 41 -90 -28 89 8 -87 -57 -405 -35 -37 103 241 -124 -206 -106 198 416 -61 -172 -84 -104
7102 -104 117 -186 -53 -126 4 77 -12 -163 -61 -71 -95 120 -161 -31 154 118 -79 -119 -134 4 34 -80 100
7125 100 -291 160 168 283 146 -194 -63 158 157 31 94 -82 136 282 -123 44 -69 142 -219 154 -191 -194
7147 -194 4 -40 139 -245 -50 -258 58 -116 -173 -42 -23 164 228 -195 -49 409 -89 16 269 -241 -72
7168 -72 -136 202 -76 76 -57 -50 328 126 -323 21 252 -144 199 -293 -96 34 153 -149 218 -176 67
7189 67 -57 91 -189 -99 -91 -87 417 21 120 -246 -445 132 -44 255 23 -251 41 -166 172 -64 412 -49
7211 -49 -41 170 -110 -90 -98 30 37 -14 -53 209 108 7 -52 -194 -342 -318 -125 -64 147 -60 -28 80 106 128 184 326
7237 326 -119 41 79 -77 339 -110 9 81 38 207 -185 -165 -166 171 -67 190 138 -134 65 -27 -24 28 -60 150
7261 150 -171 -52 13 88 6 -185 260 -180 13 -328 -73 -8 -99 -37 -536 49 -186 325 -235 -392 -115 -314
7283 -314 -100 -92 -53 117 23 -194 57 96 32 113 -69 -70 221 61 -190 32 -229 52 145 259 -20 32 48 95
7307 95 99 32 94 25 33 -65 -100 -92 4 166 -18 -85 16 77 -80 -136 274 -207 251 91 -124 -341 96 76 209 -108
7333 -108 -173 106 6 -140 305 169 -158 229 -222 300 -171 166 78 -98 109 -33 -6 99 5 185 11
7354 11 -40 38 -117 113 -146 114 237 -4 -141 -104 -71 -80 138 39 114 -140 -85 172 -77 211 232 217 114 -344
7378 -344 -103 -110 250 147 286 46 -28 50 -212 110 66 -141 242 0 4 100 -265 -75 90 111 4 -79 -174 378
7402 378 -15 -86 234 6 -34 130 26 -17 3 49 1 75 82 68 -132 52 168 196 123 -276 -237 58 -154 -181 10
7427 10 194 99 162 -51 -46 -31 52 140 282 -127 11 94 64 80 -64 244 -118 72 -137 113 175 -147 -131 4
7451 4 -65 -56 -13 -53 40 151 -91 -82 -74 87 -47 42 -253 -176 129 185 80 142 -60 0 -149 -208 245 -19 30 150
7477 150 -330 130 7 113 107 123 -31 -92 -42 -144 87 -104 150 -99 32 39 -6 -54 -8 -133 98 47 119 -267
7501 -267 265 186 18 -351 103 -48 -82 166 -152 34 -94 -296 187 -83 -81 -1 -54 -13 -8 46 -228 -242 1 -274
7525 -274 -30 -85 -165 -47 31 -302 155 6 234 37 -105 -17 -80 90 89 -154 -29 32 105 76 -146 126 -4
7548 -4 -201 17 51 -55 -48 148 -22 36 -31 98 149 -83 -64 -97 25 227 -35 41 -37 -119 11 103 -312 410 117
7573 117 123 -25 -168 -336 -248 283 49 202 -127 -404 -18 205 -19 -15 -59 -58 -32 -139 98 1 -212 -31 -204
7596 -204 -134 96 -42 84 212 96 110 125 -296 50 2 572 148 -4 85 102 -170 -98 298 328 -112 84 -139
7619 -139 248 223 144 -141 -249 105 -53 -132 94 -225 -91 67 -225 -78 -57 -147 71 97 -156 -253 389 3
7641 3 102 -215 -79 -24 15 5 -85 114 37 -65 127 -403 -36 -234 -50 -110 136 -33 -106 160 -186 237 -182
7664 -182 198 190 52 -39 82 110 -24 -59 -177 -216 -104 -125 267 283 -169 -42 38 31 64 49 7 191 140 224 219 -45
7690 -45 32 -126 55 -59 59 -53 -137 43 212 -212 113 -13 124 266 206 -97 79 158 415 259 240 -303
7712 -303 -121 -203 -1 -246 -52 -38 268 -144 -85 265 -290 -80 18 23 -122 35 108 166 -75 -6 -254 4 -152
7735 -152 -347 77 -2 -64 -38 -234 56 75 332 142 8 168 -148 -271 -63 134 -63 94 111 -114 281 29
7757 29 70 29 -55 -61 57 47 -5 -125 -213 224 63 170 212 -245 60 54 -56 74 167 15 105 -92 179 334 -128
7782 -128 -39 -280 -109 -137 -119 211 146 180 -139 25 78 -242 30 -60 224 -7 193 0 -110 -35 -121 116 -50
7805 -50 -45 -45 -191 215 -11 -26 267 70 207 66 -215 129 -1 -96 -228 -78 175 -142 -9 -218 -208 277 -299
7828 -299 -50 59 -87 12 20 228 -252 263 -22 -118 -138 88 -117 11 -25 116 -288 79 -26 23 -154 -142 59
7851 59 173 230 250 -6 -194 -128 -157 184 -450 183 64 63 -183 -70 -63 -116 121 -8 174 162 255 -21 -267 -156
7875 -156 -12 98 -151 95 -49 -11 -334 141 -103 41 211 286 52 -105 -38 320 182 31 -12 183 -231
7896 -231 0 -46 100 28 -236 -17 235 -136 -204 -30 60 69 -155 -110 -133 96 -96 -13 -70 52 10 -231 403 208
7920 208 -126 18 -259 115 41 36 -130 50 -41 233 -21 75 35 -109 -258 -150 180 305 38 155 -37 45
7942 45 105 -77 271 -181 49 -142 -374 -59 92 83 -100 -170 -181 -189 136 175 -244 100 -61 -51 270 -131 -59 260
7966 260 19 69 60 300 214 172 -142 73 107 -220 147 52 60 -1 -207 63 -96 290 144 -245 -127 -91 -50 184
7990 184 245 -129 173 222 118 -11 86 -5 257 -154 -163 -219 31 50 -277 -204 185 58 88 93 -208 -86 91 50
8014 50 80 55 30 -6 -82 -139 -33 -84 -34 -359 48 28 -145 -60 -198 104 7 21 -64 -223 76 -148 2 -165 85
8039 85 -274 -176 102 113 195 -14 -197 -293 113 -39 -32 131 187 332 242 -242 84 118 -55 -334 -150 -118 -32 -83
8063 -83 -75 118 -120 -2 -44 -276 9 287 108 314 103 250 239 -121 218 -66 -108 144 -54 23 -251 121
8085 121 125 46 -260 -93 30 -59 111 142 -371 -199 -134 47 96 228 42 -131 -89 66 -75 -155 -47 -234 -59
8108 -59 3 -108 -90 -106 -157 -72 120 239 62 126 -154 202 131 53 -62 14 73 43 -60 237 64 -180 -91 32
8132 32 -103 166 7 -326 49 -98 -92 -270 -51 211 -141 -36 -15 -193 80 124 -139 -292 -281 -43 -104 208
8154 208 -78 226 -89 257 -218 77 45 -58 84 -221 -1 5 196 75 -25 -54 -67 -3 219 -118 34 -44
8176 -44 -263 90 5 -15 54 13 39 -148 97 22 -73 -91 129 -300 29
8191B9
##END NTUPLES=NMR FID
##END=
