##TITLE=1H_LR-684-C1M
 CDcl3, 8 sc, 
 26.7.2019
##JCAMPDX= 6.0         $$ Bruker NMR JCAMP-DX V2.0
##DATA TYPE= NMR FID
##DATA CLASS= NTUPLES
##ORIGIN= UXNMR, Bruker Analytische Messtechnik GmbH
##OWNER= root
$$ XWIN-NMR		Version 3.5
$$ Fri Jul 26 15:31:31 2019 Russian Standard Time (UT+4h)  she@DPX200
##.OBSERVE FREQUENCY= 200.13155
##.OBSERVE NUCLEUS= ^1H
##.DELAY= (6, 6)
##.ACQUISITION MODE= SIMULTANEOUS
##.ACQUISITION SCHEME= undefined
##.AVERAGES= 8
##.DIGITISER RES= 18
##SPECTROMETER/DATA SYSTEM= spect
##.PULSE SEQUENCE= zg30
##.SOLVENT NAME= CDCl3
##.SHIFT REFERENCE= (INTERNAL, CDCl3, 0, 15.7039)
##AUDIT TRAIL= $$ (NUMBER, WHEN, WHO, WHERE, WHAT)
$$ ##TITLE= Audit trail, XWIN-NMR		Version 3.5
$$ ##JCAMPDX= 5.01
$$ ##ORIGIN= Bruker BioSpin GmbH
$$ ##OWNER= she
$$ F:/spectra/data/she/nmr/H-F/1/audita.txt
$$ ##AUDIT TRAIL=  $$ (NUMBER, WHEN, WHO, WHERE, WHAT)
(   1,<2019-07-26 15:30:32.39 +0400>,<she>,<DPX200>,
      <created by zg, POWCHK disabled, PULCHK disabled
       configuration hash MD5:
       00 E9 B6 7A A2 85 ED C7 34 08 36 98 17 FE 4E 26
       data hash MD5: 16K
       C6 CA 24 21 08 9C 6E 63 84 4D D1 44 FD 8A D5 91>)
$$ ##END=
$$ 
$$ hash MD5
$$ 77 27 ED 08 ED DE 97 D3 1B 6E 9C C2 05 69 1A 86
##$RELAX= 
##$RELAX= 
##$RELAX= 
##$RELAX= 
##$RELAX= 
##$RELAX= 
$$ Bruker specific parameters
$$ --------------------------
##$DU= <F:/spectra>
##$EXPNO= 1
##$NAME= <H-F>
##$PROCNO= 1
##$TYPE= <nmr>
##$USER= <she>
##$AMP= (0..31)
100 100 100 100 100 100 100 100 100 100 100 100 100 100 100 100 100 100 
100 100 100 100 100 100 100 100 100 100 100 100 100 100 
##$AQSEQ= 0
##$AQ_mod= 1
##$AUNM= <au_zg>
##$AUTOPOS= <>
##$BF1= 200.13
##$BF2= 200.13
##$BF3= 200.13
##$BF4= 200.13
##$BF5= 200.13
##$BF6= 200.13
##$BF7= 200.13
##$BF8= 200.13
##$BYTORDA= 1
##$CFDGTYP= 0
##$CFRGTYP= 5
##$CHEMSTR= <none>
##$CNST= (0..31)
1 1 145 1 1 1 1 1 1 1 1 1 1 1 1 1 1 1 1 1 1 1 1 1 1 1 1 1 1 1 1 1 
##$CPDPRG= <>
##$CPDPRG1= <>
##$CPDPRG2= <>
##$CPDPRG3= <>
##$CPDPRG4= <mlev>
##$CPDPRG5= <mlev>
##$CPDPRG6= <mlev>
##$CPDPRG7= <mlev>
##$CPDPRG8= <mlev>
##$CPDPRGB= <>
##$CPDPRGT= <>
##$D= (0..31)
0 1.2 0 0 0 0 0 0 0 0 0 0.03 0 0 0 0 0 0 0 0 0 0 0 0 0 0 0 0 0 0 0 0 
##$DATE= 1564140631
##$DBL= (0..7)
120 120 120 120 120 120 120 120 
##$DBP= (0..7)
150 150 150 150 150 150 150 150 
##$DBP07= 0
##$DBPNAM0= <>
##$DBPNAM1= <>
##$DBPNAM2= <>
##$DBPNAM3= <>
##$DBPNAM4= <>
##$DBPNAM5= <>
##$DBPNAM6= <>
##$DBPNAM7= <>
##$DBPOAL= (0..7)
0.5 0.5 0.5 0.5 0.5 0.5 0.5 0.5 
##$DBPOFFS= (0..7)
0 0 0 0 0 0 0 0 
##$DE= 6
##$DECBNUC= <off>
##$DECIM= 24
##$DECNUC= <off>
##$DECSTAT= 4
##$DIGMOD= 1
##$DIGTYP= 9
##$DL= (0..7)
0 120 120 120 120 120 120 120 
##$DP= (0..7)
150 150 150 150 150 150 150 150 
##$DP07= 0
##$DPNAME0= <>
##$DPNAME1= <>
##$DPNAME2= <>
##$DPNAME3= <>
##$DPNAME4= <>
##$DPNAME5= <>
##$DPNAME6= <>
##$DPNAME7= <>
##$DPOAL= (0..7)
0.5 0.5 0.5 0.5 0.5 0.5 0.5 0.5 
##$DPOFFS= (0..7)
0 0 0 0 0 0 0 0 
##$DQDMODE= 0
##$DR= 18
##$DS= 0
##$DSLIST= <SSSSSSSSSSSSSSS>
##$DSPFIRM= 0
$$ [...]
##$SUBNAM2= <"">
##$SUBNAM3= <"">
##$SUBNAM4= <"">
##$SUBNAM5= <"">
##$SUBNAM6= <"">
##$SUBNAM7= <"">
##$SUBNAM8= <"">
##$SUBNAM9= <"">
##$SW= 24.9336996594482
##$SWIBOX= (0..15)
0 0 2 0 0 0 0 0 0 0 0 0 0 0 0 0 
##$SW_h= 4990.01996007984
##$TD= 16384
##$TD0= 1
##$TE= 0
##$TE2= 300
##$TE3= 300
##$TEG= 300
##$TL= (0..7)
0 120 120 120 120 120 120 120 
##$TP= (0..7)
150 150 150 150 150 150 150 150 
##$TP07= 0
##$TPNAME0= <>
##$TPNAME1= <>
##$TPNAME2= <>
##$TPNAME3= <>
##$TPNAME4= <>
##$TPNAME5= <>
##$TPNAME6= <>
##$TPNAME7= <>
##$TPOAL= (0..7)
0.5 0.5 0.5 0.5 0.5 0.5 0.5 0.5 
##$TPOFFS= (0..7)
0 0 0 0 0 0 0 0 
##$TUNHIN= 0
##$TUNHOUT= 0
##$TUNXOUT= 0
##$USERA1= <user>
##$USERA2= <user>
##$USERA3= <user>
##$USERA4= <user>
##$USERA5= <user>
##$V9= 5
##$VALIST= <valist>
##$VCLIST= <CCCCCCCCCCCCCCC>
##$VD= 0
##$VDLIST= <DDDDDDDDDDDDDDD>
##$VPLIST= <PPPPPPPPPPPPPPP>
##$VTLIST= <TTTTTTTTTTTTTTT>
##$WBST= 1024
##$WBSW= 4
##$XGAIN= (0..3)
0 0 0 0 
##$XL= 0
##$YL= 0
##$YMAX_a= 49992
##$YMIN_a= -26447
##$ZGOPTNS= <>
##$ZL1= 120
##$ZL2= 120
##$ZL3= 120
##$ZL4= 120
##$ABSF1= 10
##$ABSF2= 0
##$ABSG= 5
##$ABSL= 3
##$ALPHA= 0
##$AQORDER= 0
##$ASSFAC= 0
##$ASSFACI= 0
##$ASSFACX= 0
##$ASSWID= 0
##$AUNMP= <proc_1d>
##$AZFE= 0.1
##$AZFW= 0.1
##$BCFW= 1
##$BC_mod= 2
##$BYTORDP= 1
##$COROFFS= 0
##$CY= 11.3945322036743
##$DATMOD= 1
##$DC= 2
##$DFILT= <>
##$DTYPP= 0
##$F1P= 20.1537800932815
##$F2P= 0.134698688090026
##$FCOR= 0.5
##$FTSIZE= 0
##$FT_mod= 4
##$GAMMA= 1
##$GB= 0.15
##$INTBC= 1
##$INTSCL= 1
##$ISEN= 128
##$LB= 0.24
##$LEV0= 0
##$LPBIN= 0
##$MAXI= 10000
##$MC2= 0
##$MEAN= 0
##$ME_mod= 0
##$MI= 1.114404
##$NCOEF= 0
##$NC_proc= 0
##$NLEV= 6
##$NOISF1= 3.799351
##$NOISF2= 2.8
##$NSP= 1
##$NTH_PI= 0
##$NZP= 0
##$OFFSET= 15.70392
##$PC= 1
##$PHC0= -9134.709
##$PHC1= 17.40097
##$PH_mod= 1
##$PKNL= yes
##$PPARMOD= 0
##$PSCAL= 0
##$PSIGN= 0
##$REVERSE= no
##$SF= 200.130013532006
##$SI= 16384
##$SIGF1= 3
##$SIGF2= 2
##$SINO= 400
##$SIOLD= 16384
##$SREGLST= <1H.CDCl3>
##$SSB= 0
##$STSI= 0
##$STSR= 0
##$SW_p= 3612.71676300578
##$SYMM= 0
##$S_DEV= 0
##$TDeff= 0
##$TDoff= 0
##$TI= <>
##$TILT= no
##$TM1= 0
##$TM2= 0
##$TOPLEV= 0
##$USERP1= <user>
##$USERP2= <user>
##$USERP3= <user>
##$USERP4= <user>
##$USERP5= <user>
##$WDW= 1
##$XDIM= 8192
##$YMAX_p= 0
##$YMIN_p= 0
$$ End of Bruker specific parameters
$$ ---------------------------------
##NTUPLES= NMR FID
##VAR_NAME=  TIME,          FID/REAL,        FID/IMAG
##SYMBOL=    X,             R,               I
##VAR_TYPE=  INDEPENDENT,   DEPENDENT,       DEPENDENT
##VAR_FORM=  AFFN,          ASDF,            ASDF
##VAR_DIM=   8192,          8192,            8192
##UNITS=     SECONDS,       ARBITRARY UNITS, ARBITRARY UNITS
##FACTOR=    0.0002004,     1,               1
##FIRST=     0,             0,               0
##LAST=      1.6414764,     0,               0
##MIN=       0,             -26447,          0
##MAX=       1.6414764,     49992,           0
$$ Real data points
##PAGE= N=1
##DATA TABLE= (X++(R..R)), XYDATA
$$ [...]
285F389k592l333J311J483k275j168K690R86k822j469J316l35k308k02J403m61
$$ 6389 3797 464 1775 3258 983 -185 2505 3491 669 -800 516 181 -2127 -2329 -926 -1387
301a387j234N92P29j238j116L66m8j156o3J318N65o12j84K31m75m44L12N55K51
$$ -1387 -2621 -2029 -1300 -2538 -3654 -3288 -3336 -4492 -4555 -3237 -2672 -3284 -3468 -3237 -3712 -4156 -3844 -3289 -3038
320c038O00P56M0k93K37M15ll5N24Q42P30M66O1N3K72N5l88J1J182Q62k91m5Q20
$$ -3038 -2438 -1682 -1642 -1935 -1698 -1283 -1286 -1321 -797 45 775 1241 1302 1355 1627 1682 1294 1305 2487 3349 3058 3013 3833
343C833R4j203m17R24K06r29L08J228k98j422n0O56q96j411M30J053o70r93M88
$$ 3833 3927 2724 2307 3231 3437 2508 2816 4044 3746 2324 2274 2930 2034 623 1053 2106 1436 443 931
362I31L99j348j227L20K49r03k94P86Pj042l47M11n22r48K91Q79j87o11L37O79
$$ 931 1330 -18 -1245 -925 -676 -1579 -1873 -1087 -1080 -2122 -2469 -2058 -2580 -3528 -3237 -2358 -2545 -3156 -2819 -2140
382b140l06q21J6P19K88j3K41N94M66m7l64r9N17O68J39R6O22P94K7m29RL60P7
$$ -2140 -2446 -3267 -3251 -2532 -2244 -2257 -2016 -1422 -956 -1003 -1367 -1466 -949 -281 -142 -46 576 1370 1397 968 977 1337 1414
405A414m2L99O43L60Mk9j92m48k68K42K45p4PL13J58m78o88k27o2m36l43J49M01
$$ 1414 1372 1771 2414 2774 2778 2749 2557 2109 1841 2083 2328 2254 2261 2574 2732 2254 1566 1339 1277 841 498 647 1048
428A048j07m19k95l71o31l93J58P6l79j82M19J71p27n87K55J99o05l71O16P32
$$ 1048 941 522 227 -144 -775 -1168 -1010 -934 -1313 -1495 -1076 -905 -1632 -2219 -1964 -1765 -2370 -2741 -2125 -1393
448a393k03m70O3K19j20j01L35L38J81J77K81j4j65K90L84j26j36N81P87J00l49
$$ -1393 -1596 -2066 -2003 -1784 -1904 -2005 -1670 -1332 -1151 -974 -693 -707 -872 -582 -198 -324 -460 121 908 1008 659
469F59L5L28o2k53K27O57K72q5l9Lr3j60j36m3m9K57K53K6j46j39k75n26l36P4
$$ 659 694 1022 960 707 934 1591 1863 1778 1739 1742 1649 1489 1353 1310 1261 1518 1771 1797 1651 1512 1237 711 375 449
493D49J33o1R8J48k33m78k03n9n52n47L68N97j67m18K86K99p25q96J93N60j82
$$ 449 582 521 619 767 534 56 -147 -206 -758 -1305 -937 -340 -507 -925 -639 -340 -1065 -1961 -1768 -1208 -1390
514a390l05N14N65k67l31J90q5o91P1Q67K49k96M00P50l30r62J26Q88R2m65L46
$$ -1390 -1695 -1181 -616 -883 -1214 -1024 -1109 -1800 -1729 -862 -613 -909 -509 241 -89 -1051 -925 -37 55 -410 -64
535f4P47j1k96K69K25m80k28N62K63k17K65Q43j63j145l29P51K39m46J51O42q8
$$ -64 683 672 376 645 870 390 162 724 987 770 1035 1878 1715 570 241 992 1231 785 936 1578 1490
556A490o75q8K14m27m26L68K78n09j30R37J71j236r09M65K79o78l5J137M05r09
$$ 1490 815 727 941 514 88 456 734 225 95 1032 1203 -33 -942 -477 -198 -876 -911 226 631 -278
576b78o08J93l67o32L50P53k46m37P85P11r28j024N69M78r30l98J425J162n71
$$ -278 -886 -693 -1060 -1692 -1342 -589 -835 -1272 -487 224 -704 -1728 -1159 -681 -1611 -2009 -584 578 7
595Gn32M03k28j056P9J180K76l37O80Q30p05j081O09P80p71o54J074J053m20l41
$$ 7 -525 -122 -350 -1406 -1327 -147 129 -208 472 1302 597 -484 125 905 134 -520 554 1607 1187 846
615H46O80Oj270n18Q16M15k67N38R66n08j449k58O94k27o34N40R54k89q99N2M86
$$ 846 1526 1532 262 -256 560 975 708 1246 2212 1704 255 -3 691 464 -170 370 1324 1035 136 188 674
636F74n81j056M8O43m7r7O72M87r09j164p6J76m04K04J276O31r59p98M77L0j007
$$ 674 93 -963 -915 -272 -319 -416 256 743 -166 -1330 -1406 -1230 -1634 -1430 -154 477 -482 -1280 -803 -773 -1780
657a780j49J192M22o49K45J205j22j126k53M11m36m02J475J442m92p76N44qj544
$$ -1780 -1929 -737 -315 -964 -719 486 364 -762 -1015 -604 -1040 -1442 33 1475 983 207 751 743 -801
676h01l58J816Q86r52L2J335k05j552K9J110o85j214J057J645n39j007Q84M24
$$ -801 -1159 657 1543 591 623 1958 1753 201 230 1340 655 -559 498 2143 1604 597 1481 1905
694A905j955j388J353J273p07k09J147p0j824o17R27j11r19O01J215n14r96N86
$$ 1905 -50 -1438 -85 1188 481 272 1419 1349 -475 -1092 -165 -276 -1195 -594 621 107 -889 -303
712c03O79j299j297O72R89l97j51J230N25j284j086K82K37l19N10J184K66o66
$$ -303 376 -923 -2220 -1548 -559 -956 -1107 123 648 -636 -1722 -1440 -1203 -1522 -1012 172 438 -228
730b28j61L26m00o68L11Q31O8j63O80Q04m32r39j34K17l13j5J075J011k95o77
$$ -228 -389 -63 -463 -1131 -820 11 79 -84 596 1400 968 29 -105 112 -201 -216 859 1870 1575 898
750H98p8r2q04k38R45P05m55k27O78O3j089n72N12J7o99J84J193K21p70k57Q8
$$ 898 820 728 -76 -314 631 1336 881 654 1332 1395 306 -266 246 263 -436 -252 941 1162 392 135 223
771B23q94r19P33J145k82m67P91K99j496j034R83Q14r91l97J406P28j068n05P40
$$ 223 -671 -1590 -857 288 6 -461 330 629 -867 -1901 -918 -104 -1095 -1492 -86 642 -426 -931 -191
790a91j55j318P3J368K52n17P09Q62j152j414O09J089n40l67J319Q67j077p53
$$ -191 -346 -1664 -1591 -223 29 -488 221 1083 -69 -1483 -874 215 -325 -692 627 1494 417 -336
808c36P68J84j065q6J200K00o87N60R87p62j322K25P08n36l06J133Q47q15p55
$$ -336 432 616 -449 -535 665 865 178 738 1725 963 -359 -134 574 38 -268 865 1712 897 142
827A42K75q3q46N3R56J29n50L06N55o66q90J89M23n00l21P89P45l17o06j9j44
$$ 142 417 334 -512 -459 497 626 76 382 937 271 -619 -430 -7 -507 -828 -39 706 389 -217 -236 -380
848c80n50j60N02N30J32pMk92m37k03J55J57L3J90L99K42k49l81o2M3l29j44O17
$$ -380 -930 -1090 -588 -58 74 67 71 -221 -658 -861 -706 -549 -516 -326 73 315 66 -315 -377 -334 -663 -807 -190
871a90P79o3l48Q4p8o37k15O07L76k06K37O12k76p90L5N52l75o20O60Q70k54n19
$$ -190 589 526 178 262 184 -453 -668 -61 315 109 346 958 682 -108 -73 479 104 -516 144 1014 760 241
893B41M00J17p95m16N51K38k46M01O88n31q93J81M60o02n29Q30P68n24m74M23
$$ 241 641 758 -37 -453 98 336 90 491 1179 648 -245 -64 396 -206 -735 95 863 339 -135 288
913B88J25q32l60N30O3l19M38O64l79p58R7K42n87l91P55O71k91k39K65q3o37
$$ 288 413 -419 -779 -249 -186 -505 -67 597 218 -540 -443 -201 -788 -1179 -424 247 -44 -283 -18 -101 -738
934g38j07L93K1j53M75M36k04l59J38Pl85j52M31M23O9J35O0k15l35jN1k1J97
$$ -738 -845 -452 -431 -584 -109 327 123 -236 -98 -91 -476 -628 -197 226 295 430 490 275 -60 -61 -10 -31 166
957A66M51J47k63l0N8j99k47K5K03P4J56K27m1k63j64j33k65k8L66K42j20o0J00
$$ 166 617 764 501 471 529 330 83 108 311 385 541 768 727 464 300 167 -98 -126 240 482 362 302 402
980D02k37m66j00J75Mo2K32J97j88j68j4k34m15R9M45N5j49K09K89l26n12M0K38
$$ 402 165 -301 -401 -226 -222 -284 -52 145 -43 -211 -225 -459 -874 -775 -330 -275 -424 -215 74 -252 -764 -724 -486
1003d86p5k1L64K37j07%N9k58l01K00L74K6j9K92L02k80k94O3L0p3J21K77P8k6
$$ -486 -561 -582 -218 19 -88 -88 -29 -287 -588 -388 -14 12 -7 285 587 307 13 76 106 33 154 431 509 483
1027D83K09L2m20k89K23J91j41M6K93J05k68j68n9j65r0K00N6j60P2K77j53m59
$$ 483 692 724 304 15 238 429 288 334 627 732 464 296 237 72 -18 182 238 78 150 427 274 -185
1049a85j83J38K4j74J20K70j1j67r9j18k11k0K18P0q6Q5K45m2k67j21P2J3lJ41
$$ -185 -368 -230 -206 -380 -260 10 -1 -168 -267 -385 -596 -616 -398 -328 -414 -329 -84 -126 -393 -514 -442 -429 -432 -291
1073b91J96O8O3J3k50j41J56K00p7l5L23K33k01j72Q8N2j73o1K02J95j2O4M1j60
$$ -291 -95 -27 36 49 -201 -342 -186 14 -63 -98 225 458 257 85 173 225 52 -9 193 388 376 440 481 321
1097C21k00L8P9r1l4K41J27j53j53Jj1j23j56O0K02J3j8n9j0p9j37p6KJ09N9q
$$ 321 121 159 238 147 113 354 481 328 175 176 165 42 -114 -54 148 161 143 84 74 -5 -142 -218 -216 -107 -48 -56
1123e6j6k1n1n9n2k8l4Q1J76L5j11n4Q8l5j37l7J52J18k3j5P9Lk0q5j6k3Q6J28
$$ -56 -72 -93 -144 -203 -255 -283 -317 -236 -60 -25 -136 -190 -102 -137 -274 -311 -159 -41 -64 -79 0 3 -17 -102 -118 -141 -55 73
1151G3L5p3KO5k3j45n0J30J06J9k1qM6M4q7j62L2R0O7j1l9M3J12m1j32q9R4Jj0
$$ 73 108 35 37 102 79 -66 -116 14 120 139 118 110 156 200 113 -49 -17 73 140 129 90 133 245 204 72 -17 77 78 68
1180F8J5K6N0j0j9o4q8J0P4J8q2j7J14Q8j69j16L7J06j06j06O8J77n0r8j1K1m3
$$ 68 83 109 159 149 130 66 -22 -12 62 80 -2 -19 95 183 14 -102 -65 41 -65 -171 -103 74 24 -74 -85 -64 -107
1207a07p3k5N4J3L7N8o7j12J2J24q1j74R4K31qj53P5J18l9j83l6J57O0l2J33M0
$$ -107 -180 -205 -151 -138 -101 -43 -110 -222 -210 -86 -167 -341 -247 -16 -24 -177 -102 16 -23 -206 -242 -85 -25 -57 76 116
1233A16o6k4O6p4q3P8J80M7j24L5J69rj93q0J01LjJ13J13k5r2l6p3j48m8J86J36
$$ 116 50 26 92 18 -65 13 193 240 116 151 320 311 118 38 139 142 141 254 367 342 250 214 141 -7 -55 131 267
1260B67j26q7P0O8j73k04N3J21m8j14P5J57l1j23j00j01j20J07K08Oj07J10J10
$$ 267 141 54 124 192 19 -185 -132 -11 -59 -173 -98 59 28 -95 -195 -296 -416 -309 -101 -95 -202 -92 18
1283A8k24k99J31K59k6j94J50K54p5j33L8Q1k07r0K90J28o0J39K42j79m21pL27
$$ 18 -206 -505 -374 -115 -141 -335 -185 69 -6 -139 -101 -20 -227 -317 -27 101 41 180 422 243 -178 -185 142
1306A42M4j98K41L02j72l20J20J41j81j56K33J20k28L0L75o2m17j72J92J4k29
$$ 142 186 -12 229 531 359 39 159 300 119 -37 196 316 88 118 493 431 14 -158 34 48 -181
1327a81J73M26o0m10j01O8j34j35K62K04j78j11J47P8k77j32K01kk65pM47J94
$$ -181 -8 418 358 -52 -153 -85 -219 -354 -92 112 -66 -177 -30 48 -229 -361 -160 -162 -427 -434 13 207
1349B07k16k04J15j34k50J11L98J92j30m0K9j64k40K11K56j10j46K22K74k52j12
$$ 207 -9 -213 -98 -232 -482 -371 27 219 89 49 78 -86 -326 -115 141 31 -115 107 381 129 17
1370A7J68N5l57k00L56K83kk0J29k32m36l7L12Q9p3J88K34l11l91J43L14k49k69
$$ 17 185 240 -117 -317 39 322 320 300 429 197 -239 -276 36 125 52 240 474 163 -228 -85 229 -20 -289
1393b89J58L08j35j29L24R3m63k91J77J42j59K65N15j52o35j19L55p6l09L01N29
$$ -289 -131 177 42 -87 237 330 -133 -424 -247 -105 -264 1 516 364 -271 -390 -35 -111 -420 -119 410
1414D10j83m59J07L68k35l02J81J24j88m1M58K29l87k55J70j13m18K14O85J34
$$ 410 227 -232 -125 243 8 -294 -113 11 -177 -218 240 469 82 -173 -3 -116 -534 -320 365 499
1434D99m36j28J71k02l18K22L80j05k42K25J90k41j69K28%m41r1M83L45j84o9
$$ 499 63 -65 106 -96 -414 -192 188 83 -159 66 256 15 -154 74 74 -367 -458 25 370 186 117
1455A17J46k18n04%M88K03j08J35R4k81l40K04K42k15j45K54K52k21o9K95K8n18
$$ 117 263 45 -459 -459 29 232 124 259 353 72 -268 -64 178 -37 -182 72 324 103 34 329 357 -161
1477a61k61K86K45k5J48K50j54m94j64K16J5p2K62K86k34l54J18K29k25l38J59
$$ -161 -422 -136 109 84 232 482 328 -166 -330 -114 -99 -171 91 377 143 -211 -93 136 -89 -427 -268
1498b68L06j87l9L29K33l65l71K9L5j05J75N26M5l62j39J16j56k86K42M85m1k90
$$ -268 38 -149 -188 141 374 9 -362 -333 -298 -403 -228 298 343 -19 -158 -42 -198 -484 -242 243 202 -88
1520h8N9L55j39l58J06J18j75o5L97K88j70j26O3k17m36Q6N64J91k18l9K45k35
$$ -88 -29 326 187 -171 -65 53 -122 -187 210 498 328 202 265 48 -388 -302 262 453 235 196 441 206
1542B06m19K4L11m1j89J89K03j12j43J31o7m52j45L68K16p8J0L11j26n38k18K69
$$ 206 -213 -189 122 81 -108 81 284 172 29 160 93 -359 -504 -136 80 2 12 323 197 -341 -559 -290
1564b90R3m7J88K82j32k76J8J51k29j47J49K48r9J6K98J10l60l42J63R4n8J61
$$ -290 -197 -244 -56 226 94 -182 -164 -13 -242 -389 -240 8 -91 -75 223 333 -27 -369 -206 -112 -170 -9
1586iL47J07k82j48M3j31j26J74K90l8j32J51J68k49k90N6J08j10j8L03K21j50
$$ -9 338 445 163 15 58 -73 -199 -25 265 227 95 246 414 165 -125 -69 39 -71 -89 214 435 285
1608B85k03m7j01k08J9K90R1j5lP6j74k71j2K05o7j03J93K27m5k17k9mj71j02
$$ 285 82 35 -66 -274 -255 35 126 111 108 184 10 -261 -273 -68 -135 -238 -45 182 137 -80 -109 -113 -284 -386
1632c86J64K42L7M7J35j57k64j23J80Q3r0J27K76K9k67j08J25l6j71QK05R2nP3
$$ -386 -222 20 57 104 239 82 -182 -305 -125 -42 -132 -5 271 300 33 -75 50 14 -157 -149 56 148 143 216
1656B16M1k59j65R5P2j04J11K50J04k41j85N3j3j10nJ55J08m1L4L5j62j35QO6
$$ 216 257 -2 -167 -72 0 -104 7 257 361 120 -65 -12 -25 -135 -140 15 123 82 116 151 -11 -146 -138 -72
1680g2r6N8K16J39j44j47NK9k02j7K02J50k7l0P0p2j54qO6m6j0J56J37p7j10L2
$$ -72 -168 -110 106 245 101 -46 -41 -12 -214 -231 -29 121 94 64 134 62 -92 -100 -34 -80 -90 66 203 126 16 48
1706D8k9j32o1J35J16L8l4L0p0p6p1NJ3k3J30R5k0r0k3K4j02j24N3J45N8j1k6
$$ 48 19 -113 -174 -39 77 115 81 111 41 -35 -106 -101 -88 -111 19 114 94 4 -19 5 -97 -221 -168 -23 35 24 -2
1733bL5k3j19o8J3J15N6O5J0l7k6pn5o2K0J11Q5l3jO7j8j18q8N5Q8%O6N0Kr3k2
$$ -2 33 10 -109 -177 -164 -49 7 72 82 45 19 12 -43 -105 -85 26 111 78 77 144 126 8 -80 -25 63 63 129 179 181 88 66
1764F6k7q4NQ4Q7j9o9P1L5j64j03P5O0o8K4O9qo9J1j5j28k0R6R6o2m4N8L7p6j15
$$ 66 39 -45 -40 44 131 112 43 114 149 -15 -118 -43 17 -51 -27 42 34 -35 -24 -39 -167 -187 -91 5 -57 -101 -43 -6 -82 -197
1794a97L3Q3K6pL0N4m4j2k2m0J4Q1K0k3K7L5K4l7o3j0Q4K9lk7P2J1j6k9m3j2N3
$$ -197 -164 -81 -55 -62 -32 22 -22 -34 -56 -96 -82 -1 19 -4 23 58 82 45 -18 -28 56 85 82 55 127 138 122 93 50 38 91
1825I1K2k0oN6m3k8n0k9O1n5j0K0J3J4m9n2LL1rOj1K7k9L0m8r2L8M9L0p2k1J15
$$ 91 113 93 87 143 100 72 22 -7 54 -1 -11 9 22 36 -13 -65 -62 -31 -40 -34 -45 -18 -47 -17 -65 -157 -119 -70 -40 -112 -133 -18
1857a8L9j01j5J3N2j7j9P0J2l2K2Ml6K5P1k6m0%Q9M0j13l4N6M4m0j6L3L1n5JK3
$$ -18 21 -80 -95 -82 -30 -47 -66 4 16 -16 6 10 -26 -1 70 44 4 4 93 133 20 -14 42 86 46 30 63 94 39 40 63
1888F3m1mK7K6m6o6P6Q3j09j24P8O7qn5J7K9J2n9NJ5q2Q1M1m0l5J3Q5n1j21P3
$$ 63 22 18 45 71 25 -41 35 118 9 -115 -37 30 22 -33 -16 13 25 -34 -29 -14 -96 -15 26 -14 -49 -36 49 -2 -123 -50
1918e0J02k1j11L1J17l8o5rP5l8l1R6l0k4J1L2l2j06N3J22Mj30J5R8l1j21M3R1
$$ -50 52 31 -80 -49 68 30 -35 -44 31 -7 -38 58 28 4 15 47 15 -91 -38 84 88 -42 -27 71 40 -81 -38 53
1946E3k5o3QP9o7m0O4L4j09n1J27K9p9J8Q0K2j29o8R7O0o5OR0nj20L8O7l5m8P0
$$ 53 28 -35 -27 52 -15 -55 9 43 -66 -117 10 39 -40 -22 58 80 -49 -117 -20 40 -25 -19 71 66 -54 -16 51 16 -32 38
1976C8M6q0j1Q0P2q9j36J21M9o4n3J58K7j52o1R7po0L7Q8n5j22N2Q5r0j03O7J34
$$ 38 84 4 -7 73 145 56 -80 41 90 26 -27 131 158 6 -55 42 35 -25 12 100 45 -77 -25 60 -30 -133 -66 68
2004F8j12j38J80J10j34r3O3J7j05pJ52P5j12m1O3n4j28R2J82pj83J7K05m9j53
$$ 68 -44 -182 -2 108 -26 -119 -56 -39 -144 -151 1 76 -36 -77 -14 -68 -196 -104 78 71 -112 -95 110 61 -92
2029i2M8J54j09p1J20R1m3q2J19rj97j4K18R5j70j3J35m0k13j3K23J2j70N1J21
$$ -92 -44 110 1 -70 50 141 98 16 135 126 -71 -85 133 228 58 45 180 140 -73 -86 137 149 -21 30 151
2054A51o8j37N7J42j91j14J54R0q3o7J73L0k95q1J52R5j10L3J42n6j64kJ11j1
$$ 151 83 -54 3 145 -46 -160 -6 84 1 -66 107 137 -158 -239 -87 8 -102 -69 73 17 -147 -149 -38 -49
2078d9j30R9J30o9j17J48J08j51j79J43P9p8LJ85J13k09j20J09kj04J10J68Lj77
$$ -49 -179 -80 50 -19 -136 12 120 -31 -210 -67 12 -66 -63 122 235 26 -94 15 13 -91 19 187 190 13
2102A3L8P5n8j28P1J59r7j59J59J82j16j83L2L8j06p2K26J35j21q0N6o7k14L9
$$ 13 51 126 68 -60 11 170 73 -86 73 255 139 -44 -12 26 -80 -152 74 209 88 8 64 -3 -217 -178
2126a78K23K0j89N1K03n8k40N8J30n0j97J10K08k2j09J18pk46r6K06J80j24K5
$$ -178 45 65 -124 -73 130 72 -168 -110 20 -30 -227 -117 91 69 -40 78 71 -175 -271 -65 115 -9 16
2149A6K08l0l03o9K43Qj78N4K14m1r7M3R9j53j59Q2J29o6k8K31R5k96j97J43N9
$$ 16 224 194 -109 -178 65 73 -105 -51 163 122 25 68 167 14 -145 -63 66 0 -28 203 298 2 -195 -52 7
2174Gr9KK48N3k01p2R4n0j62O3J42m9r2J59J24j06k01M8J7p9LK22J76j47j53P4
$$ 7 -92 -90 158 211 10 -62 32 -18 -180 -117 25 -24 -116 43 167 61 -140 -92 -75 -154 -151 71 247 100 -53 21
2200B1l2j37j9J96Q0r6J4J53n5k01K7J33j15j25J64K23o9j23L1K3j89j38J62J87
$$ 21 -11 -148 -167 29 109 13 27 180 125 -76 -49 84 -31 -156 8 231 162 39 70 93 -96 -234 -72 115
2224A15l3k3L9Rk15k7J18%j48O1K19oj60J0J00j05k02K6K24K2k6P8O3j77j38N9
$$ 115 82 59 98 107 -108 -135 -17 -17 -165 -104 115 109 -51 -41 59 -46 -248 -222 2 24 -2 76 139 -38 -176 -117
2250a17R0p3PK44Lj44m4J50m1k19RK13N0j22R8J05p2j68l1P3l8n1J80J93j74j08
$$ -117 -27 -100 -93 151 154 10 -34 116 75 -144 -135 78 128 6 104 209 137 -31 -62 11 -27 -78 102 295 121 13
2276A3K9J6j60l4J57N6Lo6Q0j0j31q1O9j1p4R9J59j9j36K5j6j08q2R8J55po5M3
$$ 13 42 58 -102 -136 21 77 80 14 94 84 -47 -128 -59 -70 -144 -45 114 95 -41 -16 -32 -140 -222 -124 31 24 -41 2
2304BL7j06q5P9K5n2M8J07K1r2K7M6p8j18P5J45K6m2N1Q5j15j47J2J26l5NQ2N9
$$ 2 39 -67 -152 -73 -48 -100 -52 55 76 -16 11 57 -21 -139 -64 81 107 65 116 201 86 -61 -49 77 42 47 129 188
2332A88j01n8M2m8p0J1J28j7l7J5O9l4j69m7Q2LJ1M1M0op8kl6l4n4J20O3p1J6
$$ 188 87 29 71 23 -47 -36 92 75 38 53 122 88 -81 -128 -46 -43 -32 9 49 43 -35 -37 -73 -107 -161 -41 22 -49 -33
2361c3P8l8j09n4P3L9l3NR9L4r9NKm3J9N8N3j0jM5np5o1P7M4k8j9P5O7n9p0j1
$$ -33 45 7 -102 -156 -83 -44 -77 -72 27 61 -38 -33 -31 -74 -55 3 56 46 45 90 85 10 -51 26 70 42 23 98 165 106 36 25
2393B5j8l9N7N2k1K3L1l7n4q0J0N8k0LK9P2r5m4J2l5MrO1lk1L1K4n9p1j8Q5kk
$$ 25 7 -32 25 77 56 79 110 73 19 -61 -51 7 -13 -10 19 91 -4 -48 -36 -71 -67 -76 -15 -18 -39 -8 16 -43 -114 -132 -47 -49 -51
2426e1M6K6J1p2j6J1lOJ6K3Q6l5j5l4j0nPJ5j8N7P3l2o3l2N1j8l8K1K9M9k2j0
$$ -51 -5 21 32 -40 -56 -45 -48 -42 -26 -3 83 48 33 -1 -11 -16 -9 6 -12 45 118 86 23 -9 42 24 -14 7 36 85 63 53
2458E3l0ok3j5J4J6kN1j8l5m8K2J9m4LM1M3qn2J6m2J0k3J9L2J7J7Nl1n3J8M6m2
$$ 53 23 17 -6 -21 -7 9 7 58 40 5 -43 -21 -2 -46 -43 -2 41 33 -19 -3 -45 -35 -58 -39 -7 10 27 32 1 -52 -34 12 -30
2491c0j1L3N8Rr1M9k2qj9J4PN5qK5o7m1K8kl5M2pN4kn1o%j2opO2%K0k5K2l6j4
$$ -30 -41 -8 50 59 -32 17 -5 -13 -32 -18 -11 44 36 61 -6 -47 -19 -21 -56 -14 -21 33 31 -20 -26 -26 -38 -44 -51 11 11 31 6 28 -8 -22
2527b2Mk8L6J7M4Km3jNj7n1L2N1mL6j0j6ol2mj0L6qM6Nl9l3J0J4m4J1k5N4jj6
$$ -22 -18 -46 -10 7 51 53 10 9 14 -3 -54 -22 29 25 61 51 35 29 -3 -7 -17 19 11 57 62 23 -10 0 14 -30 -19 -44 10 9 -7
2562gJ0j9k2k2k2OO3K8l5l9oM1Qn6mN8Qlj0P%J9l9j2J4J4j6N5j5LJ0j2lj9M6N2
$$ -7 3 -16 -38 -60 -82 -76 -13 15 -20 -59 -65 -24 -16 -72 -76 -18 -10 -13 -23 -16 -16 3 -36 -48 -34 -20 -36 19 4 7 17 5 2 -17 29 81
2598H1k8k5K3M8o1kMmpL7K4l2Mrror3Q3M3n1k0L9j5No8j8M4j7J2k2lRJ2j6n1m6
$$ 81 53 28 51 99 38 36 40 36 29 66 90 58 62 53 44 38 -55 28 71 20 0 39 24 29 -39 -57 -13 -30 -18 -40 -43 -34 -22 -38 -89 -135
2634a35L8M1Mm1QP8m6l6PL0LlJ9M9n3RL1l6lK7M9J5m5M7J5Oo8JP4j3j5NO0Lo4
$$ -135 -97 -56 -52 -93 -85 -7 -53 -89 -82 -52 -49 -52 -33 16 -37 -28 3 -33 -36 -9 40 55 10 57 72 78 10 11 85 72 57 62 122 125 61
2669F1J3Mn1PN9j7p4L1M5j3o2k7M9Jl8nK6pk0k7LOk9J2Qm0j8L6K6n0j8N1L1m1
$$ 61 74 78 27 34 93 76 2 33 78 65 3 -24 25 26 -12 -17 9 2 -18 -45 -42 -36 -65 -53 -45 -85 -103 -67 -41 -91 -109 -58 -27 -68
2703f8n8O3J2l2J1N8Kk6mN2k9j7N4K0l8l7P6L8j1l4M7J0m5m8N7M3j7JK3j9m9J0
$$ -68 -126 -63 -51 -83 -72 -14 -12 -38 -42 10 -19 -36 18 38 0 -37 39 77 66 32 79 89 44 -4 53 96 79 80 103 84 35 45
2735D5L3J6p8L7N2l9q5N3N7p1q4M1N4j5m2L4L4j05j7L6On8P2N3l9r6pR0l5o7l
$$ 45 78 94 16 53 105 66 -19 34 91 20 -64 -23 31 16 -26 8 42 -63 -80 -44 -38 -96 -24 29 -10 -106 -113 -23 -58 -125 -128
2766a28J06nn1J9O8n4n2M4K6m4L2M4M5o7pJ9K4m6mO9L4o9OM5k6k4J0N1n2ML8N9
$$ -128 -22 -27 -78 -59 9 -45 -97 -53 -27 -71 -39 5 50 -17 -24 -5 19 -27 -31 38 72 3 9 54 28 4 14 65 13 17 55 114
2798A14l9o9P7l4o3j4P1O8l6o1K8K0r6k2P0j0j6NN1j2q3K3L5k8n3J0P1l9k7N6
$$ 114 75 6 83 49 -14 -28 43 111 75 14 42 62 -34 -56 14 4 -12 -7 44 32 -51 -28 7 -21 -74 -64 7 -32 -59 -3
2828cL5r4o7N6O9l5qN3Po7m7O4J6o8J4J00po9O2M0n5j06J9J02m2J1O4L8o8n2L6
$$ -3 32 -62 -129 -73 -4 -39 -47 6 13 -54 -101 -37 -21 -89 -75 25 18 -51 11 51 -4 -110 -91 11 -31 -20 44 82 14 -38 -2
2859bL4m0mP2J0o2RP7l2q3K8P8j9m8M7N5mr4k2J6j0mQ3J0m3pJ4m3m4m0R8J2p7
$$ -2 32 -8 -12 60 70 8 17 94 62 -21 7 85 66 18 65 120 116 22 0 16 6 2 85 95 52 45 59 16 -28 -68 30 42 -35
2892c5qO8Mp6j0Pqn7Q3M4m6m3N1Nj28L0L8K9j1j9O8Ko1pJ3lNmN9K1o5N5L9m9q3
$$ -35 -43 25 29 -47 -57 -50 -58 -115 -32 12 -34 -77 -26 -21 -149 -119 -81 -52 -63 -82 -14 -12 -73 -80 -67 -70 -65 -69 -10 11 -54 1 40 -9 -92
2927i2N7Q7nk8L8N0o8m7K8N9m7%R4ol5nJ9lp1L3J2k0JM2K8m0j00L1K8o5l1P3K7
$$ -92 -35 52 47 19 57 107 39 -8 20 79 32 32 126 120 85 80 99 96 25 58 70 50 51 93 121 81 -19 12 40 -25 -56 17 44
2960D4n2n3M8k3m9k1M5jj6j2O6p1l2J7J4j8k5J3J12k5k5qL0m8l2P0N2k4OJ9Pl1
$$ 44 -8 -61 -13 -36 -85 -106 -61 -62 -78 -90 -24 -95 -127 -110 -96 -114 -139 -126 -14 -39 -64 -72 -42 -90 -122 -52 0 -24 -18 1 8 -23
2992b3k2M9K5l9L3O3J9o3M2Kk2j5kJ8O0k2J5K7q2m1L4N1o4rO2jm6oqlq2jL1K8
$$ -23 -45 4 29 -10 23 86 105 42 84 86 64 49 47 65 125 103 118 145 63 22 56 107 43 34 96 95 49 43 35 32 -50 -51 -20 8
3026Hm9L5J2m9l2j6M0j9J6lL4m1m8M4m0K5j9RM5lK4j0j4l7J8qPK3O1K8j6j2mM
$$ 8 -41 -6 6 -43 -75 -91 -51 -70 -54 -57 -23 -64 -112 -68 -108 -83 -102 -93 -48 -51 -27 -37 -51 -88 -70 -78 -71 -48 13 41 25 13 9 13
3060A3l5J1N9kJ8NqL1n2rkM0m2N1K4j1l6Kjj5m4J7N1K6n4J5K0m3n3j0M4k4L1k8
$$ 13 -22 -11 48 46 64 69 61 92 40 31 29 69 27 78 102 91 55 57 56 41 -3 14 65 91 37 52 72 29 -24 -34 10 -14 17 -11
3094a1k6K1kk3jm7K8K7K4k3k4L3k5k7j1L5L1m3O4l5L2l2Oj2j3K0M6j7JJ8K2nm7
$$ -11 -37 -16 -18 -41 -42 -89 -61 -34 -10 -33 -57 -24 -49 -76 -87 -52 -21 -64 0 -35 -3 -35 -29 -41 -54 -34 12 -5 -4 14 36 31 -16
3127a6l3M2LK7j3K1J6k4J3l3j1L2K4J5j2j7J5nk5Jn7P0L6p0O3k1Ol9j8Lj0M4M
$$ -16 -49 -7 -4 23 10 31 47 23 36 3 -8 24 48 63 51 34 49 44 19 20 -37 33 69 -1 62 41 47 8 -10 -7 -17 27 31
3160C1m1QK7j2m%m1J3J6J3l7K5j5k2M%NMPj2PMj0kj4m2L3QL4qL1j7l8j2%j2N5
$$ 31 -10 -2 25 13 9 9 -32 -19 -3 10 -27 -2 -17 -39 -35 -35 -30 -26 -19 -31 -24 -20 -30 -32 -46 -88 -55 -47 -13 -21 10 -7 -45 -57 -57 -69 -14
3197a4j5J9Mk0M2J1k0k8J3L6lk2N5J5k9k5j1J5l9M5J9rJ4J3Jn5l0L1j9L7RnJ5
$$ -14 -29 -10 -6 -26 16 27 7 -21 -8 28 25 3 58 73 44 19 8 23 -16 29 48 39 53 66 67 12 -18 13 -6 31 40 35 50
3230E0m0Rrj5K2l6M1kk5K0l6nj5Lj7Rj1MJ5l6J7nJ9l0LJ0K6L7n2rQMK7k1okK5
$$ 50 10 19 10 -5 17 -19 22 20 -5 15 -21 -26 -41 -38 -55 -46 -57 -53 -38 -74 -57 -62 -43 -73 -70 -60 -34 3 -49 -58 -50 -46 -19 -40 -46 -48 -23
3267b3L3j3kK9m5M1mrN5k6PqK6k2K6nKl0j5P9j0m6K2Nl5Jk8O2j1j6j8JKm3K3Q
$$ -23 10 -3 -5 24 -21 20 16 7 62 36 43 35 61 39 65 60 62 32 17 96 86 40 62 67 32 33 5 67 56 40 22 23 25 -18 5 13
3303A3Ok7%mm9LlqPKK0Ml3J2Onl3NQmK4J7j0j1J1J2J8j5j1M3Lk5J6JJ6j4OK0k
$$ 13 19 -8 -8 -12 -61 -58 -61 -69 -62 -60 -40 -36 -69 -57 -51 -56 -89 -84 -76 -80 -56 -39 -49 -60 -49 -37 -19 -34 -45 -2 1 -24 -8 -7 9 -5 1 21 19
3342A9J2jPL1k7LJ8n4L3J9PJl9K9L7l6k0K1j8l0Lj9M4k6m0K4K6m9M4j7m5J3NJ3
$$ 19 31 30 37 68 41 44 62 8 41 60 67 68 29 58 95 59 39 60 42 12 15 -4 40 14 -26 -2 24 -25 19 2 -43 -30 -25 -12
3376a2k2jk7M1J8n5j3M9k5l4K9K7k2k5L3J4Oj3J4M4m8lL9J3j8j2M5l6p%M1rk4
$$ -12 -34 -35 -62 -21 -3 -58 -71 -22 -47 -81 -52 -25 -47 -72 -39 -25 -19 -32 -18 26 -22 -25 14 27 9 -3 42 6 -1 -1 40 31 7
3409GoL2J0oj6K1k6pN7nn7K5K5j3l1lM3jl0Nmj4k7OM1k9l1K2J3l6mJ0j0K3noK2
$$ 7 1 33 43 37 21 42 16 9 66 61 4 29 54 41 10 7 50 49 19 24 20 6 -21 -15 26 -3 -34 -12 1 -35 -39 -29 -39 -16 -21 -27 -5
3446ej7j8M5Qj4m9O3k6l4L3KK2o6RL3Lk5K1O3m8k0J0nKJ1J9j6j8K3J1K1m5RK3
$$ -5 -22 -40 5 13 -1 -50 13 -13 -47 -14 -12 10 -56 -47 -14 -11 -36 -15 48 0 -20 -10 -15 -13 -2 17 1 -17 6 17 38 -7 2 25
3480B5k3J8j4M3k3k4k3M9k2j3K3M6l6j0QJ8l9rK6jml9M1k3J1j3J6J2l4k3K9J5
$$ 25 2 20 6 49 26 2 -21 28 6 -7 16 62 26 16 24 42 3 -6 20 19 15 -24 17 -6 5 -8 8 20 -14 -37 -8 7
3512Gj9J9%m0J3K4Pj8l5J9M4p3J8M4kn0MJ2K2l5K6J8J4o0J1J7k5J2K9L1k6l9J7
$$ 7 -12 7 7 -33 -20 4 11 -7 -42 -23 21 -52 -34 10 8 -42 -38 -26 -4 -39 -13 5 19 -41 -30 -13 -38 -26 3 34 8 -31 -14
3545a4M0l3pK0M8m4Nj1j0OJ6Mj7pM1LK1j4m8L2k7j2N4k2njrQj6Mk3K6QlKj7pq
$$ -14 26 -7 -14 6 54 10 15 4 -6 0 16 20 3 -4 37 40 61 47 -1 31 4 -8 46 24 19 18 9 17 1 5 -18 8 16 13 15 -2 -9 -17
3583a7K8m0k1J4M6j4j0l6M1m2JOL0j2rJ1K0k9qN5k7j7J2J2Ol5K7J3K2m0l7P4j8
$$ -17 11 -29 -50 -36 10 -4 -14 -50 -9 -51 -50 -44 -14 -26 -35 -24 -4 -33 -41 14 -13 -30 -18 -6 0 -35 -8 5 27 -13 -50 24 6
3616Fk0J5K1j5J1j8L8qj3J2J0mrRK5l2Rj1j2jnO7l1n8J3%Mk1K3K3ml1Qj0Qk3L1
$$ 6 -14 1 22 7 18 0 38 30 17 29 39 35 26 35 60 28 37 26 14 13 8 75 44 -14 -1 -1 3 -18 5 28 24 -7 1 -9 -1 -24 7
3653Gnk4Rj5N1o6Oj0J6k6J6K2%rlJ6Pm8N8jJ6NqL1k3k0J6j6j2J4J0J6k2PM2k1
$$ 7 2 -22 -13 -28 23 -43 -37 -47 -31 -57 -41 -19 -19 -28 -31 -15 -8 -56 2 1 17 22 14 45 22 2 18 2 -10 4 14 30 8 15 57 36
3689C6m2K7j1M6m2K5k1J0k1j7K2M2o5J7K5l3j8J7M1m7NMKplJ4j7kk8M8k0m3M0
$$ 36 -6 21 10 56 14 39 18 28 7 -10 12 54 -11 6 31 -2 -20 -3 38 -9 -4 0 2 -5 -8 6 -11 -13 -41 7 -13 -56 -16
3722a6RRj6K7k9j9j1L7k2j4J3L3lLn5K7K4J0k8QL8k6l0K2J2l1L1K4j3j2KL5n1
$$ -16 -7 2 -14 13 -16 -35 -46 -9 -31 -45 -32 1 -2 1 -54 -27 -3 7 -21 -13 25 -1 -31 -9 3 -28 3 27 14 2 4 39 -12
3755a2j9M8j0J1J2kk6J5%k0OrJ7mJ8k1oJ2J0l1J4qJ4l2KK8Jk2K5J3m0J5rpK1k0
$$ -12 -31 17 7 18 30 28 2 17 17 -3 3 -6 11 7 25 4 -2 10 20 -11 3 -5 9 -23 -21 7 8 -14 11 24 -16 -1 -10 -17 4 -16
3791a6J7J4m0L2n8M4Jj3L8m0J9j0k4K3j9KK4J1l3pO1j6l7lnOK3qJ3Rl9J8M4m4
$$ -16 1 15 -25 7 -51 -7 -6 -19 19 -21 -2 -12 -36 -13 -32 -30 -6 5 -28 -35 26 10 -27 -30 -35 -29 -6 -14 -1 8 -31 -13 31 -13
3825a3J2J9noJ2oPj0JLk7L1J2mnj5MNj4pJ5KKj4J9J0j9k5K8OOJ0Kk8K2l8Kk1M
$$ -13 -1 18 13 7 19 13 20 10 11 14 -13 18 30 26 21 6 10 15 1 -6 9 11 13 -1 18 28 9 -16 12 18 24 34 36 8 30 -8 -6 -27 -23
3864b3J4J5Ol8K4OKm6K5Mj9K4K8l2krOKl6mN0OpRnj1M%j0M0k7K3J9k1J4k5j1K1
$$ -23 -9 6 12 -26 -2 4 6 -40 -15 -11 -30 -6 22 -10 -12 -21 -15 -13 -49 -53 -3 3 -4 5 0 -11 -7 -7 -17 23 -4 19 38 17 31 6 -5 16
3902A6J7j2rrj4J7J2k0K0J4k0K3k5j2L3lMn0J9Kj8J5npJK0l5l0J7K2J0rPj3m1
$$ 16 33 21 12 3 -11 6 18 -2 18 32 12 35 10 -2 31 28 32 -18 1 3 -15 0 -5 -12 -11 9 -26 -56 -39 -17 -7 -16 -9 -22 -63
3937f3J5J8njmK1rj9L8j4qNk1K9RJ1PJj7Qjj5K0PjL4l9M3pk5k2K5NRl9K3k1j8
$$ -63 -48 -30 -35 -36 -40 -19 -28 -47 -9 -23 -31 -26 -47 -18 -9 2 9 10 -7 1 0 -15 5 12 11 45 6 49 42 17 -5 20 25 34 -5 18 -3 -21
3975b1M0J1%j4k9OK1Jj2j1Nj0j3J7j5J5k1K2J2k9K1pl5J2K3J4j6j6J5mK7k6kK8
$$ -21 19 30 30 16 -13 -7 14 15 3 -8 -3 -13 -26 -9 -24 -9 -30 -8 4 -25 -4 -11 -46 -34 -11 3 -13 -29 -14 -18 9 -17 -19 9
4009Il2rM2j6j5Rk2M5l3K5L0k1JjJ8ok7jM1k1Rl0L7Ll8M3j6J3oRk6L1n1NnnRK
$$ 9 -23 -32 10 -6 -21 -12 -34 11 -22 3 33 12 13 12 30 24 -3 -4 37 16 25 -5 32 35 -3 40 24 37 31 40 14 45 -6 -1 -6 -11 -2 0
4047@j2j5J4QNk3K7l1PK5jj2J3l0K1k4L8j6j1pK4mRl0PrN5l1jJ2M0m1j8j2M6k
$$ 0 -12 -27 -13 -5 0 -23 4 -27 -20 5 4 -8 5 -25 -4 -28 10 -6 -17 -24 0 -4 5 -25 -18 -27 28 -3 -4 8 48 7 -11 -23 23 21
4083B1m1L6j1JmK6oj6qNnK0Olk2L1l0J1ompK3j2NK6l6MLk2mJ5nM0l3J3qJJ1j7
$$ 21 -20 16 5 6 2 28 22 6 -2 3 -2 18 24 21 -1 30 0 11 5 1 -6 17 5 10 36 0 4 7 -15 -19 -4 -9 31 -2 11 3 4 15 -2
4122bQK0k3j5J7k3LL4j1lj5k5O7mQk9Qj0k1K2K1%Qm1NJ6l4lK7K1j5k2JmL9j8j4
$$ -2 6 26 3 -12 5 -18 -15 19 8 5 -10 -35 32 28 36 7 15 5 -16 6 27 27 35 -6 -1 15 -19 -22 5 26 11 -11 -10 -14 25 7 -7
4159gnJj8K1K5J6l4k4M1k9J5l2J9jjK3nm3M1Jj5j2O4m5J3Kj5Q%j9J0PL5l5J7n2
$$ -7 -12 -11 -29 -8 17 33 -1 -25 16 -13 2 -30 -11 -12 -13 10 5 -38 3 4 -11 -23 41 -4 9 11 -4 4 4 -15 -5 2 37 2 19 -33
4195c3M6rLOrrKPNkKKj3k1L5j2l7M3rk0j5N0n1L8j0oRjqRl4K8pJ6k1O%k0M3Oj1
$$ -33 13 4 7 13 4 -5 -3 4 9 7 9 11 -2 -23 12 0 -37 6 -3 -23 -38 12 -39 -1 -11 -17 -8 -9 -17 -8 -42 -14 -21 -5 -26 -20 -20 -40 3 9 -2
4236bljK9m0J0J8j7K1l5J2KK0ojK6j8nQK1l4j6L3nkMr%lj3J4P%Jnk2J7k9M8j4
$$ -2 -5 -6 23 -17 -7 11 -6 15 -20 -8 -6 14 8 7 33 15 10 18 39 5 -11 22 17 15 19 10 10 7 -6 8 15 15 16 11 -11 6 -23 25 11
4275A1j3j3L8j7k2J6qj1nL5j4j2j3K6n0M4m4M9qjmK9k0j3joK0j3J5Prpk0K5jN
$$ 11 -2 -15 23 6 -16 0 -8 -19 -24 11 -3 -15 -28 -2 -52 -8 -52 -3 -11 -12 -16 13 -7 -20 -21 -27 -7 -20 -5 2 -7 -14 -34 -9 -10 -5
4311eRmK7m1M0j8PKj6J6%j7L9Kj8j2l4K9Qj1K3pj6Kj0L0l2k3K5J5J8k0k3mK5p
$$ -5 4 0 27 -14 26 8 15 17 1 17 17 0 39 41 23 11 -23 6 14 3 26 19 3 5 -5 25 -7 -30 -5 10 28 8 -15 -19 6 -1
4347aoj7%Pjk7L4KJ8j8lJ2j0K2jk8K1j2K2Lj3Op%j3RMl3M0m0L5K4m3K4kJ9l4J2
$$ -1 -7 -24 -24 -17 -18 -45 -11 -9 9 -9 -12 0 -10 12 11 -17 4 -8 14 17 4 10 3 3 -10 -1 3 -30 10 -30 5 29 -14 10 8 27 -7 5
4385Ej1Jj0N3o0N8l3L0l2k3J0K4j2j4J8J1Nl6PJ1Kl5J7J3jJ4pj1Kj0%rJ4K7Ll0
$$ 5 -6 -5 -15 38 -22 36 3 33 1 -22 -12 12 0 -14 4 15 20 -16 -9 2 4 -31 -14 -1 -2 12 5 -6 -4 -14 -14 -23 -9 18 21 -9
4421iK5k2J1k9J0LMJ8k6K7Oj1l8JM1k4JJ9k9L0J8j0KJ3m4LM0k8K0J2Jm6K6j9J8
$$ -9 16 -6 5 -24 -14 -11 -7 11 -15 12 18 7 -31 -30 11 -13 -12 7 -22 8 26 16 18 31 -13 -10 30 2 22 34 35 -11 15 -4 14
4456A4j0NoL1nJ0j5m7MK6nJqj4K9m4K0K4Npj2lMJ6k3K1K3l6j8K3m0K8K1l1j9N5
$$ 14 4 9 3 34 29 39 24 -23 -19 7 2 3 -5 -19 10 -34 -14 10 15 8 -4 -7 -3 13 -10 11 34 -2 -20 3 -37 -9 12 -19 -38 17
4492A7l5J9j1nK8mJ1nk1Qj8K9l2L9j7j6J2j6L0k4pMj3RK6k6L1m9P0m1QJ2nJ2k2
$$ 17 -18 1 -10 -15 13 9 20 15 -6 2 -16 13 -19 20 3 -13 -1 -17 13 -11 -18 -14 -27 -18 8 -18 13 -36 34 -7 1 13 8 20 -2
4527bpjL1rl8K2lMj2K0K0l3J9j2mPj9O0k3j5L7m7Pl3K5oL2j7J6l4J4J3k%j5K6
$$ -2 -9 -10 21 12 -26 -4 -7 -3 -15 5 25 -8 11 -1 -5 2 -17 43 20 5 42 -5 2 -31 -6 -12 20 3 19 -15 -1 12 10 10 -5 21
4563B1J2k6k1L5j0k1J9nL7o1J0M3k4j4rL6Kmm4J8L2k2rKK4k3l8M3j0LKk9K2j5
$$ 21 33 7 -14 21 11 -10 9 4 41 -20 -10 33 9 -5 -14 22 24 20 -24 -6 26 4 -5 -3 21 -2 -40 3 -7 -4 -2 -31 -9 -24
4597b4K1Oj9K1LJ1o4L6K3k2nM2l6K0mJ2k7mK0qK3ol8K5kj2k2K0jJ7k5LMpK9j4
$$ -24 -3 3 -16 5 8 19 -45 -9 14 -8 -13 29 -7 13 9 21 -6 -10 10 2 25 19 -19 6 4 -8 -30 -10 -11 6 -19 -16 -12 -19 10 -4
4633dJ8Jj7J5Qj1pk6L9k4J1OKK3j6k0J6mj3M5k8l6J4KL8m3Oj1Jj0L5j8L0m5L3
$$ -4 14 15 -2 13 21 10 3 -23 16 -8 3 9 11 34 18 -2 14 10 -3 42 14 -22 -8 -6 32 -11 -5 -16 -15 -25 10 -8 22 -23 10
4668A0j3jl7N0Qk4N0p2N2l1nK4%j3Mj3LMJP%k2jkK5J2Jrj3J2Pq%j0qJ3J6j4Qk2
$$ 10 -3 -4 -41 9 17 -7 43 -29 23 -8 -13 11 11 -2 2 -11 -8 -4 -3 4 4 -18 -19 -21 4 16 17 8 -5 7 14 6 6 -4 -12 1 17 3 11 -11
4708a1J3Qj4kJ0J4k8J8Jk8M3l9oj1K5K6k9k1K6k0%J7k2L7j9L8k4K2j9pJ7l5J5
$$ -11 2 10 -4 -6 4 18 -10 8 9 -19 24 -15 -21 -32 -7 19 -10 -31 -5 -25 -25 -8 -30 7 -12 26 2 24 5 -2 15 -20 -5
4741eQK6k5j0K5j9jJ3rOk4K0KoK3jk4K2j5j0K4jj4Kj4lJ4nmj1jL0J5m0Lk1N1k0
$$ -5 3 29 4 -6 19 0 -1 12 3 9 -15 5 7 1 24 23 -1 21 6 -4 20 19 5 7 -7 -10 4 -1 -5 -16 -17 13 28 -12 -9 -30 21 1
4779Al4J4NQM5l5K4j6m6qM9l5MK1kOpJ0j4L2k8KJ1j9KJ5J8j0Rl4J9k5J1K9nj4
$$ 1 -33 -19 -14 -6 39 4 28 12 -34 -42 7 -28 -24 -3 -5 1 -6 4 -10 22 -6 -4 7 -12 -10 5 23 13 22 -12 7 -18 -7 22 17 3
4815CJqj1J8J2lnk1KJ3MKl8K8J5l9NJ8j1nNOL8m7J0j5K5j3Nm7M4Klk0K7lJ0Jk7
$$ 3 4 -4 -15 3 15 12 7 -14 -12 1 5 7 -31 -3 12 -27 -22 -4 -15 -20 -15 -9 29 -18 -8 -23 2 -11 -6 -53 -9 -7 -10 -30 -3 -6 4 5 -22
4854b2J0k2L1J0j5J4j3qL9k1K5k9k1K9j2J7K2j8k9J7QJ0j7jJ6j7pK1J1m7OQOL2
$$ -22 -12 -34 -3 7 -8 6 -7 -15 24 3 28 -1 -22 7 -5 12 34 16 -13 4 12 22 5 4 20 3 -4 17 28 -19 -13 -5 1 33
4888C3n2J5L4j4k7J9j2qLJ0mkk0mL0jj3k9P1k3m4K8Jj8J5KJ5k4LL1j0j6KJ9lk6
$$ 33 -19 -4 30 16 -11 8 -4 -12 -9 1 -3 -5 -25 -29 1 0 -13 -42 29 6 -38 -10 -9 -27 -12 -10 5 -19 -16 15 5 -11 -9 10 7 -19
4924a9M3roj3mj5K8J9Jl7Rj5RL6j8%P%nJ7qj9J6k6k0K4mK0mjL4o7K7j2k5J7lJ3
$$ -19 24 15 9 -4 -8 -23 5 24 25 -12 -3 -18 -9 27 9 9 16 16 11 28 20 1 17 -9 -29 -5 -9 11 7 6 40 -27 0 -12 -37 -20 -23 -10
4962a0MK2opk6oL3k0K4Kk0L6j5jj4JJ0OK9o3K4lj3M0k5J2l1M6Rl8j7L0l1J4J2
$$ -10 -6 16 10 3 -23 -29 4 -16 8 10 -10 26 11 10 -4 -3 7 13 42 -21 3 0 -13 27 2 14 -17 29 38 0 -17 13 -18 -4 8
4997HL0nNj2l0On0P3l6KJ8plj2%QJ5l3K1Kj4K1l2J8Rj2Rk2K7Mk6mPRJ7jK2m8q
$$ 8 38 33 38 26 -4 2 -48 25 -11 -9 9 2 -1 -13 -13 -5 10 -23 -2 0 -14 7 -25 -7 2 -10 -1 -23 4 8 -18 -22 -15 -6 11 10 32 -16 -24
5036b4M0lk1QQlkqJ0L6k4j3k7L0Lk4K4kj6K9J9o0J8mkL3k2MJ3k3LRJ3j0j8J1k0
$$ -24 16 13 -8 0 8 5 3 -5 5 41 17 4 -23 7 10 -14 10 8 -8 21 40 -20 -2 -6 -8 25 3 7 20 -3 0 9 22 12 -6 5 -15
5073a5JK9j0oJ4qJNqk4K8KJj1onJ5k2J8j3kMJ1Nj0K5rk1j1L7m5MK5J4k5L3j6L
$$ -15 -14 15 5 -1 13 5 6 11 3 -21 7 9 10 -1 -7 -12 3 -19 -1 -14 -16 -12 -1 4 -6 19 10 -11 -22 15 -30 -26 -1 13 -12 21 5 8
5111Hj0rJ3Rk5j4K6mJ9K0j3ln2M1ppJ6J0rk6J0K4k9J7k1%Omj4J5Qj0K7NJ5n7L2
$$ 8 -2 -11 2 11 -14 -28 -2 -6 13 33 20 17 -35 6 -1 -8 8 18 9 -17 -7 17 -12 5 -16 -16 -10 -14 -28 -13 -5 -15 12 17 32 -25 7
5148GJ2j2k9K9l9K6J3Rm6N6km2N9n3K2J0k0jK0K5n2K9l0M1k8KNMRj8lpLqM3j3
$$ 7 19 7 -22 7 -32 -6 7 16 -30 26 24 -18 41 -12 10 20 0 -1 19 44 -8 21 -9 32 4 6 11 15 24 6 3 -4 -1 -9 34 21
5184B1k3ML2n3J6K3k9K5Ll0l5J7K6OLl0J6L2j4rrk2K7L1m1J1OQk2k5K7j2L3qK6
$$ 21 -2 2 34 -19 -3 20 -9 16 19 -11 -46 -29 -3 3 6 -24 -8 24 10 1 -8 -30 -3 28 -13 -2 4 12 -10 -35 -8 -20 13 5 31
5219C1l8J0j3MK1j5K0oj7RNK3l1K0k3lL4l8J1pMNJ7ok2j9M1jk6PK6k8Rl5LL1j5
$$ 31 -7 3 -10 -6 15 0 20 14 -3 6 11 34 3 23 0 -3 31 -7 4 -3 1 6 23 17 -5 -24 17 16 -10 -3 23 -5 4 -31 -28 3 -12
5256a2JL3j3k7K4J9J1o5j8M6K1rMoJ3j3mj4RKj4K7Jj7nJ2nl7O4k6j3K2J8Jk4L2
$$ -12 -11 22 9 -18 6 25 36 -29 -47 -1 20 11 15 9 22 9 5 -9 0 2 -12 15 16 -1 -6 6 1 -36 28 2 -11 11 29 30 6 38
5292C8k3j8LJ9j9L%J0L0j9l2M3n4K9lpQk3K4KOk9J7k0J7KRj5k3J9j2L6k6j8M5
$$ 38 15 -3 0 19 0 3 3 13 43 24 -8 35 -19 10 7 0 8 -15 9 11 17 -12 5 -15 2 4 13 -2 -25 -6 -18 18 -8 -26 19
5327A9j3lj7J6k3M2j9m5L4J4qoQOk3J7Nj4L9j2pj9N6n8J3olJ8j8K9L0m8l2K7J0
$$ 19 6 3 -14 2 -21 21 2 -43 -9 5 -3 -9 -1 5 -18 -1 4 -10 29 17 10 -9 47 -11 2 -4 -7 11 -7 22 52 4 -28 -1 9
5362Ij1j6N4l7KJ2j6l2L7MlPlJ8k1NK3j3Klj4MkK2l4Nk2L2l5jKJ4KJ9k5k6OM1
$$ 9 -2 -18 36 -1 1 13 -3 -35 2 6 3 10 7 25 4 9 32 19 21 18 4 8 6 28 -6 -1 -23 9 -26 -27 -25 -11 -9 10 -15 -41 -35 6
5400Fl0J0J3Mm%k7j5N7j2k2J5Nk5K7j3K4j9LRK4m9K1j4J6l4N9l0j1QkK8k9J9k7
$$ 6 -24 -14 -1 3 -1 -1 -28 -43 14 2 -20 -5 0 -25 2 -11 13 -6 -3 6 30 -19 2 -12 4 -30 29 -1 -12 -4 -6 22 -7 12 -15
5435a5nM0k1Kj0j8M6j0j8%K4l2J5kQmPLlnMnK1k8%J7j1rmOJ3k4k1N0k8MOJ3KJ1
$$ -15 -20 20 -1 1 -9 -27 19 9 -9 -9 15 -17 -2 -4 4 0 7 10 7 2 6 1 22 -6 -6 11 0 -9 -13 -7 6 -18 -39 11 -17 -13 -7 6 8 19
5475A9j5RJ9l9O%J5m0K2k2N3m0Ok0K9K2Ol2J6j4j6J8kk2L7j6Mrj4J4K4l9L2k6
$$ 19 4 13 32 -7 -1 -1 14 -26 -4 -26 27 -13 -7 -27 2 24 30 -2 14 0 -16 2 0 -22 15 -1 3 -6 -20 -6 18 -21 11 -15
5509a5Oj5j2PM4j6j2J9j4oJ1J9k7QJ6j5j0L0kJ1j9j4MJ8Jl8%L2kj4J3nJ2Ok8K3
$$ -15 -9 -24 -36 -29 15 -1 -13 6 -8 -14 -3 16 -11 -3 13 -2 -12 18 16 27 8 -6 -2 16 17 -21 -21 11 9 -5 8 3 15 21 -7 16
5545A6oj3rJ2J4j1l0J3K9J9m6MJJ8l0J2J5j5k2K6Rm3L1oJ1k9K9oJ9j6j4Rj6K2
$$ 16 10 -3 -12 0 14 3 -27 -14 15 34 -12 -8 -7 11 -19 -7 8 -7 -29 -3 6 -37 -6 -12 -1 -30 -1 -7 12 -4 -18 -9 -25 -3
5579cK1l0%K8l0J1J6Lrl2NK2j4kK7J5k6K8k6l2L2kmpJ3K2j6k0L3j4j1J2k0K0n
$$ -3 18 -12 -12 16 -14 -3 13 16 7 -25 -20 2 -12 -14 13 28 2 30 4 -28 4 2 -2 -9 4 26 10 -10 23 9 -2 10 -10 10 5
5614EkLj3k4L7rnk3K1kKJK1nk3KRj6oM7Jm6J0j2jL6j6%j3L5k7K2j7J5K5l4L4l6
$$ 5 3 6 -7 -31 6 -3 -8 -31 -10 -12 -10 -9 12 7 -16 -14 -5 -21 -27 20 21 -25 -15 -27 -28 8 -8 -8 -21 14 -13 9 -8 7 32 -2 32 -4
5652dQj7J3MOqJJ8K%qj9K0k0J1oPmmj4L3j6NnQK4l5k7QK6Nm6K7J0j5J6j6qJ2k5
$$ -4 4 -13 0 4 10 2 3 21 23 23 15 -4 16 -4 7 1 8 4 0 -14 19 3 8 3 11 35 0 -27 -19 7 12 -34 -7 3 -12 4 -12 -20 -8 -33
5692c3J7J4nj8J9QrJ4pnk0K4nMNj1lnLpJ6pK4J1l7j5M5lkj8JL2l0KmM0ok4j0L
$$ -33 -16 -2 -7 -25 -6 2 -7 7 0 -5 -25 -1 -6 -2 3 -8 -11 -16 -13 -20 -4 -11 13 24 -13 -28 17 14 12 -6 -5 27 -3 -1 -5 35 29 5 -5 -2
5732bK1m1K7L4o1J1K0j2MNk0M3n1J6l1K5jLJ0Jj3JJ0K1jj8l5K5pK1Mk6J6J7Qj3
$$ -2 19 -22 5 39 -22 -11 9 -3 1 6 -14 29 -22 -6 -37 -12 -13 -10 0 1 -12 -11 -1 20 19 1 -34 -9 -16 5 9 -17 -1 16 24 11
5768A1l0%K6Oj4K1mnL2j3m3L0JPj6m3M3J3l3mK3j4QMQk9OPoPj9%J8k4j2L9Rk7
$$ 11 -19 -19 7 13 -1 20 16 11 43 30 -13 17 18 25 9 -34 9 22 -11 -15 8 -6 2 6 14 -15 -9 -2 -8 -1 -20 -20 -2 -26 -38 1 10 -17
5806a7k6N1j1k5K9kk5J7J4mk9L3rKoj7M8k8J5k3jM3j1qj6J1K3l7K9j5lnKJ5j7
$$ -17 -43 8 -3 -28 1 -1 -26 -9 5 1 -28 5 -4 -2 -8 -25 23 -5 10 -13 -14 29 18 10 -6 5 28 -9 20 5 2 -3 -1 14 -3
5841cK0Ok2Rj4J6j1MqKK6k8K0k3j4L6Lk3Rk6K1k4L5j4jJ0j9j1K4j8J2j1lKK5R
$$ -3 17 23 1 10 -4 12 1 5 -3 -1 25 -3 17 -6 -20 16 19 -4 5 -21 0 -24 11 -3 -4 6 -13 -24 0 -18 -6 -17 -20 -18 7 16
5877A6m6M2Qj3j7J2K6j3l8j1N0k0K1J4k4J1nk4lN0k8RJ5j1lk8K8kpQj6K0k5J1
$$ 16 -30 12 20 7 -10 2 28 15 -23 -34 16 -4 17 31 7 18 13 -11 -14 36 8 17 32 21 18 -10 18 16 9 17 1 21 -4 7
5911GKNk4jL4n6K6J6k7lL5lKk1qpJ7Nj2QNjJJ2k4Pj0J1MJ7Ml0Nj5nK8j2lj5M0
$$ 7 9 14 -10 -11 23 -33 -7 9 -18 -21 14 11 13 -8 -16 -23 -6 -1 -13 -5 0 -1 0 12 -12 -5 -15 -4 0 17 21 -9 -4 -19 -24 4 -8 -11 -26 14
5951A4j7mKr%J0Mj3J5J0J1pm5M5k2LK1J3Mqj4LJ2rj8j3oM7n1L7j5mJ7l0%NJ0K
$$ 14 -3 -7 -5 -14 -14 -4 0 -13 2 12 23 16 -29 16 -6 -3 18 31 35 27 13 16 28 19 1 -12 -18 29 -22 15 0 -4 13 -17 -17 -12 -2 0
5989@lk1M5o0L4J4j5Pk9LOJ1nMJ3Ol1J8JJ2j9lL8k1J2j3NJ2j7lJ3j1j7J2K8Rk2
$$ 0 -3 -24 21 -39 -5 9 -6 1 -28 -25 -19 -8 -13 -9 4 10 -21 -3 -2 10 -9 -12 26 5 17 4 9 21 4 1 14 3 -14 -2 26 35 13
6026A3K4k9k1J8J3qjoj0K8j8RKkkj9%k9M2K1l9j6K8n%K3%mj0j6J1j8lJ5Pkk8L1
$$ 13 37 8 -13 5 18 10 9 3 -7 21 3 12 14 12 10 -9 -9 -38 4 25 -14 -30 -2 -7 -7 16 16 12 2 -14 -3 -21 -24 -9 -2 -4 -32 -1
6064arKJ6%j5NJ7J1lj2l3J1J3RQj6j0J8j8L1k0Kok4M8n0M7k6K2k9L5j1Qk6J8k4
$$ -1 -10 -8 8 8 -7 -2 15 26 23 11 -22 -11 2 11 19 3 -7 11 -7 24 4 6 0 -24 24 -26 21 -5 17 -12 23 12 20 -6 12 -12
6100a2K1l4L4kk8J9lJ0k3K5k0rK0ol0M3%k1J9k7J8J1pRl7J1J4Oj2J2l6L9qJ7k8
$$ -12 9 -25 9 7 -21 -2 -5 5 -18 7 -13 -22 -2 -8 -38 5 5 -16 3 -24 -6 5 -2 7 -30 -19 -5 1 -11 1 -35 4 -4 13 -15
6135a5L4j4Jj2K4j3j5QK6l3K5j9QMMnJ3k2K1Nn1K6j4j0J5oQK7k7k4K6OpJ0j1P
$$ -15 19 5 6 -6 18 5 -10 -2 24 -9 16 -3 5 9 13 8 21 -1 20 25 -26 0 -14 -24 -9 -15 -7 20 -7 -31 -5 1 -6 4 -7 0
6171@qlJ1kj0jK3Ol2K1l3K0OLOk2L5k8K1j4qmk2K2J5lmPk9K1nL1l0PJ4j8oL0k
$$ 0 -8 -11 0 -2 -12 -13 10 16 -16 5 -28 -8 -2 1 7 -15 20 -8 13 -1 -9 -13 -35 -13 2 -1 -5 2 -27 -6 -11 20 -10 -3 11 -7 -13 17 15
6210A5j1J5Jj%j8oK1j8Ll2L3j6L4Ol3rK6l0JJ7J9j0j8NRj4k3lK6k6N0l2J9j5J5
$$ 15 4 19 20 19 19 1 -5 16 -2 1 -31 2 -14 20 26 -7 -16 10 -20 -19 -2 17 7 -11 -6 3 -11 -34 -37 -11 -37 13 -19 0 -15 0
6246@QJ1j8noLL0m3lL3J2l3K5j7klK7J2k1j0j7L3k2J7k4L0j9P%J7pm0M1%j8lq
$$ 0 8 19 1 -4 -10 -7 23 -20 -23 10 22 -11 14 -3 -5 -8 19 31 10 0 -17 16 -6 11 -13 17 -2 5 5 22 15 -25 16 16 -2 -5 -13
6283a3J4Lqj7J7qJJ5onMM%k1oK7J7l3K4jPj0lJ0k3j6K2M3n9J2j2M1kk2J9pok7
$$ -13 1 4 -4 -21 -4 -12 -11 4 -2 -7 -3 1 1 -20 -26 1 18 -15 9 8 15 5 2 12 -11 -27 -5 38 -21 -9 -21 20 18 -4 15 8 2 -25
6321b5K5%J0Mqj4K3k3kL2j1k2KJ3k5K6k9K2J0J7k6rJ8J3j6K0m8RJ8j4MJjJ1j8
$$ -25 0 0 10 14 6 -8 15 -8 -10 22 11 -11 -9 4 -21 5 -24 -2 8 25 -1 -10 8 21 5 25 -23 -14 4 -10 -6 -5 -6 5 -13
6356a3nk7L3mOqK1k9J0RNK8k2Qj9Rk5K0J1QNm9L3lJ3j%k3Lj0j3K4K4k4J5k7K3
$$ -13 -18 -45 -12 -16 -10 -18 3 -26 -16 -7 -2 26 4 12 -7 2 -23 -3 8 16 21 -28 5 2 15 14 14 -9 -6 -16 -29 -5 19 -5 10 -17 6
6393FPMj2lqj3OJj1K1J3l8nkQoL6k0J5k7K6j6JL8j5rK3m6L1Lj7J1j8J8j9J3mJ1
$$ 6 13 17 5 2 -6 -19 -13 -12 -23 -2 11 -27 -32 -34 -26 -32 4 -16 -1 -28 -2 -18 -17 21 6 -3 20 -26 5 8 -9 2 -16 2 -17 -4 -8 3
6431Coj4J8J6k8L1j1RJ4m3k4L7k5N5l6K3J2k5Qrlj4M2k9j4K1rNJ2Jl2PPJ3j0m
$$ 3 -3 -17 1 17 -11 20 9 18 32 -11 -35 2 -23 32 -4 19 31 6 14 5 2 -12 30 1 -13 8 -1 4 16 17 -15 -8 -1 12 2 -2
6467bk3L5j4m0O4j7J5l5j3L7j8L8l5l0J9J4jj9jK2pj2L9k0kojJ0PJ2j0J1J3m7
$$ -2 -25 10 -4 -44 20 3 18 -17 -30 7 -11 27 -8 -38 -19 -5 -6 -25 -26 -4 -11 -23 16 -4 -6 -12 -13 -3 4 16 6 17 30 -17
6501a7J7mj7K9QJj0n1O0j5J8ol3L1kjk5qL8qk8QLjJ0J2op%J5j8J1j5L6m1L8Ol9
$$ -17 0 -4 -21 8 16 17 7 -44 16 1 19 13 -20 11 9 8 -17 -25 13 5 -23 -15 -12 -13 -3 9 3 -4 -4 11 -7 4 -11 25 -16 22 28 -11
6539a1%mNJ3j2RqlJ5pKj2JJ6J6j3Oj7LmKMq%OJ9J8l4l5P6m2j2J1k1lK8K1k7N2
$$ -11 -11 -15 -10 3 -9 0 -8 -11 4 -3 -1 -13 -12 4 20 7 13 -4 -1 -5 -3 1 -7 -7 -1 18 36 2 -33 43 1 -11 0 -21 -24 4 25 -2 50
6578E0m7qjMk9L7k1MPpj2K8J7k4jk1M2l0lPLJ9l2jJ4k8M5Kj7j2Rk4lJ2J0J0j4
$$ 50 3 -5 -6 -2 -31 6 -15 -11 -4 -11 -23 5 22 -2 -3 -24 18 -12 -15 -8 -5 14 -18 -19 -5 -33 12 14 -3 -15 -6 -30 -33 -21 -11 -1 -15
6615a5K0J9mk2J0%JmK1k6KJ5rj7J4K2Rk2L3k2k9kK2pK9m6J9j0j5K2nk4J8k7J7
$$ -15 5 24 20 -2 8 8 9 5 26 0 2 17 8 -9 5 27 36 14 47 25 -4 -6 16 9 38 -8 11 1 -14 8 3 -21 -3 -30 -13
6650a3KK9l9J1QPJ0j8Jk3M1j3j5kJ8l2J3J4pL9l9kK1l4J2J3nkK2m0rL1Nj8qK0
$$ -13 -11 18 -21 -10 -2 5 15 -3 -2 -25 16 3 -12 -14 4 -28 -15 -1 -8 31 -8 -10 11 -23 -11 2 -3 -5 17 -23 -32 -1 4 -14 -22 -2
6686bLmOk2L2J0k0k6J4K1Qk6rO4n8M3m7K2J4nr%j4rqM1j4Kj0j0J9m5M2lk4K1m
$$ -2 1 -3 3 -19 13 23 3 -23 -9 12 20 -6 -15 49 -9 34 -13 9 23 18 9 9 -5 -14 -22 19 5 7 -3 -13 6 -39 3 0 -24 -3 -7
6723gNJ0K1l9RJ2rk2L8n1K3L6k7j7L6m5N4kk8nrK6l2M8j6J7oMm7O0J2l3j1jk2
$$ -7 -2 8 29 -10 -1 11 2 -20 18 -33 -10 26 -1 -18 18 -27 27 25 -3 -8 -17 9 -23 25 9 26 20 24 -23 37 49 16 5 4 -18
6758a8J3RJ8j3nmNk6K3kJ4l2K1jNQoJ5qk3LQJ1j0j4QOKk8J5m0M1%Jj4NqL7n0L2
$$ -18 -5 4 22 9 4 0 5 -21 2 0 14 -18 3 2 7 15 9 24 16 -7 -4 4 15 5 -9 -1 5 7 -21 -6 -46 -5 -5 -4 -18 -13 -21 16 -34 -2
6798bOj0j3K3k9M0k9K5nj0K0n1K9lRM0%l9qlJ0K6m1K2pLL2l2Nj1k1K4j0pqkN0
$$ -2 4 -6 -19 4 -25 15 -14 11 6 -4 16 -35 -6 -9 0 40 40 1 -7 -10 0 26 -15 7 0 3 35 3 8 -3 -24 0 -10 -17 -25 -27 23
6835B3no0O3m5m5M3K9pj5K0l9K3JjJNl0K6K9qMj7N2o0OJ6j8J3L3l0j3N%LJ2k9
$$ 23 18 -42 21 -24 -69 -26 3 -4 -19 1 -38 -15 -14 -15 -14 -9 -39 -13 16 8 12 -5 47 -13 -7 9 -9 4 37 7 -6 -1 -1 2 14 -15
6871a5mJ2k2N0k1j1J7rK3Kl1K5j5MJ1k3J1nj0k3K9j2K8%%Mk3k4K1jK3Ml7L7k7
$$ -15 -19 -7 -29 21 0 -11 6 -3 20 22 -9 16 1 5 16 -7 4 -1 -11 -34 -5 -17 11 11 11 15 -8 -32 -11 -12 11 15 -22 15 -12
6906a2k2RL1J3j7j6j0nJ1JL6rRLl3J4k5L1Jj7OJ9j2nnK4K1l5J2mj9Jj3M1m0N3
$$ -12 -34 -25 6 19 2 -14 -24 -29 -18 -17 19 10 19 22 -11 3 -22 9 10 -7 -1 18 6 1 -4 20 41 6 18 14 -5 -4 -17 24 -16 37
6942C7j2nk2lj1K1MLj3kPk1J4J4j6k4nL2j2K1l4QJ0NkJ4m8N2J8m2J4kj1pK8k1
$$ 37 25 20 -2 -5 -16 5 9 12 -1 -3 4 -17 -3 11 -5 -29 -34 -2 -14 7 -27 -19 -9 -4 -6 8 -40 12 30 -12 2 0 -11 -18 10 -11
6978a1kN%RJ9l9J7Kj0j7K6K4l9mJ8J1j3K0j5nL8k3oj5rL8k0MLqj4J2Pj1OJ8J7
$$ -11 -13 -8 -8 1 20 -19 -2 0 -10 -27 -1 23 -16 -20 -2 9 -4 16 1 -4 34 11 5 -10 -19 19 -1 3 6 -2 -16 -4 3 -8 -2 16 33
7015C3l8%j1MJ4M1l8J4%l7rJ0pKK5oOj1lQJ9j1k8K1j5K1%pj5K6J3Jl1J5J3k2P
$$ 33 -5 -5 -16 -12 2 43 5 19 19 -18 -27 -17 -24 -22 3 -3 3 -8 -11 -3 16 5 -23 -2 -17 4 4 -3 -18 8 21 22 -9 6 19 -3 4
7052DJ1k0K2LokmKJj6l1L7j%K5kok2J0Qk4K4j5j5nJK1%llmj3J1L2k7qlpJ8L6m9
$$ 4 15 -5 17 20 14 12 8 10 11 -5 -36 1 0 0 25 23 17 -5 5 13 -11 13 -2 -17 -22 -21 0 0 -3 -6 -10 -23 -12 20 -7 -15 -18 -25 -7 29 -20
7093b0KL4m6J0K6Ll0J3J1rM8n7%MKmJ7JK6l0qJ0pnK4qj2K2qj3lJ9j7ok2L4oj2
$$ -20 -18 16 -30 -20 6 9 -21 -8 3 -6 42 -15 -15 -11 -9 -13 4 5 31 1 -7 3 -4 -9 15 7 -5 17 9 -4 -7 12 -5 -11 -33 1 -5 -17
7131a7J5J9Lj7j4j3PJ1J3Qm1RLnJ8nRlj5J2J5l0N2o0OJ1l2N2k6J1J9k3J2j6l3
$$ -17 -2 17 20 3 -11 -24 -17 -6 7 15 -26 -17 -14 -19 -1 -6 3 0 -15 -3 12 -18 34 -26 -20 -9 -41 11 -15 -4 15 -8 4 -12 -45
7166d5M7J6k9LRjpJ3k2J9J7k8k1oL5j4L2l3L8nl3J0j6O7o5K4Jj5j0LJ9pjk3M0
$$ -45 2 18 -11 -8 1 0 -7 6 -16 3 20 -8 -29 -35 0 -14 18 -15 23 18 -15 -5 -21 46 -19 5 6 -9 -19 -16 3 -4 -5 -28 12
7201A2k5K7j9j5J6J2jJ5n2K3j0J6Lj7jKj2L1k3J0jLJ2K1j6j2mjJ9Km1L8Lk4J3
$$ 12 -13 14 -5 -20 -4 8 7 22 -30 -7 -17 -1 2 -15 -16 -14 -26 5 -18 -8 -9 -6 6 27 11 -1 -5 -6 13 15 -26 12 15 -9 4
7236Dk1J2K9l0K8qj7qL9k1k5M6l6K6l8M9j2j3J6j6J5j7j5J2l3N4k3k6K0j1j9J6
$$ 4 -17 -5 24 -6 22 14 -3 -11 28 7 -18 28 -8 18 -20 29 17 4 20 4 19 2 -13 -1 -34 20 -3 -29 -9 -20 -39 -23
7268b3J4Oj2kpL1k1j7J7j4K1l0j0L8ML5l8jL5l6K4Ok3j0J1PMPl8J0L2k2k0KL3
$$ -23 -9 -3 -15 -17 -24 7 -14 -31 -14 -28 -7 -37 -47 -9 -5 30 -8 -9 26 -10 14 20 -3 -13 -2 5 9 16 -22 -12 20 -2 -22 -20 13
7303A3l2Mj0K4K4j5j5Pj1J3L1l1Kj4j5Pj1J4qL1l3L0pNj0J1j1j5L0lJ0k1PLl0
$$ 13 -19 -15 -25 -1 23 8 -7 0 -11 2 33 2 4 -10 -25 -18 -29 -15 -23 8 -25 5 -2 3 -7 4 -7 -22 8 5 15 -6 1 4 -26
7338b6J2K8j6mnK7j2NJRk8K3NJ2qJ6l2oN0l8k3NJ3Pj0nOj3J3J0j8OMoOqMjj1J4
$$ -26 -14 14 -2 -6 -11 16 4 9 10 19 -9 14 19 31 23 39 7 1 51 13 -10 -5 8 15 5 0 6 -7 6 16 -2 4 8 2 8 0 4 3 -8 6
7378FOrj3NLj7j8J6L4kj6OJ1j3j0mJ8k6J9k1L3qKJ2j2Qn1N0Pm3J6kMKJJ7%J4m5
$$ 6 12 3 -10 -5 -2 -19 -37 -21 13 11 -5 1 12 -1 -11 -15 3 -23 -4 -25 8 0 2 14 2 10 -41 9 16 -27 -11 -13 -9 -7 -6 11 11 25 -20
7417b0L3k5J4j5K9Qm1J5R%K6k0mjm3L5j9J7J4m7K2kK1Kl4k2L3JL0Ml5M2l1J6j1
$$ -20 13 -12 2 -13 16 24 -17 -2 7 7 33 13 9 8 -35 0 -19 -2 12 -35 -13 -15 6 8 -26 -48 -15 -14 16 20 -15 27 -4 12 1
7452AJ0l0J1K5j3Mk3j3J4L2Mn2M7l7J6oNJ3rJ3nl5N1Rk8j7K0J1j1J3Jk4J8Kk2
$$ 1 11 -19 -8 17 4 8 -15 -28 -14 18 22 -30 17 -20 -4 -10 -5 8 -1 12 7 -28 23 32 4 -13 7 18 7 20 21 -3 15 17 -5
7487emQJ8k0J6j3K1l8L8k9J6k7J7ml0K8j0KlK4J4m1J5j6J9k8K1%K8j6j0Rk8L3
$$ -5 -9 -1 17 -3 13 0 21 -17 21 -8 8 -19 -2 -6 -36 -8 -18 -16 -19 5 19 -22 -7 -23 -4 -32 -11 -11 17 1 -9 0 -28 5
7521El2J9k2K4jK0k1JpK9oRjk1J1j8L5j2lJ1l8RKOPkPj4Lk5K3J3k5J1k0K2j4J2
$$ 5 -27 -8 -30 -6 -7 13 -8 -7 -14 15 9 18 17 -4 7 -11 24 12 9 20 -18 -9 -7 -1 6 4 11 -3 0 -25 -2 11 -14 -3 -23 -1 -15 -3
7559cj4RkM0m5Rj3%M9n8K7RJ9m6M0l0J3J0m0J5K3qjl9M6l5L5K2j9j8K5l0L1k7
$$ -3 -17 -8 -10 30 -15 -6 -19 -19 30 -28 -1 8 27 -19 21 -9 4 14 -26 -11 12 4 3 -36 10 -25 10 32 13 -5 20 -10 21 -6
7593fj2L0kj9J7M%%nJ8%l4K6J1j8Rlj7J4j1jJ3k0MJ5kj3j0K4rj3J0L3l3j2J3r
$$ -6 -18 12 10 -9 8 12 12 12 7 25 25 -9 17 28 10 19 16 -1 13 2 1 14 -6 -2 13 11 -2 -12 12 3 -10 0 33 0 -12 1 -8
7630hk6L1pK2Nj5J3j1lJ0Jk3J6kOMl1K5j0mOJ2j5MQL%J4j3j9Rm9L3K3m7M4K1L
$$ -8 -34 -3 -10 12 17 2 15 4 1 11 12 -11 5 3 9 13 -18 7 -3 -7 -1 11 -4 0 8 11 11 25 12 -7 2 -47 -14 9 -38 6 27 30
7668C0j8nKQj4j9J0mRk3L5MJ0m3K9k4k4M2KnqJ0k8K7lLQpj6J0m8M0j1J4m8M8P
$$ 30 12 7 9 17 3 -16 -6 -10 -1 -24 11 15 25 -18 11 -13 -37 5 7 2 -6 4 -24 3 0 3 11 4 -12 -2 -50 -10 -21 -7 -55 -7 0
7705@Nll9M6k1K6l6M3j1rJ0RKJ0n3M8k3kRjlln1M3K6j3Ljk5lJ5l0J4MlmJ2rJ1
$$ 0 5 2 -37 9 -12 14 -22 21 10 1 11 20 22 32 -21 27 4 2 11 10 7 4 -47 -4 22 9 12 11 -14 -17 -2 -32 -18 -14 -17 -21 -9 -18 -7
7744gj8RlJ7n2N1Rm1K9kL5m6K3%J5l3pK9j0K5k6M2l6J3J2m1M1k4k1N3Kpk2J6P
$$ -7 -25 -16 -19 -2 -54 -3 6 -35 -6 -8 27 -19 4 4 19 -14 -21 8 -2 23 -3 39 3 16 28 -13 28 4 -17 36 38 31 9 25 32
7779C2nk0K3k4j3J6k1K4J3j6j5K7Ql9L5Kk0jJ1J0k6k3N6ml0J4k1Nk2KJ5jJ1j0
$$ 32 27 7 30 6 -7 9 -12 12 25 9 -6 21 29 -10 25 27 7 6 17 27 1 -22 34 30 0 14 -7 -2 -24 -22 -7 -8 3 -7
7813gj8N9n7J7L0Ll4rOrJ8Rj1K3%Nj9J5Mj0n0K9K4l7L2J3kj9J7j6kk2M1l2OkJ5
$$ -7 -25 34 -23 -6 24 27 -7 -16 -10 -19 -1 8 -3 20 20 25 6 21 25 15 -35 -6 18 -19 13 26 24 5 22 6 4 -18 23 -9 -3 -5 10
7850A0okmLNRj4k7J5k4M9%j4j1J3%j9K2rK0k4L3m3Moj0M1l0RJ0l4K8J5k3QQnJ9
$$ 10 4 2 -2 1 6 15 1 -26 -11 -35 14 14 0 -11 2 2 -17 5 -4 16 -8 25 -18 -14 -20 -30 11 -19 -10 0 -34 -6 9 -14 -6 2 -3 16
7888A6Qm0L6k4qJ8k2J9nqjK5pNK5Nn3K7Ql5j4K6kJ9n3N4k0k0K5Pj9j1j5OJ3J7
$$ 16 24 -16 20 -4 -12 6 -16 3 -2 -10 -11 14 7 12 37 42 -11 16 24 -11 -25 1 -1 18 -35 19 -1 -21 4 11 -8 -19 -34 -28 -15 2
7924Blj1Lj1N6o2L2m9L6Nj8RJ0j1qlL3pNKk0K8Qk6jM0k4j7pK5l3L2jjk1J8Pk7
$$ 2 -1 -12 -9 -20 36 -26 6 -43 -7 -2 -20 -11 -1 -12 -20 -23 10 3 8 10 -10 18 26 0 -1 39 15 -2 -9 16 -17 15 14 13 -8 10 17 -10
7962a0J2j1J4%mj9O4m7oJ1K1l1OJ7jj6j5QpK3lkkql1N3l6k5M0Jk2J9qj4M3j5J3
$$ -10 2 -9 5 5 1 -18 46 -1 -7 4 25 -6 0 17 16 0 -15 -7 -14 9 6 4 2 -6 -37 16 -20 -45 -5 -4 -26 -7 -15 -29 14 -1 12
7999A2n0RL9k5KJ0nK1l8M0jj4J1JLl3M3Ml2kOPMK2n2J0M3k9j9ORj9K2nk5L6k6
$$ 12 -38 -29 10 -15 -13 -3 -8 13 -25 15 14 0 11 12 15 -18 25 29 -3 -5 1 8 12 34 -18 -8 35 6 -13 -7 2 -17 5 0 -25 11 -15
8036a5K2rrPk3M4J5k5Pj8k5OM1K0k3j2j2j2M8k0Jk1lK4k5J1j1J6j0L9m2K5k8J0
$$ -15 7 -2 -11 -4 -27 17 32 7 14 -4 -29 -23 18 38 15 3 -9 -21 27 7 8 -13 -16 8 -17 -6 -17 -1 -11 28 -14 11 -17 -7
8070gJ8oj7K6j3j7L6j4J1j6Rjl3N6m3KK0j3PjL7l7Mm5N5mk0LLqRK8l6Kj2J4K9
$$ -7 11 5 -12 14 1 -16 20 6 17 1 10 9 -24 32 -11 -9 11 -2 5 4 41 4 8 -37 18 14 -6 -3 0 -8 1 29 -7 -5 -17 -3 26
8107B6Rl0OMl4%J1K0j3kj7J7jpJ9n2L0oL9jk2PKKl6K8PLqJKlJ7k3J0NoRk1L4q
$$ 26 35 5 11 15 -19 -19 -8 12 -1 -3 -20 -3 -4 -11 8 -44 -14 -20 19 18 -4 3 5 7 -29 -1 6 9 1 2 4 1 18 -5 5 10 4 13 -8 26 18
8148A8Kl0J0j6K0nJ6J9l0K0l1J2RrJL6o5N1l1QMk2kJ4%J2k2Oj7K5k9J8ML3j8n5
$$ 18 20 -10 0 -16 4 -1 15 34 4 24 -7 5 14 5 6 42 -23 28 -3 5 9 -13 -15 -1 -1 11 -11 -5 -22 3 -26 -8 -4 29 11 -44
8184d4N5k6K5pOno
$$ -44 11 -15 10 3 9 4 -2
8191b
$$ Imaginary data points
##PAGE= N=2
##DATA TABLE= (X++(I..I)), XYDATA
0@%%%%%%%%%%%%%qJ6j6J6j6J6k4L2l2M0m8N6o4P2q0Q8j04J20j35J50j67J84k03
$$ 0 0 0 0 0 0 0 0 0 0 0 0 0 0 -8 8 -8 8 -8 8 -16 16 -16 24 -24 32 -32 40 -40 48 -56 64 -71 79 -88 96 -107
36a07K27k54K81l12L47l83M23m68N19n76O39p11P93q88R99j130J289j486J739
$$ -107 120 -134 147 -165 182 -201 222 -246 273 -303 336 -375 418 -470 529 -601 688 -798 941
55I41k075K547l267M514p269K4166j2040l3964L6280J3460k2972j2228K4793M376
$$ 941 -1134 1413 -1854 2660 -4609 19557 7517 -26447 9833 23293 321 -11907 12886 17262
69A7262j8335o202J0379n321n394R439K074k0363m009K2832J0534j7793q547Q873
$$ 17262 -1073 -7275 3104 -2217 -7611 1828 3902 -16461 -20470 2362 12896 -4897 -13444 -4571
83d571k117j4080M064J5567K79r004L016L276j0234o255J2335J0383o570q272
$$ -4571 -6688 -20768 -16704 -1137 -858 -9862 -6846 -3570 -13804 -20059 -7724 2659 -3911 -12183
97a2183L750N838P6n56P28j314p36K215J160m87M311P456J59q840o724K962P950
$$ -12183 -8433 -2595 -2519 -3075 -2347 -3661 -4397 -2182 -1022 -1509 2802 10258 10417 1577 -5147 -2185 5765
114E765M318j072n76K771Lo618l903N759N553l749l549M399J758n417P06P683
$$ 5765 10083 9011 8435 11206 11209 4591 688 6447 12000 8251 4702 9101 10859 5442 6148 13831
130A3831l776j4075j298J1567J225p817M216R286q053j4825J898Q385l842l206
$$ 13831 10055 -4020 -5318 6249 7474 -343 3873 13159 5106 -9719 -7821 564 -3278 -6484
144f484R185K032j3496l631J3004J225j4593j045J3097k216j3511N225J6309l276
$$ -6484 2701 4733 -8763 -12394 610 1835 -12758 -13803 -706 -2922 -16433 -11208 5101 1825
158A825j4311J482P584o305m986J2146Q697r427o504P876K079q753J420J1774
$$ 1825 -12486 -11004 -3420 -9725 -14711 -2565 6132 -3295 -9799 -1923 156 -8597 -7177 4597
172D597k55r706K126R158k157n528N567M587q199m849R551O674n768k434O379
$$ 4597 4342 -5364 -3238 5920 3763 -1765 3802 8389 190 -4659 4892 11566 5798 3364 9743
187I743q46r475m45R145K286m912O67L357l943m926L056L631l734l244L284J911
$$ 9743 8897 -578 -1023 8122 10408 5496 6163 9520 5577 651 3707 7338 3604 360 3644 5555
203E555l413j071L488k68n675k978J994J431o56R56J956j316l805k135O37P25
$$ 5555 2142 1071 4559 4291 -1384 -4362 -2368 -937 -1593 -637 1319 3 -3802 -5937 -5300 -4575
219d575n82P7J698O75k001j443J776J497k522k471J972K530j108m67L410J527
$$ -4575 -5157 -5080 -3382 -2707 -4708 -6151 -4375 -2878 -5400 -7871 -5899 -3369 -4477 -4944 -1534 -7
235gl604k064K542J128j638J905M458p63l933J354L523j957k680L743L673l208
$$ -7 -3611 -5675 -3133 -2005 -3643 -1738 2720 1957 -1976 -622 2901 944 -1736 2007 5680 2472
251B472k498M448K802m051k012L794O77m058N37N104J5m131M74K482k902l420
$$ 2472 -26 4422 7224 3173 1161 4955 5632 1574 2111 7215 7230 3099 3573 6055 3153 -267
267b67L205L343l030k509L080J025m609j744L556K26m287k22L737m97l322O62
$$ -267 2938 6281 3251 742 3822 4847 238 -1506 2050 2276 -2011 -2233 1504 1007 -2315 -1653
283a653K083k643l347J733K293j720j254K451Q40k980j499J889N30j697K72K045
$$ -1653 430 -2213 -5560 -3827 -1534 -3254 -4508 -2057 -1217 -4197 -5696 -3807 -3277 -4974 -4702 -2657
299b657J10j132O61J071q89p87R86Q44l96M18J699O79p56k15N48O7n6Q40R37L52
$$ -2657 -2547 -3679 -3018 -1947 -2836 -3623 -2637 -1793 -2189 -1771 -72 607 -149 -364 184 251 195 1035 1972 2324
319B324L23M29j67m98J52M79J0q5M51N84J11k66m47m12r9j74m47l1P70K70q91
$$ 2324 2647 3076 2909 2411 2563 3042 3052 2967 3418 4002 4113 3847 3400 2988 2889 2715 2268 2237 3007 3277 2386
340B386q18J74l09j404n04Q79J50j077j55P96o15j722k52P93o04j179P04J168
$$ 2386 1568 1742 1433 29 -475 404 554 -523 -678 118 -497 -2219 -2471 -1678 -2282 -3461 -2757 -1589
358a589o14j146M61N19j059q34R07Q48m52o5R77K19q30q8Q62J21m14P05J202J01
$$ -1589 -2203 -3349 -2888 -2369 -3428 -4262 -3355 -2507 -2959 -3024 -2047 -1828 -2658 -2746 -1884 -1763 -2177 -1472 -270 -169
378a69n37M47Q45k12n23M56J031M39o5J66M34J48k61l65N2O04N38m1k58K22K65
$$ -169 -706 -259 586 374 -149 307 1338 1777 1712 1878 2312 2460 2199 1834 1886 2490 3028 2987 2729 2951 3216
399C216m59q28j50L17Qk83J23K49k23o12m94m75m07k25K35J50k39k96m4j72o92
$$ 3216 2757 1929 1779 2096 2104 1821 1944 2193 1970 1358 864 389 -18 -243 -8 142 -97 -393 -437 -609 -1301
420a301o63p9J89j42j47K97L91k35n15k41n7j45L3M94M44j60L8M88K36n54l04
$$ -1301 -1964 -2043 -1854 -1996 -2143 -1846 -1455 -1690 -2205 -2446 -2503 -2648 -2615 -2121 -1677 -1837 -1799 -1311 -1075 -1629 -1933
441a933O39N44k03j6R28P13k75n50K33M79N4O2M28L59N1J7J50j45j18J85K84j35
$$ -1933 -1294 -750 -953 -969 -41 672 397 -153 80 559 613 675 1103 1462 1513 1530 1680 1535 1417 1602 1886 1751
463A751k12M21M82l19o73j82K53j24l01J27L91j01n26l73j54k09k62j15m7L8P5
$$ 1751 1539 1960 2442 2123 1450 1268 1521 1397 1096 1223 1614 1513 987 614 460 251 -11 -126 -173 -135 -60
484f0K9k64l87k70k51l22q7L25L01l9m2K8k74m10r3K05j21j01N71P15j23n07J84
$$ -60 -31 -295 -682 -952 -1203 -1525 -1612 -1287 -986 -1025 -1067 -1039 -1313 -1723 -1816 -1611 -1732 -1833 -1262 -547 -670 -1177 -993
507i93L63m80n76O45R08J4k45M97N18l50m37K48J32k92K79R07K94m84Q8M94m12
$$ -993 -630 -1110 -1686 -1041 -133 -119 -364 133 651 301 -136 112 244 -48 231 1138 1432 948 1036 1530 1118
528A118q88K48J034K9n76J41O01k02o27O4J38m79k15N32K61m01p9M01m52j159
$$ 1118 230 478 1512 1541 965 1106 1707 1505 878 942 1080 601 386 918 1179 778 699 1100 648 -511
548e11j71R35K66n85q9M51k96q28j26L66k37l62M22L83m19j81O02L4j237o09Q78
$$ -511 -682 253 519 -66 -155 296 0 -828 -954 -588 -825 -1187 -765 -382 -801 -982 -380 -346 -1583 -2192 -1314
569a314O93l98m3J009K21j158o43N27K27k93N42R15j61n25O06N17r26q71P68Q73
$$ -1314 -621 -1019 -1062 -53 168 -990 -1633 -1106 -879 -1172 -630 285 124 -401 205 722 -204 -1075 -307 566
589E66n34j99J401Q14r74r34L21O2o52L29J309K70o88J73M70q91j046O27Q84o08
$$ 566 32 -167 1234 2048 1074 140 461 523 -129 200 1509 1779 1091 1264 1734 843 -203 424 1308 700
609G00o82R95Q62p99q93L49k5j120k81J070O11m94l5M62p83j468QJ044R7n88M15
$$ 700 18 1013 1875 1076 183 532 507 -613 -894 176 787 293 258 720 -63 -1531 -1523 -479 -382 -970 -555
630e55P97m94j076J1O09l91p57M36R58R9k76L82J34r18r07M48Q36J08K91R72K49
$$ -555 242 -252 -1328 -1317 -708 -1099 -1856 -1420 -462 -363 -639 -257 -123 -1041 -1948 -1500 -664 -556 -265 707 956
651I56j199p80O30M64o13J00J312N34q10q3Q80k60j289j24Q72M3j56J185R90j059
$$ 956 -243 -1023 -393 71 -542 -442 870 1404 594 511 1391 1131 -158 -282 590 633 477 1662 2652 1593
671A593j392L14K58j074o1J863P20j312o19R38l33j636M5J269l66j052R42J407
$$ 1593 201 515 773 -301 -362 1501 2221 909 290 1228 895 -741 -696 573 207 -845 97 1504
689A504r14j552M92M77j565q83J782J495r00q14P97k10j662l81J494L75p49N45
$$ 1504 590 -962 -470 7 -1558 -2441 -659 836 -64 -878 -81 -291 -1953 -2334 -840 -465 -1214 -669
707f69J056n67j207N48P38r84r01J165J426l35m14Q36K33j392q78P92R30o4L80
$$ -669 387 -180 -1387 -839 -101 -1085 -1986 -821 605 270 -144 692 925 -467 -1345 -553 377 313 693
726F93R23j30j031l61M19j26m10N19Q98n0m17K77L75p48j060O1N18R4O3P67M86
$$ 693 1616 1486 455 94 513 387 -23 496 1394 1344 927 1204 1579 831 -229 -168 350 444 507 1274 1760
747A760q39j151j29J08l55J6R78N65p01o13L48p1r73m05P88L74n08J55R95k8j153
$$ 1760 921 -230 -359 -251 -606 -590 388 953 252 -361 -13 -84 -1057 -1462 -674 -300 -808 -653 342 314 -839
768h39m58L44l30l71J013J207l82q15L97K40j171p10J387J123q14m49J265N79
$$ -839 -1297 -953 -1283 -1654 -641 566 184 -631 -234 6 -1165 -1875 -488 635 -179 -628 637 1216
786A216j295p12Q59J96r33K70J546K51q60J70M88j080j172R28J415m17o06R70
$$ 1216 -79 -791 68 264 -669 -399 1147 1398 538 708 1196 116 -1056 -128 1287 870 264 1234
804A234N40j374r17Q43M18r11k7J201K07r82R7O53q20j292M28J056k26m40Q68
$$ 1234 1774 400 -517 326 744 -167 -194 1007 1214 232 329 982 162 -1130 -702 354 128 -312 556
823E56N17j178j002M43L14n51K10J006K6p61pM70n91p99M02P34k43k33P50N36
$$ 556 1073 -105 -1107 -664 -350 -901 -691 315 341 -420 -427 43 -548 -1347 -945 -211 -454 -687 63 599
843E99o27p74M1J54j64J44P24M33j31k55k00k29k91J17L73L01J12N6K37Lm20m46
$$ 599 -28 -802 -761 -607 -771 -627 97 530 399 144 -56 -285 -576 -459 -86 215 327 383 620 623 203 -243
865b43P7K45l7L0O23N50m04o89l5K9l83m3P72M01l41r7L23m05q22J35O66j57n05
$$ -243 -166 79 42 72 695 1245 841 152 117 146 -237 -280 492 893 552 455 778 373 -449 -314 352 195 -310
888c10N40P62m69p70J48J88o13k89P44M48l60Q3L72n93r24K57P22l42m10P63P45
$$ -310 230 992 523 -247 -99 89 -524 -813 -69 379 19 102 474 -119 -1043 -786 -64 -406 -816 -53 692
909F92p51p49M55K02p03j59P31L20l31K44N02n28p83K02M92k79j76Q27O29n24
$$ 692 -59 -808 -353 -151 -854 -1013 -282 38 -293 -49 453 -75 -858 -656 -164 -443 -619 208 837 313
929C13n35K38J5m55M5N74J81j44K85K68l83m81J63J64k05nN15L59j87j56p4k88
$$ 313 -222 16 31 -424 -379 195 376 232 517 785 402 -79 84 248 43 38 553 912 725 569 495 207
951B07k61R0K52K7J79K20j26m08j53M1j43j86J75K32N7l9K4k06l72j44J2k5J20
$$ 207 -54 36 288 315 494 714 588 180 27 68 -75 -261 -86 146 203 164 188 -18 -390 -534 -522 -547 -427
974d27L59J44k30k42J2j62l19J00L35J78m8J63Q7k44k49O3rj28K30N18J28k67
$$ -427 -68 76 -154 -396 -384 -546 -865 -765 -430 -252 -300 -137 -50 -294 -543 -480 -489 -617 -387 131 259 -8
996hM7K16l06m30K06M49J11o3L07J50k59j67O8j51j57K84M21m2j94J95O1l46l84
$$ -8 39 255 -51 -481 -275 174 285 222 529 679 420 253 321 170 13 297 718 676 482 677 738 392 8
1019HR6J88j2R7J81r1j74Oj05l71k29L58K70j86j00K04m5l86j86QK8QK08N0j58
$$ 8 104 292 280 377 558 467 293 299 194 -177 -406 -48 222 36 -64 140 95 -291 -477 -469 -441 -433 -225 -175 -333
1044c33K9J37j43m26k8L59J15r4J24K24p1k60p2O4n9J36K90J21j25P4J65j11k84
$$ -333 -304 -167 -310 -736 -764 -405 -290 -384 -260 -36 -107 -367 -439 -375 -434 -298 -8 113 -12 62 227 116 -168
1067a68MJ90J36K2J49J75n9o3r7j75j00K42K25o9r3K11R0l20k50J15O6j33j4K09
$$ -168 -164 26 162 184 333 508 449 386 289 114 14 256 481 412 319 530 620 300 50 165 231 98 84 293
1091B93J27j44r3n7j98j60J08J36l1l6J00P7k11j86PO2q1o9J20J73J6j20r4Om4
$$ 293 420 276 183 126 -72 -232 -124 12 -19 -55 45 122 -89 -275 -268 -206 -287 -356 -236 -63 -47 -167 -261 -255 -299
1116b99j9k7J07J62J8m5j5j3n4k3J6L3K8J34J24K9j39o4P1Pj20N9J81R0n6p3n
$$ -299 -318 -345 -238 -76 -58 -103 -118 -131 -185 -208 -192 -159 -131 3 127 156 17 -47 24 31 -89 -30 151 241 185 112 107
1143A07K7k1p0j7N4O3J00J0j12k8M1m2j13o3J31J90q1q4mPnl6j31L4J13M5k2j07
$$ 107 134 113 43 26 80 143 243 253 141 113 154 112 -1 -64 67 257 176 92 88 95 90 54 -77 -43 70 115 93 -14
1171a4L9O1p9j46k1J24P5l4l3L2j1k2l4q4k3N4M4M0r9jR5J8j59o3Q9J25j01j00
$$ -14 25 86 7 -139 -160 -36 39 5 -28 4 -7 -29 -63 -147 -170 -116 -72 -32 -131 -132 -37 -19 -178 -241 -152 -27 -128 -228
1199b28J06J68o5j49L2L4l1l1O1R5j3M4K8o8j15P4J55n0j34J00K12m5j11kJ07
$$ -228 -122 46 -19 -168 -136 -102 -133 -164 -103 -8 -21 23 51 -17 -132 -58 97 47 -87 13 225 180 69 67 174
1224A74m9j52M0J90O1l4qJ3q3l9K0l1k6P8J30rj92K8P5l7j96o3J25P8k0KN4j16
$$ 174 125 -27 13 203 264 230 222 235 152 113 133 102 76 154 284 275 83 111 186 149 -47 -110 15 93 73 75 129 13
1252A3j18q9Pn7P6J23O1j53j38J11L7j34j43J14J70k9r7J05J39p2j70n2K2jJ98
$$ 13 -105 -194 -187 -244 -168 -45 16 -137 -275 -164 -127 -261 -404 -290 -120 -149 -246 -141 -2 -74 -244 -296 -274 -275 -77
1277g7K04k1j56Q7M5j86j62J76L45Jk43J24K65j67j90MJ34r4o4K76J43j46l6J52
$$ -77 127 106 -50 37 82 -104 -266 -90 255 256 13 137 402 235 45 49 183 89 25 301 444 298 262 414
1301D14k30l60M3M84M0k61R1J66j98l85O7K46j51j22J86J69k47p3K22q2m45o2
$$ 414 184 -176 -133 351 391 130 221 387 189 -196 -129 117 -34 -156 30 199 -48 -121 101 19 -426 -488
1323d88L31R8j81J56L08j58m78p1K12Qn5K78J93j93k33J59J37k72q3K47J65k42
$$ -488 -157 -59 -240 -84 224 66 -412 -483 -271 -263 -318 -40 153 -40 -273 -114 23 -249 -332 -85 80 -162
1345a62N1M10J16l74k10J40mj29K12L70R0k82j74N1j29r8K16K81j43j79J63J48
$$ -162 -111 299 415 41 -169 -29 -33 -162 50 420 510 228 54 105 -24 -122 94 375 232 53 216 364
1367C64k35k06J41Q1k50j52M46K72j92k60M6j51l22Q2M48J27k04M9J09l05l51
$$ 364 129 -77 64 145 -105 -257 189 461 269 9 55 -96 -418 -336 112 239 35 84 193 -112 -463
1388d63K56L22j60l14K74K95j47k25J95Q0m23k37L89K74q2Q6L08k61o47L2M73
$$ -463 -207 115 -45 -359 -85 210 63 -162 33 113 -310 -547 -158 116 34 120 428 167 -480 -448 25
1409B5N2k46K60M02k43n39J44L43j64l25J94K87j91n7L80J01n38k85K95P0k22
$$ 25 77 -169 91 493 250 -289 -145 198 34 -291 -97 190 -1 -58 322 423 -115 -400 -105 -35 -257
1430b57K20N76k2o15k00K29Rk22K42L83j25l36J36K45k58k19K26P5l39L1N18K67
$$ -257 -37 539 517 -98 -298 -69 -60 -282 -40 343 218 -118 18 263 5 -214 12 87 -252 -221 297 564
1452E64l78k73J06j21l36J82N65J74k84p8J5k53k45K79K80j56k06K60K24k41j93
$$ 564 186 -87 19 -102 -438 -256 309 483 199 121 136 -117 -362 -83 197 41 -165 95 319 78 -115
1473a15K18j4m30j82M26L44p7p1J45k49m81n0L94J63o6J65J68k72m08J41L23j83
$$ -115 103 89 -341 -523 -97 247 170 99 244 -5 -486 -536 -142 21 -45 120 288 16 -392 -251 72 -111
1495a11l30L18L03r5j63K52Q1l40l55J79K69KJ75L29q0n16j80K30N1j82K50M34
$$ -111 -441 -123 180 85 -78 174 255 -85 -440 -261 8 10 185 514 434 -82 -262 -32 19 -163 87 521
1517E21j11m10O1K64j41l43L8K13j8n1K80K19l43l06N5o5k51J95N50J12m10j59
$$ 521 410 0 61 325 184 -159 -121 92 74 23 303 522 179 -127 -72 -137 -388 -193 357 469 59 -100
1539a00J18j32l71J55L61J5j97J26J79j89j96L4M6l01m8M62L16j63j41J34j64
$$ -100 18 -114 -485 -330 31 46 -151 -25 154 -35 -231 -197 -151 -452 -500 -38 278 115 -26 108 -56
1560e6m48k4M41K90j20L2J88k25k60L6J94j07j10K62K61r9j55J87K8l90k45K59
$$ -56 -504 -528 -87 203 83 115 303 78 -182 -146 48 -59 -169 93 354 255 100 287 315 -75 -320 -61
1582f1K76l8Q1K38r9l88j80R5K1k1J79K37r8k01QR4k28k52J42K02l3j8K03J47
$$ -61 215 177 258 496 397 9 -171 -76 -55 -76 103 340 242 41 49 143 -85 -337 -195 7 -26 -44 159 306
1606C06l39k66k0N4KJ16K93L3j66n4l7j46j72J30K87Lj14J58J92j88k44k8P1p
$$ 306 -33 -299 -319 -265 -263 -147 146 179 13 -41 -78 -224 -396 -266 21 24 -90 68 260 72 -172 -200 -129 -136
1630a36jK09K22o4q9j8j47k01j2K98J43j11N1J32n7k76j07J26N4r1P6K05M7j03
$$ -136 -137 72 294 230 141 123 -24 -225 -237 61 204 93 144 276 219 -57 -164 -38 16 -75 1 206 253 150
1654A50o6l4j95j00J16K04l7L4J58m4k87j76J27R5n9K2K23O8j43n7jj19r1Q5J55
$$ 150 84 50 -145 -245 -129 75 38 72 230 186 -101 -277 -150 -55 -114 -92 131 199 56 -1 -2 -121 -212 -127 28
1679B8n2M4J74L2k05j91O1N1o5M1K35O5r2o7l1q2q2N2J25L5o5J15O8j25j62L0
$$ 28 -24 20 194 226 21 -170 -109 -58 -123 -82 153 218 126 59 28 -54 -136 -84 41 76 11 126 194 69 -93 -63
1705f3Kl1n1J67J46l5p6o3r5n3l9Q8Q4M5P0Lo2j22m6N0j9rP2J78Kq7j6on2q0K0
$$ -63 -61 -92 -143 24 170 135 59 -4 -99 -152 -191 -103 -19 26 96 99 37 -85 -131 -81 -100 -109 -37 141 143 56 40 34 -18 -98 -78
1736g8Q1J14N3qn3o6l4QJ4n9O7J20J3m7n9Ll2p3k6N9P3K9j0j0n2q3ql9K0QJ12
$$ -78 3 117 170 162 109 43 9 17 31 -28 39 159 172 125 66 69 37 -36 -62 -3 70 99 89 79 27 -56 -64 -103 -83 -75 37
1767C7M3o8j02K8L8j10m7P4J06n8RL6j2p0k6K8l5K6J21M6l2n2N0M1r4o7M8J36
$$ 37 80 12 -90 -62 -24 -134 -181 -107 -1 -59 -50 -14 -26 -96 -122 -94 -129 -103 18 64 32 -20 30 71 -23 -90 -42 94
1795I4L0p2L8K1m9l3LJ4K2O4J1l8k7N9Qr6m7J4P7K6m1j4J1j4m9l2k9K3M8njk7
$$ 94 124 52 90 111 62 29 32 46 68 132 143 105 78 137 145 49 2 16 93 119 78 64 75 61 12 -20 -49 -26 22 17 16 -11
1827a1kj6n6m1K2P9ro7M1Ok2k4m6O0K0J3kL1l0NL6m7k9K8Q3jl4lP7M3j15k2O7
$$ -11 -13 -29 -85 -126 -104 -25 -34 -101 -60 -54 -76 -100 -146 -86 -66 -53 -55 -24 -54 -49 -13 -60 -89 -61 22 21 -13 -16 61 104 -11 -33 34
1860C4M9j1j4M2J1m5k4M5l8QM6L6p6nJ7O3j48k5M3P2l7n7K8N0o5n4J8K7Mpkk1
$$ 34 83 72 58 100 111 66 42 87 49 57 103 139 63 58 75 138 -10 -35 8 80 43 -14 14 64 -1 -55 -37 -10 -6 -13 -15 -36
1892c6m2L1J12q1q7L8Q1rr6M5N4no7K2NkO3K7k4o2K5M6l6p4O1J32k5j32K5J13
$$ -36 -78 -47 65 -16 -103 -65 16 7 -89 -44 10 5 -62 -40 -35 -37 26 53 29 -33 -8 38 2 -72 -11 121 96 -36 -11 102
1922A02m2j17K5N0Lk3L4L8n0m9N8j2r9O3J03j2r9mO1k0j18K7J41k7n8k1Q2op0
$$ 102 60 -57 -32 18 21 -2 32 70 20 -29 29 17 -82 -19 84 72 -27 -31 30 10 -108 -81 60 33 -25 -46 36 30 -40
1951d0L5O8j03l6J04N0p6j5Q5j9j19k5J34O5q1k6J03o4l9l3J13j4j09O0J13j07
$$ -40 -5 63 -40 -76 28 78 2 -13 72 53 -66 -91 43 108 27 1 104 40 1 -32 81 67 -42 18 131 24
1977B4m7J00N6j61o3Q7R5q4m1J00L2j36r8Q2O2p5M9N3n9j11P5R1q3r6Q6J47j46
$$ 24 -23 77 133 -28 -91 -4 91 7 -34 66 98 -38 -136 -54 8 -67 -18 35 -24 -135 -60 31 -52 -148 -62 85 -61
2004f1q5J10J37j30j46R3J12n5k7J46L1j40m5J09k4j00R9J92o1j84K0J47m6j42
$$ -61 -146 -36 101 -29 -175 -82 30 -25 -52 94 125 -15 -60 49 25 -75 24 216 155 -29 -9 138 92 -50
2028e0N6J31n5r5P9J35j08j15P3M0j55j5K40J9j84q9J49J9k23J0K18J5k08K7J27
$$ -50 6 137 82 -13 66 201 93 -22 51 91 -64 -79 161 180 -4 -93 56 75 -148 -138 80 95 -113 -86 41
2053D1m7j31L2J00j09j15J83J04j03o5J49k1k28m8K48Q8r2NQ8n0k04R7J36lr8
$$ 41 -6 -137 -105 -5 -114 -229 -46 58 -45 -110 39 18 -210 -258 -10 78 -14 -9 79 29 -175 -78 58 55 -43
2078d3R0J17j00j10J32Q8j54j39J63J33p6o9J81J4k14j28J18J08q7O8J18o1k17
$$ -43 47 164 64 -46 86 174 20 -119 44 177 101 32 213 227 13 -115 3 111 24 92 210 149 -68
2101f8K4J17o6j03O4J58j12j45J53J11j05k21M8J00m9l5J95R4j74j25M4j4j14
$$ -68 -44 73 7 -96 -32 126 14 -131 22 133 28 -193 -145 -45 -94 -129 66 160 -14 -139 -95 -109 -223
2124b23Q8K70k6j94pJ89m4k42Q3J74k1j88J24K32m7j96M1Pj42m4K53J53j40o9
$$ -223 -135 135 109 -85 -92 97 53 -189 -106 68 47 -141 -17 215 168 -28 13 20 -122 -166 87 240 100 31
2148C1J39m6k93j2K74N0j76M2J73k9k04K7J08j17j86J76J81o0n9J25J2k88j70
$$ 31 170 124 -169 -181 93 143 -33 9 182 153 -51 -24 84 -33 -219 -43 138 78 19 144 156 -132 -302
2171c02K03J77j15KJ88Jk39o3J43rj49R3J76m7j18J12J34j91j84R5J20m8j2K03
$$ -302 -99 78 -37 -35 153 154 -85 -148 -5 -14 -163 -70 106 59 -59 53 187 -4 -188 -93 27 -21 -33 170
2195A70Q8j94k11N9R9r8K5K23L0j22o3R9m1k03M3J24qr7J31J81j03k23j5P5j04
$$ 170 258 64 -147 -88 11 -87 -62 161 191 69 6 105 64 -139 -96 28 20 -77 54 235 132 -91 -106 -31 -135
2220a35m6J49J81m4j24N3n8j68NJ87M6p6M2J23l8k09J3J28o6j68J04K35L0r5J5
$$ -135 -181 -32 149 105 -19 34 -24 -192 -187 0 46 -30 12 135 97 -112 -99 29 -37 -205 -101 134 164 69 84
2245H4rj24j20J19J33j3mJ55qk44l8J29J4j53J8J98N2j58K9M3r2j47J5J19rK7
$$ 84 75 -49 -169 -50 83 70 66 221 213 -31 -69 60 74 -79 -61 137 189 31 60 103 11 -136 -121 -2 -11 16
2271A6J20N2k37j39Q8M2n3l4J50J06j25n5M7K2j65KJ27j9l0J06R8o0j65K4L0m2
$$ 16 136 188 -49 -188 -100 -58 -111 -145 5 111 -14 -69 -22 0 -165 -163 -36 -55 -85 21 119 59 -106 -82 -52 -94
2297i4n1J53J82r1j03M4M2p3r6J27O2l2J2R9k7j39k3N0j5o5Q7J50m1r3j4L1j14
$$ -94 -145 8 190 99 -4 40 82 9 -87 40 102 70 82 181 154 15 -8 42 27 -38 49 199 158 65 51 82 -32
2324c2p5Q0J01k4j6M8Oj19n3K0%n3M6Q8K7q9j3P0j14r2L5J15J8k2L8Q0j12n9m3
$$ -32 -107 -27 74 50 34 82 88 -31 -84 -64 -64 -117 -71 17 44 -45 -58 12 -102 -194 -159 -44 -26 -48 -10 70 -42 -101 -144
2353a44M1K2QJ13N5q2j8N9mj45oJ36M0oJO6n0q7NK1RJ5K6O4m4k4J2j5q5j0R0J6
$$ -144 -103 -81 -73 40 95 13 -5 54 50 -95 -101 35 75 69 70 136 86 -1 4 25 34 49 75 139 95 71 83 68 -17 -27 63 79
2385G9l9l6Q6kq2q1K4N3k8K0O3m2m0L3m2n1o9P1P4k7j7L8J9o6m3j5P0jJ6L0L9
$$ 79 40 4 90 88 6 -75 -51 2 -26 -6 57 15 -25 8 -34 -85 -154 -83 -9 -36 -53 -15 4 -62 -105 -120 -50 -51 -35 -5 34
2416C4m5Ok4l0k6J8Q7J5J0K4J9p1j6n7O9nK7jL1L8l9k2k2j0l1M2J6lJ6J1m2n4
$$ 34 -11 -5 -29 -59 -85 -67 20 35 45 69 88 17 1 -56 13 8 35 34 65 103 64 42 20 10 -21 21 37 34 50 61 19 -35
2448c5k2L6L2nL3J9oo8j8j2L1k2K2k0K7L0l6Lm1k4PO0k7K8L3K8m4l9NL4l0J5%
$$ -35 -57 -21 11 6 39 58 52 -16 -34 -46 -15 -37 -15 -35 -8 22 -14 -11 -52 -76 -69 -9 -36 -8 25 53 9 -30 -25 9 -21 -6 -6
2481fN1j9Qj3l7j5QL9j5j8P0J4l2n4%Lj0LK1N6j5J1j7m9j9J4k1M4j2N9J0l4m3
$$ -6 45 26 34 21 -16 -31 -23 16 1 -17 53 67 35 -19 -19 -16 -26 -23 -2 54 39 50 33 -16 -35 -21 -42 2 -10 49 59 25 -18
2514a8k4N3ql5N0J8J0k3Nl8Lj0N5m0K2J1L2j2m6n2K8L5j1mK0QJ2j7k5qm2%L5j
$$ -18 -42 11 3 -32 18 36 46 23 28 -10 -7 -17 38 -2 20 31 63 51 5 -47 -19 16 5 1 21 29 41 24 -1 -9 -51 -51 -16 -17
2548a7J5J7Rm9k7J1kq%L3mJ5k4K1km4j9N4pJ9QL3m5j8M4l0RkL2K4Qk6kK6l5OM
$$ -17 -2 15 24 -25 -52 -41 -43 -51 -51 -18 -22 -7 -31 -10 -12 -56 -75 -21 -28 -9 -1 32 -13 -31 13 -17 -8 -10 22 46 54 28 26 52 17 23 27
2585B7L9Mj3L6k3nj7j5l4M1K5K5Jo5PK4o4qK2j1J2k0J9Ko2K9l1j8pJ8M8k2o4N0
$$ 27 66 70 57 93 70 65 48 33 -1 40 65 90 91 26 33 57 -7 -15 7 -4 8 -12 7 9 -53 -24 -55 -73 -80 -62 -14 -36 -100 -50
2619e0Ol3l9L4K7K8k1L1j6mL3k5l9j9P7N9k1k9J6N0n6l6O8L6LnrJjJ1L6k6k5K0
$$ -50 -44 -77 -116 -82 -55 -27 -48 -17 -33 -37 -4 -29 -68 -87 -10 49 28 -1 15 65 9 -27 41 77 80 75 66 67 66 77 113 87 62 82
2653H2J3J8p1K9K0j2l8k4N8j6m8L9Pm9m7L7Ll6k8M1K5o6%M1j8n0j8O3j7m1j2M6
$$ 82 95 113 42 71 91 79 41 17 75 59 11 50 57 8 -39 -2 1 -35 -63 -22 3 -63 -63 -22 -40 -90 -108 -45 -62 -103 -115 -69
2685f9L1o1RL7j9N7nK3n2k2L9N4l9m4Q9O3o4o0O5N4l9k3P3Jo4J7M4j1j7J1L6n6
$$ -69 -38 -99 -90 -53 -72 -15 -20 3 -49 -71 -32 22 -17 -61 28 91 27 -33 32 86 47 24 97 98 34 51 95 84 67 78 114 58
2717E8l1R0j2m0l7QL8o0m4O5N2n6pPl1p3L4M7Lp5L5J8k1p1K3O1l9q4P0N6mo5J2
$$ 58 27 117 105 65 28 36 74 14 -30 35 87 31 24 31 0 -73 -39 8 11 -64 -29 -11 -32 -103 -80 -19 -58 -142 -72 -16 -20 -85 -73
2750g3L9n9nL3N6l8K0O2n1p1L9M8Ro5K7J10mj03K8N8o2mL1L9J8l7P3K0j10nON4
$$ -73 -34 -93 -98 -65 -9 -47 -27 35 -16 -87 -48 0 9 -56 -29 81 77 -26 2 60 -2 -6 25 64 82 45 118 138 28 23 29 83
2782H3m9J7P4rq4m9O6L7j22L9J3L4o9M9M4m7p3j4P0m2QL4Q4j18m8M5lo8J2R4n
$$ 83 34 51 125 116 32 -17 49 86 -36 3 16 50 -19 30 74 27 -46 -60 10 -32 -24 10 94 -24 -72 -27 -30 -98 -86 8 3
2813Cn2JL7rm7OK8m3%N8Q3l4p7K1N2o2n3Q0O7l0n2P0lq3NK8mk0M2N0Po8ON6p8
$$ 3 -49 -48 -11 -20 -67 -61 -33 -76 -76 -18 65 31 -46 -25 27 -35 -88 -8 59 29 -23 47 44 -39 -34 -6 -10 -30 12 62 69 1 7 63 -15
2848a5o3R2Q4k2k7M2J1p6m7J6P5l0k7R0j7o5l7R0o5m7KO2K2n6L2M6l8p0k1M2M
$$ -15 -78 14 98 76 49 91 102 26 -21 -5 70 40 13 103 86 21 -16 74 9 -38 -36 26 48 -8 24 70 32 -38 -59 -17 -13
2879a3l0O4J4m4m8K2Qq8J3P3L7p9J6O5nr9jM7ll6N6O6j4p8M3K0p6K4M0O9k0l6
$$ -13 -43 21 35 -9 -57 -35 -27 -115 -102 -29 8 -71 -55 10 5 -94 -95 -48 -51 -87 -31 35 21 -57 -14 6 -70 -46 -6 63 43 7
2911GP8k6o3j6R1k9j4PO5K5n2Pol2p2Q4N2ll6K5L5r5q0O3P1m0n5N5J5m9j2J4k2
$$ 7 85 59 -4 -20 71 42 28 35 100 125 73 80 74 42 -30 54 106 103 67 92 127 32 -48 15 86 46 -9 46 61 12 0 14 -8
2944hm0j8O6k1m5M2K4o3p6K1P3l5qN1L0n5m1lNOJ3M7j0J7mL8l6l8RN9J3m7P7K8
$$ -8 -48 -66 0 -21 -66 -24 0 -63 -139 -118 -45 -80 -88 -37 -7 -62 -103 -106 -101 -95 -82 -35 -45 -28 -32 6 -30 -68 -59 0 13 -34 43 71
2978G1j3l9J1L3l4KM6M9ml9nM7p1PM3J1l1RJ6L2p3ml4J9j4pJ9J6m9j5Rl4m8O0
$$ 71 58 19 30 63 29 31 77 126 122 83 78 125 54 61 104 115 84 93 109 141 68 64 30 49 35 28 47 63 14 -1 8 -26 -74 -14
3012a4Rqk8L2j3p7j1K8K1n5K1K9K1k3K8n0K0m7K5M5j4pO7J8l8n6N4K5pQM7J1j3
$$ -14 -5 -13 -41 -9 -22 -99 -110 -82 -61 -116 -95 -66 -45 -68 -40 -90 -70 -117 -92 -47 -61 -68 -1 17 -21 -77 -23 2 -5 3 50 61 48
3045D8Kk6K1j7L7j3K6j4M6kNm8l2M4j0j3J2M0k3j4Ml3Lo6Q6j7j3l8K7K4n0l6K3
$$ 48 50 24 45 28 65 52 78 64 110 108 113 65 33 77 67 54 66 106 83 69 73 40 43 -23 63 46 33 -5 22 46 -4 -40 -17
3078a7j1j5MK5K8n1rj0No5K4Q0m0%J8j1l4qJ0M6l3J7K2K4k1mJ6nk1jP4noRL%q
$$ -17 -28 -43 -39 -14 14 -37 -46 -56 -51 -116 -92 -12 -52 -52 -34 -45 -79 -87 -77 -31 -64 -47 -25 -1 -22 -26 -10 -15 -36 -37 37 32 26 35 38 38 30
3115C0j1K0j5j0M7K5rm5jJ2J0m1N0JJ6j4Kj7k8l3J8jj1O4k8Pj1j9k7L4n2J3M4
$$ 30 19 39 24 14 61 86 77 32 31 43 53 12 62 63 79 65 67 50 22 -11 7 6 -5 59 31 38 27 8 -19 15 -37 -24 20
3148B0j7k4j0K9l3j0k1L4j5M1qkk1J3j9k1rO5nqK8n7M6l5mL3k2J3ONK0K5j8Rn3
$$ 20 3 -21 -31 -2 -35 -45 -66 -32 -47 -6 -14 -16 -37 -24 -43 -64 -73 -8 -13 -21 7 -50 -4 -39 -43 -10 -32 -19 -13 -8 12 37 19 28 -25
3183b5J3M2j2J0qjRlk4K6k3J3%L7J1k3l4K1J4k5j2P2k0k9J6K1Np3J4k0M3k3J9
$$ -25 -12 30 18 28 20 19 28 25 1 27 4 17 17 54 65 42 8 29 43 18 6 78 58 29 45 66 71 -2 12 -8 35 12 31
3216C1l9L9rk2j3l8lK9J3MRj7Nj8l4MK3j9mK4K9l9qj1PK8k5M1j6O%p%k4J5J9K8
$$ 31 -8 31 22 0 -13 -51 -54 -25 -12 -8 1 -16 -11 -29 -63 -59 -36 -55 -59 -35 -6 -45 -53 -64 -57 -29 -54 -13 -29 -23 -23 -30 -30 -54 -39 -20 8
3253Hj3J2K2J3k3mNmpM1Kj2L9j1Kl1L0J1nn4N5j5J0j0l2NJ1qj3j1PL1qo7lQl5
$$ 8 -5 7 29 42 19 15 20 16 9 50 52 40 79 68 70 39 69 80 75 21 76 61 71 61 29 34 45 37 24 13 20 51 43 -24 -27 -19 -54
3290e4L3j0OkJ9%n4mJ6Ql8K7J6nj1oKnJ4mmkRM7m2KN1j4k2K5J8jpK2Kj2JJ2J1
$$ -54 -21 -31 -25 -27 -8 -8 -62 -66 -50 -42 -80 -53 -37 -42 -53 -59 -57 -62 -48 -52 -56 -58 -49 -2 -44 -42 9 -5 -27 -2 16 15 8 30 32 20 21 33 44
3329D4J6l%Nk2k3N1pqnLK5l1Mj3Ll0NqOK0l1JJ0k3m7J9klJ0J7n8nM1J5m1K1k4
$$ 44 60 57 57 62 40 17 68 61 53 48 51 76 45 49 36 39 9 14 6 12 32 1 2 12 -11 -58 -39 -41 -44 -34 -17 -75 -80 -39 -24 -65 -44 -68
3367f8L1Ml2O7k9l6qM8j9J6j1j1K0J4l1M3PjJ5kj0Rj3M8n9L8K5k5PoL5%m6PK9
$$ -68 -37 -33 -65 2 -27 -63 -71 -23 -42 -26 -37 -48 -28 -14 -45 -2 5 4 19 17 7 16 3 51 -8 30 55 30 37 31 66 66 20 27 56
3402E6l0Pj7M7K2m3j8J5kj8LJ5k7m0O8l2rk9RMl0QP2l8j2Nk7K3l8L3j3k0k0N0
$$ 56 26 33 16 63 85 42 24 39 37 19 22 37 10 -30 38 6 -3 -32 -23 -19 -49 -41 31 -7 -19 -14 -41 -18 -56 -23 -36 -56 -76 -26
3436b6L4l9mK3kl6j9Q5k9j3OJ5L2n0j2M7J0l4M3j6Lp1L4L8k7K6%L3l1m4L3L0j
$$ -26 8 -31 -35 -12 -14 -50 -69 16 -13 -26 -20 -5 27 -23 -35 12 22 -12 31 15 18 -53 -19 19 -8 18 18 51 20 -24 9 39 38
3469C8n5K2L3k9j3K1J2j9NL2j8kj4L2j3l4J4JOk3J8K3Nm1j3J9k8k1L6J4m0J1L4
$$ 38 -17 5 38 9 -4 17 29 10 15 47 29 27 13 45 32 -2 12 13 19 -4 14 37 42 1 -12 7 -21 -42 -6 8 -32 -21 13
3502A3j4J2m7J7Rm2N2j5K4mljm0k3M2RMo7J10j8l3nk3N4p4K6L2M3p2N2oQj8Pj0
$$ 13 -1 11 -36 -19 -10 -52 0 -15 9 5 2 1 -39 -62 -20 -11 -7 -74 36 18 -15 -20 -43 11 -63 -37 -5 38 -34 18 12 20 2 9 -1
3537aL5k5KM1l8l3K5L3k4j2L7%rk3J5L9n1jRJ7k6K8opl4rL5oo2O9J6l2o0N1J5
$$ -1 34 9 11 52 14 -19 6 39 15 3 40 40 31 8 23 62 11 10 19 36 10 38 32 25 -9 -18 17 11 -51 18 34 2 -58 -7 8
3572Hml9ML4l2j4K8J5l9j1M5j4n0N6L7k3k5MJ3j1k2PN5L1o3J4K8l3j3O6jn9l5
$$ 8 4 -35 -31 3 -29 -43 -15 0 -39 -50 -5 -19 -69 -13 24 1 -24 -20 -7 -18 -40 -33 22 53 -10 4 32 -1 -14 52 51 -8 -43
3605d3O2%oM1J2j3p8O3KRk8J7J6j7k6moK9j0K1L0o0k0J6Nm5MJ6M5l6m4L6Om9P
$$ -43 19 19 13 54 66 53 -25 38 40 49 21 38 54 37 11 7 1 30 20 41 71 11 -9 7 12 -33 -29 -13 32 -4 -48 -12 -6 -55 -48
3640d8K2j1l3P0opm5M4j7K3k9M7J9n7PK4K5l7oj5M3l4N4Nk0k5L5ok0J6J0J4lo
$$ -48 -26 -37 -70 0 -6 -13 -58 -14 -31 -8 -37 10 29 -28 -21 3 28 -9 -15 -30 13 -21 33 38 18 -7 28 22 2 18 28 42 39 33
3674C3lLolmK8k3j3lL8j8k5K8j1k0JK4k1j1nM2n1j7OK6J8m9L0L5p7K2nK2n8L4
$$ 33 30 33 27 24 20 48 25 12 9 47 29 4 32 21 1 2 26 5 -6 -11 31 -20 -37 -31 -5 13 -36 -6 29 -48 -26 -31 -9 -67 -33
3709c3K3j4j7L0oM0n6nM7k9RRK4jl9K4k1pL4l0K5moK0Km6L7J9rmk5J8L0ql5j2
$$ -33 -10 -24 -41 -11 -17 23 -33 -38 9 -20 -11 -2 22 21 -18 6 -15 -22 12 -18 7 3 -3 17 19 -27 10 29 20 16 -9 9 39 31 -4 -16
3745a6RJ1kL6rk1j9L3k4l7M7J9j7JN%rn3O0k1J8k7N0rqk5j1kj1J5LK6mkjl2L3
$$ -16 -7 4 2 38 29 8 -11 22 -2 -39 8 27 10 11 16 16 7 -46 14 -7 11 -16 34 25 17 -8 -19 -21 -32 -17 -14 12 8 6 5 -27 6
3782F%k4L9m4K2K8k3Rj9k3Lj3M8j4Kj1L0Pl7QL1k1J2L3n0%J1pj9J6nK9n1N3j7
$$ 6 6 -18 21 -23 -1 27 4 13 -6 -29 -26 -39 9 -5 -3 -14 16 23 -14 -6 25 4 16 49 -1 -1 10 3 -16 0 -5 24 -27 26 9
3817IJ3J2n2kJ0lL9l3K0K6k6QlLOj6ok5L5J8Npo0L0Jkl7L9QK1m1j4PJJ5jk1J4
$$ 9 22 34 -18 -20 -10 -13 26 -7 13 39 13 21 18 21 27 11 5 -20 15 33 38 31 -29 1 2 0 -37 2 10 31 -10 -24 -17 -16 -1 -2 -23 -9
3855iOj6jQMprJ3L9k7j5KqJ4j1pK4QNj6K7Mm3K0j4L0qj8L1J0j9J3j3OKk0M8m0
$$ -9 -3 -19 -20 -12 -8 -15 -24 -11 28 1 -14 -12 -20 -6 -17 -24 0 8 13 -3 24 28 -15 5 -9 21 13 -5 26 36 17 30 17 23 25 5 53 13
3893A3J2rL9q4M0M0l4J0kJ2pqj6J1nJ7l9lL5j4Ll4Rj3mJ5j5pM0Ml6J4Nk9J2qJ9
$$ 13 25 16 55 -29 11 51 17 27 25 37 30 22 6 17 12 29 -10 -13 22 8 11 -23 -14 -27 -31 -16 -31 -38 2 6 -30 -16 -11 -40 -28 -36 -17
3930a7J9J1qj9j9L9m0N8l3RJ8j0ok8N3k0M8l5J9qkl8K9rJ8j0j1J9lOK6m0J4j5
$$ -17 2 13 5 -14 -33 6 -34 24 -9 0 18 8 2 -26 27 7 55 20 39 31 29 -9 20 11 29 19 8 27 24 30 56 16 30 15
3964A5j6K1j2KnJ4m6K9KJ5k6J0lJrLJ0k8K7k7J5j1QK2j8nk2J9J7j0m0M3j4J3k
$$ 15 -1 20 8 10 5 19 -27 2 4 19 -7 3 0 1 -8 -5 5 -23 4 -23 -8 -19 -11 11 -7 -12 -34 -15 2 -8 -48 -5 -19 -6 -8
3999hJj6MN1l3%nJ9L4j6k2MJ5k0P%J0k3K0k7K4j7K3j5NJJ1j9Qj8oNk2J2j3K8K3
$$ -8 -7 -23 -19 32 -1 -1 -6 13 47 31 9 13 28 8 15 15 25 2 22 -5 19 2 25 10 15 16 27 8 16 -2 -8 -3 -25 -13 -26 2 25
4036B5Qj5%l4K9j9l0J6MJ2JJ7jJll6J8rMJ5O%j9J1K%j4K6Qk0lOkJ8m1K1K7j0M
$$ 25 33 18 18 -16 13 -6 -36 -20 -16 -4 -3 14 13 14 11 -25 -7 -16 -12 3 9 9 -10 1 3 3 -11 15 23 3 0 6 4 22 -19 2 29 19 23
4075B3j2J6k9k1Q4r0M0j5K8mK7n3L7j5n8N2m0M0J5j1j3J9l9KL0J3m8K8MKl5K1
$$ 23 11 27 -2 -23 61 -29 11 -4 24 20 47 -6 31 16 -42 10 -30 10 25 14 1 20 -19 -17 13 26 -22 6 10 12 -23 -2
4107bN9m0j5JK3k6QK3j4k1pK9l1lK8jJ9l7K4k9O%MK5rJ7k7Mm1K7J6j7J2Nk0L8
$$ -2 57 17 2 3 26 0 8 31 17 -4 -11 18 -13 -16 12 11 30 -7 17 -12 -6 -6 -2 23 14 31 4 8 -33 -6 10 -7 5 10 -10 28
4143B8oOk7pj1nK4j0J1l6L8j8KNJ4K1j3j5J5j5K0kkj3mOJ6Jk2J1mJ2k%JQj8J9
$$ 28 22 28 1 -6 -17 -22 2 -8 3 -33 5 -13 -11 -6 8 29 16 1 16 1 21 19 17 4 0 6 22 23 1 12 8 20 18 18 19 27 9 28
4181B8lk0K1k4J2jJ4Jk1kk1L0l0nK6j6j4K0J0lqlNNljJk6J5L3j4j3l8M8k1J3P
$$ 28 25 5 26 2 14 13 27 28 7 5 -16 14 -16 -21 5 -11 -25 -5 5 2 -6 -9 -4 1 -2 -3 -2 -28 -13 20 6 -7 -45 3 -18 -5 2
4218BpJ2k8L6j3Njk0K2K0n4M2klrJ2j5J1J4l9L4k3N3l1jjj5J9k0oL2j5j7qPK3
$$ 2 -5 7 -21 15 2 7 6 -14 8 28 -26 16 14 11 2 14 -1 10 24 -15 19 -4 49 18 17 16 1 20 0 -6 26 11 -6 -14 -7 16
4254A6lj7K4j3j0j2JK4k8%J9oj0L3j6k4K0j5J7p%j4J9mj3k8K1K5j4OJ3J0J2l2
$$ 16 13 -4 20 7 -3 -15 -14 10 -18 -18 1 -5 -15 18 2 -22 -2 -17 0 -7 -7 -21 -2 -6 -19 -47 -26 -1 -15 -9 4 14 26 -6
4288fL1j7Lj5j7K9lK0j0jJ5j2%RKl3J0J9k8K1lj4L8j9mk2J9k0j6OK2l0J1KJ0K0
$$ -6 25 8 11 -4 -21 8 5 25 15 14 29 17 17 26 28 -5 5 24 -4 17 14 0 38 19 15 -7 12 -8 -24 -18 4 -26 -15 -13 -3 17
4324A7j6j4NL4l6qOK8Rl3Qj4QQk9K7l1M8l7L7j4m5J8K0JlK2OQj0J4j7k4K8Pk9
$$ 17 1 -13 -8 26 -10 -18 -12 16 25 -8 0 -14 -6 2 -27 0 -31 17 -20 17 3 -42 -24 -4 -3 -6 16 22 30 20 34 17 -7 21 28 -1
4360aljJ4j2K7k6lRj0K6onkPl1J9RRk5rnJ9k2LL6j5J5j0L0j9J6j7k9QJoN1l3p
$$ -1 -4 -5 9 -3 24 -2 -5 4 -6 20 14 9 7 14 -17 2 11 20 -5 -14 -19 0 -22 -19 17 2 17 7 37 18 34 17 -12 -4 -3 -9 42 9 2
4399BNrJ4MJj2l8L8NJ4l8L0l5RJ6j6nK1rj1K0J2l7J5qLj2L0k2N1m5nQj6J5K2j6
$$ 2 7 -2 12 16 17 5 -33 5 10 24 -14 16 -19 -10 6 -10 -15 6 -3 -14 6 18 -19 -4 -12 -9 -21 9 -13 38 -7 -12 -4 -20 -5 17 1
4436AkK3k6j3J1j4L1k6J9j2J6J1mmk5K1n4L8L3k8K9k1Qj3k1K3%K1rMj0L8qm1n
$$ 1 -1 22 -4 -17 -6 -20 11 -15 4 -8 8 19 15 11 -14 7 -47 -9 24 -4 25 4 12 -1 -22 1 1 22 13 17 7 45 37 -4 -9
4471iOQmMk1K3KQo9N1Qlj3nRj4J5Lj8K1j1mk2M3RRKj1l5K1L1m3L3j6j6OJ4%Ol1
$$ -9 -3 5 1 5 -16 7 9 17 -52 -1 7 4 -9 -14 -5 -19 -4 -1 -19 2 -9 -13 -35 8 17 26 28 17 -18 3 34 -9 24 8 -8 -2 12 12 18 -13
4511a3K3j4mlK7M8m3j7J2mk9J4L4k1K7l3k9M6l2j6M%K7nJ4J1m6K8J0j8qj7L9l1
$$ -13 10 -4 -8 -11 16 64 21 4 16 12 -17 -3 31 10 37 4 -25 21 -11 -27 -23 -23 4 -1 13 24 -22 6 16 -2 -10 -27 12 -19
4545a9%PJ3J2k9K7rm1L9Nmj4L7l8RMK1j5okmK6j6K0nlMK4k0Pl7Qk8M2j2k0J9Q
$$ -19 -19 -12 1 13 -16 11 2 -39 0 5 1 -13 24 -14 -5 -1 20 5 -1 -3 -7 19 3 23 18 15 19 43 23 30 -7 1 -27 15 3 -17 2 10
4583A0j0j8Qj3J2k2L1jnK1l3J0L1Ro9J3M1KKl8K9k7J3J0%j0J5qJ5pLk0KJ4l0M0
$$ 10 0 -18 -10 -23 -11 -33 -2 -3 -8 13 -20 -10 21 30 -39 -26 15 17 19 -19 10 -17 -4 6 6 -4 11 3 18 11 14 -6 -4 10 -20 20
4619B0qRl0JmJ6k7M8j4k4J8mk6K9j5J4j1l0N6qPpJ1j7OJ3k5j0KK4pJ0j9LJ0%k2
$$ 20 12 21 -9 -8 -12 4 -23 25 11 -13 5 1 -25 4 -11 3 -8 -38 18 10 17 10 21 4 10 23 -2 -12 -10 14 7 17 -2 1 11 11 -11
4656a1K1j5L3m2K1k9J4Oj8K9qKNkJ1oj1J3J6qj7Qj9N3l0NqjML1m9K8ln2M4j6L1
$$ -11 10 -5 28 -14 7 -22 -8 -2 -20 9 1 3 8 6 17 11 0 13 29 21 4 12 -7 46 16 21 13 12 16 47 -2 26 23 -29 15 -1 30
4693C0k0k5L7rnk6J7RJ2l2K4J0nl4K9l7J3J0jJ0k0K2ok4K6Qk6L4n0K6k4K9j5q
$$ 30 10 -15 22 13 8 -18 -1 8 20 -12 12 22 17 -17 12 -25 -12 -2 -3 7 -13 9 3 -21 5 13 -13 21 -29 -3 -27 2 -13 -21
4727b1L6%K1k3J2Lj0l6K0j1K2J8n6M3mjjl3J9PJ4pnNj9L0j6l8L9k4LMJ4J9kJl9
$$ -21 15 15 36 13 25 28 18 -18 2 -9 13 31 -25 18 14 13 12 -21 -2 5 19 12 7 12 -7 23 7 -31 8 -16 -13 -9 5 24 22 23 -16
4764a6J6nnjJ9J2j3J7l1k4K7Mj8PJ9Njk8K9j7nKJ7m6L5opmJ7JN0n7kJ5L1k7K2
$$ -16 0 -5 -10 -11 8 20 7 24 -7 -31 -4 0 -18 -11 8 13 12 -16 13 -4 -9 -7 10 -36 -1 -7 -14 -18 -1 0 50 -7 -9 6 37 10 32
4801C2l0KJ4K0k6k2ML8m2RL2l2KK1j7J3mj2LnK2m8J9oJ8J8rl2J0J2j5j0j1M6k0
$$ 32 2 4 18 38 12 -10 -6 32 -10 -1 31 -1 1 22 5 18 14 2 5 0 22 -26 -7 -13 5 23 14 -18 -8 4 -11 -21 -32 14 -6
4836fJ6nrj6K4Jj7k1J6L1k3k3K9%J5j8%L1k3L4qm3LMj1J8J1J0m1J5J3KoLn%JQ
$$ -6 10 5 -4 -20 4 5 -12 -33 -17 14 -9 -32 -3 -3 12 -6 -6 25 2 36 28 -15 -12 -8 -19 -1 10 20 -21 -6 7 9 3 6 1 1 2 10
4874A0rLj8J0K6l2QJ8j1qJ4Nmk7JK2mj7NJ6l1J5qJ0j5QLL0k4J2Rj0l2L9Qk1k0
$$ 10 1 4 -14 -4 22 -10 -2 16 5 -3 11 16 12 -15 -14 8 4 -13 -8 8 -23 -8 -16 -6 -21 -13 -10 20 -4 8 17 7 -25 14 22 1 -19
4911a9K1j8j3L9j0K6j5%K3j7n4L9LoKrMmK2JPl5L2k5pJ8Lk6%K8rkJ4j6jK3o3L9
$$ -19 2 -16 -29 10 0 26 11 11 34 17 -37 2 5 -1 1 -8 -4 -8 14 15 22 -13 19 -6 -13 5 8 -18 -18 10 1 -1 13 -3 -4 19 -44 -5
4949elnJ2rM1l3lJQJqJ7kKJn1M3Knj1mK0j5L3Qn8R%M0Jk5j4K1LPn2L7nj0M5k0
$$ -5 -8 -13 -1 -10 31 -2 -5 -4 4 5 -3 14 12 14 15 -36 7 9 4 -7 -11 9 -6 27 35 -23 -14 -14 26 27 2 -12 9 12 19 -33 4 -1 -11 34 14
4990A4%k8J1qnk0M7Lk9K0kL6o5j4M0qJ6Pj2J8n2J5N1l9RnRj0L0l1jk1L0%R%Kj3
$$ 14 14 -14 -3 -11 -16 -36 11 14 -15 5 3 39 -26 -40 0 -8 8 15 3 21 -31 -16 35 -4 5 0 9 -1 29 -2 -3 -24 6 6 15 15 17 4
5028DpJ1KRl6K8M%mJ3k5J1k2kK3j1J0Rj0j6K3ljj2%PK3j6jKk4M7l9j5J3MKrJ2
$$ 4 -3 8 10 19 -17 11 15 15 11 24 -1 10 -12 -14 9 -2 8 17 7 -9 14 11 10 -2 -2 5 28 12 11 13 -11 36 -3 -18 -5 -1 1 -8 4
5067Dj4kK2j2Ok1nN7m1J9l0J7NNJ0j9oOk0J5%J2Lk2K5j0K9j4j0J6jj5j2LK0k8
$$ 4 -10 -12 10 -2 4 -17 -22 35 -6 13 -17 0 5 10 20 1 -5 1 -19 -4 -4 8 11 -11 14 4 33 19 9 25 24 9 -3 0 20 -8
5103hpL8l8KK3k9K2l2OL4J1kn1M8k9JM2l9J0Pkj6mJ2k2M0j6k8K9J4Nm1K9k0J7
$$ -8 -15 23 -15 -13 10 -19 3 -29 -23 11 22 20 -31 17 -12 -11 31 -8 2 9 7 -9 -13 -1 -23 17 1 -27 2 16 21 -20 9 -11 6
5138FL0k8kk0nK7K2kj8J3k9J1K2l1K7j3j7J5j1L5J4l3J4m2RJ8pK7l3kJ1J0Ml4
$$ 6 36 8 6 -14 -19 8 30 28 10 23 -6 5 27 -4 23 10 -7 8 -3 32 46 13 27 -15 -6 12 5 32 -1 -3 8 18 22 -12
5172a2K7j0j2oK7j0j4J4j9MkK8j1LJ1j9L5m5K1k3Qk6L7Qk9J2L1pj2nRk3J0Lnj4
$$ -12 15 5 -7 -13 14 4 -10 4 -15 -11 -13 15 4 7 18 -1 34 -11 10 -13 -5 -31 6 14 -15 -3 28 21 9 4 13 -10 0 3 -2 -16
5208a6L2jl1J8kQK8n0J2J3NK7l3j0j9KM0k0k2PL1k9PJ0J6l1J0J0Pj2l5N9k6ml
$$ -16 16 15 -16 2 0 8 36 -14 -2 11 16 43 10 0 -19 -17 23 3 -19 -12 19 -10 -3 7 23 -8 2 12 19 7 -28 31 5 1 -2
5243brPNlLQ%j0oNJ4j2Q%k3K2kLJ5k9K3j0J3qJPn1N6j8L0m9K3qj0Rk7M4j0Lqq
$$ -2 -11 -4 1 -2 1 9 9 -1 -7 -2 12 0 8 8 -15 7 5 8 23 -6 17 7 20 12 13 20 -31 25 7 37 -12 11 3 -7 2 -25 19 9 12 4 -4
5284dL2pj5j5L0qj1jj0JJ4k6L2lPPl9K1k7L7J1l6jJ7j6MK4rj2M2m3qoL6Orj5m
$$ -4 28 21 6 -9 21 13 2 1 -9 -8 6 -20 12 9 16 23 -16 5 -22 15 26 -10 -11 6 -10 -6 18 9 -3 39 -4 -12 -18 18 24 15 0 -4
5322dL4l2pNNJ2j7NNL1n8K4Kl2N0k6L3k8J2Lk4KJKMJ4k4LRj5Rj8lM1K3n3J4Mj6
$$ -4 30 -2 -9 -4 1 13 -4 1 6 37 -21 3 5 -27 23 -3 30 2 14 17 -7 -5 -4 -2 2 16 -8 -5 4 -11 -2 -20 -23 18 41 -12 2 6 -10
5361a0K2k8J8k0L6j8K4jj7k0J2J4k2pK6nl5L2J8j1J3l8K4rK0J6l3J2qOj9L3l0
$$ -10 12 -16 2 -18 18 0 24 23 6 -14 -2 12 -10 -17 9 4 -31 1 19 8 21 -17 7 -2 18 34 1 13 5 11 -8 25 -5
5394eJ0jQj1jklMJ3j3j2J3okO4q0L0mk7L4kJ3j5Rl4K6oj1PrJ7nJ2oK2m5MJ6j2
$$ -5 5 4 12 1 0 -2 -5 -1 12 -1 -13 0 -6 -8 56 -24 6 2 -25 9 7 20 5 14 -20 6 0 -11 -4 -13 4 -1 11 5 27 -18 -14 2 -10
5433a0K3J6j1j2mj6L8l0kQOl0J4N3k6Rk7qJ6kk2j1J9K1rJK0k0J5j7Lj7J6%L2m2
$$ -10 13 29 18 6 2 -14 24 -6 -8 0 6 -24 -10 43 17 26 -1 -9 7 5 -17 -28 -9 12 3 4 24 4 19 2 5 -12 4 4 36 -6
5469fK6j4j3K8l2J2ROj8Pj1J4J8j3rk4L6oJ0k9K2j3Rkj6Nj3O1l4J7j5K0m2mL3
$$ -6 20 6 -7 21 -11 1 10 16 -2 5 -6 8 26 13 4 -20 16 10 20 -9 13 0 9 7 -9 -4 -17 44 10 27 12 32 -10 -14 19
5504A9j8LJ2k3KNRk3K8k3J5Qm6N1l9K6Lk3M0k2j5J7J0l7K0Ok5M3m1J1J8Ql6J2
$$ 19 1 4 16 -7 -5 0 9 -14 14 -9 6 14 -32 19 -20 6 9 -14 26 4 -11 6 16 -21 -1 5 -20 23 -18 -7 11 19 -17 -5
5538ejm%K1mKJ6l7M0l7K7k1qL8m3Ql0M5j2n0M9K1j6J6orJPMOj2MJ7k3k1K3J3k9
$$ -5 -6 -10 -10 11 7 9 25 -12 28 -9 18 -3 -11 27 -16 -8 -38 7 -5 -55 -6 15 -1 15 9 0 1 8 12 18 6 10 27 4 -17 6 19 -10
5576a0L0Kl6K8j2j4J4k1J2KL1l8L4k6K1k0k6J6nJ0J8J4l1k7L6j4OJ6k5J4nK0j6
$$ -10 20 22 -14 14 2 -12 2 -19 -7 -5 26 -12 22 -4 17 -3 -29 -13 -18 -8 10 24 -7 -34 2 -12 -6 10 -15 -1 -6 14 -2
5609bkJJ2k1PL1m5POk9K1K8j2L0k1j9J7l0rL9nJNjj7NKlJ0j9K8k1Mk2K9Pj1K5
$$ -2 -4 -3 9 -12 -5 26 -19 -12 -6 -35 -14 14 2 32 11 -8 9 -21 -30 9 4 5 10 9 -8 -3 -1 -4 6 -13 15 -6 -2 -24 5 12 1 26
5647B6k2L8m3k0K9j7Oj3K8j3K5k6lj4J6qJ3K5l5qKKJ0kJ5m0N0ml1JNL4k0j1ln
$$ 26 4 42 -1 -21 8 -9 -3 -16 12 -1 24 -2 -5 -19 -3 -11 2 27 -8 -16 -14 -12 -2 -4 11 -29 21 17 -14 -13 -8 26 6 -5 -8 -13
5683a3K8J0m2L2k7K1ql9K4jOj4K3J0j3mNRj3j2J8j0K1Rk9K2J2k9LM0l2j5L0Rm3
$$ -13 15 25 -17 15 -12 9 1 -38 -14 -15 -9 -23 0 10 -3 -7 -2 7 -6 -18 0 -10 11 20 -9 13 25 -4 -1 39 7 -8 22 31 -12
5718a2M2k4l1J7J3J6m7j1M9K5k6j5J6j0kk0J5k3L7mj2K8mnl9L1pJ2nMj6j6J8N1
$$ -12 30 6 -25 -8 5 21 -26 -37 12 37 11 -4 12 2 0 -20 -5 -28 9 5 -7 21 17 12 -27 4 -3 9 4 8 -8 -24 -6 45
5752D5m2Pj0QJ2Rl9M0oLj6Mj4J7j6KnOj9K4J4k9L4n7K9J3k8K8k2J4jNk2nJpM1
$$ 45 3 10 0 8 20 29 -10 30 24 27 11 15 1 18 2 4 -1 5 -14 10 24 -5 29 -28 1 14 -14 14 -8 6 5 10 -12 -17 -16 -23 18
5789A8j3PkLqqlPjqQK9l8PMJ8j0l1L1k1J4k5QK5Mp4Q1k8k4K2oK5k2L5j5lj5L7
$$ 18 5 12 10 13 5 -3 -6 1 0 -8 0 29 -9 -2 2 20 10 -21 10 -11 3 -22 -14 11 15 -59 22 -6 -30 -8 -14 11 -11 24 9 6 -9 28
5827B8pKl5JK1k5K3oJ5k6J9j7Jj0M6m7M3m0K5J9m2J2k6J8jjMJ3k4K9j2oNJ0Lj5
$$ 28 21 23 -12 -11 10 -15 8 2 17 -9 10 -7 -6 -16 30 -17 26 -14 11 30 -12 0 -26 -8 -9 -10 -6 7 -17 12 0 -6 -1 9 12 -3
5863cK5k0Nmm0J8RJ5MJ2k8Rk6M5ml0lN6l0k1MpM2m1K8mk0J6K7k0nmJKqj2J9J7
$$ -3 22 2 7 3 -37 -19 -10 5 9 21 -7 2 -24 21 17 -13 -16 40 10 -11 -7 -14 28 -13 15 11 -9 7 34 14 9 5 6 8 0 -12 7 24
5901B4ln5M2j2Nj6L6k1qPLk6MROK9m9RKK4J7j2j2pJ4k5nL2j7j0K0k7M1n3K4J9
$$ 24 21 -34 8 -4 1 -15 21 0 -8 -1 2 -24 -20 -11 -5 24 -25 -16 -14 10 27 15 3 -4 10 -15 -20 12 -5 -15 5 -22 19 -34 -10 9
5937IMk0OJ5j2k1M3l3K1Qj8oJ5j6j2K1RNj2Mlk5J8moJ3k7L2j2JRj4lK3J4k5Kp
$$ 9 13 -7 -1 14 2 -19 24 -9 12 20 2 -4 11 -5 -17 4 13 18 6 10 7 -18 0 -4 -10 3 -24 8 -4 -3 6 -8 -11 12 26 1 3 -4
5975dm3K1M5J7j6j0k3J3%l0K8k5qM2j7NJ0j4%J7jkl5L8kj1%Qj7L8j9QJ1l6OL2
$$ -4 -47 -26 19 36 20 10 -13 0 0 -30 -2 -27 -35 7 -10 -5 5 -9 -9 8 7 5 -30 8 6 -5 -5 3 -14 24 5 13 24 -12 -6 26
6011B6m1OlJQj0Rj6KJ6mK3Mm0PPM0m1L3pm0L3Mj7j8K2koLqj7L4j2j6L2ll9L6q
$$ 26 -15 -9 -12 -11 -3 -13 -4 -20 -18 -2 -6 17 21 -19 -12 -5 35 -6 27 20 -20 13 17 0 -18 4 2 -4 -1 -9 -26 8 -4 -20 12 9 -30 6 -2
6050bj4J4J4k5k0L1JpJ1J2J2k5K0ml2K0kJ4l4N3k5j4L8ml6kK5ql2J1J5J3j9oK8
$$ -2 -16 -2 12 -13 -33 -2 -1 -8 3 15 27 2 22 18 -14 6 4 18 -16 37 12 -2 36 32 -4 -6 19 11 -21 -10 5 18 -1 -7 21
6085B1mK1k3k3Jj0PJ1k3K0K5j4onNj5J1j4j6L4Lj4K2lk2nK3%l3J3J1kMJ0NJj8
$$ 21 17 38 15 -8 -7 -17 -10 1 -22 -2 23 9 3 -2 3 -12 -1 -15 -31 3 6 -8 14 11 -11 -16 7 7 -26 -13 -2 -4 0 10 15 16 -2
6122bj0K8l2j4J1L2J9k2ooj0K0k9J0K7kj7mJ1k9L3l3J6K1k3Pj1oKK4qj4K7j0m
$$ -2 -12 16 -16 -30 -19 13 32 10 4 -2 -12 8 -21 -11 16 14 -3 -7 4 -25 8 -25 -9 12 -11 -4 -15 -21 -19 5 -3 -17 10 0 -4
6157dkLnJ8jkj6J8Jl4J2L2kk8nmK7j3QJ2Oo3M8j6NP%k4K8j6j9J1K9l6kK6J0J4
$$ -4 -6 -3 -8 10 9 7 -9 9 10 -24 -12 20 18 -10 -15 -19 8 -5 3 15 21 -42 6 -10 -5 2 2 -22 6 -10 -29 -18 11 -25 -27 -1 9 23
6195B3J3m4J1j0L1l9M2j0j7lPj8JK5J3k7j0J8j1L7m8K6k1Poj0L1pRk1loJ0j8N1
$$ 23 36 -8 3 -7 24 -15 27 17 0 -3 4 -14 -13 12 25 -2 -12 6 -5 32 -16 10 -11 -4 -10 -20 11 4 13 -8 -11 -17 -7 -25 26
6230B6l4K0k3ML5k8j2OJ8nj1J3K8o5J3j6M6pm5M5qj4K0J2k1l0L6j6K1PRJ9n7K
$$ 26 -8 12 -11 -7 28 0 -12 -6 12 7 -4 9 37 -28 -15 -31 15 8 -37 8 0 -14 6 18 -3 -33 3 -13 8 15 24 43 -14 -12
6264a2J1Lj0QOK1nj7k1K4K1k5j7jL4qk7J2oMj4L3jk7L6j9j9M7n4K3mK3mJ3l4J7
$$ -12 -1 2 -8 0 6 27 22 5 -16 8 29 4 -13 -14 20 12 -15 -3 -9 -5 -19 14 13 -14 22 3 -16 31 -23 0 -4 19 15 28 -6 11
6300A1J1j5Kk4j2M5J1k7Qk6KJ9k5L9l5NMK5j3J7Ql0pL4k5j6K9l2J0%J0J6Kj5k2
$$ 11 22 7 9 -15 -27 18 29 2 10 -16 -14 5 -20 19 -16 -11 -7 18 5 22 30 0 -7 27 2 -14 15 -17 -7 -7 3 19 21 6 -16
6335a6j2M1kK1n0RQJ4plm6M4j0nMmJ5K0l2rJ9moJ7j2J2j9J5pNLJ9j3k3jJ0jJ8
$$ -16 -28 13 11 32 -18 -9 -1 13 6 3 -43 1 -9 -14 -10 -14 1 21 -11 -20 -1 -5 -11 6 -6 6 -13 2 -5 0 3 22 9 -14 -15 -5 -6 12
6373A2nj6%pJ9k1RRlPm0K0JrOK5k0J3lLJ5l6J1K6qnj1K2oK7l0j4Qk0OJ2K4l0K
$$ 12 7 -9 -9 -16 3 -18 -9 0 -3 4 -36 -16 -15 -24 -18 7 -13 0 -3 0 15 -21 -10 16 8 3 -8 14 8 35 5 -9 -1 -21 -15 -3 21 -9 -7
6412gJJ6qnj4JK1k3J6K6l6Mj0J7kJ0k1K5J1rJ6j1%Kj7Qk1J9J0k1qj1L3j6L3m3
$$ -7 -6 10 2 -3 -17 -16 5 -18 -2 24 -12 -8 -18 -1 -3 7 -14 11 22 13 29 18 18 20 3 11 -10 9 19 -2 -10 -21 12 -4 29 -14
6448a4nRPJ3LJ2m0L1ok2k4M7lj7KJ0K4k5PJ2j5k4K1j9J3nqJ8Kk5K4lKQk3MJ2k3
$$ -14 -19 -10 -3 10 13 25 -15 16 10 -12 -36 11 8 -9 -7 3 27 2 9 21 6 -18 3 -16 -3 -8 -16 2 4 -21 3 0 2 10 -13 -9 3 -20
6486b0%J4k0J6K5l5L4j9K8m4K0mk1M8ml2J9J1j8J0kpj4Pj6J3J5J5j5lOj6%%J3
$$ -20 -20 -6 -26 -10 15 -20 14 -5 23 -21 -1 -5 -26 22 18 -14 5 16 -2 8 6 -1 -15 -8 -24 -11 4 19 4 1 7 -9 -9 -9 4
6521DqL1k5j5pJ2k1J7j4LO0n3JK1JK2m4J2K6pj8J1j3jk8N8n7J1lJ9J5J3k0oPq
$$ 4 -4 27 2 -13 -20 -8 -29 -12 -26 -23 37 -16 -15 6 7 29 -15 -3 23 16 -2 9 -4 -5 -33 25 -32 -21 -24 -5 10 23 3 -3 4 -4
6557dnK9l2QL4m2K5j1Rk7J4j2M7j5j7K9l2J4J2l8J5K0k0MKkj6L0j4J8l6L1kKp
$$ -4 -9 20 -12 -4 30 -12 13 2 11 -16 -2 -14 33 18 1 30 -2 12 24 -14 1 21 1 5 7 5 -11 19 5 23 -13 18 16 18 11
6592A1k0RoM2k3j5K4Jj0mMj5lkpJ6qpJ1j1J6Mj0lK9Jj7k8L4rK3l2j0RJ5k8J9K3
$$ 11 -9 0 -6 36 13 -2 22 23 13 9 13 -2 -5 -7 -14 2 -6 -13 -2 -13 3 7 -3 -6 23 24 7 -21 13 4 27 -5 -15 -6 9 -19 0 23
6630B3ql5M8n2K4j2L4Jmj3qM0n1K6k4mJ2QK4k7Pj1j0Pj5K3moJL1mk3J2l2MM8m6
$$ 23 15 -20 28 -24 0 -12 22 23 19 6 -2 38 -13 13 -11 -15 -3 5 29 2 9 -2 -12 -5 -20 3 -1 -7 -6 25 21 -2 10 -22 -18 30 -16
6667a6N2m3oK6Qk9J5K0m0PJ4rm0K7K9j0J0Npk3k%K3k6J9K5j1k2NnJ3j3J9k0J9
$$ -16 36 -7 -13 13 21 -8 7 27 -13 -6 8 -1 -41 -14 15 5 15 20 13 -10 -12 -12 11 -15 4 29 18 -4 1 -4 9 -4 15 -5 14
6702A4k5J3J1m2J9J4k0K2J0j6l0J2k2J3J5RK7m7J0JK6rpJ1jj6nJ1k0J1J1J0k1
$$ 14 -11 2 13 -29 -10 4 -16 6 16 0 -30 -18 -40 -27 -12 -3 24 -23 -13 -12 14 5 -2 9 8 -8 -13 -2 -22 -11 0 10 -11
6735a1J7JJk9lM3l0P%LQj4nK4k1K9qk5J8jL2m3Rjj7K5k2J7J6j2KJ7k9%k1J6K2
$$ -11 6 7 8 -21 -24 19 -11 -4 -4 -1 7 -7 -12 12 -9 20 12 -13 5 4 36 -7 2 1 -16 9 -13 4 20 8 10 27 -2 -2 -23 -7 15
6772A5K0pl0L4j5j0KJ5rk1LJ5j4k0J0L7k0Mj5noJK6m9M0QkNj5J4mrMK8n2K0L4
$$ 15 35 28 -2 32 17 7 9 24 15 -6 -3 12 -2 -22 -12 25 5 9 -6 -11 -17 -16 10 -39 1 9 7 12 -3 11 7 -2 2 30 -22 -2 32
6809C2l3PJj5oOJ1k1KK2j5jJ3j8PJ5Loj9J4lJ2kk6okJ6%J8Mm1M7j1m2K6OQk9K1
$$ 32 -1 6 7 -8 -14 -8 3 -18 -16 6 -9 -10 3 -15 -8 7 10 4 -15 -1 -4 8 6 -20 -26 -28 -12 -12 6 10 -31 16 5 -37 -11 -5 3 -26 -5
6848ejjPjj2RJ8qJ2l4J7Kk8J2L2Nk3j6J3K6j0Lk2mK0mj0K7k4L1j5l4J7J4j6L1
$$ -5 -6 -7 0 -1 -13 -4 14 6 18 -16 1 3 -25 -13 19 24 1 -15 -2 24 14 17 -5 -9 11 7 -3 24 0 31 16 -18 -1 13 -3 28
6884B8k8OJ8k9J2j9K0K4j0k6mJ4j1J9Om2K2J2j0LJjnKJ0k7J3j8J2J9K2lk8qpL4
$$ 28 0 6 24 -5 7 -12 8 32 22 -4 -8 6 -5 14 20 -22 0 12 2 5 6 5 0 2 12 -15 -2 -20 -8 11 33 30 2 -6 -13 21
6920B1k4j7K4M%m0J5oM1k1L8k1k1PlJ6j1OLk0L4m3NJ6Lj9J9K7m4M1l1j0LL0k7
$$ 21 -3 -20 4 8 8 -32 -17 -23 18 -3 35 14 -7 0 -3 13 2 8 11 -9 25 -18 -13 3 6 -13 6 33 -11 30 -1 -11 -8 22 -5
6955eJ9j2k5mN1j4j6J0O%KLj4k9L0K3j5J2k3qK9J0j7j7lJ4NLpJ4j0j0J9j0j7j6
$$ -5 14 2 -23 -27 24 10 -6 4 10 10 12 15 1 -28 2 25 10 22 -1 -9 20 30 13 -4 -7 7 12 15 8 22 12 2 21 11 -6 -22
6991b2J4pJ7J2rlplMJ6l6K4jrkK1k0M8k6NLqrqJ1L1l8RmMNj3koN2n0J8j5RPJk4
$$ -22 -8 -15 2 14 5 2 -5 -8 -4 12 -24 0 -1 -10 -12 9 -11 37 11 16 19 11 2 -6 5 36 -2 7 3 7 12 -1 -3 -9 43 -7 11 -4 5 12 13 -11
7033a1LJ3Pj5K8k6Jj5KK4Rm7L4j8K9lk7M3l1j4K5k0J3J6m8K4j2RKK4k6m0O9jl8
$$ -11 -8 5 12 -3 25 -1 0 -15 -13 11 20 -27 7 -11 18 15 -12 31 0 -14 11 -9 4 20 -28 -4 -16 -7 -5 19 -7 -47 22 21 -17
7068a7kK9%JJ5j1Lj4Qj0kNj5K0l1K9J6k8L2qL7n7j0j3rM3J4j2MJmmlJ6m2J5Qj3
$$ -17 -19 10 10 11 26 15 18 4 12 2 0 5 -10 10 -21 8 24 -4 28 20 57 0 -10 -23 -32 11 25 13 17 18 14 10 7 23 -19 -4 4 -9
7106iPkj4j4K9oJ8j8K1Pj2PjpoMRnm4N5j4RRl5J4k2K8K1n1j3M0J0j0nkK3k0RJ5
$$ -9 -2 -4 -18 -32 -3 -9 9 -9 12 19 7 14 13 6 0 4 13 8 -36 19 5 14 23 -12 2 -20 8 29 -22 -35 5 15 5 0 -2 21 1 10 25
7145B5l4J7j4J9%l2j6N9MNk7omNj1L1m2K6mLk1L5rMoJ0l5L1j8pJ3lK7k0Rk3mN
$$ 25 -9 8 -6 13 13 -19 -35 24 28 33 6 0 -4 1 -10 21 -21 5 1 4 -17 18 9 13 7 17 -18 13 -5 -12 1 -2 25 5 14 -9 -13 -8
7183hKpQKK1m1J1KK3k3K6lKo6O3nk5K5NJ2oj5K7m0L4j7oK7%j4l3J6j9J8mrK4j1
$$ -8 -6 -13 -5 -3 18 -23 -12 -10 13 -10 16 13 15 -51 12 7 -18 7 12 24 18 3 30 -10 24 7 1 28 28 14 -19 -3 -22 -4 -8 -17 7 -4
7221dJ2pK6k0J0OJl2L5j8j7J5k5Kj7N2k6K6mk0pj4L0j0lOOk5K0J3lJ7k8JmOj1
$$ -4 8 1 27 7 17 23 24 -8 27 9 -8 7 -18 -16 -33 19 -7 19 15 -5 -12 -26 4 -6 -9 -3 3 -22 -2 11 8 25 -3 -2 -6 0 -11
7258a1K5pk5K1Kj3K3j4qPK9k0pK1l2%PjJ4K3n3K3lpk4K1Qk2N2nk0Jj1J6k4%j3
$$ -11 14 7 -18 3 5 -8 15 1 -7 0 29 9 2 23 -9 -9 -2 -3 11 34 -19 4 1 -6 -30 -9 -1 -23 29 24 4 5 -6 10 -14 -14 -27
7295b7M4nk2K6lj0Pl9QJ1K0j7j4K8POPl1PK4j5k5KOJ7m4J3K1KJ2k1JL2m5O3o7
$$ -27 17 12 -10 16 13 3 10 -29 -21 -10 10 -7 -21 7 14 20 27 -4 3 27 12 -13 -11 -5 12 -32 -19 2 4 16 -5 -4 28 -17 46 -21
7331b1K9l0pL2MM7m2j6J7qj5J6OmJJJ4j5LJ0pK7j0o5N1j2J0j5J0K5j8nj1qk3M1
$$ -21 8 -22 -29 3 7 54 12 -4 13 5 -10 6 12 8 9 10 24 9 12 22 15 42 32 -33 18 6 16 1 11 36 18 13 2 -6 -29 12
7367A2k5L3l2L5r%k1JJ9Jj5K8j9J7kk8L4k1K3l9Nj9K4Qj9K0k1J9kJ5Jkrk7J9L7
$$ 12 -13 20 -12 23 14 14 -7 -6 13 14 -1 27 8 25 23 -5 29 8 31 -8 -3 -22 2 10 -9 11 -10 9 7 22 23 21 12 -15 4 41
7403D1j7prl3J6Oj8K7Pj9K6pj3j2OrpL0J4mkm5K6J0k5MJ0OL%kj4k0M3Kk3L4m8
$$ 41 24 17 8 -25 -9 -3 -21 6 13 -6 20 13 0 -12 -6 -15 -22 8 22 18 16 -29 -3 7 -18 -14 -4 2 5 5 3 -11 -31 12 14 -9 25 -23
7441b3M8l0lj1RkJ3PJ2j9j1L4k9JJ9%%oJ2j9POLoJpj7J3M2m6K9j4l4M4j5Qk5q
$$ -23 25 -5 -8 -19 -10 -12 1 8 20 1 -10 24 -5 -4 15 15 15 9 21 2 9 15 18 12 13 6 -11 2 44 -2 27 13 -21 23 8 16 -9 -17
7479a7J2MQ%j7mJ7pl4M1j0oj0K4K6l2J9k1JKJ3k4K5mj7JJ2Pk5J4RJ4l1qL4qlO
$$ -17 -5 -1 7 7 -10 -14 3 -4 -38 3 -7 -13 -23 1 27 -5 14 -7 -6 -4 9 -15 10 6 -11 -10 2 9 -16 -2 7 21 -10 -18 16 8 5 11
7517A1J1K1m7K2Lk1J5j6J1ojKK9mk8L8j2l3jL2k7jJ3MmMkj9kOPk0M2l9mj5L7q
$$ 11 22 43 -4 18 21 0 15 -1 10 4 3 5 34 30 2 40 28 -5 -6 26 -1 -2 11 15 11 15 13 -6 -8 -2 5 -15 27 -12 -16 -31 6 -2
7555bj5L1Qk8J6l3J6J1jJ5k7J8Mm0L8mpK0m0L1qLlJ8Mn4K3Jl%OJ5k3QKk1J9K8
$$ -2 -17 14 22 -6 10 -23 -7 4 3 18 -9 9 13 -27 11 7 0 20 -20 11 3 6 3 21 25 -29 -6 -5 -8 -8 -2 13 -10 -2 0 -21 -2 26
7593B6j6J7k5K0l4K2lk5L4l2J6Ok7J3rJ3j1%j5N4k3jPl9K6J3l3K5Mkj5J5Jk0L6
$$ 26 10 27 2 22 -12 10 7 -18 16 -16 0 6 -21 -8 -17 -4 -15 -15 -30 24 1 0 7 -32 -6 7 -26 -1 3 1 -14 1 2 -18 18
7628A8j3pkj3mpL5j4oL1k9M0l7jK0l9J9K1k9J8onj4J5Rj2OJ0J2J1m4%J5J1Plk8
$$ 18 5 -2 -4 -17 -21 -28 7 -7 -13 18 -11 29 -8 -9 11 -28 -9 12 -17 1 -5 -10 -24 -9 0 -12 -6 4 16 27 -17 -17 -2 9 16 13 -15
7665a5pL1k0j1K5k9J2L2l1M1m6L1mk1RL1J2l8RjJ8k7k5J5OrrL3m1N1J3Npl5J9
$$ -15 -22 9 -11 -22 3 -26 -14 18 -13 28 -18 13 9 -12 -3 28 40 2 11 10 28 1 -24 -9 -3 -12 -21 12 -29 22 35 40 33 -2 17
7700A7J1k4rL0Qj5qj0j1J3j2MNJ7oqk2L1OorK3m2J1PLMk2K6j3LMnl5N3k3J8l2
$$ 17 28 4 -5 25 33 18 10 0 -11 2 -10 -6 -1 16 10 2 -20 11 17 11 2 25 -17 -6 1 4 8 -14 12 -1 2 6 1 -34 19 -4 14 -18
7738a8M1l2K2Mk9j5K4J0k6j6M8J9n1J3PNrQklj0lK9qnl8M8j8j0M3n2N2j9Oj2q
$$ -18 23 -9 13 17 -12 -27 -3 7 -19 -35 13 32 -19 -6 1 6 -3 5 3 0 -10 -13 16 8 3 -35 13 -5 -15 28 -24 28 9 15 3 -5
7774ej0M1l3NJ1j9J1j1L6k6rJqL1n3N1l4OL0j4j5j2M0j8k1K2J5j8rL0k2J0OMQ
$$ -5 -15 26 -7 -2 9 -10 1 -10 26 0 -9 -8 -16 15 -38 13 -21 -15 15 1 -14 -26 14 -4 -25 -3 12 -6 -15 15 -7 3 9 13 21
7809B1k8JK2j0J2j5kjl4J7K0ok1K3MMkJ0l2J8j0Oj6J2L7l8OJ5q%j1J4J5l1K1k5
$$ 21 -7 -6 16 6 18 3 1 0 -34 -17 3 -3 -24 -1 3 7 5 15 -17 1 -9 -3 -19 -7 30 -8 -2 13 5 5 -6 8 23 -8 13 -12
7845a2k1L3l3N4l2K7k4QK%K1j0Qk8j6J8j7L5j8kL9k7OMj3JJ4j1m4N1l2K3pnnn
$$ -12 -33 0 -33 21 -11 16 -8 0 2 2 23 13 21 -7 -23 -5 -22 13 -5 -7 32 5 11 15 2 3 17 6 -38 13 -19 4 -3 -8 -13 -18
7881a8K8j8jJJ2q%J6k2lJ2pRL2l8JJ1nk3JmK6J0lJ4k0j6QnmmQL0m4RM0l1J4k9
$$ -18 10 -8 -9 -8 4 -4 -4 12 -10 -13 -1 -8 1 33 -5 -4 7 2 -21 -20 -24 2 12 9 23 3 -13 -5 -10 -14 -18 -10 20 -24 -15 25 -6 8 -21
7920b1K2%K2k7K6l5NK9j6K4j7j7J5k0L4kl2M6n0oK6l3K8MqK2j1Ql8K7k5K5J2k1
$$ -21 1 1 23 -4 22 -13 -8 21 5 29 12 -5 10 -10 24 22 -10 36 -14 -20 6 -27 1 5 -3 19 8 16 -22 5 -20 5 17 -4
7954dnJ8J4j5J3Ok6kJ1j7L6l0J1m3L1K3pJ4l5J6nJ0j1J7l3K8k3K3LrJ4l5lQK4
$$ -4 -9 9 23 8 21 27 1 -1 10 -7 29 -1 10 -33 -2 21 14 28 -7 9 4 14 3 20 -13 15 -8 15 18 9 23 -12 -15 -7 17
7989A7l5J9qJ3Kj8J5j4RNk5J3L9o3J3M1m7J7J3k1Mjqk4K2M0j6J4j7KJ1pj4PNr
$$ 17 -18 1 -7 6 8 -10 5 -9 0 5 -20 -7 32 -31 -18 23 -24 -7 6 -15 -11 -12 -20 -44 -22 18 2 16 -1 1 12 5 -9 -2 3 -6
$$ [...]
8191a4
##END NTUPLES=NMR FID
##END=
